{
  // Extensions I'd consider essential in any project
  // TODO: Dev containers
  "recommendations": [
    "aaron-bond.better-comments",           // Better Comments
    "adpyke.codesnap",                      // Those pretty code snapshots you see online
    "donjayamanne.githistory",              // Better git history
    "DotJoshJohnson.xml",                   // XML tooling
    "eamodio.gitlens",                      // GitLens (extra git functionality)
    "foxundermoon.shell-format",            // Format shell scripts
    "EditorConfig.EditorConfig",            // EditorConfig integration
    "mhutchie.git-graph",                   // Git graph view
    "nhoizey.gremlins",                     // Avoid unicode "gremlins"
    "stkb.rewrap",                          // Wrap comments to fit in a certain line length
    "tamasfe.even-better-toml",             // TOML v1+ support (does any official tool care support new versions...?)
    "timonwong.shellcheck",                 // Don't write bad shell scripts
    "yzhang.markdown-all-in-one",           // Extra functionality for MarkDown
  ],

  // Random tools that make life a bit easier
  // TODO: Todo Tree?
  // TODO: Test Explorer UI?
  "recommendations.tools": [
    "betwo.vscode-linux-binary-preview",    // Enable viewing of binary file info
    "janisdd.vscode-edit-csv",              // Easier editing of CSV files ala Excel
    "khaeransori.json2csv",                 // Convert JSON to CSV (and vice-versa)
    "mechatroner.rainbow-csv",              // Colorize CSVs cause they're hard to read at times
    "phplasma.csv-to-table",                // CSV to ASCII table
    "richie5um2.vscode-sort-json",          // Sort JSON
  ],
}
