............
----------------------------------------------------------------------
Ran 12 tests in 0.002s

OK
Name               Stmts   Miss Branch BrPart  Cover   Missing
--------------------------------------------------------------
TestDiplomacy.py      47      0      0      0   100%
cut_support.py        13      0     10      0   100%
diplomacy.py          63      0     48      1    99%   73->65
--------------------------------------------------------------
TOTAL                123      0     58      1    99%
