1 10 20
100 200 125
201 210 89
900 1000 174
1 1 1
1 999999 525
837943 912348 476
34 82 116
19 991 179
3000 7000 262
123 456 144
3929 8192 262
71279 91827 351
9998 9999 92
90000 90001 165
12000 13000 263
15000 18000 279
3829 9182 262
5172 9821 262
7283 83927 351
7384 9283 260
72638 82736 351
72638 73826 294
23748 32847 308
48392 53920 340
12382 21938 279
73628 98372 351
72638 83729 351
83729 92837 333
72638 92837 351
26372 42849 324
2 9 20
10 15 18
123 847 171
70 80 116
90 100 119
1201 1300 177
1400 1829 180
1029 2013 182
1928 9108 262
12837 13890 276
1827 9201 262
17273 10298 276
16238 19288 279
3829 5839 236
19283 87929 351
12883 72618 340
8192 9281 260
43 92 116
41 80 116
21 99 119
12 109 119
30 1230 182
189 1902 182
289 2910 209
1029 12983 268
1283 10298 262
23 45 112
129 1029 179
238 300 123
122 1029 179
2 4 8
1 9 20
200 300 128
837 1928 182
2819 9999 262
1029 3839 238
1928 10298 262
10298 10300 149
3728 4839 215
1029 4000 238
5843 8192 262
9012 9720 260
8372 9203 247
300 400 144
738 839 153
209 300 128
100 200 125
837 920 179
738 889 179
1928 2000 175
2037 9487 262
34956 64732 340
83648 93743 333
29834 36488 324
82437 93747 333
23478 98733 351
2983 3784 238
8273 9283 260
7483 9284 260
736 839 153
928 1000 174
7364 9293 260
29384 73829 340
29374 234473 443
293847 299312 371
600 900 179
700 1000 179
2930 19298 279
319662 322868 371
560495 559981 359
831101 831011 251
784445 782843 331
859271 859331 295
998394 998498 277
975465 975228 228
687538 680880 398
786313 786051 269
780568 780732 300
363174 361163 361
261481 261858 288
908012 909802 370
984442 984350 246
931890 931544 277
788836 791387 406
919454 919499 202
575642 575716 297
915504 916839 339
285788 285880 252
919365 918704 339
827554 827930 313
850429 850334 313
737959 737960 150
82734 92873 333
92874 99203 328
8293 9283 260
7283 9182 252
7263 8273 252
1928 2837 209
8734 9999 260
