................
----------------------------------------------------------------------
Ran 16 tests in 0.103s

OK
Name             Stmts   Miss Branch BrPart  Cover   Missing
------------------------------------------------------------
Collatz.py          42      1     16      1    97%   173->176, 176
TestCollatz.py      67      0      0      0   100%
------------------------------------------------------------
TOTAL              109      1     16      1    98%
