Thu-Jan-2021 00:43:16 info Info log
Thu-Jan-2021 00:43:16 alert Alert log
Thu-Jan-2021 00:43:16 error Error log
Thu-Jan-2021 00:43:16 debug Debug log
Thu-Jan-2021 00:43:16 notice Notice log
Thu-Jan-2021 00:43:16 warning Warning log
Thu-Jan-2021 00:43:16 critical Critical log
Thu-Jan-2021 00:43:16 emergency Emergency log
