; Sprite   : 0
; Mode     : Mode : 1 sprite               
; TGS size : 32
; Address  : Start + #0
sprite0tgs:
    db %00000000
    db %00000000
    db %00000000
    db %00000000
    db %00000000
    db %00000000
    db %11111000
    db %11111111
    db %10101111
    db %01010101
    db %10101010
    db %01010101
    db %10101010
    db %01010101
    db %10101010
    db %01010101
    db %00000000
    db %00000000
    db %00000000
    db %00000000
    db %00000000
    db %00000000
    db %01000000
    db %11111111
    db %11111110
    db %11110101
    db %10101010
    db %01010101
    db %10101010
    db %01010101
    db %10101010
    db %01010101

; Sprite   : 1
; Mode     : Mode : 1 sprite               
; TGS size : 32
; Address  : Start + #32
sprite1tgs:
    db %10101010
    db %01010101
    db %10101010
    db %01010101
    db %10101010
    db %01010101
    db %10101010
    db %01010101
    db %10101010
    db %01010101
    db %10101010
    db %01010101
    db %10101010
    db %01010101
    db %10101010
    db %01010101
    db %10101010
    db %01010101
    db %10101010
    db %01010101
    db %10101010
    db %01010101
    db %10101010
    db %01010101
    db %10101010
    db %01010101
    db %10101010
    db %01010101
    db %10101010
    db %01010101
    db %10101010
    db %01010101

; Sprite   : 0
; TCS size : 16
; Address  : Start + #64
sprite0tcs:
    db #00
    db #00
    db #00
    db #00
    db #00
    db #00
    db #02
    db #02
    db #02
    db #02
    db #02
    db #02
    db #02
    db #02
    db #02
    db #02

; Sprite   : 1
; TCS size : 16
; Address  : Start + #80
sprite1tcs:
    db #02
    db #02
    db #02
    db #02
    db #02
    db #02
    db #02
    db #02
    db #02
    db #02
    db #02
    db #02
    db #02
    db #02
    db #02
    db #02

; Color Palette
; Address  : Start + 96
pal:
    db #46,#06
    db #00,#00
    db #27,#05
    db #14,#01
    db #40,#05
    db #20,#03
    db #00,#02
    db #77,#07
    db #57,#07
    db #71,#06
    db #41,#02
    db #53,#04
    db #00,#00
    db #75,#06
    db #72,#03
    db #00,#00
