{
    "modules": [
        {
            "config": {
                "position": [
                    240,
                    76
                ]
            },
            "name": "New Model Object",
            "value": {
                "actionGroup": {
                    "_default0_list": false,
                    "_default1_show": false,
                    "_default2_new_create": false,
                    "_default3_edit_update": false,
                    "_default4_delete": false,
                    "customActions": [
                        "render"
                    ]
                },
                "name": "Form",
                "objectsettings": {
                    "addDeletedField": true,
                    "addHiddenField": true,
                    "addStarttimeEndtimeFields": true,
                    "aggregateRoot": true,
                    "categorizable": false,
                    "description": "",
                    "mapToTable": "",
                    "parentClass": "",
                    "sorting": false,
                    "type": "Entity",
                    "uid": "1176672314472"
                },
                "propertyGroup": {
                    "properties": [
                        {
                            "allowedFileTypes": "",
                            "maxItems": "1",
                            "propertyDescription": "",
                            "propertyIsExcludeField": false,
                            "propertyIsL10nModeExclude": false,
                            "propertyIsRequired": true,
                            "propertyName": "title",
                            "propertyType": "String",
                            "uid": "1383636452211"
                        },
                        {
                            "allowedFileTypes": "",
                            "maxItems": "1",
                            "propertyDescription": "",
                            "propertyIsExcludeField": false,
                            "propertyIsL10nModeExclude": false,
                            "propertyIsRequired": false,
                            "propertyName": "description",
                            "propertyType": "Text",
                            "uid": "129284922542"
                        },
                        {
                            "allowedFileTypes": "",
                            "maxItems": "1",
                            "propertyDescription": "",
                            "propertyIsExcludeField": false,
                            "propertyIsL10nModeExclude": false,
                            "propertyIsRequired": false,
                            "propertyName": "textSubmit",
                            "propertyType": "RichText",
                            "uid": "362347103962"
                        },
                        {
                            "allowedFileTypes": "",
                            "maxItems": "1",
                            "propertyDescription": "",
                            "propertyIsExcludeField": false,
                            "propertyIsL10nModeExclude": false,
                            "propertyIsRequired": false,
                            "propertyName": "textConfirm",
                            "propertyType": "RichText",
                            "uid": "836458438127"
                        },
                        {
                            "allowedFileTypes": "",
                            "maxItems": "1",
                            "propertyDescription": "",
                            "propertyIsExcludeField": false,
                            "propertyIsL10nModeExclude": false,
                            "propertyIsRequired": false,
                            "propertyName": "fieldSenderFirstName",
                            "propertyType": "String",
                            "uid": "1261025935595"
                        },
                        {
                            "allowedFileTypes": "",
                            "maxItems": "1",
                            "propertyDescription": "",
                            "propertyIsExcludeField": false,
                            "propertyIsL10nModeExclude": false,
                            "propertyIsRequired": false,
                            "propertyName": "fieldSenderName",
                            "propertyType": "String",
                            "uid": "992806615347"
                        },
                        {
                            "allowedFileTypes": "",
                            "maxItems": "1",
                            "propertyDescription": "",
                            "propertyIsExcludeField": false,
                            "propertyIsL10nModeExclude": false,
                            "propertyIsRequired": false,
                            "propertyName": "fieldSenderMail",
                            "propertyType": "String",
                            "uid": "1282074722254"
                        },
                        {
                            "allowedFileTypes": "",
                            "maxItems": "1",
                            "propertyDescription": "",
                            "propertyIsExcludeField": false,
                            "propertyIsL10nModeExclude": false,
                            "propertyIsRequired": false,
                            "propertyName": "storagePath",
                            "propertyType": "Text",
                            "uid": "453133112923"
                        },
                        {
                            "allowedFileTypes": "",
                            "maxItems": "1",
                            "propertyDescription": "",
                            "propertyIsExcludeField": false,
                            "propertyIsL10nModeExclude": false,
                            "propertyIsRequired": false,
                            "propertyName": "storageConfirmPath",
                            "propertyType": "Text",
                            "uid": "98828403584"
                        }
                    ]
                },
                "relationGroup": {
                    "relations": [
                        {
                            "foreignRelationClass": "",
                            "lazyLoading": false,
                            "propertyIsExcludeField": false,
                            "relationDescription": "",
                            "relationName": "step",
                            "relationType": "manyToMany",
                            "relationWire": "[wired]",
                            "renderType": "selectMultipleSideBySide",
                            "uid": "12746542469"
                        },
                        {
                            "foreignRelationClass": "",
                            "lazyLoading": false,
                            "propertyIsExcludeField": false,
                            "relationDescription": "",
                            "relationName": "mailToSenderConfirm",
                            "relationType": "manyToOne",
                            "relationWire": "[wired]",
                            "renderType": "selectSingle",
                            "uid": "239822643255"
                        },
                        {
                            "foreignRelationClass": "",
                            "lazyLoading": false,
                            "propertyIsExcludeField": false,
                            "relationDescription": "",
                            "relationName": "mailToSender",
                            "relationType": "manyToOne",
                            "relationWire": "[wired]",
                            "renderType": "selectSingle",
                            "uid": "394047900881"
                        },
                        {
                            "foreignRelationClass": "",
                            "lazyLoading": false,
                            "propertyIsExcludeField": false,
                            "relationDescription": "",
                            "relationName": "mailToReceiver",
                            "relationType": "manyToOne",
                            "relationWire": "[wired]",
                            "renderType": "selectSingle",
                            "uid": "374123358976"
                        }
                    ]
                }
            }
        },
        {
            "config": {
                "position": [
                    81,
                    779
                ]
            },
            "name": "New Model Object",
            "value": {
                "actionGroup": {
                    "_default0_list": false,
                    "_default1_show": false,
                    "_default2_new_create": false,
                    "_default3_edit_update": false,
                    "_default4_delete": false,
                    "customActions": []
                },
                "name": "Field",
                "objectsettings": {
                    "addDeletedField": true,
                    "addHiddenField": true,
                    "addStarttimeEndtimeFields": true,
                    "aggregateRoot": true,
                    "categorizable": false,
                    "description": "",
                    "mapToTable": "",
                    "parentClass": "",
                    "sorting": true,
                    "type": "Entity",
                    "uid": "811822728403"
                },
                "propertyGroup": {
                    "properties": [
                        {
                            "allowedFileTypes": "",
                            "maxItems": "1",
                            "propertyDescription": "",
                            "propertyIsExcludeField": false,
                            "propertyIsL10nModeExclude": false,
                            "propertyIsRequired": true,
                            "propertyName": "title",
                            "propertyType": "String",
                            "uid": "935152741715"
                        },
                        {
                            "allowedFileTypes": "",
                            "maxItems": "1",
                            "propertyDescription": "",
                            "propertyIsExcludeField": false,
                            "propertyIsL10nModeExclude": false,
                            "propertyIsRequired": true,
                            "propertyName": "type",
                            "propertyType": "String",
                            "uid": "658992466388"
                        },
                        {
                            "allowedFileTypes": "",
                            "maxItems": "1",
                            "propertyDescription": "",
                            "propertyIsExcludeField": false,
                            "propertyIsL10nModeExclude": false,
                            "propertyIsRequired": false,
                            "propertyName": "richTextLabel",
                            "propertyType": "RichText",
                            "uid": "907839294239"
                        },
                        {
                            "allowedFileTypes": "",
                            "maxItems": "1",
                            "propertyDescription": "",
                            "propertyIsExcludeField": false,
                            "propertyIsL10nModeExclude": false,
                            "propertyIsRequired": false,
                            "propertyName": "options",
                            "propertyType": "Text",
                            "uid": "1387590485232"
                        },
                        {
                            "allowedFileTypes": "",
                            "maxItems": "1",
                            "propertyDescription": "",
                            "propertyIsExcludeField": false,
                            "propertyIsL10nModeExclude": false,
                            "propertyIsRequired": false,
                            "propertyName": "helpText",
                            "propertyType": "String",
                            "uid": "313600003313"
                        },
                        {
                            "allowedFileTypes": "",
                            "maxItems": "1",
                            "propertyDescription": "",
                            "propertyIsExcludeField": true,
                            "propertyIsL10nModeExclude": false,
                            "propertyIsRequired": false,
                            "propertyName": "class",
                            "propertyType": "String",
                            "uid": "254144589361"
                        },
                        {
                            "allowedFileTypes": "",
                            "maxItems": "1",
                            "propertyDescription": "",
                            "propertyIsExcludeField": false,
                            "propertyIsL10nModeExclude": false,
                            "propertyIsRequired": false,
                            "propertyName": "placeholder",
                            "propertyType": "String",
                            "uid": "1239543077355"
                        }
                    ]
                },
                "relationGroup": {
                    "relations": []
                }
            }
        },
        {
            "config": {
                "position": [
                    339,
                    637
                ]
            },
            "name": "New Model Object",
            "value": {
                "actionGroup": {
                    "_default0_list": false,
                    "_default1_show": false,
                    "_default2_new_create": false,
                    "_default3_edit_update": false,
                    "_default4_delete": false,
                    "customActions": []
                },
                "name": "Fieldset",
                "objectsettings": {
                    "addDeletedField": true,
                    "addHiddenField": true,
                    "addStarttimeEndtimeFields": true,
                    "aggregateRoot": true,
                    "categorizable": false,
                    "description": "",
                    "mapToTable": "",
                    "parentClass": "",
                    "sorting": true,
                    "type": "Entity",
                    "uid": "514118505047"
                },
                "propertyGroup": {
                    "properties": [
                        {
                            "allowedFileTypes": "",
                            "maxItems": "1",
                            "propertyDescription": "",
                            "propertyIsExcludeField": false,
                            "propertyIsL10nModeExclude": false,
                            "propertyIsRequired": true,
                            "propertyName": "title",
                            "propertyType": "String",
                            "uid": "1509381177018"
                        },
                        {
                            "allowedFileTypes": "",
                            "maxItems": "1",
                            "propertyDescription": "",
                            "propertyIsExcludeField": true,
                            "propertyIsL10nModeExclude": false,
                            "propertyIsRequired": false,
                            "propertyName": "class",
                            "propertyType": "String",
                            "uid": "129400282652"
                        }
                    ]
                },
                "relationGroup": {
                    "relations": [
                        {
                            "foreignRelationClass": "",
                            "lazyLoading": false,
                            "propertyIsExcludeField": false,
                            "relationDescription": "",
                            "relationName": "field",
                            "relationType": "manyToMany",
                            "relationWire": "[wired]",
                            "renderType": "selectMultipleSideBySide",
                            "uid": "349098386859"
                        }
                    ]
                }
            }
        },
        {
            "config": {
                "position": [
                    595,
                    464
                ]
            },
            "name": "New Model Object",
            "value": {
                "actionGroup": {
                    "_default0_list": false,
                    "_default1_show": false,
                    "_default2_new_create": false,
                    "_default3_edit_update": false,
                    "_default4_delete": false,
                    "customActions": []
                },
                "name": "Step",
                "objectsettings": {
                    "addDeletedField": true,
                    "addHiddenField": true,
                    "addStarttimeEndtimeFields": true,
                    "aggregateRoot": true,
                    "categorizable": false,
                    "description": "",
                    "mapToTable": "",
                    "parentClass": "",
                    "sorting": true,
                    "type": "Entity",
                    "uid": "1144368098046"
                },
                "propertyGroup": {
                    "properties": [
                        {
                            "allowedFileTypes": "",
                            "maxItems": "1",
                            "propertyDescription": "",
                            "propertyIsExcludeField": false,
                            "propertyIsL10nModeExclude": false,
                            "propertyIsRequired": true,
                            "propertyName": "title",
                            "propertyType": "String",
                            "uid": "286017497276"
                        }
                    ]
                },
                "relationGroup": {
                    "relations": [
                        {
                            "foreignRelationClass": "",
                            "lazyLoading": false,
                            "propertyIsExcludeField": false,
                            "relationDescription": "",
                            "relationName": "fieldset",
                            "relationType": "manyToMany",
                            "relationWire": "[wired]",
                            "renderType": "selectMultipleSideBySide",
                            "uid": "751634793557"
                        }
                    ]
                }
            }
        },
        {
            "config": {
                "position": [
                    35,
                    336
                ]
            },
            "name": "New Model Object",
            "value": {
                "actionGroup": {
                    "_default0_list": false,
                    "_default1_show": false,
                    "_default2_new_create": false,
                    "_default3_edit_update": false,
                    "_default4_delete": false,
                    "customActions": [
                        "render"
                    ]
                },
                "name": "Render",
                "objectsettings": {
                    "addDeletedField": true,
                    "addHiddenField": true,
                    "addStarttimeEndtimeFields": true,
                    "aggregateRoot": true,
                    "categorizable": false,
                    "description": "",
                    "mapToTable": "",
                    "parentClass": "",
                    "sorting": false,
                    "type": "Entity",
                    "uid": "1374612123325"
                },
                "propertyGroup": {
                    "properties": [
                        {
                            "allowedFileTypes": "",
                            "maxItems": "1",
                            "propertyDescription": "",
                            "propertyIsExcludeField": true,
                            "propertyIsL10nModeExclude": false,
                            "propertyIsRequired": false,
                            "propertyName": "dummy",
                            "propertyType": "String",
                            "uid": "78843774554"
                        }
                    ]
                },
                "relationGroup": {
                    "relations": []
                }
            }
        },
        {
            "config": {
                "position": [
                    600,
                    29
                ]
            },
            "name": "New Model Object",
            "value": {
                "actionGroup": {
                    "_default0_list": false,
                    "_default1_show": false,
                    "_default2_new_create": false,
                    "_default3_edit_update": false,
                    "_default4_delete": false,
                    "customActions": []
                },
                "name": "Constraint",
                "objectsettings": {
                    "addDeletedField": true,
                    "addHiddenField": true,
                    "addStarttimeEndtimeFields": true,
                    "aggregateRoot": true,
                    "categorizable": false,
                    "description": "",
                    "mapToTable": "",
                    "parentClass": "",
                    "sorting": false,
                    "type": "ValueObject",
                    "uid": "27821145686"
                },
                "propertyGroup": {
                    "properties": [
                        {
                            "allowedFileTypes": "",
                            "maxItems": "1",
                            "propertyDescription": "",
                            "propertyIsExcludeField": false,
                            "propertyIsL10nModeExclude": false,
                            "propertyIsRequired": false,
                            "propertyName": "mandatory",
                            "propertyType": "Boolean",
                            "uid": "525228298825"
                        },
                        {
                            "allowedFileTypes": "",
                            "maxItems": "1",
                            "propertyDescription": "",
                            "propertyIsExcludeField": false,
                            "propertyIsL10nModeExclude": false,
                            "propertyIsRequired": false,
                            "propertyName": "minLength",
                            "propertyType": "Integer",
                            "uid": "643582791764"
                        },
                        {
                            "allowedFileTypes": "",
                            "maxItems": "1",
                            "propertyDescription": "",
                            "propertyIsExcludeField": false,
                            "propertyIsL10nModeExclude": false,
                            "propertyIsRequired": false,
                            "propertyName": "maxLength",
                            "propertyType": "Integer",
                            "uid": "718694279358"
                        },
                        {
                            "allowedFileTypes": "",
                            "maxItems": "1",
                            "propertyDescription": "",
                            "propertyIsExcludeField": false,
                            "propertyIsL10nModeExclude": false,
                            "propertyIsRequired": false,
                            "propertyName": "mimeType",
                            "propertyType": "String",
                            "uid": "608882754629"
                        },
                        {
                            "allowedFileTypes": "",
                            "maxItems": "1",
                            "propertyDescription": "",
                            "propertyIsExcludeField": false,
                            "propertyIsL10nModeExclude": false,
                            "propertyIsRequired": false,
                            "propertyName": "maxFileSize",
                            "propertyType": "Float",
                            "uid": "1277741470579"
                        },
                        {
                            "allowedFileTypes": "",
                            "maxItems": "1",
                            "propertyDescription": "",
                            "propertyIsExcludeField": false,
                            "propertyIsL10nModeExclude": false,
                            "propertyIsRequired": false,
                            "propertyName": "maxFileSizeUnit",
                            "propertyType": "String",
                            "uid": "1029851674851"
                        }
                    ]
                },
                "relationGroup": {
                    "relations": [
                        {
                            "foreignRelationClass": "",
                            "lazyLoading": false,
                            "propertyIsExcludeField": false,
                            "relationDescription": "",
                            "relationName": "form",
                            "relationType": "zeroToOne",
                            "relationWire": "[wired]",
                            "renderType": "selectSingle",
                            "uid": "1215582411221"
                        },
                        {
                            "foreignRelationClass": "",
                            "lazyLoading": false,
                            "propertyIsExcludeField": false,
                            "relationDescription": "",
                            "relationName": "field",
                            "relationType": "zeroToOne",
                            "relationWire": "[wired]",
                            "renderType": "selectSingle",
                            "uid": "758528390550"
                        }
                    ]
                }
            }
        },
        {
            "config": {
                "position": [
                    879,
                    58
                ]
            },
            "name": "New Model Object",
            "value": {
                "actionGroup": {
                    "_default0_list": false,
                    "_default1_show": false,
                    "_default2_new_create": false,
                    "_default3_edit_update": false,
                    "_default4_delete": false,
                    "customActions": []
                },
                "name": "MailToSender",
                "objectsettings": {
                    "addDeletedField": true,
                    "addHiddenField": true,
                    "addStarttimeEndtimeFields": true,
                    "aggregateRoot": true,
                    "categorizable": false,
                    "description": "",
                    "mapToTable": "",
                    "parentClass": "",
                    "sorting": true,
                    "type": "Entity",
                    "uid": "1183105705509"
                },
                "propertyGroup": {
                    "properties": [
                        {
                            "allowedFileTypes": "",
                            "maxItems": "1",
                            "propertyDescription": "",
                            "propertyIsExcludeField": false,
                            "propertyIsL10nModeExclude": false,
                            "propertyIsRequired": true,
                            "propertyName": "title",
                            "propertyType": "String",
                            "uid": "478634201186"
                        },
                        {
                            "allowedFileTypes": "",
                            "maxItems": "1",
                            "propertyDescription": "",
                            "propertyIsExcludeField": false,
                            "propertyIsL10nModeExclude": false,
                            "propertyIsRequired": true,
                            "propertyName": "fromName",
                            "propertyType": "String",
                            "uid": "1474486420365"
                        },
                        {
                            "allowedFileTypes": "",
                            "maxItems": "1",
                            "propertyDescription": "",
                            "propertyIsExcludeField": false,
                            "propertyIsL10nModeExclude": false,
                            "propertyIsRequired": true,
                            "propertyName": "fromMail",
                            "propertyType": "String",
                            "uid": "525317678522"
                        },
                        {
                            "allowedFileTypes": "",
                            "maxItems": "1",
                            "propertyDescription": "",
                            "propertyIsExcludeField": false,
                            "propertyIsL10nModeExclude": false,
                            "propertyIsRequired": true,
                            "propertyName": "fromSubject",
                            "propertyType": "String",
                            "uid": "246548919991"
                        },
                        {
                            "allowedFileTypes": "",
                            "maxItems": "1",
                            "propertyDescription": "",
                            "propertyIsExcludeField": false,
                            "propertyIsL10nModeExclude": false,
                            "propertyIsRequired": true,
                            "propertyName": "fromSalutation",
                            "propertyType": "String",
                            "uid": "1267322327043"
                        },
                        {
                            "allowedFileTypes": "",
                            "maxItems": "1",
                            "propertyDescription": "",
                            "propertyIsExcludeField": false,
                            "propertyIsL10nModeExclude": false,
                            "propertyIsRequired": true,
                            "propertyName": "fromBody",
                            "propertyType": "RichText",
                            "uid": "38980434829"
                        },
                        {
                            "allowedFileTypes": "",
                            "maxItems": "1",
                            "propertyDescription": "",
                            "propertyIsExcludeField": false,
                            "propertyIsL10nModeExclude": false,
                            "propertyIsRequired": true,
                            "propertyName": "fromComplimentaryClose",
                            "propertyType": "RichText",
                            "uid": "890504853440"
                        },
                        {
                            "allowedFileTypes": "",
                            "maxItems": "1",
                            "propertyDescription": "",
                            "propertyIsExcludeField": false,
                            "propertyIsL10nModeExclude": false,
                            "propertyIsRequired": true,
                            "propertyName": "fromFooter",
                            "propertyType": "RichText",
                            "uid": "615492934993"
                        },
                        {
                            "allowedFileTypes": "",
                            "maxItems": "1",
                            "propertyDescription": "",
                            "propertyIsExcludeField": false,
                            "propertyIsL10nModeExclude": false,
                            "propertyIsRequired": false,
                            "propertyName": "appendData",
                            "propertyType": "Boolean",
                            "uid": "1085203612023"
                        },
                        {
                            "allowedFileTypes": "",
                            "maxItems": "1",
                            "propertyDescription": "",
                            "propertyIsExcludeField": false,
                            "propertyIsL10nModeExclude": false,
                            "propertyIsRequired": false,
                            "propertyName": "replyToName",
                            "propertyType": "String",
                            "uid": "1471320109256"
                        },
                        {
                            "allowedFileTypes": "",
                            "maxItems": "1",
                            "propertyDescription": "",
                            "propertyIsExcludeField": false,
                            "propertyIsL10nModeExclude": false,
                            "propertyIsRequired": false,
                            "propertyName": "replyToMail",
                            "propertyType": "String",
                            "uid": "1285998127330"
                        }
                    ]
                },
                "relationGroup": {
                    "relations": []
                }
            }
        },
        {
            "config": {
                "position": [
                    1120,
                    59
                ]
            },
            "name": "New Model Object",
            "value": {
                "actionGroup": {
                    "_default0_list": false,
                    "_default1_show": false,
                    "_default2_new_create": false,
                    "_default3_edit_update": false,
                    "_default4_delete": false,
                    "customActions": []
                },
                "name": "MailToSenderConfirm",
                "objectsettings": {
                    "addDeletedField": true,
                    "addHiddenField": true,
                    "addStarttimeEndtimeFields": true,
                    "aggregateRoot": true,
                    "categorizable": false,
                    "description": "",
                    "mapToTable": "",
                    "parentClass": "",
                    "sorting": true,
                    "type": "Entity",
                    "uid": "193253299192"
                },
                "propertyGroup": {
                    "properties": [
                        {
                            "allowedFileTypes": "",
                            "maxItems": "1",
                            "propertyDescription": "",
                            "propertyIsExcludeField": false,
                            "propertyIsL10nModeExclude": false,
                            "propertyIsRequired": true,
                            "propertyName": "title",
                            "propertyType": "String",
                            "uid": "1243084935142"
                        },
                        {
                            "allowedFileTypes": "",
                            "maxItems": "1",
                            "propertyDescription": "",
                            "propertyIsExcludeField": false,
                            "propertyIsL10nModeExclude": false,
                            "propertyIsRequired": true,
                            "propertyName": "fromName",
                            "propertyType": "String",
                            "uid": "807074277486"
                        },
                        {
                            "allowedFileTypes": "",
                            "maxItems": "1",
                            "propertyDescription": "",
                            "propertyIsExcludeField": false,
                            "propertyIsL10nModeExclude": false,
                            "propertyIsRequired": true,
                            "propertyName": "fromMail",
                            "propertyType": "String",
                            "uid": "206642574993"
                        },
                        {
                            "allowedFileTypes": "",
                            "maxItems": "1",
                            "propertyDescription": "",
                            "propertyIsExcludeField": false,
                            "propertyIsL10nModeExclude": false,
                            "propertyIsRequired": true,
                            "propertyName": "fromSubject",
                            "propertyType": "String",
                            "uid": "796094996668"
                        },
                        {
                            "allowedFileTypes": "",
                            "maxItems": "1",
                            "propertyDescription": "",
                            "propertyIsExcludeField": false,
                            "propertyIsL10nModeExclude": false,
                            "propertyIsRequired": true,
                            "propertyName": "fromSalutation",
                            "propertyType": "String",
                            "uid": "961169431939"
                        },
                        {
                            "allowedFileTypes": "",
                            "maxItems": "1",
                            "propertyDescription": "",
                            "propertyIsExcludeField": false,
                            "propertyIsL10nModeExclude": false,
                            "propertyIsRequired": true,
                            "propertyName": "fromBodyBeforeLink",
                            "propertyType": "RichText",
                            "uid": "192295256565"
                        },
                        {
                            "allowedFileTypes": "",
                            "maxItems": "1",
                            "propertyDescription": "",
                            "propertyIsExcludeField": false,
                            "propertyIsL10nModeExclude": false,
                            "propertyIsRequired": true,
                            "propertyName": "fromBodyAfterLink",
                            "propertyType": "RichText",
                            "uid": "551469504941"
                        },
                        {
                            "allowedFileTypes": "",
                            "maxItems": "1",
                            "propertyDescription": "",
                            "propertyIsExcludeField": false,
                            "propertyIsL10nModeExclude": false,
                            "propertyIsRequired": true,
                            "propertyName": "fromComplimentaryClose",
                            "propertyType": "RichText",
                            "uid": "195693495423"
                        },
                        {
                            "allowedFileTypes": "",
                            "maxItems": "1",
                            "propertyDescription": "",
                            "propertyIsExcludeField": false,
                            "propertyIsL10nModeExclude": false,
                            "propertyIsRequired": true,
                            "propertyName": "fromFooter",
                            "propertyType": "RichText",
                            "uid": "910125212212"
                        },
                        {
                            "allowedFileTypes": "",
                            "maxItems": "1",
                            "propertyDescription": "",
                            "propertyIsExcludeField": false,
                            "propertyIsL10nModeExclude": false,
                            "propertyIsRequired": false,
                            "propertyName": "replyToName",
                            "propertyType": "String",
                            "uid": "504045329597"
                        },
                        {
                            "allowedFileTypes": "",
                            "maxItems": "1",
                            "propertyDescription": "",
                            "propertyIsExcludeField": false,
                            "propertyIsL10nModeExclude": false,
                            "propertyIsRequired": false,
                            "propertyName": "replyToMail",
                            "propertyType": "String",
                            "uid": "1143173833262"
                        }
                    ]
                },
                "relationGroup": {
                    "relations": []
                }
            }
        },
        {
            "config": {
                "position": [
                    1360,
                    59
                ]
            },
            "name": "New Model Object",
            "value": {
                "actionGroup": {
                    "_default0_list": false,
                    "_default1_show": false,
                    "_default2_new_create": false,
                    "_default3_edit_update": false,
                    "_default4_delete": false,
                    "customActions": []
                },
                "name": "MailToReceiver",
                "objectsettings": {
                    "addDeletedField": true,
                    "addHiddenField": true,
                    "addStarttimeEndtimeFields": true,
                    "aggregateRoot": true,
                    "categorizable": false,
                    "description": "",
                    "mapToTable": "",
                    "parentClass": "",
                    "sorting": true,
                    "type": "Entity",
                    "uid": "163683597645"
                },
                "propertyGroup": {
                    "properties": [
                        {
                            "allowedFileTypes": "",
                            "maxItems": "1",
                            "propertyDescription": "",
                            "propertyIsExcludeField": false,
                            "propertyIsL10nModeExclude": false,
                            "propertyIsRequired": true,
                            "propertyName": "title",
                            "propertyType": "String",
                            "uid": "326582539086"
                        },
                        {
                            "allowedFileTypes": "",
                            "maxItems": "1",
                            "propertyDescription": "",
                            "propertyIsExcludeField": false,
                            "propertyIsL10nModeExclude": false,
                            "propertyIsRequired": true,
                            "propertyName": "fromName",
                            "propertyType": "String",
                            "uid": "215680448870"
                        },
                        {
                            "allowedFileTypes": "",
                            "maxItems": "1",
                            "propertyDescription": "",
                            "propertyIsExcludeField": false,
                            "propertyIsL10nModeExclude": false,
                            "propertyIsRequired": true,
                            "propertyName": "fromMail",
                            "propertyType": "String",
                            "uid": "812294415005"
                        },
                        {
                            "allowedFileTypes": "",
                            "maxItems": "1",
                            "propertyDescription": "",
                            "propertyIsExcludeField": false,
                            "propertyIsL10nModeExclude": false,
                            "propertyIsRequired": true,
                            "propertyName": "fromSubject",
                            "propertyType": "String",
                            "uid": "333740721427"
                        },
                        {
                            "allowedFileTypes": "",
                            "maxItems": "1",
                            "propertyDescription": "",
                            "propertyIsExcludeField": false,
                            "propertyIsL10nModeExclude": false,
                            "propertyIsRequired": true,
                            "propertyName": "toName",
                            "propertyType": "String",
                            "uid": "364272906155"
                        },
                        {
                            "allowedFileTypes": "",
                            "maxItems": "1",
                            "propertyDescription": "",
                            "propertyIsExcludeField": false,
                            "propertyIsL10nModeExclude": false,
                            "propertyIsRequired": true,
                            "propertyName": "toMail",
                            "propertyType": "String",
                            "uid": "6207491862"
                        },
                        {
                            "allowedFileTypes": "",
                            "maxItems": "1",
                            "propertyDescription": "",
                            "propertyIsExcludeField": false,
                            "propertyIsL10nModeExclude": false,
                            "propertyIsRequired": false,
                            "propertyName": "toCc",
                            "propertyType": "String",
                            "uid": "941425312915"
                        },
                        {
                            "allowedFileTypes": "",
                            "maxItems": "1",
                            "propertyDescription": "",
                            "propertyIsExcludeField": false,
                            "propertyIsL10nModeExclude": false,
                            "propertyIsRequired": false,
                            "propertyName": "toBcc",
                            "propertyType": "String",
                            "uid": "1445926765344"
                        },
                        {
                            "allowedFileTypes": "",
                            "maxItems": "1",
                            "propertyDescription": "",
                            "propertyIsExcludeField": false,
                            "propertyIsL10nModeExclude": false,
                            "propertyIsRequired": false,
                            "propertyName": "appendData",
                            "propertyType": "Boolean",
                            "uid": "720650225643"
                        }
                    ]
                },
                "relationGroup": {
                    "relations": []
                }
            }
        }
    ],
    "properties": {
        "backendModules": [],
        "description": "",
        "emConf": {
            "category": "plugin",
            "custom_category": "",
            "dependsOn": "typo3 => 8.7.0-0.0.0\n",
            "disableLocalization": false,
            "disableVersioning": false,
            "skipGenerateDocumentationTemplate": false,
            "sourceLanguage": "en",
            "state": "stable",
            "targetVersion": "9.5.0-9.5.99",
            "version": "9.5.4"
        },
        "extensionKey": "kitt3n_form",
        "name": "kitt3n | Form",
        "originalExtensionKey": "kitt3n_form",
        "originalVendorName": "KITT3N",
        "persons": [],
        "plugins": [
            {
                "actions": {
                    "controllerActionCombinations": "Form => render",
                    "noncacheableActions": "",
                    "switchableActions": ""
                },
                "description": "",
                "key": "kitt3nformformrender",
                "name": "kitt3n_form :: Form :: render"
            },
            {
                "actions": {
                    "controllerActionCombinations": "Render => render",
                    "noncacheableActions": "Render => render",
                    "switchableActions": ""
                },
                "description": "",
                "key": "kitt3nformrenderrender",
                "name": "kitt3n_form :: Render :: render"
            }
        ],
        "vendorName": "KITT3N"
    },
    "wires": [
        {
            "src": {
                "moduleId": 2,
                "terminal": "relationWire_0",
                "uid": "349098386859"
            },
            "tgt": {
                "moduleId": 1,
                "terminal": "SOURCES",
                "uid": "811822728403"
            }
        },
        {
            "src": {
                "moduleId": 3,
                "terminal": "relationWire_0",
                "uid": "751634793557"
            },
            "tgt": {
                "moduleId": 2,
                "terminal": "SOURCES",
                "uid": "514118505047"
            }
        },
        {
            "src": {
                "moduleId": 0,
                "terminal": "relationWire_0",
                "uid": "12746542469"
            },
            "tgt": {
                "moduleId": 3,
                "terminal": "SOURCES",
                "uid": "1144368098046"
            }
        },
        {
            "src": {
                "moduleId": 5,
                "terminal": "relationWire_0",
                "uid": "1215582411221"
            },
            "tgt": {
                "moduleId": 0,
                "terminal": "SOURCES",
                "uid": "1176672314472"
            }
        },
        {
            "src": {
                "moduleId": 5,
                "terminal": "relationWire_1",
                "uid": "758528390550"
            },
            "tgt": {
                "moduleId": 1,
                "terminal": "SOURCES",
                "uid": "811822728403"
            }
        },
        {
            "src": {
                "moduleId": 0,
                "terminal": "relationWire_2",
                "uid": "394047900881"
            },
            "tgt": {
                "moduleId": 6,
                "terminal": "SOURCES",
                "uid": "1183105705509"
            }
        },
        {
            "src": {
                "moduleId": 0,
                "terminal": "relationWire_1",
                "uid": "239822643255"
            },
            "tgt": {
                "moduleId": 7,
                "terminal": "SOURCES",
                "uid": "193253299192"
            }
        },
        {
            "src": {
                "moduleId": 0,
                "terminal": "relationWire_3",
                "uid": "374123358976"
            },
            "tgt": {
                "moduleId": 8,
                "terminal": "SOURCES",
                "uid": "163683597645"
            }
        }
    ],
    "log": {
        "last_modified": "2019-02-18 09:39",
        "extension_builder_version": "9.10.0",
        "be_user": " (3)"
    }
}