<?xml version="1.0" encoding="UTF-8" standalone="no"?>
<!DOCTYPE svg PUBLIC "-//W3C//DTD SVG 1.1//EN" "http://www.w3.org/Graphics/SVG/1.1/DTD/svg11.dtd">
<svg width="100%" height="100%" viewBox="0 0 482 482" version="1.1" xmlns="http://www.w3.org/2000/svg" xmlns:xlink="http://www.w3.org/1999/xlink" xml:space="preserve" xmlns:serif="http://www.serif.com/" style="fill-rule:evenodd;clip-rule:evenodd;stroke-linejoin:round;stroke-miterlimit:1.41421;">
    <g transform="matrix(-1,0,-0,1,482,0)">
        <g transform="matrix(-1,0.577401,0,1,482,-129.222)">
            <path d="M223.8,482L29.3,482L29.3,257.305L223.8,257.305L223.8,482ZM161.064,405.418C159.044,406.015 157.436,406.238 155.323,406.238C138.019,406.238 112.612,345.769 112.612,325.643C112.612,318.235 114.364,315.763 116.84,313.64C95.661,316.113 70.25,323.884 62.122,333.763C60.367,336.239 59.3,340.118 59.3,345.063C59.3,376.482 92.835,447.773 116.49,447.773C127.433,447.773 145.883,429.783 161.064,405.418ZM150.018,311.531C171.901,311.531 193.8,315.06 193.8,327.412C193.8,352.473 177.905,382.843 169.795,382.843C155.32,382.843 137.316,342.594 137.316,322.467C137.316,313.29 140.845,311.531 150.018,311.531Z" style="fill:rgb(244,151,0);"/>
        </g>
        <path d="M315,43.3L240.2,0L40.3,115.4L115.2,158.7L315,43.3Z" style="fill:rgb(244,151,0);fill-rule:nonzero;"/>
        <path d="M440,115.4L353.8,66.3L154,181.7L165.4,187.6L240.2,230.8L314.6,187.9L440,115.4Z" style="fill:rgb(244,151,0);fill-rule:nonzero;"/>
        <path d="M138.9,264.3L103.1,245.9L103.1,188.7L29.3,146.2L29.3,369.3L222.4,480.8L222.4,257.7L138.9,209.6L138.9,264.3Z" style="fill:rgb(244,151,0);fill-rule:nonzero;"/>
    </g>
</svg>
