{
  "compilerOptions": {
    "baseUrl": "./",
    "paths": {
      "@": ["src/"],
      "@api": ["src/api/"],
      "@styles": ["src/styles/"],
      "@assets": ["src/assets/"],
      "@mocks": ["src/mocks/"],
      "@hooks": ["src/hooks/"],
      "@components": ["src/components/"]
    }
  }
}
