826654 893517
732952 921510
919664 224080
125988 379640
174946 574338
413284 357181
247600 116248
857736 293057
951343 995709
441943 790763
373618 150971
149993 691719
965642 369040
811750 49665
316420 819150
794704 568586
802341 415579
533836 820086
293163 520648
254953 832465
607902 794171
193206 174239
767909 346034
74362 928422
349080 954044
297405 442532
34005 872454
184112 507191
521197 97245
94925 623248
611735 379466
514766 2695
499429 346218
561783 131621
818870 519524
823981 133992
358172 799567
642147 885903
693510 775682
250417 425318
614412 190492
713102 171958
412120 408683
519395 698031
783223 969498
888574 766535
329228 196224
742745 91563
165140 464527
880260 817968
356898 287360
622735 414583
987745 496426
188520 829364
773454 449707
584567 419166
191681 405262
677902 737715
57200 400564
64953 76319
45469 374682
203944 892702
839994 763463
430383 923314
777087 641102
819220 989772
780710 56860
817838 102026
491025 162973
491006 814245
721809 474313
787147 343227
752459 243269
728999 557846
997385 155546
111682 777525
587562 867570
610338 708443
414386 567517
767744 280404
273190 743484
780268 487446
229457 575743
505283 222454
973283 52745
135742 627898
566110 21121
720800 598074
243980 716993
428209 740142
50137 982013
71522 511364
516831 627102
826390 854718
672482 601373
738951 611917
794412 863281
236225 915536
275893 529197
306622 471093
386243 707029
416699 536240
731502 110457
305947 906415
106520 237729
79821 151170
267858 295350
419385 639502
334642 622161
248739 287252
959908 962509
185614 950342
146805 217740
742529 710225
861365 493828
727586 165086
167309 127632
940947 25706
851474 192148
975263 248178
72230 214727
179758 400682
945285 120846
196748 626077
479566 767247
230246 373448
467132 132582
210494 377945
279395 228408
388667 278862
46988 837803
99151 604748
350687 893893
425509 316210
681311 523531
870446 361641
422512 276001
112344 582156
776387 850245
475564 407978
755712 324722
589275 26604
16923 808955
144349 962043
955246 128589
581082 888357
828689 681517
875501 896446
749345 263704
691350 638107
402524 174381
941261 211496
791064 539673
128975 413717
120124 881018
868269 51847
665299 542565
283780 589489
338164 203046
848918 842915
105823 159361
856987 262140
841756 396560
906311 363908
850971 71027
562207 475304
931865 936028
105231 780260
874276 123605
722147 989552
241820 321697
541071 377987
762462 603925
191161 357537
228077 162114
766835 622029
603063 69476
731023 636449
773014 656646
248150 366619
175409 309032
136805 96251
494827 587426
862046 839391
174890 341349
953653 546323
150805 976901
833005 497018
119834 899139
774051 824359
884225 196796
583054 242349
71662 560583
1468 282530
202646 662081
545994 261032
883194 620864
504265 565818
558173 494153
539702 572460
125891 88795
565974 93424
938076 883035
973409 689096
386521 397331
422798 748539
323305 146735
341718 923339
612833 95830
808016 446234
293103 903007
703271 642820
113272 728704
159713 451389
602957 114374
42454 92377
622200 463486
983740 574123
350776 717016
409193 80533
765119 982550
370563 138339
685308 148270
211820 112239
442693 992847
446370 644017
615843 873451
