702428 281142 509
759945 507721 509
800899 500682 509
172806 817189 509
358195 881226 525
930118 652521 525
334977 937050 525
195549 55602 383
796435 708534 468
351806 88135 443
831622 441705 509
106277 46252 354
152201 868932 525
959899 76870 525
659966 234302 509
248694 180959 443
293513 369347 441
718824 534980 509
118192 824558 509
853918 59943 525
144810 831544 509
757804 687955 504
195239 702071 509
601600 561984 434
63603 112084 354
844541 19165 525
205240 19444 383
52919 800195 509
979905 782919 525
981280 746208 525
530432 49425 470
705998 91485 509
795974 718067 468
629431 65926 509
213163 999040 525
954714 395323 525
44521 398214 443
855120 661762 525
891118 522088 525
506205 990364 525
314989 289804 384
248787 606389 470
447311 391285 449
717863 20634 509
648798 788987 504
537645 900052 525
295936 262879 407
783455 973371 525
830697 899690 525
755189 855951 525
287539 129489 443
170224 637565 509
618484 977505 525
234082 469216 449
338022 894759 525
538536 597814 452
459258 948740 525
229750 840253 525
200710 405181 443
233891 806889 509
192562 987648 525
915235 777380 525
175815 750001 509
377452 648355 509
760108 298332 509
240717 959837 525
861265 376888 525
970177 596472 525
216905 932875 525
283971 27111 443
691164 928214 525
904948 728978 525
168826 2254 383
340281 474343 449
722642 352478 509
547373 841906 525
265758 123892 443
243095 528296 470
193345 195248 342
130346 822135 509
408801 989502 525
455737 421196 418
47833 973005 525
630834 63444 509
250078 452851 449
388781 23916 443
112695 734134 509
474032 244996 449
258275 368955 441
841629 160148 525
563463 828168 509
142714 889266 525
70930 367701 443
412444 109997 449
705447 623432 509
426496 127907 449
974656 252449 525
116005 983251 525
546405 292571 470
471240 337974 449
210657 5069 383
96346 436258 449
681769 387391 509
383672 619269 470
239409 621412 470
406345 898664 525
824694 603835 509
15613 812438 509
52923 502849 449
260174 495982 449
691397 665563 398
408484 17584 443
972602 328074 525
419136 143263 449
474340 955406 525
632052 805999 504
611058 376270 470
481329 17927 449
632604 32088 509
774941 724374 468
382789 209101 443
724435 225944 509
198670 213684 373
408423 42349 443
965507 343031 525
83352 792169 509
578280 481674 470
304220 116266 443
604853 368110 470
311325 961806 525
515533 971335 525
392052 281168 441
614916 152764 470
113601 323355 443
19319 577369 470
5367 108273 354
119338 989424 525
6691 1292 262
399706 446902 449
97819 817673 509
493962 67942 449
688215 947981 525
392803 244054 441
663260 18123 509
872760 193472 525
268247 851638 525
680925 343855 509
201566 483921 449
770018 966301 525
961667 617417 525
262781 607874 470
736478 177774 509
827915 795119 468
32019 603987 470
376367 268563 441
390843 19868 443
665645 453196 509
78805 724473 509
925913 648053 525
725161 658786 504
3015 191230 383
259015 105307 443
131113 395022 443
904049 828114 525
454814 736734 509
656381 91758 509
587606 433627 470
868857 68453 525
995688 898751 507
922045 108800 525
981886 221074 525
724602 158631 509
715358 613756 509
322732 99260 443
867129 158477 525
753747 304897 509
281488 831568 509
186867 155374 383
115901 678277 509
109366 605278 470
522823 581476 452
518385 919298 525
723643 666662 504
366554 625214 470
932084 77320 525
315714 954564 525
845212 489727 525
502607 483283 426
399317 984497 525
611614 555711 434
148264 449387 449
266233 54421 443
62135 310663 443
300500 195985 443
454815 383085 449
414694 61608 449
306280 356058 441
697079 168038 509
897047 471 525
565502 142538 470
43176 729944 509
720134 968281 525
704176 387917 509
559130 698552 509
159814 577236 470
512162 847032 525
835716 674897 504
149190 240939 443
32536 237522 443
901261 958088 507
615325 542221 452
98632 725850 509
898460 150367 525
405490 864892 525
530296 226597 470
602345 625793 447
346524 209418 443
653519 801866 504
843111 73898 525
579640 379808 470
613321 569746 434
251564 353437 441
511631 655229 509
654716 436636 509
522773 348235 470
562608 403231 470
576582 850754 525
448467 460782 387
992799 210997 525
437332 978988 525
20435 701565 509
414501 352300 449
971083 18772 525
894842 407416 525
109994 629254 509
610534 621454 447
272086 464892 449
884382 248438 525
606372 818114 509
37693 69268 340
762516 772313 468
565514 925724 525
137854 537368 470
463122 149150 449
58321 808450 509
308630 8920 443
777637 263925 509
108784 554649 470
639273 430491 509
414432 209243 449
248050 429938 449
53510 405989 443
707384 345228 509
725004 200098 509
91218 851565 525
210373 188400 373
510392 680343 509
976303 970001 458
459662 554114 470
980215 212103 525
268939 44158 443
495087 614762 470
595112 631751 509
982552 754064 525
650401 518715 509
175769 210636 373
775036 722237 468
473400 421400 444
910781 158795 525
733987 605612 509
553361 54178 470
860418 936171 476
37617 675067 509
462012 73420 449
144407 376199 443
685588 482676 509
293984 406274 441
86485 894165 525
656526 838594 525
134972 306612 443
