802186 7957 509
761844 624600 509
685517 976632 525
443178 477071 444
886438 769775 525
109328 946009 525
844404 624354 525
574561 522299 452
745590 869077 525
16927 823689 509
971702 366636 525
422579 322038 449
404682 406365 405
270367 653603 509
589915 545982 452
145031 309084 443
388568 480342 449
39559 875278 525
624821 897957 525
715889 637984 504
728644 166511 509
154602 683924 509
477970 192095 449
778216 729791 468
736279 718635 424
399074 39874 443
438365 664068 509
712620 125199 509
863458 799148 525
808585 277099 509
853811 130114 525
167288 983472 525
468591 742895 509
861174 456706 525
73007 591207 470
26969 251707 443
171601 325775 443
977665 795625 525
819154 153650 509
418020 541786 470
365147 539037 470
703692 825677 504
764478 762845 375
223244 220182 355
443755 690719 509
544518 772436 509
794032 416323 509
245112 448784 449
265803 967755 525
469291 423735 444
617810 238839 470
492447 834655 509
331798 927086 525
288905 104906 443
351897 915364 525
431152 318244 449
626916 130250 509
258853 269000 407
609594 708862 509
818159 393102 509
530856 532643 346
479458 42797 449
513105 120414 470
753305 721079 424
495880 375389 449
351888 152516 443
650099 405480 509
290835 994361 525
287326 793682 509
365787 298108 441
1059 450785 449
842407 151230 525
394335 252637 441
772977 254153 509
40203 703831 509
266303 212337 443
325745 656492 509
666843 773459 504
204956 848426 525
678298 208849 509
585985 700788 509
554854 290024 470
424098 906182 525
636471 204594 509
3449 529235 470
166681 391804 443
557079 879533 525
41681 381205 443
175315 457444 449
670990 700989 442
875335 151438 525
83045 358595 443
41050 879842 525
494568 358822 449
88410 345412 443
871914 75102 525
23986 185202 383
836322 74207 509
619909 73021 470
426239 186763 449
785430 721018 468
492706 629102 509
789163 830926 468
362601 769961 509
148638 603267 470
17302 867964 525
564170 565163 421
7463 584945 470
774023 801162 468
487109 767470 509
850618 886729 432
54620 557661 470
428631 911696 525
162925 819154 509
678143 321306 509
548058 550813 346
971514 263107 525
116557 21186 354
302320 496078 449
159333 463391 449
250279 817774 509
257242 648573 509
646418 958979 525
653844 909276 525
141478 858907 525
842808 916476 476
372568 341473 441
953642 346771 525
510303 844673 525
923755 63149 525
359095 639074 509
974246 889473 507
312898 755265 509
405619 785486 509
822858 19199 509
114938 331189 443
403819 235482 441
421060 6340 449
48400 419848 449
926739 242681 525
46274 503717 449
518275 987326 525
725685 870487 525
93482 848957 525
785419 263029 509
149376 152564 370
632035 971985 525
6572 201956 383
268570 231547 407
665706 646704 442
592221 860958 525
336099 491551 449
473644 531280 470
93563 726422 509
175186 659646 509
228837 383389 443
217083 791528 509
411816 315911 449
170530 915340 525
742926 810538 468
365541 425773 449
200686 383206 443
132559 325578 443
578433 240170 470
514456 559633 452
831883 765627 468
602532 56868 470
365353 336276 441
380194 906235 525
452633 903263 525
727202 881518 525
527918 566551 452
637854 44482 509
902096 325057 525
158494 533590 470
463342 142475 449
855296 261380 525
73570 216985 386
820907 340143 509
894861 145812 525
972950 374661 525
117679 630846 509
77240 119310 354
774176 2022 509
659869 644316 429
706532 626967 504
856175 590072 525
975296 854353 507
403281 864567 525
64654 532750 470
517930 168539 470
786713 808150 468
867470 147536 525
213236 949601 525
339911 370779 441
978499 940092 458
428430 980755 525
860798 488087 525
144681 130680 375
390380 298261 441
723209 78509 509
218025 162364 386
431050 779518 509
380844 625687 470
190771 882287 525
798896 92246 509
215920 839843 525
420446 120199 449
935717 994540 507
431131 833155 509
966928 512793 525
10804 653116 509
16102 188887 383
500629 514366 470
921383 43393 525
440580 106310 449
892487 98286 525
387203 574656 470
208667 105109 383
98047 231478 443
159669 901682 525
605282 763120 509
824718 75751 509
775830 227725 509
966819 704043 525
775316 206965 509
875735 773087 525
219847 805319 509
790195 500100 509
698621 33992 509
454591 154498 449
392402 940664 525
389435 759056 509
195193 670322 509
662343 289127 509
246092 378517 441
487446 222968 449
957202 832806 525
587772 789604 509
