132349 281903
674320 588660
537552 452524
586839 235457
248805 49907
913928 631526
710430 574904
811666 563005
867776 920673
392069 168671
208869 19425
515736 621389
208362 868566
353606 196247
639697 17434
429055 393803
711805 18697
697321 153388
265394 504720
139043 193677
491933 264259
152131 562728
687264 931464
638806 865920
912743 983164
374893 267842
674314 662150
321159 645975
332200 229693
533720 669258
996692 399506
721224 438196
90155 248940
144997 839377
911446 686563
570858 576091
715950 804235
278575 543965
860813 350920
328406 360844
782441 602019
880554 708850
577639 793246
908148 126434
228007 751338
436032 563657
502619 995675
872328 816730
477777 398713
72465 717552
745998 83695
904619 636707
778849 263553
675717 198804
388184 797949
650883 813721
646456 568494
301800 709051
130947 842577
49102 570142
651245 547481
19721 650099
850590 569817
678826 237620
14340 440027
142266 63610
443890 639428
265214 170950
735590 944409
247157 800733
458976 438122
850361 989285
905117 920211
969075 657473
373638 457037
38876 221281
630093 436442
850481 612457
929485 126127
480566 631288
827067 833887
858510 799046
174893 455261
574829 632397
639989 872296
238271 608379
583732 640988
111172 184116
336897 442424
793183 263670
914494 77498
357098 914937
624196 855328
320488 655175
29059 476432
694287 561443
12395 35364
943493 454147
359252 51660
541075 499860
832740 805603
658971 629417
385435 644828
93072 496111
980612 161328
254139 974809
227350 936297
582308 901852
224250 948375
131208 898651
268711 867371
997323 230949
133841 427467
491231 321690
799119 653126
497144 300370
143572 747435
951498 230088
967089 223168
500341 192490
264557 851183
457432 842528
257889 397409
486432 314230
490040 929296
200014 736033
57393 835962
169346 374910
523625 734359
620939 252939
132006 713990
305680 313014
368163 955233
526990 743177
649989 830094
27727 813128
223492 892963
15595 252313
778833 581668
535395 463268
571368 828224
391225 275627
754803 711376
830835 640189
837102 395540
132218 889547
917436 362903
603928 545017
889523 212927
633784 818246
314874 14775
632220 522606
594857 766879
238565 690481
632000 718422
11570 763386
715673 227328
786200 521137
995110 47842
773583 618872
499135 853192
94318 251727
96778 930149
796227 445085
681447 789324
535296 421051
241057 621572
399842 306261
291331 728823
490164 710863
814935 541926
543823 916318
946366 200243
186474 199175
823944 632094
665157 644338
104696 80490
743778 853287
705461 418548
863590 419752
858432 421400
770844 899462
400781 440119
22833 522013
756789 641204
342934 109605
657420 417614
238639 36526
530524 246596
766705 447850
787828 233697
623991 640975
264892 828261
194585 958999
157372 345292
671825 346982
723412 208369
875297 405264
486139 602363
6812 158767
940306 94342
354434 826021
346501 893845
326565 569475
714029 180805
125194 371875
830460 366607
501959 48096
833851 865107
490522 221273
505288 636057
259488 846531
548173 954334
418117 167642
424491 637347
450827 131070
595270 578653
621668 235983
703370 786130
801104 519319
484944 571524
306671 220180
601733 309614
952305 447093
66435 439303
204292 290707
966755 729386
398499 913653
457585 275487
7536 690726
674856 513209
665763 338899
300836 836900
650698 606955
390261 255372
491761 143138
834623 530293
424435 972426
301708 576577
633834 390057
907697 445505
