605518 1577
690514 809808
768183 869568
881805 661995
888842 943726
563682 927851
386980 682042
369746 949976
283435 726943
821464 102068
344044 562535
489304 630646
654538 453899
140191 793113
526820 975900
855216 808621
33693 433329
938554 446468
687928 622675
67688 820334
602156 255457
25639 801731
408630 774938
825462 339025
394240 666982
98847 870275
857757 390727
185358 20913
671491 23892
874414 35421
560761 498550
284279 325303
394358 907809
454988 93245
23486 147200
36088 731112
225457 257344
13966 366214
82733 586850
386131 550031
605633 464620
743176 578735
257215 809891
275462 47635
363655 232697
505051 89371
920314 418924
465191 976597
588502 768887
160244 38731
830766 285294
952779 283920
583163 689676
781196 216758
107807 672815
491742 865334
662025 531767
381568 878447
392278 105120
923767 514498
657821 772276
302293 67701
492821 119046
407395 727525
88087 810393
659423 172614
989806 921927
718487 839747
346411 249410
952172 796470
531397 126432
785705 701755
364817 976340
268003 731005
471062 192599
585093 184778
562453 30729
561699 413272
849676 937618
875885 148088
37051 295902
262935 65236
168966 241373
594173 261232
822473 885386
370492 777594
321736 494427
526390 699365
988567 289740
936895 139877
908269 998526
370489 863213
608589 168456
365674 965458
407145 978338
332135 617881
750061 965247
609072 606738
144275 257531
803408 745139
984465 897058
906966 224892
130657 426202
146347 173356
104129 336153
748451 246083
874138 712644
904333 405918
252927 677658
206478 776832
644452 487304
137310 907708
383910 478432
938955 694175
258904 372553
129853 480430
815301 227204
876028 134203
938680 999502
311236 644789
61068 994210
969022 853078
905257 908430
864841 514478
672452 415205
219157 829850
249334 687563
472649 22146
159616 868397
67074 963652
435442 537984
752829 510993
781603 178815
349633 553780
226436 696543
739544 952669
157118 449055
718452 284681
778132 612447
688202 677481
147627 688275
521127 692910
556482 708041
337025 149483
339946 254015
146438 195382
832068 904229
227518 114050
131181 100619
1429 494975
449513 444124
458269 146405
82988 548125
518954 707216
113123 201536
356922 482417
845379 845087
835587 268200
39757 214450
434255 182395
496028 157762
594295 620389
27763 474190
669806 454729
878505 73031
308454 436114
426756 107985
490654 549829
662485 529035
14745 463793
28478 154062
588961 816092
896816 772375
199326 275237
376548 716381
170789 553488
782208 918400
915554 988131
319080 977092
956334 633288
463012 256614
863354 52069
422231 24108
69633 756152
493925 378937
574798 792971
118895 77192
738456 694406
983355 496314
408663 344006
872009 78018
71149 965710
284259 368145
486922 977071
764070 785512
291389 742559
795453 283376
757807 903881
183795 421471
203544 839141
839050 404697
67801 293016
521362 729202
101839 234609
163931 857521
878885 741864
483602 456865
861918 54419
580620 885810
998489 350169
122634 625759
37012 245576
378028 596644
895753 638498
344496 22467
