491733 813920
570496 969079
989989 137996
328394 764012
595860 794131
717810 170747
409362 353941
242645 883962
452064 628181
413473 810832
71725 738572
596265 669974
261244 382484
852702 169917
277543 508942
571670 220275
686050 49682
912869 741261
75364 723909
35709 440594
185811 498396
569783 523105
216858 810750
25463 484982
579972 983883
247991 711648
992435 289808
179375 320780
933792 937960
280718 840759
330847 618088
298929 891027
114485 756298
746514 685142
310161 269624
233822 349023
943427 442537
950759 280807
779067 392246
923784 304457
7393 96423
610852 494257
300811 928090
603304 430862
833301 438538
514841 261461
386603 701850
53240 575171
872455 24127
12194 562968
449437 930849
284262 254046
575616 176716
444577 136586
504696 988786
23782 565403
1271 901613
961395 321600
362132 811063
327813 530790
487718 365147
580251 85753
853370 992571
874410 921729
914402 963334
5270 616855
609448 307169
402498 510576
467743 366372
467760 547426
227234 720435
329928 221431
239464 962068
675354 555381
871684 922303
51955 688513
49221 171521
800652 925730
323702 918793
484606 555733
319285 704664
469332 607852
941249 749818
679841 466336
367277 819709
217750 110169
817967 894153
790348 508600
574523 606591
328075 192206
372837 328513
794962 460044
577169 652631
187479 73042
765355 435319
73234 894108
548259 97076
872090 731889
221917 397161
249283 908712
600645 153404
506306 511578
839410 371217
31182 8528
582589 993918
165012 752500
856206 809602
968809 757262
565092 349300
717457 818259
206322 171733
268163 442464
814327 256553
536587 782154
540172 769335
839425 297372
156254 43519
595717 804976
489379 543469
734816 859847
540507 317811
96493 957407
400276 743623
912551 772663
209293 221051
454122 224689
565881 386553
886534 364840
131054 446902
821121 179402
214660 472274
828962 199295
169578 668655
162363 734879
745593 782157
272984 767340
370289 311913
471262 719292
509169 930707
31700 352468
391224 781167
651328 160541
585659 283031
137341 319054
316842 449794
221494 561798
87029 275717
829486 811321
263360 281623
426618 538635
297172 887521
673132 329693
184496 32574
250214 830193
204146 901964
427934 254351
53889 796882
7311 454497
781057 601420
549474 764381
297499 717778
218591 400691
119616 50000
268304 576499
843554 752020
140572 67926
304413 644691
914539 456067
849714 87772
849539 892708
162312 87507
315403 666749
2895 667431
963501 899624
503885 998419
818774 5101
56306 720177
52805 996715
438994 820354
153369 577959
204509 18265
906922 459272
621308 485577
402764 235697
211958 128787
232863 312373
826089 344674
808483 611906
39580 106455
831184 367096
27147 5629
827137 118797
950287 498059
382899 923286
465957 281707
509699 292476
571393 428752
270224 51128
691624 432368
784056 868814
983349 809746
261615 292467
920888 613516
249042 123881
915507 198361
943047 920400
321974 386925
33780 974791
237282 390459
140052 182719
59628 604878
