40982 472590
840695 4667
661438 696574
766455 860077
209991 16376
474229 141273
119545 752598
56402 375414
754306 734633
227860 87554
155774 574786
365960 978735
943306 161469
234675 530326
901029 664323
168928 332556
636364 881045
600498 412015
108748 26969
468663 89292
849366 488388
73304 280818
818918 388296
937052 52746
74717 11462
749011 63917
338608 558587
790833 880535
657211 448754
27140 499242
250624 468746
470875 584485
142984 705913
862267 398424
826029 183038
908808 785381
974490 346328
903211 771472
673541 669743
640412 473768
613445 611050
154470 736382
42649 881199
771149 249529
827593 115312
663339 288211
597415 623568
837787 54637
117213 591724
173009 606651
387518 292157
224253 307306
545617 109948
46916 269857
321320 458007
416200 977007
479365 54879
451314 727005
655315 845940
671594 82639
285599 325545
120196 637739
895931 249304
173499 913087
272902 171503
480935 771642
984799 859596
104723 695317
860129 808265
746619 98823
113899 24152
491005 603290
278476 92937
536568 452575
251546 615177
385302 681227
876496 82670
686948 397345
942744 93613
467560 65479
23489 890861
357657 452788
642926 312894
51399 270002
735917 974031
651381 848490
369354 810999
357322 420842
216608 455827
875123 96518
324320 780368
300662 473880
266904 402250
935905 387604
303875 387576
411440 625402
836848 508302
334819 62608
466544 323231
241135 572976
242698 21593
40210 6798
740631 179824
700871 94724
324366 292831
286998 156399
787369 565352
183853 509289
175974 799568
549933 771160
518919 978760
524110 957965
221755 375688
822541 144434
951992 993229
688798 771164
853554 151863
165686 686394
700241 694353
478385 333459
482275 619754
872718 960232
333650 347562
624890 515753
697342 147657
154430 620485
385071 557231
805138 589959
203508 439027
972476 561775
959382 955737
246420 808172
827807 99089
102049 396083
748711 11877
65832 287740
154532 769327
495761 757904
258156 690514
392193 958229
426247 290670
37645 868773
240391 472479
798788 212556
269091 44380
513407 567859
409049 573855
100411 757011
676612 682536
560505 263637
719302 71999
332610 397088
200190 560780
576278 977199
892110 581755
924975 582643
133383 566735
961040 399411
947953 322495
465529 368694
89036 996180
747928 583121
180328 607595
457808 497957
27896 907373
702693 26638
715352 164959
774302 863695
754035 562885
490457 654741
229810 497188
275295 362522
143146 67436
599466 305479
729304 844388
227290 439033
264598 394616
518885 130630
570869 563853
101564 177353
630092 271983
857676 270384
528154 894023
850324 436425
488638 200285
734007 958549
451006 758926
410152 385824
393577 385391
589445 193680
583219 395028
833010 574019
362604 346218
557505 264314
402180 73712
756531 191149
493890 241528
527198 143093
820693 552813
414534 835728
277737 505431
929153 88451
