758522 621072 509
387349 419692 449
974900 498324 525
542189 366052 470
659252 789895 504
566425 200868 470
847584 104019 525
915453 872241 476
642522 886097 525
324769 112653 443
325353 335695 353
759822 744668 424
291155 176750 443
238736 82343 443
296076 491571 449
63594 28682 340
108673 98820 354
546185 683725 509
165755 354405 443
449737 174647 449
551973 223611 470
215113 184300 373
246443 911489 525
654264 725229 504
508118 538250 470
833601 897516 525
407727 368064 436
64962 365666 443
11863 31196 308
273972 908911 525
929735 832806 525
346454 186490 443
46016 565521 470
986222 390670 525
680706 267899 509
396852 649499 509
803035 315130 509
658755 59665 509
662780 158879 509
953931 127959 525
993304 90626 525
201754 556752 470
143739 886338 525
916855 891082 476
427192 182252 449
402281 425067 449
781568 157061 509
986353 291588 525
523609 128627 470
603637 510808 470
817514 716394 468
247171 766547 509
610150 931789 525
562350 559995 359
204363 391318 443
23029 71368 340
85415 251408 443
869591 100193 525
278854 395801 441
715810 713253 380
864698 627842 525
810091 129816 509
718002 266184 509
671707 356730 509
840750 308182 525
259136 724762 509
194027 126888 383
610640 241981 470
735847 657571 504
216126 537733 470
818441 49690 509
410173 944265 525
901478 522224 525
1777 169709 383
942728 376265 525
391651 44827 443
95727 357737 443
902130 112706 525
485586 610768 470
340703 307560 384
203411 419262 449
452829 261796 449
710432 833024 468
312464 10448 443
894889 470677 525
200064 628644 509
519388 329597 470
899017 55159 525
535889 392213 470
892393 476845 525
979745 734809 525
356255 834833 509
560484 674744 509
987582 202701 525
949903 8061 525
211251 30853 383
168287 950218 525
949047 562483 525
396749 992675 525
945056 673692 525
519005 122820 470
925083 949331 507
948072 268618 525
197636 784444 509
628302 114325 509
723039 801508 468
413356 139933 449
19164 384448 443
783991 17508 509
123460 985562 525
107044 336575 443
820905 96022 509
828648 473624 509
493620 126116 449
899267 545053 525
691561 56118 509
978315 815194 525
761388 366165 509
262198 172211 443
49821 276840 443
816915 747849 468
763597 862325 525
350157 121642 443
226169 55158 386
808546 391360 509
847684 509797 525
143947 467363 449
121505 282559 443
934264 503451 525
33909 843887 525
219605 896400 525
560477 916676 525
605938 804033 509
762710 240968 509
354130 874566 525
425493 121321 449
550336 258915 470
621691 597684 447
253879 708783 509
97225 268007 443
498161 907401 525
195686 13182 383
212651 167527 373
892218 909060 445
731668 68748 509
72829 955459 525
3610 753425 509
337076 253622 407
251022 295042 407
893495 681663 525
496812 797868 509
906044 205480 525
289914 98188 443
786131 176311 509
306349 188037 443
371728 100037 443
507075 111961 449
880934 65765 525
21582 899963 525
379084 551044 470
153688 20889 375
824635 60520 509
72039 370593 443
4586 489965 449
466924 640735 509
958373 220241 525
745425 229937 509
391692 907087 525
224720 552633 470
495472 920157 525
245569 710548 509
301518 328917 384
20952 875936 525
142502 49667 354
189639 842460 525
46918 667331 509
615240 796 470
350939 231401 441
551384 523740 452
774945 76068 509
617557 595306 447
712716 545714 509
363247 543775 470
820493 132490 509
484194 177089 449
795336 13332 509
133377 164512 383
101906 222504 386
300876 290678 371
441378 86757 449
781076 692466 504
244119 377505 441
765134 508791 509
500775 738671 509
382407 399316 436
547949 716698 509
466658 833445 509
183959 960871 525
678587 332374 509
154797 263668 443
376998 839089 525
999975 989995 440
239233 976230 525
392853 169434 443
627744 568442 509
985817 806923 525
547117 345155 470
542648 740550 509
430432 811173 509
832224 957062 525
360294 906371 525
469042 697285 509
775872 822618 468
469452 557395 470
896295 322239 525
721783 717215 411
990773 905910 507
323751 436272 449
349626 998801 525
431734 235402 449
499279 82938 449
850856 844856 419
407953 947601 525
764875 438895 509
534186 717102 509
284346 75688 443
313554 386757 441
272177 274374 358
600505 400376 470
92457 461993 449
300874 318366 384
982181 177668 525
656798 569124 509
873229 326286 525
235131 61264 443
645858 914560 525
773176 665023 504
301226 327046 384
523533 626746 509
100964 931059 525
237353 264080 407
576291 971405 525
505773 327688 449
389970 977867 525
817364 33385 509
210121 642124 509
739905 119452 509
920510 934208 476
30680 900684 525
152155 922477 525
684224 568603 509
259219 157660 443
184011 869555 525
642119 762532 504
372638 314493 441
285729 508862 449
28393 853995 525
829103 367061 509
721055 771058 468
122755 367706 443
962542 985327 458
407238 247786 441
923343 368758 525
699614 382072 509
613587 201082 470
138341 92734 354
390713 916227 525
233984 435813 449
158420 880391 525
345960 914902 525
906139 161969 525
137530 800706 509
716481 804685 468
265215 613113 470
150540 461694 449
648640 483258 509
668295 158035 509
598060 152833 470
765855 611650 509
490153 320990 449
756167 508917 509
50411 661457 509
956793 99734 525
473159 602504 470
803105 712166 468
276590 992446 525
998335 495244 525
448676 423346 418
50548 654509 509
405581 530458 470
817815 57198 509
994488 249286 525
209005 686485 509
64350 779494 509
3652 47120 324
129371 853823 525
515291 973053 525
984062 533282 525
824913 199006 509
87946 525499 470
144850 317281 443
143917 858917 525
462118 708594 509
569716 217513 470
738884 338306 509
794586 893427 525
981450 219229 525
91148 650544 509
397125 716436 509
716482 658472 504
514752 277057 470
18019 981155 525
55321 639147 509
784791 217254 509
188643 558306 470
588508 473580 470
215787 209471 373
312350 73704 443
584773 707833 509
161672 390372 443
598745 213410 470
795045 674283 504
583457 600867 434
796373 25173 509
973659 459660 525
553336 112624 470
899062 732304 525
669210 225090 509
207290 303340 443
301297 514125 470
136731 768339 509
241617 87278 443
917726 525055 525
5381 469401 449
991514 936224 507
624234 232696 470
267123 652493 509
484432 995901 525
925226 104766 525
796264 381203 509
94441 800211 509
136166 388223 443
590872 827346 509
682990 427651 509
560094 949769 525
576579 500917 470
221912 616951 470
541773 60038 470
39274 964772 525
318444 690977 509
768911 571507 509
582821 33664 470
50487 806437 509
52057 471585 449
182753 159738 370
629673 453683 509
23410 161828 383
65625 528054 470
244076 955045 525
623639 197471 470
57496 220030 386
367622 369567 361
11026 260980 443
91001 81943 333
10914 267063 443
525732 449599 470
328571 857008 525
530380 630219 509
828944 799461 450
735240 830427 468
10375 440013 449
125514 290235 443
600657 63667 470
342697 65233 443
809537 571007 509
639128 825702 504
942937 43913 525
756831 552007 509
755241 719471 424
287483 61600 443
918793 528043 525
92868 190258 383
807976 743240 468
253641 976612 525
936691 503253 525
730720 936877 525
615541 324913 470
878008 776662 525
226273 672451 509
685608 255292 509
873030 9849 525
333224 569961 470
504399 517642 470
643201 297971 509
58727 970619 525
180180 319739 443
208690 675573 509
208095 198331 373
314747 753348 509
152347 926482 525
949670 804918 525
568606 102620 470
716289 641938 504
34392 146929 375
956314 466245 525
818142 32376 509
19836 663418 509
985454 694807 525
930972 817250 525
804535 738702 468
484855 636555 509
283219 337407 389
455811 587837 470
757267 560239 509
32448 753779 509
333539 117115 443
662900 948567 525
911627 633191 525
676052 616430 509
731455 316489 509
450142 75146 449
450870 341442 449
11746 567046 470
809863 677068 504
506476 918453 525
452339 584277 470
639318 49764 509
622309 861380 525
351794 789390 509
602269 725483 509
793833 152949 509
979843 719372 525
818414 420655 509
992811 928866 507
152698 472609 449
438017 241148 449
633886 154570 509
383759 836634 509
911840 844139 476
155576 915736 525
306409 272402 389
660442 822617 504
436433 164392 449
15084 304752 443
165872 643326 509
819504 612587 509
194134 571957 470
567466 408308 470
615253 614872 447
695985 459364 509
153221 628258 509
132872 96271 354
937296 1689 525
834029 314720 509
825830 289018 509
763498 942495 525
624977 153022 470
851519 435414 525
148513 293392 443
213125 374508 443
700294 419404 509
67479 614080 470
583845 830079 509
939935 285261 525
355516 221682 443
694862 332917 509
195042 392145 443
313250 40841 443
605648 933495 525
172368 838634 525
245048 310741 407
141356 436122 449
198130 961709 525
666702 409430 509
245792 458434 449
621006 224722 470
911942 838171 476
741410 24131 509
740264 296592 509
762369 343620 509
513267 358997 470
625109 157279 470
938779 163131 525
528741 570503 452
