759735 877104 525
843463 508280 525
265682 763497 509
830621 83608 509
363550 47275 443
560931 517765 452
737372 462343 509
999449 826317 525
185827 479873 449
891150 956563 507
611417 126592 470
189328 886382 525
541036 426847 470
691985 642738 442
97288 123890 354
275619 775629 509
9698 603217 470
142884 37086 375
581779 124415 470
753704 106317 509
227883 445093 449
163224 288574 443
87859 489734 449
677137 308197 509
999777 370756 525
446840 488165 444
841369 170842 525
25778 519563 470
286312 301726 389
61273 113938 354
336774 338367 366
552043 300630 470
189797 88486 383
675804 71917 509
376535 845089 525
480171 602284 470
228206 585762 470
258922 805329 509
531022 147014 470
196165 42890 383
816439 107507 509
519517 295481 470
499583 106427 449
479015 188996 449
585445 801024 509
730859 420964 509
672579 212367 509
832333 168080 509
317576 716516 509
745318 575308 509
808747 781903 468
145127 665533 509
703492 953183 525
897559 365435 525
947012 125985 525
670591 496601 509
859674 62015 525
469737 634554 509
232811 635998 509
273059 241059 407
608510 808123 509
365642 548549 470
578440 445479 470
178393 258320 443
46439 453637 449
897074 723485 525
179717 597117 470
251419 771550 509
367472 494964 449
124373 608864 470
671676 575533 509
447190 122246 449
528417 104940 470
722178 728375 411
923194 240240 525
854046 235038 525
120760 736931 509
588881 431639 470
968958 907767 507
58723 25186 340
104648 785389 509
364379 492081 449
300692 639611 509
894245 81906 525
106637 367689 443
974431 830357 525
197722 674974 509
474173 646547 509
623178 34239 470
282669 728749 509
552202 522761 452
428548 55929 449
105825 234092 443
720103 974333 525
197006 67900 383
541268 282637 470
259555 164536 443
57617 574751 470
637837 501788 509
310086 427789 449
236398 418262 449
651162 478533 509
694572 341225 509
482060 152461 449
417915 512327 470
731415 909518 525
640702 35559 509
221078 912539 525
706385 481058 509
301939 123537 443
715629 240912 509
602952 261013 470
733598 685446 504
650500 520550 509
847421 966349 507
737740 598867 509
308211 30716 443
545912 251799 470
129128 441645 449
627580 689036 442
438081 303150 449
778418 486015 509
703631 973771 525
606631 144969 470
635894 305294 509
803373 954330 525
566529 825892 509
769519 602016 509
702184 326815 509
424583 826346 509
537606 52754 470
839278 750161 525
979902 878030 507
267826 730441 509
641087 441565 509
874947 140072 525
143933 61026 375
690424 39411 509
722288 407284 509
127394 593648 470
143573 808721 509
273940 625932 470
633737 158447 509
746989 929514 525
967965 586029 525
267222 550552 470
961895 293229 525
162565 941911 525
753261 439486 509
196848 823920 509
625540 572958 447
323297 704459 509
678692 362269 509
427865 365847 449
508274 554650 470
39955 518376 470
906726 372592 525
253941 877794 525
91657 370479 443
463175 645645 509
239152 874912 525
516231 36851 470
40935 641097 509
70071 968916 525
430243 317832 449
894438 572251 525
302113 108403 443
946631 614708 525
141656 598299 470
163862 967820 525
990196 247862 525
471739 849137 525
493397 58033 449
445396 875732 525
861559 426554 525
308314 826058 509
552574 824324 509
284562 882287 525
748941 723019 424
750054 837862 525
915997 15578 525
820689 478295 509
124414 39055 354
404848 636038 509
654603 278629 509
749467 875093 525
103924 428633 449
346984 732433 509
175105 844188 525
540472 375223 470
190862 352803 443
863181 603561 525
166516 955930 525
235070 120662 443
819816 10345 509
462959 783617 509
349134 356519 379
241194 935725 525
25706 465950 449
632601 71315 509
582851 947746 525
866869 529402 525
293625 841433 525
736165 493598 509
438569 840459 525
516033 671133 509
784866 814392 468
874772 285374 525
820663 588198 509
900393 330078 525
426041 7170 449
289890 468792 449
257414 46123 443
391596 434419 449
40035 456678 449
465805 871947 525
883854 523033 525
452606 527223 470
97845 683233 509
387188 98204 443
644542 903136 525
422127 978950 525
959464 908272 507
911272 71040 525
724815 97692 509
825384 310459 509
103575 688376 509
