491733 813920 509
570496 969079 525
989989 137996 525
328394 764012 509
595860 794131 509
717810 170747 509
409362 353941 436
242645 883962 525
452064 628181 509
413473 810832 509
71725 738572 509
596265 669974 509
261244 382484 441
852702 169917 525
277543 508942 449
571670 220275 470
686050 49682 509
912869 741261 525
75364 723909 509
35709 440594 449
185811 498396 449
569783 523105 452
216858 810750 509
25463 484982 449
579972 983883 525
247991 711648 509
992435 289808 525
179375 320780 443
933792 937960 414
280718 840759 525
330847 618088 470
298929 891027 525
114485 756298 509
746514 685142 504
310161 269624 407
233822 349023 441
943427 442537 525
950759 280807 525
779067 392246 509
923784 304457 525
7393 96423 351
610852 494257 470
300811 928090 525
603304 430862 470
833301 438538 509
514841 261461 470
386603 701850 509
53240 575171 470
872455 24127 525
12194 562968 470
449437 930849 525
284262 254046 407
575616 176716 470
444577 136586 449
504696 988786 525
23782 565403 470
1271 901613 525
961395 321600 525
362132 811063 509
327813 530790 470
487718 365147 449
580251 85753 470
853370 992571 507
874410 921729 476
914402 963334 507
5270 616855 470
609448 307169 470
402498 510576 449
467743 366372 449
467760 547426 470
227234 720435 509
329928 221431 443
239464 962068 525
675354 555381 509
871684 922303 476
51955 688513 509
49221 171521 383
800652 925730 525
323702 918793 525
484606 555733 470
319285 704664 509
469332 607852 470
941249 749818 525
679841 466336 509
367277 819709 509
217750 110169 386
817967 894153 525
790348 508600 509
574523 606591 434
328075 192206 443
372837 328513 441
794962 460044 509
577169 652631 509
187479 73042 383
765355 435319 509
73234 894108 525
548259 97076 470
872090 731889 525
221917 397161 443
249283 908712 525
600645 153404 470
506306 511578 382
839410 371217 525
31182 8528 308
582589 993918 525
165012 752500 509
856206 809602 525
968809 757262 525
565092 349300 470
717457 818259 468
206322 171733 365
268163 442464 449
814327 256553 509
536587 782154 509
540172 769335 509
839425 297372 525
156254 43519 383
595717 804976 509
489379 543469 470
734816 859847 525
540507 317811 470
96493 957407 525
400276 743623 509
912551 772663 525
209293 221051 386
454122 224689 449
565881 386553 470
886534 364840 525
131054 446902 449
821121 179402 509
214660 472274 449
828962 199295 509
169578 668655 509
162363 734879 509
745593 782157 468
272984 767340 509
370289 311913 441
471262 719292 509
509169 930707 525
31700 352468 443
391224 781167 509
651328 160541 509
585659 283031 470
137341 319054 443
316842 449794 449
221494 561798 470
87029 275717 443
829486 811321 450
263360 281623 407
426618 538635 470
297172 887521 525
673132 329693 509
184496 32574 383
250214 830193 509
204146 901964 525
427934 254351 449
53889 796882 509
7311 454497 449
781057 601420 509
549474 764381 509
297499 717778 509
218591 400691 443
119616 50000 354
268304 576499 470
843554 752020 525
140572 67926 354
304413 644691 509
914539 456067 525
849714 87772 525
849539 892708 445
162312 87507 383
315403 666749 509
2895 667431 509
963501 899624 507
503885 998419 525
818774 5101 509
56306 720177 509
52805 996715 525
438994 820354 509
153369 577959 470
204509 18265 383
906922 459272 525
621308 485577 470
402764 235697 441
211958 128787 383
232863 312373 407
826089 344674 509
808483 611906 509
39580 106455 354
831184 367096 509
27147 5629 308
827137 118797 509
950287 498059 525
382899 923286 525
465957 281707 449
509699 292476 449
571393 428752 470
270224 51128 443
691624 432368 509
784056 868814 525
983349 809746 525
261615 292467 407
920888 613516 525
249042 123881 443
915507 198361 525
943047 920400 507
321974 386925 441
33780 974791 525
237282 390459 441
140052 182719 383
59628 604878 470
