293896 665652
981080 771400
289910 193993
601933 40611
846971 767994
496989 851324
56010 627061
622390 294795
350198 370235
447144 961201
590211 271701
733431 938518
656597 729826
783298 720748
286048 811160
974708 983469
293087 533912
188849 867422
984416 976812
206126 259561
73698 813130
668944 95252
823922 524179
857460 788446
146359 972772
319681 123974
497149 622849
513125 199618
530812 360602
980652 653782
465746 584367
497605 984947
498310 614678
659668 49028
50013 828951
765312 658822
967947 910314
122468 966820
570225 88969
401159 279423
10823 304394
992425 498866
451964 15470
787508 5588
584909 905933
257672 282533
508981 796146
143447 692689
74804 971523
836217 621025
859280 552995
772909 848146
957665 948307
987956 580239
934910 731497
27653 861591
223773 827480
986256 240130
415630 351699
414169 215141
663122 751184
422760 755391
975937 715530
306292 293094
176949 358055
754312 325201
530393 394243
137403 992716
292107 606816
759218 842030
175054 142593
654037 539802
481414 416659
892815 55525
606954 408889
994286 989355
120163 734159
870751 245852
25976 117688
525184 649840
877803 103061
181380 21291
810129 688234
551607 260502
931465 401986
713797 313293
194968 785717
916137 75969
946000 550438
64869 947966
124571 162809
150283 222246
199061 859305
572965 378212
540039 644364
644244 343579
240194 95231
274479 255980
466365 179392
307698 105442
667326 922015
966514 562771
109559 650503
557489 239625
490465 690517
860349 144413
781558 318258
567754 346026
203031 921770
768911 495982
88111 461917
406011 343611
363057 204615
430515 440138
528235 137783
586884 192458
114242 993872
471206 745336
133494 125415
709906 877461
197125 338008
495912 831035
142590 927355
334891 297434
187975 190305
849067 38592
571739 454751
820149 87887
912903 324929
134279 926280
11210 729493
581714 197240
155984 719295
699991 610623
102678 206899
288245 768847
444408 286961
160562 895054
245283 130240
786689 990649
106989 851621
394904 560786
628842 661206
188263 219615
579322 474052
875092 642570
590184 130286
822438 805325
64687 65842
310856 496120
320247 771616
517720 865628
705441 147897
510094 391505
913158 113328
428937 86318
739641 477065
318295 79570
592865 732476
647220 234195
658302 739572
86329 518557
495997 540637
266547 873652
979368 33606
145358 768188
592378 133470
431253 572157
344099 485698
479099 881422
244513 836634
815540 174330
632834 591516
468325 79801
257866 619198
28527 900972
441101 966677
904483 787150
956671 6367
737157 219527
61159 769937
200591 182161
398074 393341
784368 384150
577505 984193
669545 551467
755794 720943
183887 160313
348420 907346
516486 719542
796094 70089
681923 861326
821254 22650
560997 815194
805357 889550
775526 96285
920167 150309
978148 240359
929334 925024
770970 431667
787700 491467
371037 669224
218957 90982
409529 893095
116178 157792
518924 112524
890475 494504
56673 618233
865294 148059
238426 766788
101926 808069
467662 408193
197275 841761
291030 282123
223140 861796
839832 437760
301296 494503
423482 150609
939412 779484
669866 851488
893430 356263
709890 768024
528394 847768
292400 285568
280796 426820
447742 139767
859344 478677
14151 55076
729507 885327
291729 819348
157637 653052
510162 598645
666832 510499
118800 23135
335395 979634
654720 192046
723041 559907
293600 11845
430872 765626
487466 533536
558779 712460
537567 161269
676528 325859
612115 193123
132622 111364
133636 693366
752055 932375
969073 486872
993892 863858
67974 812044
641667 172274
183309 520955
92370 765981
357886 542178
751177 387610
369953 754299
968985 421028
295027 746603
450878 989997
732662 201441
197066 660683
15707 303593
763364 415048
391285 220638
649198 635637
425750 368831
348365 501329
360018 312534
577004 520324
198802 297648
57127 816568
675675 293945
238916 956303
771611 204950
242351 587133
892164 49928
41063 305376
