﻿نماد,نام,تعداد,حجم,ارزش,دیروز,اولین,آخرین معامله - مقدار,آخرین معامله - تغییر,آخرین معامله - درصد,قیمت پایانی - مقدار,قیمت پایانی - تغییر,قیمت پایانی - درصد,کمترین,بیشترین
پالايش,صندوق پالايشي يکم-سهام,99235,137814592,1.2028E+13,80100,88110,88110,"8,010.00",10.00,87280,"7,180.00",8.96,83000,88110
دارا يكم,صندوق واسطه گري مالي يكم-سهام,87185,75672355,1.14048E+13,139970,153960,153960,"13,990.00",9.99,150710,"10,740.00",7.67,143750,153960
شستا,سرمايه گذاري تامين اجتماعي,44196,172698757,3.84659E+12,21620,22700,22280,660.00,3.05,22270,650.00,3.01,21150,22700
سپيدار,سپيدار سيستم آسيا,37882,335184,20362763184,57859,60751,60751,"2,892.00",5.00,58937,"1,078.00",1.86,60751,60751
خودرو,ايران‌ خودرو,34569,1192787774,3.14018E+12,2570,2690,2670,100.00,3.89,2630,60.00,2.33,2530,2690
خساپا,سايپا,32844,1817304289,4.1155E+12,2170,2270,2270,100.00,4.61,2260,90.00,4.15,2210,2270
شپنا,پالايش نفت اصفهان,32278,402136350,4.70121E+12,11170,11720,11720,550.00,4.92,11690,520.00,4.66,11230,11720
آوا,صندوق س.سهام آواي معيار-س,28613,313332292,2.63761E+12,8501,9020,8230,-271.00,-3.19,8418,-83.00,-0.98,7905,9100
خگستر,گسترش‌سرمايه‌گذاري‌ايران‌خودرو,25758,764355413,2.36531E+12,3070,3140,3110,40.00,1.30,3090,20.00,0.65,2970,3190
بركت,گروه دارويي بركت,23633,79334852,1.80978E+12,21950,23040,23040,"1,090.00",4.97,22810,860.00,3.92,22000,23040
شتران,پالايش نفت تهران,23131,225639526,2.03167E+12,8690,9120,9020,330.00,3.80,9000,310.00,3.57,8430,9120
وكبهمن,مديريت سرمايه گذاري كوثربهمن,22238,18357892,2.47012E+11,14027,14270,13326,-701.00,-5.00,13455,-572.00,-4.08,13326,14270
فملي,ملي‌ صنايع‌ مس‌ ايران‌,20542,193565264,2.01375E+12,9930,10420,10420,490.00,4.93,10400,470.00,4.73,10100,10420
وسپهر,سرمايه گذاري مالي سپهرصادرات,19148,70997629,7.17492E+11,10243,10300,10101,-142.00,-1.39,10106,-137.00,-1.34,10100,10300
بوعلي,پتروشيمي بوعلي سينا,17426,6711959,2.92975E+11,43750,44900,43130,-620.00,-1.42,43650,-100.00,-0.23,42370,44900
سبهان,سيمان‌ بهبهان‌,17095,11915216,1.87147E+12,149920,157410,157410,"7,490.00",5.00,157070,"7,150.00",4.77,151120,157410
وتجارت,بانك تجارت,16493,472718140,1.34064E+12,2810,2890,2870,60.00,2.14,2840,30.00,1.07,2710,2900
زملارد,كشاورزي و دامپروري ملارد شير,16037,5787828,2.08157E+11,35363,37000,35650,287.00,0.81,35965,602.00,1.70,34300,37130
شاروم,پتروشيمي اروميه,15805,11877312,2.22551E+11,18971,19700,18230,-741.00,-3.91,18737,-234.00,-1.23,18050,19850
فولاد,فولاد مباركه اصفهان,14612,158299571,1.79549E+12,10810,11350,11350,540.00,5.00,11340,530.00,4.90,11150,11350
غزر,صنعتي زر ماكارون,14338,11402429,3.19865E+11,29340,29000,27880,"-1,460.00",-4.98,28050,"-1,290.00",-4.40,27880,29790
كزغال,زغال سنگ پروده طبس,14178,1758278,39816205310,21567,22645,22645,"1,078.00",5.00,22343,776.00,3.60,22645,22645
حكشتي,كشتيراني جمهوري اسلامي ايران,14101,62982932,1.28643E+12,21000,21330,20100,-900.00,-4.29,20430,-570.00,-2.71,19950,21700
ثبهساز,بهساز كاشانه تهران,13999,109272551,2.71472E+11,2490,2610,2460,-30.00,-1.20,2480,-10.00,-0.40,2380,2610
قثابت,قند ثابت‌ خراسان‌,13357,27037112,1.74829E+12,63420,60450,66250,"2,830.00",4.46,63420,0,0,60450,66590
سيتا,سرمايه گذاري سيمان تامين,13271,32480242,4.8819E+11,15440,15490,15020,-420.00,-2.72,15030,-410.00,-2.66,15000,15490
ثاميد,توسعه و عمران اميد,13057,113033814,1.95738E+11,1760,1800,1720,-40.00,-2.27,1730,-30.00,-1.70,1680,1810
وبصادر,بانك صادرات ايران,12528,377522722,9.82789E+11,2520,2640,2620,100.00,3.97,2600,80.00,3.17,2490,2640
ذوب,سهامي ذوب آهن  اصفهان,12445,204727425,8.53934E+11,4037,4218,4212,175.00,4.33,4171,134.00,3.32,3993,4238
وبملت,بانك ملت,10929,352746692,1.39358E+12,3790,3970,3970,180.00,4.75,3950,160.00,4.22,3810,3970
بپيوند,برق و انرژي پيوندگستر پارس,10769,12346828,1.91463E+11,15461,16234,15360,-101.00,-0.65,15507,46.00,0.30,14800,16234
شبندر,پالايش نفت بندرعباس,10389,39624067,8.29689E+11,20170,21170,21080,910.00,4.51,20940,770.00,3.82,20000,21170
كاما,باما,10309,57433564,8.24908E+11,14830,15400,14090,-740.00,-4.99,14360,-470.00,-3.17,14090,15450
سمگا,گروه سرمايه گذاري ميراث فرهنگي,10173,63716555,1.81252E+12,27383,28000,28752,"1,369.00",5.00,28447,"1,064.00",3.89,27100,28752
ثشاهد,سرمايه‌ گذاري‌ شاهد,9730,43685928,8.94973E+11,21110,21750,20160,-950.00,-4.50,20490,-620.00,-2.94,20060,21870
وپارس,بانك‌پارسيان‌,9595,419738718,1.28801E+12,2940,3080,3080,140.00,4.76,3070,130.00,4.42,2950,3080
ثفارس,عمران‌وتوسعه‌فارس‌,9313,58704282,7.6919E+11,12950,13590,12460,-490.00,-3.78,13100,150.00,1.16,12400,13590
امين,تامين سرمايه امين,9234,10116167,1.051E+11,10590,10550,10410,-180.00,-1.70,10390,-200.00,-1.89,10150,10550
آريا,پليمر آريا ساسول,9082,4191590,3.29219E+11,76270,80083,77863,"1,593.00",2.09,78543,"2,273.00",2.98,76271,80083
غگل,گلوكوزان‌,9036,113622955,4.37002E+11,3990,4080,3810,-180.00,-4.51,3850,-140.00,-3.51,3800,4090
آبادا,توليد نيروي برق آبادان,8917,4979901,73985422580,15130,15280,14900,-230.00,-1.52,14860,-270.00,-1.78,14380,15830
بگيلان,توسعه مسير برق گيلان,8881,4950732,1.04236E+11,21096,21060,21400,304.00,1.44,21055,-41.00,-0.19,20043,21840
آگاس,صندوق س.هستي بخش آگاه-س,8526,13111893,8.60524E+11,68107,69000,65000,"-3,107.00",-4.56,65629,"-2,478.00",-3.64,63201,69000
غنوش,نوش‌ مازندران‌,8308,12930333,7.24946E+11,58610,57000,56100,"-2,510.00",-4.28,56070,"-2,540.00",-4.33,55680,59000
وخارزم,سرمايه گذاري خوارزمي,8228,62262867,5.42896E+11,8420,8840,8840,420.00,4.99,8720,300.00,3.56,8320,8840
كرمان,س. توسعه و عمران استان كرمان,8184,12347867,6.78975E+11,56748,57050,53980,"-2,768.00",-4.88,54987,"-1,761.00",-3.10,53920,58100
انرژي3,سايراشخاص بورس انرژي,7893,2340948,7.11381E+11,297880,312770,301990,"4,110.00",1.38,303890,"6,010.00",2.02,290000,312770
سرو,صندوق س سروسودمند مدبران-سهام,7667,12190237,8.16089E+11,68540,69850,65990,"-2,550.00",-3.72,66950,"-1,590.00",-2.32,64500,69900
ثقزوي,شركت عمران و سازندگي قزوين,7631,18208247,5.74418E+11,31436,31493,32379,943.00,3.00,31547,111.00,0.35,30493,32379
چكاپا,گروه صنايع كاغذ پارس,7269,90738908,4.68545E+11,5320,5420,5190,-130.00,-2.44,5160,-160.00,-3.01,5060,5480
رافزا,رايان هم افزا,7231,42215,1830484615,41297,43361,43361,"2,064.00",5.00,41369,72.00,0.17,43361,43361
وهنر,گروه توسعه هنر ايران,7163,81680504,7.90318E+11,9224,9685,9685,461.00,5.00,9676,452.00,4.90,9224,9685
كلر,كلر پارس,7014,5937944,8.17082E+11,142661,145533,135670,"-6,991.00",-4.90,137604,"-5,057.00",-3.54,135528,145533
آسيا,بيمه آسيا,6927,135722709,3.34525E+11,2540,2640,2420,-120.00,-4.72,2460,-80.00,-3.15,2420,2640
شگويا,پتروشيمي تندگويان,6911,34863120,2.89939E+11,8202,8600,8301,99.00,1.21,8317,115.00,1.40,8003,8600
پيزد,مجتمع صنايع لاستيك يزد,6849,1502431,1.01351E+11,70359,69500,67040,"-3,319.00",-4.72,67458,"-2,901.00",-4.12,66852,69500
خزاميا,زامياد,6802,73711043,6.00079E+11,8130,8440,8120,-10.00,-0.12,8140,10.00,0.12,7800,8490
ثاخت,بين‌المللي‌توسعه‌ساختمان,6791,131970083,3.94938E+11,3110,3130,2970,-140.00,-4.50,2990,-120.00,-3.86,2960,3180
خبهمن,گروه‌بهمن‌,6744,45568178,9.53189E+11,20030,21030,21030,"1,000.00",4.99,20920,890.00,4.44,20210,21030
ولپارس,ليزينگ پارسيان,6683,17267405,95662881500,5770,5950,5490,-280.00,-4.85,5540,-230.00,-3.99,5490,5950
خپارس,پارس‌ خودرو,6583,113602834,6.62528E+11,5810,5940,5880,70.00,1.20,5830,20.00,0.34,5580,6060
غپينو,پارس‌ مينو,6463,57149689,4.09631E+11,7030,7380,6960,-70.00,-1.00,7170,140.00,1.99,6710,7380
شبريز,پالايش نفت تبريز,6460,27866103,7.28053E+11,25670,26950,26050,380.00,1.48,26130,460.00,1.79,24800,26950
بترانس,ايران‌ ترانسفو,6322,178782338,4.82038E+11,2580,2700,2700,120.00,4.65,2700,120.00,4.65,2600,2700
تكشا,گسترش‌صنايع‌وخدمات‌كشاورزي‌,6047,7310867,3.55465E+11,48450,49490,48550,100.00,0.21,48620,170.00,0.35,46300,50700
صبا,سرمايه گذاري صبا تامين,5834,29941150,2.30618E+11,7695,8030,7655,-40.00,-0.52,7702,7.00,0.09,7360,8063
شپلي,پلي اكريل ايران,5825,91073097,1.09649E+12,12138,11896,12380,242.00,1.99,12040,-98.00,-0.81,11896,12380
وغدير,سرمايه‌گذاري‌غدير(هلدينگ‌,5773,75272601,8.66742E+11,10990,11530,11530,540.00,4.91,11510,520.00,4.73,11140,11530
فارس,صنايع پتروشيمي خليج فارس,5599,68231394,6.25627E+11,8750,9180,9180,430.00,4.91,9170,420.00,4.80,9000,9180
فروي,ذوب روي اصفهان,5309,4181031,2.75965E+11,64473,66800,66499,"2,026.00",3.14,66004,"1,531.00",2.37,63473,67696
تاصيكو,سرمايه گذاري صدرتامين,5163,77286184,7.93025E+11,10680,10800,10150,-530.00,-4.96,10260,-420.00,-3.93,10150,10980
كمند,صندوق س. با درآمد ثابت كمند,5056,224520774,2.25152E+12,10022,10027,10027,5.00,0.05,10028,6.00,0.06,10027,10031
فرابورس,فرابورس ايران,4904,12126743,4.05718E+11,34144,35680,32730,"-1,414.00",-4.14,33456,-688.00,-2.01,32437,35680
قلرست,قند لرستان‌,4807,10459181,3.46801E+11,32680,32200,34310,"1,630.00",4.99,33160,480.00,1.47,31050,34310
مدير,ص.س.مديريت ثروت ص.بازنشستگي-س,4790,29577209,2.88276E+11,9508,10100,9690,182.00,1.91,9747,239.00,2.51,9310,10190
خمحركه,نيرو محركه‌,4584,46975060,2.27502E+11,4950,5030,4780,-170.00,-3.43,4840,-110.00,-2.22,4710,5130
وپويا,سرمايه گذاري پويا,4520,3846998,24863148074,6156,6463,6463,307.00,4.99,6292,136.00,2.21,6463,6463
فزرين,زرين معدن آسيا,4369,19143256,4.44463E+11,23316,24250,23590,274.00,1.18,23218,-98.00,-0.42,22155,24300
گكوثر,هتل پارسيان كوثر اصفهان,4365,95457492,2.52569E+11,2764,2790,2673,-91.00,-3.29,2646,-118.00,-4.27,2626,2790
تليسه,دامداري تليسه نمونه,4361,43013574,1.8552E+11,4477,4634,4254,-223.00,-4.98,4313,-164.00,-3.66,4254,4634
كبافق,معادن‌ بافق‌,4326,5156662,2.73051E+11,51940,54500,54450,"2,510.00",4.83,52950,"1,010.00",1.94,49350,54530
چفيبر,فيبر ايران‌,4302,32803416,4.55834E+11,14500,13910,13780,-720.00,-4.97,13900,-600.00,-4.14,13780,14780
قشكر,شكرشاهرود,4206,62144244,2.39688E+11,3970,4150,3800,-170.00,-4.28,3860,-110.00,-2.77,3780,4150
ساوه,سيمان ساوه,4198,2526950,1.37443E+11,54751,56900,53300,"-1,451.00",-2.65,54391,-360.00,-0.66,52500,56900
بجهرم,توسعه مولد نيروگاهي جهرم,4141,54708570,1.60961E+11,2875,3015,2963,88.00,3.06,2942,67.00,2.33,2837,3015
ونوين,بانك‌اقتصادنوين‌,4091,109723974,4.31298E+11,3800,3990,3920,120.00,3.16,3930,130.00,3.42,3780,3990
وساپا,سرمايه‌گذاري‌ سايپا,4086,54633967,3.29768E+11,5950,6240,6030,80.00,1.34,6040,90.00,1.51,5700,6240
وملي,گروه‌ صنعتي‌ ملي‌ (هلدينگ‌,4072,1588358,2.77843E+11,179120,185000,172000,"-7,120.00",-3.97,174920,"-4,200.00",-2.34,170170,185000
كوير,توليدي فولاد سپيد فراب كوير,4021,16912024,4.14605E+11,25430,25790,24160,"-1,270.00",-4.99,24520,-910.00,-3.58,24160,25790
غسالم,سالمين‌,4015,44341760,1.90343E+11,4400,4570,4290,-110.00,-2.50,4290,-110.00,-2.50,4180,4570
سبزوا,سيمان لار سبزوار,3959,40482858,1.53018E+11,3908,4090,3715,-193.00,-4.94,3780,-128.00,-3.28,3713,4090
ثنوسا,نوسازي‌وساختمان‌تهران‌,3908,31089964,4.07557E+11,12610,12960,13240,630.00,5.00,13110,500.00,3.97,12600,13240
وآذر,سرمايه‌گذاري‌توسعه‌آذربايجان‌,3877,3859227,3.35727E+11,89380,90200,84920,"-4,460.00",-4.99,86990,"-2,390.00",-2.67,84920,92000
تاپيكو,س. نفت و گاز و پتروشيمي تأمين,3839,41105213,4.85073E+11,11290,11850,11850,560.00,4.96,11800,510.00,4.52,11410,11850
فخوز,فولاد  خوزستان,3795,28494256,3.60625E+11,12140,12700,12600,460.00,3.79,12660,520.00,4.28,12180,12740
فاراك,ماشين‌ سازي‌ اراك‌,3793,42018919,2.10061E+11,5120,5300,5020,-100.00,-1.95,5000,-120.00,-2.34,4870,5300
قپيرا,فرآورده‌هاي‌غدايي‌وقندپيرانشهر,3686,2799809,2.8341E+11,102490,97370,106590,"4,100.00",4.00,101220,"-1,270.00",-1.24,97370,107000
غشهداب,كشت و صنعت شهداب ناب خراسان,3675,51057190,1.93046E+11,3690,3850,3874,184.00,4.99,3781,91.00,2.47,3560,3874
بكام,كارخانجات توليدي شهيد قندي,3666,53845715,1.83226E+11,3520,3640,3350,-170.00,-4.83,3400,-120.00,-3.41,3350,3640
نوري,پتروشيمي نوري,3639,4967467,2.6057E+11,52050,52580,52420,370.00,0.71,52460,410.00,0.79,50610,53990
شيران,س. صنايع‌شيميايي‌ايران,3550,10543831,2.95862E+11,28240,28540,29000,760.00,2.69,28060,-180.00,-0.64,27000,29070
فاذر,صنايع‌ آذرآب‌,3547,11649978,2.83275E+11,24960,25800,24200,-760.00,-3.04,24320,-640.00,-2.56,23720,25800
ارزش,صندوق س ارزش آفرين بيدار-سهام,3528,28191429,2.83444E+11,9980,10380,9970,-10.00,-0.10,10050,70.00,0.70,9710,10400
ختوقا,قطعات‌ اتومبيل‌ ايران‌,3513,73956021,1.91492E+11,2620,2700,2580,-40.00,-1.53,2590,-30.00,-1.15,2500,2730
فجر,فولاد اميركبيركاشان,3501,8770468,5.84222E+11,64290,65000,66900,"2,610.00",4.06,66610,"2,320.00",3.61,64000,67500
سفارس,سيمان فارس و خوزستان,3498,21413626,3.9197E+11,19080,19290,18130,-950.00,-4.98,18300,-780.00,-4.09,18130,19290
خكمك,كمك‌فنرايندامين‌,3443,12185628,3.50445E+11,29570,31040,28100,"-1,470.00",-4.97,28760,-810.00,-2.74,28100,31040
كالا,بورس كالاي ايران,3432,8303830,2.67771E+11,33130,34470,31850,"-1,280.00",-3.86,32250,-880.00,-2.66,31480,34470
ميهن,بيمه ميهن,3429,32565939,1.51928E+11,4780,4930,4732,-48.00,-1.00,4665,-115.00,-2.41,4541,4940
وكارح,ح . بانك‌ كارآفرين‌,3417,146354198,2.08667E+11,1440,1520,1400,-40.00,-2.78,1430,-10.00,-0.69,1340,1570
ملت,بيمه ملت,3379,15118706,2.35939E+11,15360,16110,15400,40.00,0.26,15610,250.00,1.63,14810,16120
كرازي,كارخانجات‌توليدي‌شيشه‌رازي‌,3337,10235267,2.64038E+11,27010,26520,25660,"-1,350.00",-5.00,25800,"-1,210.00",-4.48,25660,27300
اخابر,مخابرات ايران,3336,29331615,3.04473E+11,10240,10670,10330,90.00,0.88,10380,140.00,1.37,9900,10750
خنصير,مهندسي‌نصيرماشين‌,3335,2986046,2.62027E+11,87220,87400,87160,-60.00,-0.07,87750,530.00,0.61,83020,90500
زكوثر,سرمايه گذاري كشاورزي كوثر,3289,10132612,2.14034E+11,22060,22750,21000,"-1,060.00",-4.81,21120,-940.00,-4.26,20960,22750
كپارس,كاشي‌ پارس‌,3269,1643771,2.53196E+11,149900,155000,157390,"7,490.00",5.00,154030,"4,130.00",2.76,144580,157390
توريل,توکاريل,3238,12817893,3.12622E+11,23345,24512,24512,"1,167.00",5.00,24390,"1,045.00",4.48,23400,24512
ديران,ايران‌دارو,3235,8499959,2.33415E+11,28600,28800,27170,"-1,430.00",-5.00,27460,"-1,140.00",-3.99,27170,29250
غبهنوش,بهنوش‌ ايران‌,3230,2545617,1.85693E+11,72650,76000,71350,"-1,300.00",-1.79,72950,300.00,0.41,70100,76000
زقيام,كشت و دام قيام اصفهان,3202,8425048,2.69935E+11,30677,32210,32210,"1,533.00",5.00,32040,"1,363.00",4.44,30677,32210
شلعاب,لعابيران‌,3181,15182478,2.43314E+11,16530,15820,16450,-80.00,-0.48,16030,-500.00,-3.02,15710,16530
شسينا,صنايع‌شيميايي‌سينا,3179,2672476,3.40033E+11,121780,127800,127860,"6,080.00",4.99,127240,"5,460.00",4.48,122970,127860
پدرخش,درخشان‌ تهران‌,3159,1206096,1.73349E+11,141000,148040,141000,0,0,143730,"2,730.00",1.94,136790,148040
حفاري,حفاري شمال,3150,17959976,1.93853E+11,10740,11190,10740,0,0,10790,50.00,0.47,10450,11210
فسرب,ملي‌ سرب‌وروي‌ ايران‌,3150,3357822,2.61847E+11,80630,84600,77790,"-2,840.00",-3.52,77980,"-2,650.00",-3.29,76600,84600
غگيلا,شيرپاستوريزه پگاه گيلان,3103,79413,1828722564,21932,23028,23028,"1,096.00",5.00,21970,38.00,0.17,23028,23028
كماسه,تامين‌ ماسه‌ ريخته‌گري‌,3053,4854432,2.26401E+11,48580,49500,46160,"-2,420.00",-4.98,46640,"-1,940.00",-3.99,46160,49500
ونيرو,سرمايه‌گذاري‌نيرو,3027,64089546,1.68585E+11,2650,2740,2610,-40.00,-1.51,2630,-20.00,-0.75,2520,2780
غگرجي,بيسكويت‌  گرجي‌,3020,9058475,1.75485E+11,20190,20200,19190,"-1,000.00",-4.95,19370,-820.00,-4.06,19190,20690
دانا,بيمه دانا,3000,42999214,2.63673E+11,6440,6200,6120,-320.00,-4.97,6130,-310.00,-4.81,6120,6230
امين يكم,صندوق درآمد ثابت امين يكم فردا,2977,117785639,1.20107E+12,10188,10190,10199,11.00,0.11,10197,9.00,0.09,10190,10201
دماوند,توليد نيروي برق دماوند,2968,3870478,1.99589E+11,53532,54990,50856,"-2,676.00",-5.00,51567,"-1,965.00",-3.67,50856,54990
وپاسار,بانك  پاسارگاد,2942,34004728,4.08879E+11,11950,12020,12140,190.00,1.59,12020,70.00,0.59,11710,12200
وتوصا,گروه س توسعه صنعتي ايران,2874,17062329,2.18317E+11,13030,13500,12380,-650.00,-4.99,12800,-230.00,-1.77,12380,13590
ولانا,شركت ليزينگ آريا دانا,2854,5603052,1.86326E+11,34196,33171,33173,"-1,023.00",-2.99,33254,-942.00,-2.75,33171,34051
ماديرا,صنايع ماشين هاي اداري ايران,2820,15806948,1.44093E+11,9452,9560,8980,-472.00,-4.99,9116,-336.00,-3.55,8980,9700
وپست,پست بانك ايران,2819,19719149,3.2412E+11,17140,17890,16500,-640.00,-3.73,16440,-700.00,-4.08,16290,17890
ولساپا,ليزينگ رايان‌ سايپا,2803,46871843,1.70983E+11,3700,3750,3630,-70.00,-1.89,3650,-50.00,-1.35,3520,3790
ونيكي,سرمايه‌گذاري‌ ملي‌ايران‌,2786,11524487,1.23236E+11,10590,11110,10500,-90.00,-0.85,10690,100.00,0.94,10100,11110
حفارس,حمل و نقل بين المللي خليج فارس,2769,36989555,1.86419E+11,5260,5200,5000,-260.00,-4.94,5040,-220.00,-4.18,5000,5320
كچاد,معدني‌وصنعتي‌چادرملو,2730,19237698,3.87211E+11,19230,20190,20190,960.00,4.99,20130,900.00,4.68,19310,20190
ورنا,سرمايه‌گذاري‌ رنا(هلدينگ‌,2687,33269846,1.82403E+11,5620,5650,5460,-160.00,-2.85,5480,-140.00,-2.49,5340,5750
رتكو,كنترل‌خوردگي‌تكين‌كو,2681,13335921,2.77013E+11,21740,20660,20660,"-1,080.00",-4.97,20770,-970.00,-4.46,20660,21500
كگل,معدني و صنعتي گل گهر,2653,21489107,3.82728E+11,17050,17700,17900,850.00,4.99,17810,760.00,4.46,16950,17900
بشهاب,لامپ‌  پارس‌ شهاب‌,2645,1759269,2.09517E+11,118780,113000,124710,"5,930.00",4.99,119090,310.00,0.26,112850,124710
البرز,بيمه البرز,2598,36179141,1.371E+11,3910,4020,3770,-140.00,-3.58,3790,-120.00,-3.07,3720,4020
خودكفا,اقتصادي و خودكفايي آزادگان,2551,10169694,2.69246E+11,27000,27000,26190,-810.00,-3.00,26475,-525.00,-1.94,26190,27777
فافزا,فولاد افزا سپاهان,2539,3970609,2.20604E+11,56715,55100,57399,684.00,1.21,55559,"-1,156.00",-2.04,55014,57996
سكرما,سيمان‌ كرمان‌,2525,9786291,1.7518E+11,18310,19160,18380,70.00,0.38,17900,-410.00,-2.24,17400,19160
فنوال,نورد آلومينيوم‌,2521,10459840,2.76752E+11,27510,27510,26800,-710.00,-2.58,26460,"-1,050.00",-3.82,26140,28100
چكاوهح,ح . صنايع‌كاغذسازي‌كاوه‌,2497,17600957,1.61239E+11,10010,9980,9030,-980.00,-9.79,9160,-850.00,-8.49,9010,9980
كلوند,كاشي‌ الوند,2482,6260944,3.30828E+11,50330,52840,52840,"2,510.00",4.99,52840,"2,510.00",4.99,52840,52840
بكهنوج,توليد برق ماهتاب كهنوج,2413,49163547,90508658985,1804,1894,1830,26.00,1.44,1841,37.00,2.05,1750,1894
ودي,بيمه  دي,2397,13913946,3.1514E+11,23667,24300,22484,"-1,183.00",-5.00,22649,"-1,018.00",-4.30,22484,24300
غدشت,دشت‌ مرغاب‌,2369,839871,2.67254E+11,311390,320000,310000,"-1,390.00",-0.45,318210,"6,820.00",2.19,296000,326950
فولاي,صنايع فولاد آلياژي يزد,2361,6280088,3.34632E+11,50895,53439,53439,"2,544.00",5.00,53285,"2,390.00",4.70,51439,53439
دعبيد,لابراتوارداروسازي‌  دكترعبيدي‌,2348,4806363,1.14845E+11,24530,24450,24900,370.00,1.51,23890,-640.00,-2.61,23310,25090
قچار,فراوردههاي غذايي وقند چهارمحال,2340,2087231,1.97631E+11,92172,95990,92800,628.00,0.68,94686,"2,514.00",2.73,92501,96780
سشرق,سيمان‌ شرق‌,2308,22805900,1.61908E+11,7350,7500,7000,-350.00,-4.76,7100,-250.00,-3.40,6990,7550
كاردان,صندوق س تجارت شاخصي كاردان,2293,1563111,2.46098E+11,159700,164000,156840,"-2,860.00",-1.79,157440,"-2,260.00",-1.42,144000,164000
قنيشا,قند  نيشابور,2283,3335049,2.01816E+11,59420,62300,61000,"1,580.00",2.66,60510,"1,090.00",1.83,57100,62300
چدن,توليدي چدن سازان,2277,6452329,1.68889E+11,26400,27720,25590,-810.00,-3.07,26170,-230.00,-0.87,25080,27720
فلوله,لوله‌وماشين‌سازي‌ايران‌,2272,9230582,2.06694E+11,21830,22000,22500,670.00,3.07,22390,560.00,2.57,21050,22920
شلرد,كود شيميايي اوره لردگان,2265,22770035,1.67035E+11,7289,7504,7250,-39.00,-0.54,7336,47.00,0.64,7100,7507
سقاين,سيمان‌ قائن‌,2263,3067119,2.52303E+11,78380,82290,82290,"3,910.00",4.99,82260,"3,880.00",4.95,78500,82290
وصنعت,سرمايه گذاري توسعه صنعت وتجارت,2248,22233858,1.4322E+11,6430,6700,6500,70.00,1.09,6440,10.00,0.16,6110,6700
زدشت,كشت و صنعت دشت خرم دره,2239,5067804,1.64148E+11,33933,32510,32480,"-1,453.00",-4.28,32390,"-1,543.00",-4.55,32237,33200
مرقام,ايران‌ارقام‌,2215,10098260,1.73893E+11,17970,18200,17320,-650.00,-3.62,17220,-750.00,-4.17,17080,18200
كسرا,سراميك‌هاي‌صنعتي‌اردكان‌,2187,12847514,2.77395E+11,22280,22510,21330,-950.00,-4.26,21590,-690.00,-3.10,21170,23000
غمينو,شركت صنايع غذايي مينو شرق,2179,12117188,1.58746E+11,13013,13663,12799,-214.00,-1.64,13101,88.00,0.68,12363,13663
خرينگ,رينگ‌سازي‌مشهد,2145,3993815,1.90637E+11,49420,48500,46950,"-2,470.00",-5.00,47730,"-1,690.00",-3.42,46950,51000
وساخت,سرمايه‌ گذاري‌ ساختمان‌ايران‌,2139,3536864,1.70192E+11,47460,49830,47780,320.00,0.67,48120,660.00,1.39,45090,49830
ومعلم,بيمه معلم,2115,20329175,91715590076,4707,4852,4472,-235.00,-4.99,4512,-195.00,-4.14,4472,4852
زمگسا,كشاورزي‌ ودامپروي‌ مگسال‌,2110,4609377,1.39597E+11,31190,32400,29640,"-1,550.00",-4.97,30290,-900.00,-2.89,29640,32400
تاپكيش,تجارت الكترونيك پارسيان كيش,2098,6541552,1.34751E+11,21531,21520,20455,"-1,076.00",-5.00,20599,-932.00,-4.33,20455,21962
ستران,سيمان‌ تهران‌,2093,5481884,1.45661E+11,27070,28410,26260,-810.00,-2.99,26570,-500.00,-1.85,25810,28410
شكربن,كربن‌ ايران‌,2076,1356870,1.45587E+11,103210,108370,107900,"4,690.00",4.54,107300,"4,090.00",3.96,104210,108370
غشاذر,پگاه‌آذربايجان‌غربي‌,2071,12070898,2.4275E+11,21040,21040,19990,"-1,050.00",-4.99,20110,-930.00,-4.42,19990,21150
خاهن,آهنگري‌ تراكتورسازي‌ ايران‌,2066,4264322,1.64161E+11,38740,39000,38180,-560.00,-1.45,38500,-240.00,-0.62,38010,39740
نوين,بيمه نوين,2065,18811005,1.11491E+11,6151,6350,5844,-307.00,-4.99,5927,-224.00,-3.64,5844,6350
كترام,توليدي‌ كاشي‌ تكسرام‌,2061,5815421,2.51328E+11,45140,44300,43000,"-2,140.00",-4.74,43220,"-1,920.00",-4.25,42890,45490
فيروزه,صندوق شاخص30 شركت فيروزه- سهام,2055,1862416,2.62837E+11,145020,146060,140000,"-5,020.00",-3.46,141130,"-3,890.00",-2.68,132110,146140
وبازار,صندوق س شاخصي بازارآشنا,2054,16472998,1.6473E+11,10000,10000,10000,0,0,10000,0,0,10000,10000
تملت,تامين سرمايه بانك ملت,2042,10825752,68206757470,6350,6200,6230,-120.00,-1.89,6300,-50.00,-0.79,6180,6510
دزهراويح,ح . ‌داروسازي‌زهراوي‌,2041,13078454,84678027840,6110,6720,6420,310.00,5.07,6470,360.00,5.89,6120,6720
سخزر,سيمان‌ خزر,2014,6107831,1.85216E+11,29060,29060,30510,"1,450.00",4.99,30320,"1,260.00",4.34,29060,30510
غصينو,صنعتي مينو,1981,3057152,2.30619E+11,78480,79900,74556,"-3,924.00",-5.00,75436,"-3,044.00",-3.88,74556,79900
پترول,گروه پتروشيمي س. ايرانيان,1979,19285906,1.87707E+11,9320,9640,9780,460.00,4.94,9730,410.00,4.40,9610,9780
قصفها,قنداصفهان‌,1975,750792,1.21706E+11,166060,170000,161710,"-4,350.00",-2.62,162100,"-3,960.00",-2.38,158020,170000
والبر,سرمايه‌ گذاري‌ البرز(هلدينگ‌,1972,9367928,1.59452E+11,16350,17100,17160,810.00,4.95,17020,670.00,4.10,16370,17160
چكارن,كارتن‌ ايران‌,1971,25965393,82794637760,3210,3300,3230,20.00,0.62,3190,-20.00,-0.62,3060,3320
ثغرب,شركت سرمايه گذاري مسكن شمالغرب,1967,13719713,91939937343,6925,7220,6579,-346.00,-5.00,6701,-224.00,-3.23,6579,7220
ولصنم,ليزينگ‌صنعت‌ومعدن‌,1965,9755930,1.06557E+11,10660,11000,10800,140.00,1.31,10920,260.00,2.44,10640,11180
پكوير,كوير تاير,1964,9949800,1.39604E+11,14250,14840,13710,-540.00,-3.79,14030,-220.00,-1.54,13550,14840
كسرام,پارس‌ سرام‌,1926,14240283,1.41458E+11,10210,10300,9700,-510.00,-5.00,9930,-280.00,-2.74,9700,10400
قشير,قند شيروان قوچان و بجنورد,1907,7165132,1.84356E+11,24692,25730,25926,"1,234.00",5.00,25730,"1,038.00",4.20,24000,25926
دتوليد,داروسازي توليد دارو,1895,4910017,1.28044E+11,27295,27890,25940,"-1,355.00",-4.96,26078,"-1,217.00",-4.46,25931,27890
زشگزا,شير و گوشت زاگرس شهركرد,1895,9920408,88285772890,9249,9330,8787,-462.00,-5.00,8899,-350.00,-3.78,8787,9417
ثباغ,شهر سازي و خانه سازي باغميشه,1879,7109813,1.10282E+11,15925,16010,15160,-765.00,-4.80,15511,-414.00,-2.60,15129,16680
تسه9910,امتياز تسهيلات مسكن دي99,1869,53157,32364793732,625361,600000,602011,"-23,350.00",-3.73,608853,"-16,508.00",-2.64,595009,649500
وسپهح,ح . سرمايه‌گذاري‌ سپه‌,1868,13168410,64616216870,4800,4990,4900,100.00,2.08,4910,110.00,2.29,4650,5150
نطرين,عطرين نخ قم,1864,8475988,98465225653,11839,12429,11371,-468.00,-3.95,11617,-222.00,-1.88,11248,12429
وسكاب,س.ص.بازنشستگي كاركنان بانكها,1835,24662294,1.61495E+11,6300,6590,6610,310.00,4.92,6550,250.00,3.97,6330,6610
كاريس,صندوق س.سپهر كاريزما-س,1829,13029745,1.42655E+11,11224,11780,10900,-324.00,-2.89,10948,-276.00,-2.46,10662,11780
خريخت,صنايع‌ريخته‌گري‌ايران‌,1816,33513647,1.19598E+11,3730,3790,3570,-160.00,-4.29,3570,-160.00,-4.29,3550,3790
خاذين,سايپاآذين‌,1816,26117350,1.18053E+11,4610,4770,4490,-120.00,-2.60,4520,-90.00,-1.95,4380,4770
دزهراوي,داروسازي‌زهراوي‌,1784,6932813,57151959030,8300,8550,8180,-120.00,-1.45,8240,-60.00,-0.72,8000,8550
سشمال,سيمان‌ شمال‌,1775,7355218,79969118980,10780,11310,10990,210.00,1.95,10870,90.00,0.83,10300,11310
سصفها,سيمان‌اصفهان‌,1751,481134,1.76871E+11,376170,370000,360010,"-16,160.00",-4.30,367610,"-8,560.00",-2.28,357380,385000
سيمرغ,سيمرغ,1742,6446415,1.03276E+11,16600,17160,15920,-680.00,-4.10,16020,-580.00,-3.49,15770,17160
شغدير,پتروشيمي غدير,1740,4790992,2.78393E+11,55749,58536,57770,"2,021.00",3.63,58108,"2,359.00",4.23,56000,58536
خزر,فنرسازي‌زر,1732,4712989,2.40174E+11,48540,50960,50960,"2,420.00",4.99,50960,"2,420.00",4.99,50960,50960
وبانك,سرمايه گذاري گروه توسعه ملي,1711,14308462,1.16177E+11,7850,8240,8170,320.00,4.08,8120,270.00,3.44,7800,8240
ومهان,گروه توسعه مالي مهر آيندگان,1708,7775317,98694052003,12599,12840,13000,401.00,3.18,12693,94.00,0.75,12250,13179
خفنر,فنرسازي‌خاور,1700,13008179,2.91184E+11,21340,22330,22400,"1,060.00",4.97,22380,"1,040.00",4.87,21710,22400
غپآذر,شير پگاه آذربايجان شرقي,1695,2478524,1.55923E+11,60507,63333,63532,"3,025.00",5.00,62910,"2,403.00",3.97,59505,63532
بزاگرس,نيروگاه زاگرس كوثر,1687,9430667,62767712619,6925,7221,6600,-325.00,-4.69,6656,-269.00,-3.88,6579,7221
ثزاگرس,سرمايه گذاري توسعه عمران زاگرس,1685,1905208,1.27408E+11,63786,66500,66975,"3,189.00",5.00,66873,"3,087.00",4.84,63900,66975
زپارس,ملي كشت و صنعت و دامپروري پارس,1678,1535728,2.51704E+11,159850,156000,161460,"1,610.00",1.01,163900,"4,050.00",2.53,156000,167840
خشرق,الكتريك‌ خودرو شرق‌,1670,8452880,1.30134E+11,15990,16500,15200,-790.00,-4.94,15400,-590.00,-3.69,15200,16600
دلقما,دارويي‌ لقمان‌,1668,5588888,1.27126E+11,22340,22560,23450,"1,110.00",4.97,22750,410.00,1.84,21230,23450
واحيا,م .صنايع و معادن احياء سپاهان,1662,1310786,1.84945E+11,139818,135730,144009,"4,191.00",3.00,141095,"1,277.00",0.91,135730,144012
وسينا,بانك سينا,1660,28776607,99741266160,3540,3700,3410,-130.00,-3.67,3470,-70.00,-1.98,3370,3700
سصوفي,سيمان‌ صوفيان‌,1659,13438842,2.07033E+11,14730,15460,15460,730.00,4.96,15410,680.00,4.62,14750,15460
ولشرق,ليزينگ ايران و شرق,1648,10877853,81681068906,7752,8000,7365,-387.00,-4.99,7509,-243.00,-3.13,7365,8000
دروز,داروسازي‌ روزدارو,1645,6008571,1.66567E+11,26520,27840,27840,"1,320.00",4.98,27720,"1,200.00",4.52,26630,27840
قنقش,قند نقش جهان,1644,2644763,2.13096E+11,77569,80671,80671,"3,102.00",4.00,80573,"3,004.00",3.87,76203,80671
كي بي سي,شركت كي بي سي,1639,5628519,1.53646E+11,28581,29400,27500,"-1,081.00",-3.78,27298,"-1,283.00",-4.49,27152,29400
اعتماد,صندوق س.اعتماد آفرين پارسيان-د,1638,39358310,1.36792E+12,34737,34753,34753,16.00,0.05,34755,18.00,0.05,34752,34759
فاما,صنعتي‌ آما,1630,4458686,97483104340,22340,22000,21610,-730.00,-3.27,21860,-480.00,-2.15,21500,22400
زاگرس,پتروشيمي زاگرس,1610,887315,1.67112E+11,184497,193721,189500,"5,003.00",2.71,188334,"3,837.00",2.08,179050,193721
قرن,پديده شيمي قرن,1608,1643608,99960435150,62350,64020,60000,"-2,350.00",-3.77,60820,"-1,530.00",-2.45,59720,64100
آپ,آسان پرداخت پرشين,1607,5469750,91118478290,16560,16850,16760,200.00,1.21,16660,100.00,0.60,16120,17250
كحافظ,كاشي‌ وسراميك‌ حافظ‌,1570,5819543,76742649790,13180,13510,13050,-130.00,-0.99,13190,10.00,0.08,12750,13780
سغرب,سيمان‌غرب‌,1569,4160109,1.18128E+11,27270,28500,28630,"1,360.00",4.99,28400,"1,130.00",4.14,27330,28630
فباهنر,مس‌ شهيدباهنر,1569,1948822,98206904230,50960,51500,50650,-310.00,-0.61,50390,-570.00,-1.12,49000,52940
وگردش,بانك گردشگري,1568,14279489,2.60396E+11,18629,18321,19000,371.00,1.99,18236,-393.00,-2.11,18071,19000
ثپرديس,سرمايه گذاري مسكن پرديس,1565,7872375,83704133960,10994,11200,10445,-549.00,-4.99,10633,-361.00,-3.28,10445,11290
حبندر,دريايي و کشتيراني خط دريابندر,1564,3135452,1.03927E+11,31787,31790,32800,"1,013.00",3.19,33146,"1,359.00",4.28,31790,33376
رانفور,خدمات‌انفورماتيك‌,1558,3976224,1.04847E+11,26570,27790,26570,0,0,26370,-200.00,-0.75,25270,27790
تپمپي,پمپ‌ سازي‌ ايران‌,1550,4741057,88972572870,19470,20380,18500,-970.00,-4.98,18770,-700.00,-3.60,18500,20380
شفن,پتروشيمي فناوران,1548,707294,2.04635E+11,288040,290990,291370,"3,330.00",1.16,289320,"1,280.00",0.44,282000,297000
واتي,سرمايه‌ گذاري‌ آتيه‌ دماوند,1510,15847865,1.88581E+11,11400,11600,11970,570.00,5.00,11900,500.00,4.39,11040,11970
غگلپا,شير پاستوريزه پگاه گلپايگان,1506,1922447,1.26446E+11,68529,69000,65105,"-3,424.00",-5.00,65773,"-2,756.00",-4.02,65103,69350
فروس,فروسيليس‌ ايران‌,1487,15410219,76592759550,4940,5100,4910,-30.00,-0.61,4970,30.00,0.61,4750,5150
ثاباد,توريستي ورفاهي آبادگران ايران,1484,2255858,1.16325E+11,50640,52700,51600,960.00,1.90,51570,930.00,1.84,50640,52820
وصنا,گروه‌صنايع‌بهشهرايران‌,1482,14245218,86115990520,6310,6310,6050,-260.00,-4.12,6050,-260.00,-4.12,6000,6460
رمپنا,گروه مپنا (سهامي عام),1480,10588340,1.80011E+11,16420,17000,16980,560.00,3.41,17000,580.00,3.53,16400,17240
حپارسا,توسعه حمل و نقل ريلي پارسيان,1461,4221812,1.56182E+11,35443,37215,37215,"1,772.00",5.00,36994,"1,551.00",4.38,35550,37215
غديس,پاكديس,1458,6976826,87680432862,13053,12750,12401,-652.00,-5.00,12567,-486.00,-3.72,12401,13170
ولملت,واسپاري ملت,1457,10652441,93294296780,9130,9000,8680,-450.00,-4.93,8760,-370.00,-4.05,8680,9350
لسرما,سرما آفرين‌,1453,4974553,1.23516E+11,25610,25320,25000,-610.00,-2.38,24830,-780.00,-3.05,24330,25940
وبيمه,سرمايه‌ گذاري‌ صنعت‌ بيمه‌,1444,25705890,72639909790,2730,2860,2860,130.00,4.76,2830,100.00,3.66,2700,2860
بميلا,توسعه بازرگاني آهن وفولادميلاد,1431,6059698,1.22766E+11,21082,20872,20640,-442.00,-2.10,20259,-823.00,-3.90,20028,21079
كسعدي,كاشي‌ سعدي‌,1420,4393379,80196313970,18970,19390,18030,-940.00,-4.96,18250,-720.00,-3.80,18030,19390
هرمز,فولاد هرمزگان جنوب,1416,13769830,1.72192E+11,11936,12532,12532,596.00,4.99,12505,569.00,4.77,12200,12532
بورس,بورس اوراق بهادار تهران,1411,2440219,1.0017E+11,41000,43050,40900,-100.00,-0.24,41050,50.00,0.12,39500,43050
پلاسك,پلاسكوكار,1393,8778162,70740061860,8200,8250,8000,-200.00,-2.44,8060,-140.00,-1.71,7800,8520
دبالك,مواد اوليه دارويي البرز بالك,1387,4270105,83727793581,20432,20800,19411,"-1,021.00",-5.00,19608,-824.00,-4.03,19411,20800
تكمبا,كمباين‌ سازي‌ ايران‌,1386,9168002,78128715280,8780,8950,8350,-430.00,-4.90,8520,-260.00,-2.96,8350,9070
فسازان,غلتك سازان سپاهان,1384,2887805,1.02468E+11,35130,36870,34590,-540.00,-1.54,35480,350.00,1.00,34100,36880
حتايد,تايدواترخاورميانه,1375,4497257,1.03998E+11,23600,24650,22970,-630.00,-2.67,23120,-480.00,-2.03,22500,24650
پاكشو,گروه صنعتي پاكشو,1365,1614745,1.29288E+11,80490,82790,80500,10.00,0.01,80070,-420.00,-0.52,78550,82790
خاور,ايران خودرو ديزل,1360,24015745,1.66082E+11,6759,6900,6961,202.00,2.99,6916,157.00,2.32,6610,6961
شسپا,نفت سپاهان,1348,4352891,1.00286E+11,22980,24070,22970,-10.00,-0.04,23040,60.00,0.26,22250,24070
شتولي,تولي‌پرس‌,1339,2125296,83379311289,38335,39868,39868,"1,533.00",4.00,39232,897.00,2.34,37353,39868
وملل,اعتباري ملل,1336,11596763,1.78743E+11,14843,15120,15585,742.00,5.00,15413,570.00,3.84,14843,15585
كسعديح,ح . كاشي‌ سعدي‌,1334,4463554,62559449580,14490,14950,13950,-540.00,-3.73,14020,-470.00,-3.24,13460,15210
بهپاك,صنعتي بهپاك,1331,2165656,1.00476E+11,45617,46270,47440,"1,823.00",4.00,46395,778.00,1.71,43510,47700
كهمدا,شيشه‌ همدان‌,1331,6969790,70612761200,9870,10300,10130,260.00,2.63,10130,260.00,2.63,9380,10360
ريشمك,توليد و صادرات ريشمك,1326,1489389,84910264321,57444,57300,56880,-564.00,-0.98,57010,-434.00,-0.76,55530,58820
سپاها,سيمان‌سپاهان‌,1326,8169987,71326712290,9090,9190,8700,-390.00,-4.29,8730,-360.00,-3.96,8640,9210
فرآور,فرآوري‌موادمعدني‌ايران‌,1324,5911846,1.87966E+11,30340,31850,31850,"1,510.00",4.98,31790,"1,450.00",4.78,30850,31850
ساراب,سيمان‌ داراب‌,1324,7492941,1.18131E+11,16340,17120,15530,-810.00,-4.96,15770,-570.00,-3.49,15530,17120
وثخوز,سرمايه گذاري و توسعه خوزستان,1323,2443399,2.01555E+11,78573,82501,82501,"3,928.00",5.00,82490,"3,917.00",4.99,81000,82501
حآسا,آسيا سير ارس,1323,4412166,1.87557E+11,43823,43850,41632,"-2,191.00",-5.00,42509,"-1,314.00",-3.00,41632,45000
خوساز,محورسازان‌ايران‌خودرو,1317,10663036,88157468950,8560,8680,8160,-400.00,-4.67,8270,-290.00,-3.39,8140,8850
شصدف,صنعتي دوده فام,1315,52644,1523885868,27569,28947,28947,"1,378.00",5.00,27609,40.00,0.15,28947,28947
تبرك,گروه كارخانجات صنعتي تبرك,1309,4952856,75110228086,15501,15440,15590,89.00,0.57,15165,-336.00,-2.17,14726,15766
درهآور,دارويي ره آورد تامين,1307,2909159,1.42758E+11,46738,49074,49074,"2,336.00",5.00,49072,"2,334.00",4.99,48328,49074
خكار,ايركا پارت صنعت,1297,5853210,1.03554E+11,18520,17760,17600,-920.00,-4.97,17690,-830.00,-4.48,17600,18490
زبينا,كشاورزي و دامپروري بينالود,1295,2216060,73128171832,34610,34550,32880,"-1,730.00",-5.00,32999,"-1,611.00",-4.65,32880,34590
ضسپا1102,اختيارخ خساپا-2000-1399/11/26,1283,56868,11981394000,201,258,230,29.00,14.43,211,10.00,4.98,160,284
همراه,شركت ارتباطات سيار ايران,1277,3777288,99246514990,26290,26310,26500,210.00,0.80,26270,-20.00,-0.08,25500,26940
خكاوه,سايپا ديزل,1267,15638118,69327439496,4402,4533,4490,88.00,2.00,4433,31.00,0.70,4270,4533
افرا,افرانت,1227,1875087,57594113363,31822,31700,30231,"-1,591.00",-5.00,30715,"-1,107.00",-3.48,30231,32500
پسهند,صنايع‌ لاستيكي‌  سهند,1221,3001841,1.24386E+11,40720,41300,42750,"2,030.00",4.99,41440,720.00,1.77,39300,42750
ثعمرا,عمران و توسعه شاهد,1215,7226128,87598076198,12546,12546,11919,-627.00,-5.00,12122,-424.00,-3.38,11919,13000
غشصفا,شيرپاستوريزه‌پگاه‌اصفهان‌,1212,5683946,1.61323E+11,28050,28150,29450,"1,400.00",4.99,28380,330.00,1.18,26900,29450
وآوا,سرمايه گذاري آوا نوين,1202,9350161,72867384786,7462,7720,7835,373.00,5.00,7793,331.00,4.44,7587,7835
ونفت,سرمايه‌گذاري‌ صنعت‌ نفت‌,1196,4178554,66363381750,15810,16600,16020,210.00,1.33,15880,70.00,0.44,15120,16600
كپشير,پشم‌شيشه‌ايران‌,1184,5008203,1.70703E+11,32540,34160,34160,"1,620.00",4.98,34080,"1,540.00",4.73,31070,34160
لابسا,آبسال‌,1179,1933094,94940251000,51350,49990,48790,"-2,560.00",-4.99,49110,"-2,240.00",-4.36,48790,52000
شاراك,پتروشيمي شازند,1178,5227704,1.28146E+11,24210,25270,24360,150.00,0.62,24510,300.00,1.24,23810,25420
آتيمس,صندوق س.آرمان آتيه درخشان مس-س,1177,960518,1.67782E+11,178077,179990,173000,"-5,077.00",-2.85,174679,"-3,398.00",-1.91,161000,179990
وبوعلي,سرمايه‌گذاري‌بوعلي‌,1177,8597117,48183194090,5570,5830,5690,120.00,2.15,5600,30.00,0.54,5480,5840
فنورد,نوردوقطعات‌ فولادي‌,1163,505442,1.17401E+11,243390,234000,231230,"-12,160.00",-5.00,232270,"-11,120.00",-4.57,231230,244000
اپرداز,آتيه داده پرداز,1161,3529800,78402504230,23142,23670,21985,"-1,157.00",-5.00,22212,-930.00,-4.02,21985,23670
بنيرو,نيروترانس‌,1156,3767055,61943487050,17120,16800,16270,-850.00,-4.96,16440,-680.00,-3.97,16270,17600
وتوس,توسعه‌شهري‌توس‌گستر,1154,5722897,99859240900,18100,17600,17200,-900.00,-4.97,17450,-650.00,-3.59,17200,18100
كمنگنز,معادن‌منگنزايران‌,1152,1076846,99958100390,91500,96070,91170,-330.00,-0.36,92820,"1,320.00",1.44,88000,96070
كيان,صندوق س. با درآمد ثابت كيان,1122,25586686,6.9334E+11,27083,27096,27098,15.00,0.06,27098,15.00,0.06,27095,27104
ركيش,كارت اعتباري ايران كيش,1114,3882507,92671057220,24540,25030,23320,"-1,220.00",-4.97,23870,-670.00,-2.73,23320,25190
سامان,بانك سامان,1105,12367186,1.13463E+11,9445,9300,9162,-283.00,-3.00,9175,-270.00,-2.86,9162,9600
خموتور,موتورسازان‌تراكتورسازي‌ايران‌,1102,6999755,1.13329E+11,16900,16790,16060,-840.00,-4.97,16190,-710.00,-4.20,16060,16800
سفانو,سيمان فارس نو,1100,2079727,77247688100,38550,38190,37150,"-1,400.00",-3.63,37140,"-1,410.00",-3.66,36630,39000
سرود,سيمان‌شاهرود,1097,3171824,59164145820,18730,19400,18400,-330.00,-1.76,18650,-80.00,-0.43,18000,19400
وثنو,سرمايه گذاري ساختماني نوين,1097,3972265,69494007177,17409,17900,17710,301.00,1.73,17495,86.00,0.49,16880,18000
افق,فروشگاههاي زنجيره اي افق كوروش,1097,1126100,90971756990,80540,81490,80710,170.00,0.21,80770,230.00,0.29,79220,82350
شرانل,نفت ايرانول,1093,2707795,1.00895E+11,37631,37998,37120,-511.00,-1.36,37261,-370.00,-0.98,36380,38111
شپديس,پتروشيمي پرديس,1086,2024261,1.91111E+11,92080,96560,93500,"1,420.00",1.54,94410,"2,330.00",2.53,91000,96680
ميدكو,هلدينگ صنايع  معدني خاورميانه,1085,5497736,1.70337E+11,30760,31000,31000,240.00,0.78,30983,223.00,0.72,30220,31300
سكرد,سيمان كردستان,1085,8761091,84101520470,10030,9920,9530,-500.00,-4.99,9600,-430.00,-4.29,9530,10170
خچرخش,چرخشگر,1083,4446525,71598155480,16860,16990,16020,-840.00,-4.98,16100,-760.00,-4.51,16020,16990
غشان,شيرپاستوريزه‌پگاه‌خراسان‌,1083,12718425,76275507200,5750,6030,6030,280.00,4.87,6000,250.00,4.35,5770,6030
اطلس,صندوق س.توسعه اندوخته آينده-س,1083,280953,56393122570,201431,210000,199800,"-1,631.00",-0.81,200721,-710.00,-0.35,196001,210000
رنيك,جنرال مكانيك,1081,2589430,53980195109,20991,21600,20960,-31.00,-0.15,20846,-145.00,-0.69,20400,21600
دفرا,فرآورده‌هاي‌ تزريقي‌ ايران‌,1079,2724712,73553674550,27380,27630,27800,420.00,1.53,27000,-380.00,-1.39,26020,28400
پاسا,ايران‌ياساتايرورابر,1073,9350785,2.37414E+11,24190,25390,25390,"1,200.00",4.96,25390,"1,200.00",4.96,25310,25390
مداران,داده‌پردازي‌ايران‌,1064,2689588,62503552940,24320,23750,23110,"-1,210.00",-4.98,23240,"-1,080.00",-4.44,23110,24290
پارسان,گسترش نفت و گاز پارسيان,1051,6937295,1.27073E+11,17760,18640,18210,450.00,2.53,18320,560.00,3.15,17500,18640
واعتبار,سرمايه گذاري اعتبار ايران,1040,13488131,1.11982E+11,8640,8900,8300,-340.00,-3.94,8300,-340.00,-3.94,8210,8900
طلا,صندوق س.پشتوانه طلاي لوتوس,1034,746437,60977179330,77896,81010,82200,"4,304.00",5.53,81691,"3,795.00",4.87,81010,82202
كتوكاح,ح.توليدي وخدمات صنايع نسوزتوكا,1032,4173300,1.10326E+11,25190,26400,26449,"1,259.00",5.00,26436,"1,246.00",4.95,25430,26449
خمهر,مهركام‌پارس‌,1029,28429843,70379395750,2580,2610,2460,-120.00,-4.65,2480,-100.00,-3.88,2460,2620
غپاك,لبنيات‌ پاك‌,1027,5013744,76608190170,15250,15900,15340,90.00,0.59,15280,30.00,0.20,14530,15920
فپنتا,سپنتا,1015,282916,1.104E+11,409980,400000,390850,"-19,130.00",-4.67,390220,"-19,760.00",-4.82,389490,409900
پارند,صندوق س. پارند پايدار سپهر,1010,38458960,4.30965E+11,11201,11210,11205,4.00,0.04,11206,5.00,0.04,11205,11215
دسانكو,داروسازي سبحان انكولوژي,1008,3308340,50137524231,15779,16100,14991,-788.00,-4.99,15155,-624.00,-3.95,14991,16100
شدوص,دوده‌ صنعتي‌ پارس‌,1004,3898069,1.18888E+11,29090,30540,30540,"1,450.00",4.98,30500,"1,410.00",4.85,29900,30540
وكار,بانك‌ كارآفرين‌,986,17985276,46450700860,2650,2760,2550,-100.00,-3.77,2590,-60.00,-2.26,2520,2760
غچين,كشت‌ و صنعت‌ چين‌ چين,981,5308310,1.0192E+11,19950,19740,18760,"-1,190.00",-5.96,19200,-750.00,-3.76,18760,19750
وتوسم,سرمايه‌گذاري‌توسعه‌ملي‌,976,10093919,1.18632E+11,11300,11860,11860,560.00,4.96,11750,450.00,3.98,11400,11860
وحكمت,بيمه حكمت صبا,962,14423272,59520165774,4240,4320,4113,-127.00,-3.00,4127,-113.00,-2.67,4113,4320
وسپه,سرمايه‌گذاري‌ سپه‌,954,4935380,34189046280,6870,7190,6820,-50.00,-0.73,6910,40.00,0.58,6720,7190
قزوين,كارخانجات‌ قند قزوين‌,952,2366380,87204949010,35580,35790,37350,"1,770.00",4.97,36850,"1,270.00",3.57,34500,37350
سرچشمه,سرمايه گذاري مس سرچشمه,948,6856170,46694348691,6680,7000,6840,160.00,2.40,6799,119.00,1.78,6600,7000
تپولا,مهندسي مرآت پولاد,946,2176674,81009090437,36292,35208,37380,"1,088.00",3.00,37217,925.00,2.55,35208,37380
قهكمت,قندهكمتان‌,941,1201622,51567946730,43840,43990,42400,"-1,440.00",-3.28,42920,-920.00,-2.10,41650,45790
تسه9909,امتياز تسهيلات مسكن آذر99,936,23538,14265064610,621259,600000,604000,"-17,259.00",-2.78,606044,"-15,215.00",-2.45,590198,620000
سمازن,سيمان‌مازندران‌,934,4219761,43882841220,10390,10750,10400,10.00,0.10,10400,10.00,0.10,10000,10780
فمراد,آلومراد,928,454910,71959609880,164520,161000,156300,"-8,220.00",-5.00,158180,"-6,340.00",-3.85,156300,167770
فايرا,آلومينيوم‌ايران‌,928,3079453,76396761270,23940,25050,24690,750.00,3.13,24810,870.00,3.63,24100,25130
خلنت,لنت‌ ترمزايران‌,918,620126,59008744780,99400,101990,94430,"-4,970.00",-5.00,95160,"-4,240.00",-4.27,94430,101990
غاذر,كشت‌وصنعت‌پياذر,917,1147849,64334910120,58050,58690,55150,"-2,900.00",-5.00,56050,"-2,000.00",-3.45,55150,59600
تسه9908,امتياز تسهيلات مسكن آبان99,916,23823,14428999424,621881,600000,591000,"-30,881.00",-4.97,605675,"-16,206.00",-2.61,590787,619998
لبوتان,گروه‌صنعتي‌بوتان‌,886,1158089,71243698800,64500,65500,61300,"-3,200.00",-4.96,61520,"-2,980.00",-4.62,61280,65960
كطبس,ذغال‌سنگ‌ نگين‌ ط‌بس‌,881,880442,64898389190,76020,77840,72980,"-3,040.00",-4.00,73710,"-2,310.00",-3.04,72220,77840
ددام,داروسازي زاگرس فارمد پارس,880,4403626,89182805120,21190,21000,20140,"-1,050.00",-4.96,20250,-940.00,-4.44,20140,21170
وشهر,بانك شهر,878,17102714,1.06495E+11,5991,6230,6200,209.00,3.49,6227,236.00,3.94,6117,6230
وليز,ليزينگ‌ايران‌,874,8706642,61812787300,7030,7270,7150,120.00,1.71,7100,70.00,1.00,6700,7270
كنور,توسعه معدني و صنعتي صبانور,863,1536002,68919443670,44690,44940,45850,"1,160.00",2.60,44870,180.00,0.40,43350,46000
قشرين,قند شيرين خراسان,863,3587565,63860701078,17686,17500,17321,-365.00,-2.06,17801,115.00,0.65,17200,18216
ارفع,شركت آهن و فولاد ارفع,862,12220901,1.43188E+11,11169,11727,11727,558.00,5.00,11717,548.00,4.91,11300,11727
ثامان,سامان‌ گستراصفهان‌,857,3606643,82412463070,23920,23740,22730,"-1,190.00",-4.97,22850,"-1,070.00",-4.47,22730,23740
اميد,تامين سرمايه اميد,856,4395799,34652870940,8020,8210,7780,-240.00,-2.99,7920,-100.00,-1.25,7620,8220
دشيري,شيرين دارو,855,277699,71815974964,263149,271043,257900,"-5,249.00",-1.99,258611,"-4,538.00",-1.72,255255,271043
خكرمان,گروه اقتصادي كرمان خودرو,837,11610429,49756668923,4400,4400,4268,-132.00,-3.00,4286,-114.00,-2.59,4268,4439
شبهرن,نفت‌ بهران‌,837,1099056,64776395170,58170,59000,58780,610.00,1.05,58940,770.00,1.32,57750,61000
حسير,ريل سير كوثر,836,2669760,46302374874,18145,18480,17238,-907.00,-5.00,17351,-794.00,-4.38,17238,18480
واميد,گروه مديريت سرمايه گذاري اميد,834,4806058,1.80069E+11,37420,37880,37400,-20.00,-0.05,37470,50.00,0.13,36420,38880
دفارا,داروسازي‌ فارابي‌,831,1279562,78179524510,59900,62850,61900,"2,000.00",3.34,61100,"1,200.00",2.00,58700,62850
شپترو,پتروشيمي آبادان,829,14175844,62744101412,4555,4510,4419,-136.00,-2.99,4426,-129.00,-2.83,4419,4560
شجم,صنايع پتروشيمي تخت جمشيد,825,6526893,70271970414,10833,10800,10720,-113.00,-1.04,10767,-66.00,-0.61,10509,11157
ثمسكن,سرمايه‌گذاري‌ مسكن‌,823,9794466,46933789200,4790,4950,4870,80.00,1.67,4790,0,0,4650,4950
فلامي,لاميران‌,821,1004297,47776587130,49910,47500,47420,"-2,490.00",-4.99,47650,"-2,260.00",-4.53,47420,49900
وخاور,بانك خاورميانه,821,12437854,1.24037E+11,10000,10080,9790,-210.00,-2.10,9970,-30.00,-0.30,9710,10080
ساروج,بين المللي ساروج بوشهر,820,6502569,1.30533E+11,20666,20047,20480,-186.00,-0.90,20074,-592.00,-2.86,20047,20665
غشهد,شهد ايران ‌,820,11281386,73744315950,6390,6570,6700,310.00,4.85,6540,150.00,2.35,6210,6700
بالاس,مهندسي ساختمان تاسيسات راه آهن,815,1515745,85667870910,53967,56000,56665,"2,698.00",5.00,56519,"2,552.00",4.73,55040,56665
زكشت,كشاورزي مكانيزه اصفهان كشت,813,1763588,58796125710,32551,34178,33000,449.00,1.38,33339,788.00,2.42,31550,34178
ثشرق,سرمايه گذاري مسكن شمال شرق,801,10692818,54512815810,5300,5450,5040,-260.00,-4.91,5100,-200.00,-3.77,5040,5450
آساس,صندوق س.آسمان آرماني سهام-س,799,545355,89474491441,166308,169499,163432,"-2,876.00",-1.73,164067,"-2,241.00",-1.35,160000,169499
كشرق,صنعتي و معدني شمال شرق شاهرود,791,532461,51570274933,96310,99800,93000,"-3,310.00",-3.44,96853,543.00,0.56,93000,99800
سخوز,سيمان خوزستان,787,4072968,90248888940,23130,23480,22400,-730.00,-3.16,22160,-970.00,-4.19,21980,23480
آريان,سرمايه گذاري پارس آريان,783,17120737,2.03941E+11,12220,11930,11854,-366.00,-3.00,11912,-308.00,-2.52,11854,12220
تنوين,تامين سرمايه نوين,782,11385078,71418697180,6380,6480,6300,-80.00,-1.25,6270,-110.00,-1.72,6200,6590
وگستر,گسترش سرمايه گذاري ايرانيان,779,2163387,42794932639,20063,19440,19930,-133.00,-0.66,19821,-242.00,-1.21,19060,20690
وآرين,شركت توسعه اقتصادي آرين,773,6639391,28051210765,4330,4290,4201,-129.00,-2.98,4225,-105.00,-2.42,4201,4400
سمتاز,سيمان ممتازان كرمان,773,1975843,38399698944,19206,19600,19780,574.00,2.99,19435,229.00,1.19,18800,19782
اعتلا,شركت سرمايه گذاري اعتلاء البرز,772,4883656,34511422598,7373,7410,7040,-333.00,-4.52,7144,-229.00,-3.11,7005,7410
دكوثر,داروسازي‌ كوثر,765,1633196,30948189420,19340,20290,18710,-630.00,-3.26,19090,-250.00,-1.29,18400,20290
پرديس,سرمايه گذاري پرديس,763,5877458,38307154950,6460,6590,6530,70.00,1.08,6500,40.00,0.62,6360,6690
كوثر,بيمه كوثر,760,5864812,89909242380,16056,15900,15254,-802.00,-5.00,15330,-726.00,-4.52,15254,15900
وبهمن,سرمايه‌گذاري‌بهمن‌,757,2053905,32639689970,16330,17060,15600,-730.00,-4.47,16030,-300.00,-1.84,15520,17070
وارس,سرمايه گذاري ارس صبا,756,3378429,56086901157,17085,16711,16573,-512.00,-3.00,16601,-484.00,-2.83,16573,17200
فسپا,گروه‌صنعتي‌سپاهان‌,746,1473122,57749716470,39590,40780,39680,90.00,0.23,39200,-390.00,-0.99,38060,40880
غبشهر,صنعتي‌ بهشهر,743,2208536,43971433490,20710,21060,20040,-670.00,-3.24,19970,-740.00,-3.57,19680,21060
كگهر,سنگ آهن گهرزمين,730,640994,29708409962,46966,49250,45900,"-1,066.00",-2.27,46811,-155.00,-0.33,45000,49250
كصدف,كاشي صدف سرام استقلال آباده,729,4267580,1.13284E+11,27097,26285,26285,-812.00,-3.00,26545,-552.00,-2.04,26285,27909
حسينا,توسعه خدمات دريايي وبندري سينا,728,879008,63848727650,71793,73690,71150,-643.00,-0.90,72637,844.00,1.18,71003,74421
بساما,بيمه سامان,727,2579325,55692791250,21467,22540,22400,933.00,4.35,21592,125.00,0.58,20980,22540
ثرود,سرمايه‌گذاري مسكن زاينده رود,726,4847719,79840096650,15686,16470,16470,784.00,5.00,16470,784.00,5.00,16310,16470
كگاز,شيشه‌ و گاز,725,2004933,34960879090,17640,17950,17400,-240.00,-1.36,17490,-150.00,-0.85,17000,17950
هجرت,پخش هجرت,720,1045828,27241438983,27090,27111,26000,"-1,090.00",-4.02,26487,-603.00,-2.23,25736,27820
ولغدر,ليزينگ‌خودروغدير,715,3550917,73969381790,21290,21160,20230,"-1,060.00",-4.98,20830,-460.00,-2.16,20230,21750
دكيمي,كيميدارو,706,1810568,46316679120,24870,25700,26110,"1,240.00",4.99,25550,680.00,2.73,24600,26110
وبشهر,توسعه‌ صنايع‌ بهشهر(هلدينگ,703,3256414,36651736090,11560,12000,11300,-260.00,-2.25,11330,-230.00,-1.99,11000,12000
فولاژ,فولاد آلياژي ايران,698,3668318,56601861860,15200,15830,15380,180.00,1.18,15410,210.00,1.38,14650,15960
كپرور,فرآوري زغال سنگ پروده طبس,697,1138612,45755925707,39698,40480,40499,801.00,2.02,40148,450.00,1.13,39170,40980
بموتو,موتوژن‌,693,1442232,80278886460,53890,55300,56580,"2,690.00",4.99,55660,"1,770.00",3.28,54060,56580
كمينا,شيشه سازي مينا,691,2471362,66444694128,28001,28100,26601,"-1,400.00",-5.00,26886,"-1,115.00",-3.98,26601,28800
تيپيكو,سرمايه گذاري دارويي تامين,687,701924,30901826570,44890,44530,44440,-450.00,-1.00,44540,-350.00,-0.78,43050,46450
دتماد,توليدمواداوليه‌داروپخش‌,685,1295348,60346208390,48880,48020,46650,"-2,230.00",-4.56,46590,"-2,290.00",-4.68,46440,48940
رتاپ,تجارت الكترونيك  پارسيان,684,2821778,17138617370,6060,6280,6130,70.00,1.16,6060,0,0,5900,6280
غگلستا,شير پاستوريزه پگاه گلستان,680,2049681,62476705365,31596,31596,30017,"-1,579.00",-5.00,30481,"-1,115.00",-3.53,30017,31596
ساربيل,سيمان آرتا اردبيل,677,1527003,75834522930,47580,49950,49950,"2,370.00",4.98,49660,"2,080.00",4.37,45210,49950
مبين,مبين انرژي خليج فارس,673,15556345,2.33345E+11,14290,15000,15000,710.00,4.97,15000,710.00,4.97,15000,15000
وپترو,سرمايه‌گذاري صنايع پتروشيمي‌,665,3222018,47659294600,14770,15440,14930,160.00,1.08,14790,20.00,0.14,14280,15440
وصندوق,سرمايه‌گذاري‌صندوق‌بازنشستگي‌,651,5818633,76902223570,13290,13660,13180,-110.00,-0.83,13240,-50.00,-0.38,12780,13800
ثاصفا,شركت‌ ساختمان‌ اصفهان‌,647,1436441,38853362829,26290,26980,27078,788.00,3.00,27048,758.00,2.88,26500,27078
پارس,پتروشيمي پارس,645,705411,92170488680,126780,132990,130390,"3,610.00",2.85,130170,"3,390.00",2.67,128150,133110
سخاش,سيمان‌خاش‌,644,1075193,1.73794E+11,153950,161640,161640,"7,690.00",5.00,161640,"7,690.00",5.00,161640,161640
شاوان,پالايش نفت لاوان,643,489130,39272683847,80846,84000,79400,"-1,446.00",-1.79,80406,-440.00,-0.54,77250,84000
فاسمين,كالسيمين‌,643,13679417,2.02729E+11,14120,14820,14820,700.00,4.96,14820,700.00,4.96,14820,14820
ختراك,ريخته‌گري‌ تراكتورسازي‌ ايران‌,632,5445392,80538404490,14100,14800,14800,700.00,4.96,14790,690.00,4.89,14250,14800
شگل,گلتاش‌,629,1064046,26362908690,25300,26350,24890,-410.00,-1.62,25020,-280.00,-1.11,24040,26350
شپاكسا,پاكسان‌,628,1593881,47333229260,29930,28660,29400,-530.00,-1.77,29710,-220.00,-0.74,28660,30640
غفارس,شير پاستوريزه پگاه فارس,626,6756410,87232473725,12300,12915,12915,615.00,5.00,12911,611.00,4.97,12300,12915
شفارا,پتروشيمي فارابي,625,9300580,40485958342,4484,4400,4350,-134.00,-2.99,4353,-131.00,-2.92,4350,4440
چافست,افست‌,621,2106778,31943954840,15870,15870,15080,-790.00,-4.98,15370,-500.00,-3.15,15080,15970
ختور,رادياتور ايران‌,621,1293018,29079941360,23500,23320,22330,"-1,170.00",-4.98,22890,-610.00,-2.60,22330,23390
جم پيلن,پلي پروپيلن جم - جم پيلن,608,743014,50704572380,68380,70000,69490,"1,110.00",1.62,68250,-130.00,-0.19,66900,70080
شكبير,پتروشيمي اميركبير,605,1797167,1.57218E+11,89915,87222,87219,"-2,696.00",-3.00,87481,"-2,434.00",-2.71,87218,89898
خمحور,توليدمحورخودرو,602,788656,45280891870,56760,58110,57640,880.00,1.55,57330,570.00,1.00,55030,59200
وايران,ليزينگ ايرانيان,599,3104403,35109567630,11660,11250,11080,-580.00,-4.97,11390,-270.00,-2.32,11080,11750
فالوم,آلومتك‌,596,2077116,81112122826,40026,40804,38826,"-1,200.00",-3.00,39050,-976.00,-2.44,38826,41130
حريل,ريل پردازسير,593,9821624,49235801112,4775,5013,5013,238.00,4.98,4998,223.00,4.67,5013,5013
پارسيان,بيمه پارسيان,593,2922907,30328216220,10800,10790,10470,-330.00,-3.06,10530,-270.00,-2.50,10260,10800
غبهار,كشت وصنعت بهاران گلبهار خراسان,592,976629,35496030650,37208,36300,36092,"-1,116.00",-3.00,36345,-863.00,-2.32,36092,37208
وتوشه,سرمايه‌ گذاري‌ پارس‌ توشه‌,591,1478366,33854458560,22550,22230,23020,470.00,2.08,22780,230.00,1.02,22210,23670
سيدكو,سرمايه گذاري توسعه صنايع سيمان,591,3345926,19408787040,5890,6100,5760,-130.00,-2.21,5850,-40.00,-0.68,5700,6100
پخش,پخش البرز,588,1383987,47733784248,33518,34700,35193,"1,675.00",5.00,34417,899.00,2.68,33518,35193
وآفري,بيمه كارآفرين,578,1604178,33773871636,21077,21699,21070,-7.00,-0.03,21054,-23.00,-0.11,20571,21709
ما,بيمه  ما,572,6868397,57839560450,8470,8470,8470,0,0,8420,-50.00,-0.59,8240,8590
فخاس,فولاد خراسان,570,1413109,36410207370,25870,26450,25700,-170.00,-0.66,25830,-40.00,-0.15,25130,26450
عيار,صندوق س. پشتوانه طلاي مفيد,547,456133,13031514717,27447,28080,28722,"1,275.00",4.65,28570,"1,123.00",4.09,28080,28814
اتكام,شركت بيمه اتكايي امين,547,5044164,26507587532,5210,5400,5319,109.00,2.09,5233,23.00,0.44,5120,5419
دارو,كارخانجات‌داروپخش‌,547,773965,25076775530,34050,32600,32410,"-1,640.00",-4.82,33160,-890.00,-2.61,32350,34290
وملت,سرمايه گذاري ملت,539,6606865,30059402981,4483,4572,4572,89.00,1.99,4550,67.00,1.49,4511,4572
لخزر,پارس‌ خزر,534,177788,30621618110,180350,180000,171340,"-9,010.00",-5.00,175110,"-5,240.00",-2.91,171340,180300
ثنور,سرمايه گذاري كوه نور,534,6633774,78727342654,12223,11857,11857,-366.00,-2.99,11868,-355.00,-2.90,11857,12133
ثجوان,تامين مسكن جوانان,520,2617569,34124909524,12860,12477,12890,30.00,0.23,13037,177.00,1.38,12477,13245
غپونه,نوش پونه مشهد,513,1521135,30910132246,19801,20389,20395,594.00,3.00,20320,519.00,2.62,19836,20395
داوه,داروسازي آوه سينا,509,1290135,23208632283,18842,18000,17900,-942.00,-5.00,18417,-425.00,-2.26,17900,18300
بالبر,كابل‌ البرز,505,1250959,50752718240,42260,42070,40150,"-2,110.00",-4.99,40570,"-1,690.00",-4.00,40150,42070
شوينده,مديريت صنعت شوينده ت.ص.بهشهر,504,1055465,34110168420,32610,33430,32490,-120.00,-0.37,32400,-210.00,-0.64,32000,33610
سايرا,ايرانيت‌,502,867148,42811231605,49178,50161,48195,-983.00,-2.00,49370,192.00,0.39,48195,50161
سهرمز,سيمان‌هرمزگان‌,501,1009281,25012464630,25680,25200,24400,"-1,280.00",-4.98,25180,-500.00,-1.95,24400,26000
امين يكم2,صندوق درآمد ثابت امين يكم فردا,500,50000000,50000000,10188,1,1,"-10,187.00",-99.99,1,"-10,187.00",-99.99,1,1
ومعادن,توسعه‌معادن‌وفلزات‌,499,8396479,92025409840,10440,10960,10960,520.00,4.98,10820,380.00,3.64,10960,10960
كروي,توسعه‌ معادن‌ روي‌ ايران‌,497,2014601,55844739720,26400,27720,27720,"1,320.00",5.00,27720,"1,320.00",5.00,27720,27720
شپارس,بين‌ المللي‌ محصولات‌  پارس‌,495,1457883,23703031000,16480,17050,16160,-320.00,-1.94,16370,-110.00,-0.67,15800,17050
كرماشا,صنايع پتروشيمي كرمانشاه,489,1431474,51582542490,35620,36400,36100,480.00,1.35,36030,410.00,1.15,35500,37100
مارون,پتروشيمي مارون,488,389160,57889818877,152080,153950,146020,"-6,060.00",-3.98,150117,"-1,963.00",-1.29,145000,153950
دامين,داروسازي‌ امين‌,488,1274634,18471981260,15180,15000,14430,-750.00,-4.94,14910,-270.00,-1.78,14430,15000
پكرمان,گروه‌ صنعتي‌ بارز,484,3271562,86185867750,26130,27360,26190,60.00,0.23,26340,210.00,0.80,25010,27360
قاسم,قاسم ايران,481,3234858,47642988624,14027,14728,14728,701.00,5.00,14610,583.00,4.16,14728,14728
تايرا,تراكتورسازي‌ايران‌,479,1366287,36303077690,27520,27990,26150,"-1,370.00",-4.98,26780,-740.00,-2.69,26150,28000
ثنظام,س. ساختماني نظام مهندسي ايران,479,1032738,53799453372,50577,52094,52094,"1,517.00",3.00,52094,"1,517.00",3.00,52094,52094
نيرو,نيرو سرمايه,476,586244,35420343579,61700,63300,62869,"1,169.00",1.89,60419,"-1,281.00",-2.08,59849,63300
بفجر,فجر انرژي خليج فارس,475,2001215,47478315630,23490,23700,23850,360.00,1.53,23670,180.00,0.77,23270,24480
شنفت,نفت‌ پارس‌,474,767613,40432476330,52230,54790,51690,-540.00,-1.03,52570,340.00,0.65,51410,54790
بخاور,بيمه زندگي خاورميانه,473,3705083,25125124452,6891,6850,6730,-161.00,-2.34,6834,-57.00,-0.83,6650,7110
سپ,پرداخت الكترونيك سامان كيش,471,1198273,18239537640,15490,15850,15500,10.00,0.06,15390,-100.00,-0.65,14720,15850
فلات,گروه صنايع معادن فلات ايرانيان,469,2054299,26783305144,13300,13061,12901,-399.00,-3.00,13038,-262.00,-1.97,12901,13500
چكاوه,صنايع‌كاغذسازي‌كاوه‌,464,2468418,33097312140,14090,13390,13390,-700.00,-4.97,13600,-490.00,-3.48,13390,13710
اوان,مبين وان كيش,463,661778,33213454092,51122,51395,50660,-462.00,-0.90,50498,-624.00,-1.22,49140,53000
ضخود2006,اختيارخ خودرو-2500-1400/02/08,461,17592,7847554000,429,461,445,16.00,3.73,446,17.00,3.96,405,490
قشهد,شهد,460,561073,18310091290,33130,33500,32840,-290.00,-0.88,32940,-190.00,-0.57,31600,33970
تماوند,تامين سرمايه دماوند,458,2051428,35506348677,17609,17950,17780,171.00,0.97,17308,-301.00,-1.71,17040,17950
خفناور,مهندسي صنعتي روان فن آور,456,1086172,55178709409,49327,50806,50806,"1,479.00",3.00,50801,"1,474.00",2.99,49996,50806
لوتوس,تامين سرمايه لوتوس پارسيان,454,2227948,22651925130,10030,10490,10210,180.00,1.79,10090,60.00,0.60,9800,10490
دلرح,ح . داروسازي‌ اكسير,451,1461877,40548348110,27370,26580,27820,450.00,1.64,27740,370.00,1.35,26560,30000
داسوه,داروسازي‌ اسوه‌,444,995470,40475810200,42800,40660,40660,"-2,140.00",-5.00,40880,"-1,920.00",-4.49,40660,40660
وساشرقي,شركت س استان آذربايجان شرقي,441,17733331,16856591380,980,940,940,-40.00,-4.08,970,-10.00,-1.02,940,970
سيلام,سيمان‌ ايلام‌,434,3704426,40970951560,10540,11060,11060,520.00,4.93,10910,370.00,3.51,11060,11060
بسويچ,پارس‌سويچ‌,433,528198,25690968710,50790,52400,48260,"-2,530.00",-4.98,49650,"-1,140.00",-2.24,48260,52400
ساروم,سيمان‌اروميه‌,432,986478,37357921860,36070,37870,37870,"1,800.00",4.99,37270,"1,200.00",3.33,37870,37870
آكورد,صندوق س. آرمان آتي كوثر-د,427,11483585,3.51881E+11,30632,30647,30644,12.00,0.04,30642,10.00,0.03,30629,30653
شراز,پالايش نفت شيراز,426,599250,59643925990,97262,97262,98198,936.00,0.96,99531,"2,269.00",2.33,94121,102125
بكاب,صنايع‌جوشكاب‌يزد,426,149404,55798257550,392310,372910,372700,"-19,610.00",-5.00,373470,"-18,840.00",-4.80,372700,389380
افق ملت,صندوق س در سهام افق ملت,417,179801,22118666340,126350,130000,121350,"-5,000.00",-3.96,123020,"-3,330.00",-2.64,119000,130000
دالبر,البرزدارو,415,1384692,29495023650,21100,21490,21200,100.00,0.47,21220,120.00,0.57,20330,22150
شبصير,توليدات پتروشيمي قائد بصير,413,240554,21822616169,91084,93962,89588,"-1,496.00",-1.64,90919,-165.00,-0.18,89400,94909
لكما,كارخانجات‌مخابراتي‌ايران‌,413,2739954,18437150466,7083,6729,6729,-354.00,-5.00,6729,-354.00,-5.00,6729,6729
خديزل,بهمن  ديزل,408,1911228,82473169298,43925,45100,44000,75.00,0.17,43152,-773.00,-1.76,42300,46121
گشان,توسعه بين المللي پديده شانديز,401,481818,20145774216,42665,41812,41812,-853.00,-2.00,41973,-692.00,-1.62,41812,41812
غويتا,ويتانا,399,1363884,25607776124,19721,18740,18735,-986.00,-5.00,19201,-520.00,-2.64,18735,19162
وزمين,بانك ايران زمين,399,3789134,52296721062,13889,13889,13884,-5.00,-0.04,13802,-87.00,-0.63,13612,13980
كفپارس,فرآورده‌هاي‌ نسوز پارس‌,396,5075814,22993437420,4320,4530,4530,210.00,4.86,4410,90.00,2.08,4530,4530
ساينا,صنايع بهداشتي ساينا,395,110833,17628743003,166299,167000,158002,"-8,297.00",-4.99,163605,"-2,694.00",-1.62,157985,167000
دپارس,پارس‌ دارو,394,223961,18449420700,85870,88500,81580,"-4,290.00",-5.00,84510,"-1,360.00",-1.58,81580,88500
دلر,داروسازي‌ اكسير,392,996840,34268533840,35320,36490,34360,-960.00,-2.72,34650,-670.00,-1.90,33850,36490
وپخش,داروپخش‌ (هلدينگ‌,392,483884,54044833090,117520,111650,111650,"-5,870.00",-4.99,111690,"-5,830.00",-4.96,111650,117320
شخارك,پتروشيمي‌ خارك‌,388,928530,39514985430,42280,42280,41980,-300.00,-0.71,42390,110.00,0.26,41800,43500
دابور,داروسازي‌ ابوريحان‌,377,388399,14476284730,37870,38210,37480,-390.00,-1.03,37690,-180.00,-0.48,36090,39000
آ س پ,آ.س.پ,377,2899910,47535324720,15612,16392,16392,780.00,5.00,16287,675.00,4.32,16392,16392
ضخود2007,اختيارخ خودرو-3000-1400/02/08,369,11495,2806323000,255,261,251,-4.00,-1.57,244,-11.00,-4.31,220,261
وسنا,سرمايه گذاري نيروگاهي ايران,366,1006563,16907059364,17250,17500,16892,-358.00,-2.08,16920,-330.00,-1.91,16444,17500
فنفت,صنايع تجهيزات نفت,366,1010185,29978683402,28861,29726,29726,865.00,3.00,29676,815.00,2.82,29140,29726
هجرتح,ح . پخش هجرت,362,816552,16359696553,20434,20810,20000,-434.00,-2.12,20035,-399.00,-1.95,19800,20810
بنو,بيمه تجارت نو,362,2140587,72606570453,32304,33919,33919,"1,615.00",5.00,33919,"1,615.00",5.00,33919,33919
سپاس,صندوق س. پاداش سهامداري توسعه1,362,14302043,1.43276E+11,10018,10023,10018,0,0,10018,0,0,10011,10035
درازك,دارويي‌ رازك‌,362,1078986,39093191640,36480,38150,35700,-780.00,-2.14,36280,-200.00,-0.55,35020,38150
داروح,ح . كارخانجات‌داروپخش,358,476275,11854060080,26510,27000,24700,"-1,810.00",-6.83,24890,"-1,620.00",-6.11,24100,27000
كاوه,فولاد كاوه جنوب كيش,353,11470282,1.95224E+11,16210,17020,17020,810.00,5.00,17020,810.00,5.00,17020,17020
دجابر,داروسازي‌ جابرابن‌حيان‌,352,705375,14958459730,21380,22400,21380,0,0,21330,-50.00,-0.23,20420,22400
غالبر,لبنيات‌ كالبر,345,1256115,21580055700,16370,17180,17180,810.00,4.95,16690,320.00,1.95,17180,17180
دسبحا,گروه دارويي سبحان,339,942052,18437639750,19040,19050,19490,450.00,2.36,19230,190.00,1.00,18500,19980
زر,صندوق س.پشتوانه سكه طلاي زر,329,212821,10470818942,47164,48020,49250,"2,086.00",4.42,49200,"2,036.00",4.32,48020,49600
سهگمت,سيمان‌هگمتان‌,325,867613,20129152640,23480,22520,22830,-650.00,-2.77,23370,-110.00,-0.47,22520,24310
شرنگي,شيميايي رنگين,324,135091,23604324906,178478,178478,173124,"-5,354.00",-3.00,174729,"-3,749.00",-2.10,173124,178478
كفرا,فراورده‌ هاي‌ نسوزايران‌,322,331998,14948447570,47220,45170,44860,"-2,360.00",-5.00,46530,-690.00,-1.46,44860,47530
ولتجار,واسپاري تجارت وسرمايه ايرانيان,320,2731589,21097451313,7925,7900,7688,-237.00,-2.99,7724,-201.00,-2.54,7688,7969
تكنو,تكنوتار,320,1755568,41378737760,24810,23570,23570,"-1,240.00",-5.00,23640,"-1,170.00",-4.72,23570,23570
گدنا,تهيه توزيع غذاي دنا آفرين فدك,318,1134064,32481861088,30149,28642,28642,"-1,507.00",-5.00,29078,"-1,071.00",-3.55,28642,28642
شپاس,نفت پاسارگاد,316,712938,15767408303,22115,23000,22155,40.00,0.18,22115,0,0,21700,23000
وسرمد,بيمه  سرمد,314,3151324,19100031191,6180,6288,5995,-185.00,-2.99,6061,-119.00,-1.93,5995,6288
ولبهمن,شركت بهمن ليزينگ,305,4819985,40926492635,8087,8491,8491,404.00,5.00,8386,299.00,3.70,8491,8491
دسبحان,سبحان دارو,304,644195,13700768250,21180,22200,21320,140.00,0.66,21200,20.00,0.09,20510,22200
شفا,سرمايه گذاري شفادارو,301,428886,19289781610,44680,46800,44800,120.00,0.27,44790,110.00,0.25,43230,46800
دسينا,داروسازي‌ سينا,298,548615,14142284780,26690,26530,25900,-790.00,-2.96,26420,-270.00,-1.01,25400,26540
چخزر,صنايع چوب خزر كاسپين,296,505407,30108611211,62708,59573,59573,"-3,135.00",-5.00,60581,"-2,127.00",-3.39,59573,59573
ضسپا1103,اختيارخ خساپا-2500-1399/11/26,295,16886,237769000,18,20,13,-5.00,-27.78,14,-4.00,-22.22,8,20
خصدرا,صنعتي‌ دريايي‌ ايران‌,294,9078144,33861477120,3825,3730,3730,-95.00,-2.48,3743,-82.00,-2.14,3730,3730
حخزر,كشتيراني درياي خزر,290,1374308,32790183523,23285,23960,24449,"1,164.00",5.00,23656,371.00,1.59,22450,24449
خراسان,پتروشيمي خراسان,288,380908,26203968440,67780,70700,68300,520.00,0.77,68300,520.00,0.77,67440,70700
شيراز,پتروشيمي‌شيراز,284,747205,41076726360,54050,56620,54890,840.00,1.55,54430,380.00,0.70,53800,56620
سكه0012پ01,سكه تمام بهارتحويلي 1روزه رفاه,279,83500,94853736100,1089827,1132000,1140000,"50,173.00",4.60,1135973,"46,146.00",4.23,1131111,1141000
سبجنو,سيمان‌ بجنورد,272,545600,29838864000,52090,54690,54690,"2,600.00",4.99,53510,"1,420.00",2.73,54690,54690
تسه9907,امتياز تسهيلات مسكن مهر99,271,4020,2490163373,640298,608284,608284,"-32,014.00",-5.00,619444,"-20,854.00",-3.26,608284,650000
وتعاون,بيمه  تعاون,271,3349582,21791052894,6700,6830,6499,-201.00,-3.00,6506,-194.00,-2.90,6499,6830
كفرآور,فرآورده هاي سيمان شرق,266,1756982,43773449548,24189,24914,24914,725.00,3.00,24914,725.00,3.00,24914,24914
كاسپين,داروسازي كاسپين تامين,256,267539,6412456498,24900,23760,23768,"-1,132.00",-4.55,24774,-126.00,-0.51,23660,24830
پارتا,مجتمع‌صنعتي‌آرتاويل‌تاير,254,593760,36293423634,62927,61052,61040,"-1,887.00",-3.00,61125,"-1,802.00",-2.86,61040,62790
شاملا,معدني‌ املاح‌  ايران‌,251,195787,10305344490,53440,55000,51610,"-1,830.00",-3.42,53270,-170.00,-0.32,50770,55000
ضخود2005,اختيارخ خودرو-2000-1400/02/08,249,6900,5001956000,712,719,741,29.00,4.07,725,13.00,1.83,662,770
لازما,كارخانه هاي صنعتي آزمايش,248,1273930,47452618570,36165,37249,37249,"1,084.00",3.00,37249,"1,084.00",3.00,37249,37249
زعف0008پ10,زعفران0008نگين طلاي سرخ(پ),246,304824,38454406186,125992,126001,126500,508.00,0.40,126153,161.00,0.13,125500,126500
ياقوت,صندوق س ياقوت آگاه-ثابت,245,3357055,39782064475,11852,11850,11850,-2.00,-0.02,11850,-2.00,-0.02,11848,11865
غمهرا,توليدي‌مهرام‌,239,281408,33377802880,112970,118610,118610,"5,640.00",4.99,116270,"3,300.00",2.92,118610,118610
شساخت,مهندسي و ساختمان صنايع نفت,238,1266433,50634225725,41211,42000,40000,"-1,211.00",-2.94,39982,"-1,229.00",-2.98,39975,42000
وتوكا,سرمايه‌گذاري‌توكافولاد(هلدينگ,237,3304394,35819630960,10330,10840,10840,510.00,4.94,10660,330.00,3.19,10840,10840
بمپنا,توليد برق عسلويه  مپنا,223,96574,6961245708,74853,76231,72198,"-2,655.00",-3.55,74448,-405.00,-0.54,71111,76231
سپر,صندوق س سپر سرمايه بيدار- ثابت,221,3730848,42517426039,11378,11391,11397,19.00,0.17,11396,18.00,0.16,11382,11440
زفكا,كشت و دامداري فكا,220,1416638,16358227788,11849,11530,11450,-399.00,-3.37,11743,-106.00,-0.89,11390,11980
دارا,صندوق س. دارا الگوريتم-د,218,6547731,65954719383,10064,10080,10073,9.00,0.09,10073,9.00,0.09,10011,10100
آينده,بازرگاني آينده سازان بهشت پارس,216,1023551,24396338085,24572,23835,23835,-737.00,-3.00,23835,-737.00,-3.00,23835,23835
حپترو,حمل و نقل پتروشيمي( سهامي عام,215,508154,24945279860,46760,49090,49090,"2,330.00",4.98,47790,"1,030.00",2.20,49090,49090
شفارس,صنايع‌ شيميايي‌ فارس‌,214,1412133,69533428920,46900,49240,49240,"2,340.00",4.99,49240,"2,340.00",4.99,49240,49240
كخاك,صنايع‌خاك‌چيني‌ايران‌,202,167625,7314092020,44300,45600,43270,"-1,030.00",-2.33,44200,-100.00,-0.23,43090,45600
زنگان,صنعت روي زنگان,199,160535,18370180585,120453,114431,114431,"-6,022.00",-5.00,117934,"-2,519.00",-2.09,114431,114431
تسه9902,امتياز تسهيلات مسكن ارديبهشت99,197,3610,2209507816,622285,621000,602608,"-19,677.00",-3.16,612052,"-10,233.00",-1.64,591200,653399
بذر,صندوق س بذر اميد آفرين-سهام,195,95151,9142489660,99770,99770,95310,"-4,460.00",-4.47,96080,"-3,690.00",-3.70,94410,99770
گوهر,صندوق سكه طلاي كيان,194,597731,33547795767,53994,55001,56323,"2,329.00",4.31,56125,"2,131.00",3.95,55001,56689
شصفها,پتروشيمي‌ اصفهان‌,187,114135,13353418810,119242,118400,116870,"-2,372.00",-1.99,117106,"-2,136.00",-1.79,116858,121500
غويتاح,ح . ويتانا,185,552881,7229154270,13713,13050,13028,-685.00,-5.00,13075,-638.00,-4.65,13028,13300
فن آوا,گروه فن آوا,185,2183164,41794034403,18587,19144,19144,557.00,3.00,19144,557.00,3.00,18900,19144
كيميا,معدني كيمياي زنجان گستران,184,3572937,54058536810,14410,15130,15130,720.00,5.00,15129,719.00,4.99,15130,15130
تسه9801,امتياز تسهيلات مسكن فروردين98,180,3855,2339866984,629083,601010,610000,"-19,083.00",-3.03,606969,"-22,114.00",-3.52,597629,615000
سفار,سيمان‌فارس‌,179,245583,34364429190,133270,139930,139930,"6,660.00",5.00,137620,"4,350.00",3.26,139930,139930
كيان2,صندوق س. با درآمد ثابت كيان,179,17900000,17900000,27083,1,1,"-27,082.00",-100.00,1,"-27,082.00",-100.00,1,1
تسه9712,امتياز تسهيلات مسكن اسفند97,179,3842,2296639939,619302,603010,599998,"-19,304.00",-3.12,597772,"-21,530.00",-3.48,588337,610000
تابا,تابان نيرو سپاهان,173,343542,20635880856,57208,60068,60068,"2,860.00",5.00,60041,"2,833.00",4.95,60068,60068
فردا,صندوق س آواي فرداي زاگرس-ثابت,167,1921152,19491617088,10139,10144,10146,7.00,0.07,10146,7.00,0.07,10144,10148
كتوكا,توليدي و خدمات صنايع نسوز توكا,166,506843,19607728298,36844,38686,38686,"1,842.00",5.00,37492,648.00,1.76,38686,38686
كاذر,فرآورده‌هاي‌نسوزآذر,163,262600,9059700000,36310,34500,34500,"-1,810.00",-4.98,35950,-360.00,-0.99,34500,34500
تسه9904,امتياز تسهيلات مسكن تير99,160,2524,1567119609,627138,596782,607000,"-20,138.00",-3.21,620887,"-6,251.00",-1.00,595782,657999
وسين,بيمه سينا,158,1111846,21870010820,18734,19670,19670,936.00,5.00,19670,936.00,5.00,19670,19670
تسه9906,امتياز تسهيلات مسكن شهريور99,154,2234,1373027036,624241,593029,606000,"-18,241.00",-2.92,614605,"-9,636.00",-1.54,593029,649000
سكه9912پ04,سكه تمام بهارتحويل1روزه صادرات,152,66800,75810457500,1089824,1123500,1139987,"50,163.00",4.60,1134887,"45,063.00",4.13,1123500,1139998
مفاخر,توسعه فناوري اطلاعات خوارزمي,152,528778,29339776108,52844,55486,55486,"2,642.00",5.00,54297,"1,453.00",2.75,55486,55486
اتكاي,بيمه اتكايي ايرانيان,149,833852,11202405963,14134,13430,13428,-706.00,-5.00,13961,-173.00,-1.22,13428,13999
ضسپا3004,اختيارخ خساپا-2500-1400/03/26,148,6823,1991256000,1,222,310,309.00,"30,900.00",292,291.00,"29,100.00",200,329
تسه9810,امتياز تسهيلات مسكن دي98,142,2547,1563121105,614826,610000,638000,"23,174.00",3.77,613711,"-1,115.00",-0.18,592198,640000
زگلدشت,كشت و دام گلدشت نمونه اصفهان,142,245761,11868535973,50834,48293,48293,"-2,541.00",-5.00,50160,-674.00,-1.33,48293,48293
شتوكا,توكا رنگ فولاد سپاهان,140,199505,10435308530,55058,52306,52306,"-2,752.00",-5.00,54421,-637.00,-1.16,52306,52306
سباقر,سيمان باقران,139,604019,10528655189,16924,17431,17431,507.00,3.00,17171,247.00,1.46,17431,17431
سجام,مجتمع سيمان غرب آسيا,139,1585000,8587560317,5582,5415,5415,-167.00,-2.99,5507,-75.00,-1.34,5415,5500
ضسپا1101,اختيارخ خساپا-1800-1399/11/26,139,7043,2943786000,408,420,420,12.00,2.94,418,10.00,2.45,334,434
تسه9905,امتياز تسهيلات مسكن مرداد99,138,1675,1027662119,622492,600000,600000,"-22,492.00",-3.61,613530,"-8,962.00",-1.44,592111,653616
قمرو,قند مرودشت‌,136,1007732,33295465280,31470,33040,33040,"1,570.00",4.99,32400,930.00,2.96,33040,33040
تصميم,صندوق س با درآمد ثابت تصميم,131,1019024,15890220915,15581,15594,15597,16.00,0.10,15594,13.00,0.08,15592,15600
كهرام,توليدي گرانيت بهسرام,130,118487,11392169589,93347,96147,96147,"2,800.00",3.00,94812,"1,465.00",1.57,96147,96147
تسه9802,امتياز تسهيلات مسكن ارديبهشت98,130,2211,1354391647,638152,610021,610000,"-28,152.00",-4.41,612570,"-25,582.00",-4.01,606245,620010
شكف,كف,128,104949,9122272029,85217,86921,86921,"1,704.00",2.00,86688,"1,471.00",1.73,86921,86921
ضپاس2002,اختيارخ وپارس-3000-1400/02/29,127,3290,1629770000,498,580,509,11.00,2.21,495,-3.00,-0.60,440,580
الماس,صندوق س.امين تدبيرگران فردا-س,126,66861,7291075410,113125,114991,109000,"-4,125.00",-3.65,109048,"-4,077.00",-3.60,107250,114991
گكيش,توريستي ورفاهي آبادگران كيش,125,110181,9654499944,90333,87624,87624,"-2,709.00",-3.00,88928,"-1,405.00",-1.56,87624,87624
بپاس,بيمه پاسارگاد,125,72872,6368065464,91986,87387,87387,"-4,599.00",-5.00,91674,-312.00,-0.34,87387,87387
تسه9803,امتياز تسهيلات مسكن خرداد98,121,1334,826431423,634113,606020,619798,"-14,315.00",-2.26,619514,"-14,599.00",-2.30,606020,665818
سجامح,ح.مجتمع سيمان غرب آسيا,120,1051811,3378046769,3310,3211,3211,-99.00,-2.99,3212,-98.00,-2.96,3211,3250
كساوه,صنايع‌ كاشي‌ و سراميك‌ سينا,120,86601,5635127070,68490,65070,65070,"-3,420.00",-4.99,68060,-430.00,-0.63,65070,65070
جهرم,پتروشيمي جهرم,119,1628084,3186160388,2059,1957,1957,-102.00,-4.95,2042,-17.00,-0.83,1957,1957
بايكا,كارخانجات كابلسازي ‌ايران‌,117,72075,3186507825,45578,44211,44211,"-1,367.00",-3.00,45356,-222.00,-0.49,44211,44211
آساميد,صندوق س.مشترك آسمان اميد -د,116,3970104,45758414868,11517,11533,11528,11.00,0.10,11526,9.00,0.08,11523,11537
ضپاس2001,اختيارخ وپارس-2500-1400/02/29,116,3295,2384808000,711,701,770,59.00,8.30,724,13.00,1.83,650,800
ارمغان,ص سرمايه گذاري ارمغان ايرانيان,111,1464901,14693535841,10028,10030,10031,3.00,0.03,10030,2.00,0.02,10025,10031
دقاضي,داروسازي شهيد قاضي,111,220105,10329427968,48318,47650,47000,"-1,318.00",-2.73,47601,-717.00,-1.48,46869,47720
سكه0112پ03,سكه تمام بهارتحويلي1روزه سامان,110,38100,43243762400,1091057,1135000,1139998,"48,941.00",4.49,1135007,"43,950.00",4.03,1130002,1140000
فيروزا,صندوق بادرآمد ثابت فيروزه آسيا,109,777967,17309523732,22273,22270,22254,-19.00,-0.09,22250,-23.00,-0.10,22211,22271
تسه9903,امتياز تسهيلات مسكن خرداد99,106,913,556160966,626661,610000,607000,"-19,661.00",-3.14,609158,"-17,503.00",-2.79,595328,625000
خپويش,سازه‌ پويش‌,104,232137,12238262640,50210,52720,52720,"2,510.00",5.00,50780,570.00,1.14,52720,52720
زفكاح,ح . كشت و دامداري فكا,103,659844,4810439630,7463,7490,7295,-168.00,-2.25,7290,-173.00,-2.32,7225,7490
پرداخت,به پرداخت ملت,101,234023,8396745240,37760,35880,35880,"-1,880.00",-4.98,37410,-350.00,-0.93,35880,35880
ورازي,بيمه رازي,97,1465065,12168829890,7911,8306,8306,395.00,4.99,8144,233.00,2.95,8306,8306
اخزا821,اسنادخزانه-م21بودجه98-020906,97,112498,66914078685,597328,598500,594000,"-3,328.00",-0.56,594802,"-2,526.00",-0.42,593000,598500
فسا,پتروشيمي فسا,96,1111363,1984894318,1879,1786,1786,-93.00,-4.95,1869,-10.00,-0.53,1786,1786
فجام,جام‌دارو,95,373828,3902764320,10980,10440,10440,-540.00,-4.92,10940,-40.00,-0.36,10440,10440
حتوكا,حمل‌ونقل‌توكا,94,239879,7441046580,32650,31020,31020,"-1,630.00",-4.99,32390,-260.00,-0.80,31020,31020
فسديد,لوله‌وتجهيزات‌ سديد - ورشكسته,94,33902,4053517888,120029,120562,118829,"-1,200.00",-1.00,119658,-371.00,-0.31,118829,121229
ثروتم,صندوق س. ثروت آفرين پارسيان-س,94,178860,14168567000,77303,80000,80390,"3,087.00",3.99,79216,"1,913.00",2.47,78400,80950
سكه0011پ02,سكه تمام بهارتحويلي 1روزه ملت,92,31800,36155251800,1089525,1114747,1142400,"52,875.00",4.85,1136958,"47,433.00",4.35,1114747,1144350
غشوكو,شوكو پارس,90,132486,5405826258,42064,40803,40803,"-1,261.00",-3.00,41693,-371.00,-0.88,40803,40803
كقزوي,شيشه‌ قزوين‌,89,368044,3662405844,10474,9951,9951,-523.00,-4.99,10373,-101.00,-0.96,9951,9951
ضغدر1119,اختيارخ وغدير-10000-1399/11/26,88,1370,1798992000,1003,1498,1350,347.00,34.60,1313,310.00,30.91,600,1590
زعف0008پ16,زعفران0008نگين بيرجند(پ),87,69745,8632166700,123988,123300,124000,12.00,0.01,123768,-220.00,-0.18,123000,124000
تسه9901,امتياز تسهيلات مسكن فروردين99,87,1152,716705763,635836,604345,605000,"-30,836.00",-4.85,622140,"-13,696.00",-2.15,604045,667627
سخواف,سيمان مجد خواف,86,354727,6563158954,19074,18502,18502,-572.00,-3.00,18871,-203.00,-1.06,18502,18502
ضجار2002,اختيارخ وتجارت-2500-1400/02/22,86,2314,1425522000,634,650,635,1.00,0.16,616,-18.00,-2.84,580,650
تسه9812,امتياز تسهيلات مسكن اسفند98,80,502,312485337,636433,668254,636440,7.00,0,622481,"-13,952.00",-2.19,604612,668254
وسديد,گروه ‌صنعتي‌سديد,78,101288,2296604112,23136,22674,22674,-462.00,-2.00,23107,-29.00,-0.13,22674,22674
تشتاد,صنايع توليدي اشتاد ايران‌,78,441231,6785250318,16187,15378,15378,-809.00,-5.00,15893,-294.00,-1.82,15378,15378
اخزا815,اسنادخزانه-م15بودجه98-010406,76,72175,56325159799,782160,778390,780511,"-1,649.00",-0.21,780397,"-1,763.00",-0.23,778380,784000
آسام,صندوق س.آرمان سپهر آشنا-م,75,85070,8740270680,102621,103990,103900,"1,279.00",1.25,102742,121.00,0.12,100200,103990
صايند,صندوق س. گنجينه آينده روشن-د,74,711060,7095556850,9965,9950,9984,19.00,0.19,9979,14.00,0.14,9950,9990
دقاضيح,ح . داروسازي شهيد قاضي,74,46446,1643728381,36252,35500,35165,"-1,087.00",-3.00,35390,-862.00,-2.38,35165,36000
كدما,معدني‌ دماوند,72,17141,3994538640,245300,233040,233040,"-12,260.00",-5.00,244260,"-1,040.00",-0.42,233040,233040
ضشنا2001,اختيارخ شپنا-10000-1400/02/27,72,684,1655721000,2377,2390,2550,173.00,7.28,2421,44.00,1.85,1801,2600
لخانه,لوازم‌ خانگي‌ پارس‌,72,89084,2626908992,28630,29488,29488,858.00,3.00,28739,109.00,0.38,29488,29488
آكورد2,صندوق س. آرمان آتي كوثر-د,70,7000000,7000000,30632,1,1,"-30,631.00",-100.00,1,"-30,631.00",-100.00,1,1
گپارس,امور رفاهي كارگزاران پارس,68,34212,7462081956,207727,218113,218113,"10,386.00",5.00,211290,"3,563.00",1.72,218113,218113
ضسپا3003,اختيارخ خساپا-2000-1400/03/26,68,3085,1623082000,523,550,580,57.00,10.90,526,3.00,0.57,505,605
پلاست,كارخانجات توليدي پلاستيران,65,38566,2861481502,76491,74197,74197,"-2,294.00",-3.00,76158,-333.00,-0.44,74197,74197
اخزا903,اسنادخزانه-م3بودجه99-011110,63,251416,1.75741E+11,699582,695200,695930,"-3,652.00",-0.52,699007,-575.00,-0.08,695200,701000
وپسا,س. پتروشيمي ساختمان  خليج فارس,63,747764,2260490572,3084,3023,3023,-61.00,-1.98,3070,-14.00,-0.45,3023,3023
خاتم,صندوق س خاتم ايساتيس پويا-ثابت,62,1626280,17097666497,10508,10513,10513,5.00,0.05,10513,5.00,0.05,10513,10517
سنوين,سرمايه گذاري اقتصاد نوين,62,1646248,15960374360,9413,9695,9695,282.00,3.00,9624,211.00,2.24,9695,9695
صنوين,صندوق سرمايه‌گذاري صنوين-مختلط,61,39426,3905815760,99210,98610,100900,"1,690.00",1.70,99070,-140.00,-0.14,98600,101000
وكادو,تكادو,61,150073,3338523958,22934,22246,22246,-688.00,-3.00,22809,-125.00,-0.55,22246,22246
اخزا901,اسنادخزانه-م1بودجه99-010621,60,45240,33760074663,746091,746000,746990,899.00,0.12,746244,153.00,0.02,745600,747498
افران,صندوق س افرا نماد پايدار-ثابت,60,616652,7786976125,12623,12638,12633,10.00,0.08,12628,5.00,0.04,12623,12639
معيار,سرمايه گذاري معيار صنعت پارس,59,89971,4004609210,43214,44510,44510,"1,296.00",3.00,43458,244.00,0.56,44510,44510
ضفلا1153,اختيارخ فولاد-10000-1399/11/28,58,514,761641000,1047,1670,1648,601.00,57.40,1482,435.00,41.55,1000,1670
ضشنا2002,اختيارخ شپنا-12000-1400/02/27,57,637,904360000,1254,1400,1470,216.00,17.22,1420,166.00,13.24,1251,1600
اخزا817,اسنادخزانه-م17بودجه98-010512,55,300888,2.31775E+11,769568,769568,766907,"-2,661.00",-0.35,770303,735.00,0.10,766222,771100
وبيمهح,ح . سرمايه‌ گذاري‌ صنعت‌ بيمه‌,53,535625,899172680,1600,1700,1650,50.00,3.13,1680,80.00,5.00,1650,1700
تسه9811,امتياز تسهيلات مسكن بهمن98,52,268,165034858,629642,617000,618500,"-11,142.00",-1.77,615802,"-13,840.00",-2.20,598160,621000
تسه9808,امتياز تسهيلات مسكن آبان98,52,795,510773200,626809,658149,638149,"11,340.00",1.81,642482,"15,673.00",2.50,595469,658149
ضفلا1154,اختيارخ فولاد-12000-1399/11/28,49,1208,289605000,132,198,300,168.00,127.27,240,108.00,81.82,110,300
كساپا,سايپاشيشه‌,48,113378,4172310400,38730,36800,36800,"-1,930.00",-4.98,38550,-180.00,-0.46,36800,36800
اخزا902,اسنادخزانه-م2بودجه99-011019,46,53076,37400815441,705590,704025,704045,"-1,545.00",-0.22,704665,-925.00,-0.13,704025,705900
اراد65,مرابحه عام دولتي65-ش.خ0210,46,7957041,7.37657E+12,926990,927050,927050,60.00,0.01,927050,60.00,0.01,927050,927050
اخزا907,اسنادخزانه-م7بودجه99-020704,44,232517,1.42185E+11,612903,611770,612000,-903.00,-0.15,611502,"-1,401.00",-0.23,610000,612999
ضشنا2000,اختيارخ شپنا-9000-1400/02/27,44,962,3331072000,3122,2461,3560,438.00,14.03,3463,341.00,10.92,2460,3560
ضسپا1100,اختيارخ خساپا-1600-1399/11/26,44,1921,1176189000,605,401,630,25.00,4.13,612,7.00,1.16,401,639
سكارون,سيمان كارون,44,10631,1881229867,182429,176957,176957,"-5,472.00",-3.00,181890,-539.00,-0.30,176957,176957
تسه9809,امتياز تسهيلات مسكن آذر98,43,385,236308253,620299,589386,620000,-299.00,-0.05,613788,"-6,511.00",-1.05,589386,643000
كارين,صندوق س نگين سامان-ثابت,41,1130768,11442648539,10115,10121,10120,5.00,0.05,10119,4.00,0.04,10115,10121
نمرينو,ايران‌ مرينوس‌,41,38327,2229864860,55410,58180,58180,"2,770.00",5.00,55530,120.00,0.22,58180,58180
ضفلا1155,اختيارخ فولاد-14000-1399/11/28,40,1723,21006000,6,5,15,9.00,150.00,12,6.00,100.00,3,18
اخزا808,اسنادخزانه-م8بودجه98-000817,40,15238,13349490559,874696,872001,876103,"1,407.00",0.16,876066,"1,370.00",0.16,872001,876600
وسكرد,شركت س استان كردستان,40,1076790,764520900,740,710,710,-30.00,-4.05,740,0,0,710,710
وسمركز,شركت س استان مركزي,39,621461,783040860,1400,1260,1260,-140.00,-10.00,1400,0,0,1260,1260
زنجان,صنايع كشاورزي وكود زنجان,38,281653,2681899866,9816,9522,9522,-294.00,-3.00,9775,-41.00,-0.42,9522,9522
وايرا,سرمايه گذاري صنايع ايران,38,531612,6026353632,11686,11336,11336,-350.00,-3.00,11574,-112.00,-0.96,11336,11336
دمعيار,صندوق س. توازن معيار-د,38,1814523,18323707561,10095,10100,10095,0,0,10098,3.00,0.03,10095,10110
ضفلا1156,اختيارخ فولاد-16000-1399/11/28,37,1803,1952000,1,1,1,0,0,1,0,0,1,2
اخزا814,اسنادخزانه-م14بودجه98-010318,37,87267,68862610531,787139,786879,790000,"2,861.00",0.36,789102,"1,963.00",0.25,785500,790000
ضغدر3003,اختيارخ وغدير-10000-1400/03/26,37,1623,4387960000,1622,3000,2900,"1,278.00",78.79,2704,"1,082.00",66.71,2500,3000
زعف0008پ05,زعفران0008نگين زرين(پ),35,49037,6075655870,124004,124000,124000,-4.00,0,123899,-105.00,-0.08,123700,124100
سمايه,بانك سرمايه,35,43267,306200559,7295,7077,7077,-218.00,-2.99,7292,-3.00,-0.04,7077,7077
ثاژن,سخت آژند,35,131841,1396723554,10387,10594,10594,207.00,1.99,10414,27.00,0.26,10594,10594
سلار,شركت سيمان لارستان,33,322817,20702577027,66114,64131,64131,"-1,983.00",-3.00,64131,"-1,983.00",-3.00,64131,64131
ولراز,ليزينگ رازي,32,19779,1146588630,59762,57970,57970,"-1,792.00",-3.00,59653,-109.00,-0.18,57970,57970
اخزا908,اسنادخزانه-م8بودجه99-020606,32,98272,61087658305,623686,624000,620500,"-3,186.00",-0.51,621618,"-2,068.00",-0.33,619538,624000
تسه9806,امتياز تسهيلات مسكن شهريور98,30,352,223776957,626693,658027,610000,"-16,693.00",-2.66,635730,"9,037.00",1.44,595359,658027
سخند,صندوق س.سپهرخبرگان نفت-د,30,164870,1653095310,10024,10030,10030,6.00,0.06,10027,3.00,0.03,10025,10030
ضخود2008,اختيارخ خودرو-3500-1400/02/08,29,1000,125461000,138,140,121,-17.00,-12.32,125,-13.00,-9.42,113,140
ضسپا1105,اختيارخ خساپا-3500-1399/11/26,29,2225,4225000,1,1,5,4.00,400.00,2,1.00,100.00,1,5
اخزا905,اسنادخزانه-م5بودجه99-020218,29,110826,72976405787,658863,659999,658000,-863.00,-0.13,658477,-386.00,-0.06,658000,659999
سفاسي,شركت فارسيت اهواز,29,111012,1600793040,14865,14420,14420,-445.00,-2.99,14828,-37.00,-0.25,14420,14420
ضفلا1152,اختيارخ فولاد-9000-1399/11/28,28,252,512096000,1921,1920,2500,579.00,30.14,2032,111.00,5.78,1800,2500
سدشت,صنايع سيمان دشتستان,28,46205,2166090400,44650,46880,46880,"2,230.00",4.99,44740,90.00,0.20,46880,46880
اخزا812,اسنادخزانه-م12بودجه98-001111,28,118859,99849089742,839388,840000,841100,"1,712.00",0.20,840063,675.00,0.08,840000,841100
فنرژي,گسترش صنايع انرژي آذرآب,27,59046,1174011618,19494,19883,19883,389.00,2.00,19537,43.00,0.22,19883,19883
اوصتا,صندوق انديشه ورزان صباتامين -د,27,450712,8043047882,17839,17846,17852,13.00,0.07,17845,6.00,0.03,17845,17852
ضجار2000,اختيارخ وتجارت-1800-1400/02/22,26,1046,1323490000,1292,1290,1250,-42.00,-3.25,1265,-27.00,-2.09,1100,1500
اخزا818,اسنادخزانه-م18بودجه98-010614,24,33114,25120562525,760728,756590,758113,"-2,615.00",-0.34,758608,"-2,120.00",-0.28,734657,764999
اخزا809,اسنادخزانه-م9بودجه98-000923,24,33205,28548870388,860969,858155,859928,"-1,041.00",-0.12,859776,"-1,193.00",-0.14,858155,862000
اخزا909,اسنادخزانه-م9بودجه99-020316,23,16458,10654368376,647792,650000,646099,"-1,693.00",-0.26,647367,-425.00,-0.07,646040,652800
وحافظ,بيمه حافظ,23,49083,3597096738,74781,73286,73286,"-1,495.00",-2.00,74229,-552.00,-0.74,73286,73286
تسه9807,امتياز تسهيلات مسكن مهر98,23,110,67924748,638624,606693,626693,"-11,931.00",-1.87,617498,"-21,126.00",-3.31,606693,626693
تسه9804,امتياز تسهيلات مسكن تير98,23,138,84023568,626753,630000,600000,"-26,753.00",-4.27,608866,"-17,887.00",-2.85,595416,630000
حاريا,كشتيراني آريا,23,31297,939755019,30955,30027,30027,-928.00,-3.00,30910,-45.00,-0.15,30027,30027
وسگيلا,شركت س استان گيلان,21,311570,236793200,800,760,760,-40.00,-5.00,800,0,0,760,760
زعف0008پ20,زعفران0008نگين وحدت جام(پ),20,9720,1196705991,123793,123800,123800,7.00,0.01,123118,-675.00,-0.55,121200,123900
اخزا806,اسنادخزانه-م6بودجه98-000519,20,30213,27538691231,911681,910325,912000,319.00,0.03,911485,-196.00,-0.02,910325,912000
اخزا811,اسنادخزانه-م11بودجه98-001013,20,70137,59627945446,850280,849207,850021,-259.00,-0.03,850164,-116.00,-0.01,849207,851900
زعف0008پ11,زعفران0008نگين سحرخيز(پ),19,66700,8371844020,125218,125500,125500,282.00,0.23,125515,297.00,0.24,125460,125645
وسصفا,شركت س استان اصفهان,19,188242,192006840,1070,1020,1020,-50.00,-4.67,1070,0,0,1020,1020
تاپكيشح,ح.تجارت الكترونيك پارسيان كيش,18,82166,1454342740,18569,19090,17641,-928.00,-5.00,17700,-869.00,-4.68,17641,19090
وآرينح,ح. شركت توسعه اقتصادي آرين,18,290866,868336082,3167,3170,2977,-190.00,-6.00,2985,-182.00,-5.75,2977,3170
اخزا816,اسنادخزانه-م16بودجه98-010503,17,188215,1.45442E+11,770534,774000,772000,"1,466.00",0.19,772742,"2,208.00",0.29,771000,774000
ضپاس2003,اختيارخ وپارس-3500-1400/02/29,17,451,170990000,400,450,370,-30.00,-7.50,379,-21.00,-5.25,280,450
تسه9805,امتياز تسهيلات مسكن مرداد98,17,91,56414995,652531,619905,620000,"-32,531.00",-4.99,619945,"-32,586.00",-4.99,619905,620000
اخزا813,اسنادخزانه-م13بودجه98-010219,16,21490,17192369824,800522,800001,800010,-512.00,-0.06,800017,-505.00,-0.06,800000,800100
گنجين,صندوق س. گنجينه يكم آويد-د,16,136423,1662564933,12179,12183,12186,7.00,0.06,12187,8.00,0.07,12183,12190
اخزا721,اسنادخزانه-م21بودجه97-000728,15,12208,10737834354,879516,879500,880000,484.00,0.06,879574,58.00,0.01,879500,882000
ضملت1130,اختيارخ وبملت-8000-1399/11/28,14,670,670000,1,1,1,0,0,1,0,0,1,1
كيسون,شركت كيسون,14,19313,280926898,14842,14546,14546,-296.00,-1.99,14839,-3.00,-0.02,14546,14546
ضملت1129,اختيارخ وبملت-7000-1399/11/28,14,529,530000,1,1,1,0,0,1,0,0,1,2
اخزا810,اسنادخزانه-م10بودجه98-001006,14,75855,64923578834,854048,854049,855819,"1,771.00",0.21,855891,"1,843.00",0.22,853416,856000
خبازرس,بازرسي مهندسي و صنعتي ايران,14,511100,12912430400,24529,25264,25264,735.00,3.00,24988,459.00,1.87,25264,25264
داراب,پتروشيمي داراب,14,230212,552508800,2474,2400,2400,-74.00,-2.99,2472,-2.00,-0.08,2400,2400
زعف0008پ19,زعفران0008نگين تروند قاينات(پ),13,8614,1067578630,123588,124000,124000,412.00,0.33,123935,347.00,0.28,123900,124000
ضملت1125,اختيارخ وبملت-4000-1399/11/28,13,657,100824000,152,150,130,-22.00,-14.47,153,1.00,0.66,121,160
آبين,كشت و صنعت آبشيرين,13,30857,131635962,4353,4266,4266,-87.00,-2.00,4352,-1.00,-0.02,4266,4266
ضگل1142,اختيارخ كگل-16000-1399/11/21,12,352,472868000,1289,1190,1600,311.00,24.13,1343,54.00,4.19,1190,1600
ضفلا1151,اختيارخ فولاد-8000-1399/11/28,11,64,205671000,2945,3500,3400,455.00,15.45,3214,269.00,9.13,2851,3500
ضفلا3005,اختيارخ فولاد-14000-1400/03/19,11,77,47450000,1,550,800,799.00,"79,900.00",616,615.00,"61,500.00",550,800
ضخود2009,اختيارخ خودرو-4000-1400/02/08,11,116,10615000,97,90,88,-9.00,-9.28,92,-5.00,-5.15,88,96
ضملي3002,اختيارخ فملي-10000-1400/03/02,11,109,208060000,1297,1980,1900,603.00,46.49,1909,612.00,47.19,1900,1980
دحاوي,الحاوي,11,118650,1420003200,12338,11968,11968,-370.00,-3.00,12311,-27.00,-0.22,11968,11968
صبا1401,اجاره مهندسي صبا نفت14010225,10,610,600540000,970305,979000,985000,"14,695.00",1.51,984492,"14,187.00",1.46,979000,985000
اراد70,مرابحه عام دولت70-ش.خ0112,10,2000000,1.88344E+12,941640,941720,941720,80.00,0.01,941720,80.00,0.01,941720,941720
نگين,ص.س. زمين و ساختمان نگين شهرري,10,1723,82244890,48270,47540,47850,-420.00,-0.87,47730,-540.00,-1.12,47540,48420
فخاسح,ح . فولاد خراسان,9,112487,2699688000,32160,24000,24000,"-8,160.00",-25.37,24000,"-8,160.00",-25.37,24000,24000
ضفار3000,اختيارخ فارس-8000-1400/03/05,9,45,97102000,1887,2520,2060,173.00,9.17,2158,271.00,14.36,2000,2520
ضغدر1120,اختيارخ وغدير-12000-1399/11/26,9,171,33610000,121,198,195,74.00,61.16,197,76.00,62.81,140,250
ضگل1141,اختيارخ كگل-14000-1399/11/21,8,75,260776000,2744,2800,3600,856.00,31.20,3477,733.00,26.71,2800,3600
ضشنا2003,اختيارخ شپنا-14000-1400/02/27,8,115,111030000,1000,999,1000,0,0,965,-35.00,-3.50,888,1000
اخزا713,اسنادخزانه-م13بودجه97-000518,8,23697,21617862980,911046,912002,912500,"1,454.00",0.16,912262,"1,216.00",0.13,912002,912500
اطلس2,صندوق س.توسعه اندوخته آينده-س,8,80000,80000,201431,1,1,"-201,430.00",-100.00,1,"-201,430.00",-100.00,1,1
ضصاد3001,اختيارخ وبصادر-2000-1400/03/12,8,180,148720000,800,1000,860,60.00,7.50,826,26.00,3.25,800,1000
زير0003پ01,زيره سبز0003كيميابذر(پ),8,170,88487290,498513,522999,523000,"24,487.00",4.91,520513,"22,000.00",4.41,500000,523000
زعف0008پ18,زعفران0008نگين بهرامن(پ),8,4064,507696898,123491,125999,126990,"3,499.00",2.83,124925,"1,434.00",1.16,124500,126990
تملي804,تسهيلات مسكن ب. ملي-تير98,7,348,182396942,534681,507947,561415,"26,734.00",5.00,524129,"-10,552.00",-1.97,507947,561415
ضخود2013,اختيارخ خودرو-7000-1400/02/08,7,142,2673000,22,14,23,1.00,4.55,19,-3.00,-13.64,14,23
اخزا820,اسنادخزانه-م20بودجه98-020806,7,100193,60996463800,606721,608799,603000,"-3,721.00",-0.61,608790,"2,069.00",0.34,603000,608799
شستا991,اجاره تامين اجتماعي-امين991226,7,130,129545484,982505,972001,999998,"17,493.00",1.78,996504,"13,999.00",1.42,972001,1000000
وسقم,شركت س استان قم,7,116145,155634300,1410,1340,1340,-70.00,-4.96,1410,0,0,1340,1340
داريك,صندوق س.اعتماد داريك-د,7,12186,125988836,10359,10360,10359,0,0,10339,-20.00,-0.19,10280,10360
ضملت1124,اختيارخ وبملت-3500-1399/11/28,6,146,57970000,386,410,390,4.00,1.04,397,11.00,2.85,390,420
ضملت3000,اختيارخ وبملت-3000-1400/03/19,6,12,15370000,899,1200,1400,501.00,55.73,1281,382.00,42.49,1200,1400
ضجار2003,اختيارخ وتجارت-3000-1400/02/22,6,90,41890000,475,498,465,-10.00,-2.11,465,-10.00,-2.11,440,498
هصيكو402,اختيارف ت تاصيكو13500-00/02/20,6,55500,136530000,2146,2460,2460,314.00,14.63,2460,314.00,14.63,2460,2460
ضملت1123,اختيارخ وبملت-3000-1399/11/28,6,257,247295000,850,990,973,123.00,14.47,962,112.00,13.18,800,990
وسيستا,شركت س استان سيستان وبلوچستان,6,147042,108811080,770,740,740,-30.00,-3.90,770,0,0,740,740
اخزا804,اسنادخزانه-م4بودجه98-000421,6,25593,23737918832,926020,927510,927500,"1,480.00",0.16,927516,"1,496.00",0.16,927500,927562
اخزا805,اسنادخزانه-م5بودجه98-000422,6,14081,12998089276,923076,925000,923076,0,0,923094,18.00,0,923076,925000
ضترا3002,اختيارخ شتران-8000-1400/03/09,5,60,132000000,1600,2200,2200,600.00,37.50,2200,600.00,37.50,2200,2200
ضغدر1121,اختيارخ وغدير-14000-1399/11/26,5,82,485000,2,100,5,3.00,150.00,6,4.00,200.00,5,10
ضملي3000,اختيارخ فملي-8000-1400/03/02,5,31,102750000,3022,3300,3400,378.00,12.51,3315,293.00,9.70,3199,3400
ضملت3003,اختيارخ وبملت-4500-1400/03/19,5,60,23550000,1,300,500,499.00,"49,900.00",392,391.00,"39,100.00",300,500
ضملي3003,اختيارخ فملي-12000-1400/03/02,5,135,140955000,1003,800,1050,47.00,4.69,1044,41.00,4.09,800,1060
اخزا904,اسنادخزانه-م4بودجه99-011215,5,5560,3810747760,690000,690000,685130,"-4,870.00",-0.71,685386,"-4,614.00",-0.67,685120,690000
ضمخا2001,اختيارخ اخابر-10000-1400/02/29,5,39,77850000,2046,2000,1950,-96.00,-4.69,1996,-50.00,-2.44,1950,2000
خعمرا,توسعه و عمران شهرستان نائين,5,2857,65196740,22156,22820,22820,664.00,3.00,22158,2.00,0.01,22820,22820
ضملت1126,اختيارخ وبملت-4500-1399/11/28,5,500,8900000,32,29,13,-19.00,-59.38,18,-14.00,-43.75,13,29
ضغدر1118,اختيارخ وغدير-9000-1399/11/26,4,38,81300000,2011,2100,2300,289.00,14.37,2139,128.00,6.36,2100,2300
زعف0008پ15,زعفران0008پوشالمعمول طلاسرخ(پ),4,224,18051400,82999,80400,80500,"-2,499.00",-3.01,80587,"-2,412.00",-2.91,80400,80610
ضگل1143,اختيارخ كگل-18000-1399/11/21,4,34,2692000,453,10,371,-82.00,-18.10,79,-374.00,-82.56,10,371
اراد50,مرابحه عام دولت5-ش.خ0302,4,68100,68100068100,1000000,1000001,1000001,1.00,0,1000001,1.00,0,1000001,1000001
وسكرشا,س.سهام عدالت استان كرمانشاه,4,20300,24360000,1260,1200,1200,-60.00,-4.76,1260,0,0,1200,1200
ضصاد3002,اختيارخ وبصادر-2500-1400/03/12,4,30,14500000,450,460,495,45.00,10.00,483,33.00,7.33,460,495
تملي701,تسهيلات مسكن ب. ملي-فروردين97,4,41,24672607,595238,624999,624999,"29,761.00",5.00,601771,"6,533.00",1.10,565477,624999
اراد314,مرابحه عام دولت3-ش.خ 0208,4,20500000,1.8364E+13,1000000,894041,897300,"-102,700.00",-10.27,895805,"-104,195.00",-10.42,894041,897446
ضفلا3003,اختيارخ فولاد-10000-1400/03/19,4,152,390800000,1987,3299,2501,514.00,25.87,2571,584.00,29.39,2500,3299
ضخود2012,اختيارخ خودرو-6000-1400/02/08,4,40,1295000,35,34,31,-4.00,-11.43,32,-3.00,-8.57,31,34
اخزا718,اسنادخزانه-م18بودجه97-000525,4,2653,2409839870,910076,907501,910000,-76.00,-0.01,908345,"-1,731.00",-0.19,907501,911000
كمند2,صندوق س. با درآمد ثابت كمند,3,244000000,244000000,10022,1,1,"-10,021.00",-99.99,1,"-10,021.00",-99.99,1,1
وسخراش,شركت س استان خراسان شمالي,3,20000,26200000,1370,1310,1310,-60.00,-4.38,1370,0,0,1310,1310
زعف0008پ08,زعفران0008نگين روستا(پ),3,8000,992000000,124149,124000,124000,-149.00,-0.12,124000,-149.00,-0.12,124000,124000
شسم,توليد سموم‌ علف‌ كش,3,8160,746199360,87929,91446,91446,"3,517.00",4.00,88181,252.00,0.29,91446,91446
ضترا3003,اختيارخ شتران-9000-1400/03/09,3,32,64000000,1900,2000,2000,100.00,5.26,2000,100.00,5.26,2000,2000
تفيرو,مهندسي فيروزا,3,604,11767128,19100,19482,19482,382.00,2.00,19100,0,0,19482,19482
عيار2,صندوق س. پشتوانه طلاي مفيد,3,30000,30000,27447,1,1,"-27,446.00",-100.00,1,"-27,446.00",-100.00,1,1
سپرمي,پرميت‌,3,10800,93571200,8495,8664,8664,169.00,1.99,8498,3.00,0.04,8664,8664
اروند05,منفعت صبا اروند لوتوس 14001113,3,4500,4410000740,1005001,980001,980000,"-25,001.00",-2.49,980000,"-25,001.00",-2.49,980000,980001
پست0008پ08,پسته فندقي32-30مه ولات0008(پ),3,430,576770000,1314000,1315000,1350000,"36,000.00",2.74,1341326,"27,326.00",2.08,1315000,1350000
اخزا722,اسنادخزانه-م22بودجه97-000428,3,3550,3277061448,921510,927000,923001,"1,491.00",0.16,923116,"1,606.00",0.17,923001,927000
تملي809,تسهيلات مسكن ب. ملي-آذر98,3,110,29260990,253342,266009,266009,"12,667.00",5.00,266009,"12,667.00",5.00,266009,266009
ضپاس2000,اختيارخ وپارس-2000-1400/02/29,3,110,131500000,1250,1150,1250,0,0,1195,-55.00,-4.40,1150,1250
وسمازن,س.سهام عدالت استان مازندران,3,21500,19995000,970,930,930,-40.00,-4.12,970,0,0,930,930
ضفلا3004,اختيارخ فولاد-12000-1400/03/19,3,3,6000000,1500,2000,2000,500.00,33.33,2000,500.00,33.33,2000,2000
تملي808,تسهيلات مسكن ب. ملي-آبان98,3,74,16194900,208429,218850,218850,"10,421.00",5.00,218850,"10,421.00",5.00,218850,218850
اخزا8114,اسنادخزانه-م11بودجه98-001013,2,1736000,1.47724E+12,850280,851610,850280,0,0,850945,665.00,0.08,850280,851610
اخزا7224,اسنادخزانه-م22بودجه97-000428,2,1838000,1.69604E+12,921510,924020,921510,0,0,922765,"1,255.00",0.14,921510,924020
اخزا7204,اسنادخزانه-م20بودجه97-000324,2,1420000,1.33339E+12,939837,938178,939837,0,0,939007,-830.00,-0.09,938178,939837
اخزا906,اسنادخزانه-م6بودجه99-020321,2,1450,1011806000,683149,699864,684880,"1,731.00",0.25,697797,"14,648.00",2.14,684880,699864
اخزا8074,اسنادخزانه-م7بودجه98-000719,2,668000,5.93962E+11,883509,894819,883509,0,0,889164,"5,655.00",0.64,883509,894819
كابگن,توليدي و صنعتي آبگينه‌,2,63632,326432160,5080,5130,5130,50.00,0.98,5083,3.00,0.06,5130,5130
زير0003پ02,زيره سبز0003 دانش(پ),2,19,9072897,490000,480000,473271,"-16,729.00",-3.41,477521,"-12,479.00",-2.55,473271,480000
وسخراج,شركت س استان خراسان جنوبي,2,31400,66254000,2220,2110,2110,-110.00,-4.95,2220,0,0,2110,2110
زعف0008پ09,زعفران0008نگين نوين(پ),2,1043,128706822,124500,131554,123050,"-1,450.00",-1.16,123401,"-1,099.00",-0.88,123050,131554
شستا992,اجاره تامين اجتماعي-سپهر991226,2,10,10000000,999999,1000000,1000000,1.00,0,1000000,1.00,0,1000000,1000000
اراد454,مرابحه عام دولت4-ش.خ 0107,2,4210000,4.02595E+12,960000,956020,956543,"-3,457.00",-0.36,956281,"-3,719.00",-0.39,956020,956543
اخزا807,اسنادخزانه-م7بودجه98-000719,2,571,504501062,883509,883522,883542,33.00,0,883539,30.00,0,883522,883542
اخزا7164,اسنادخزانه-م16بودجه97-000407,2,1636000,1.56384E+12,932000,979783,932000,0,0,955891,"23,891.00",2.56,932000,979783
ضفلا3002,اختيارخ فولاد-9000-1400/03/19,2,22,76120000,3200,3460,3460,260.00,8.13,3460,260.00,8.13,3460,3460
ضجار2001,اختيارخ وتجارت-2000-1400/02/22,2,20,22000000,1221,1150,1050,-171.00,-14.00,1100,-121.00,-9.91,1050,1150
شستا004,اجاره تامين اجتماعي-نوين000523,2,10,10029000,990000,1000000,1029000,"39,000.00",3.94,1002900,"12,900.00",1.30,1000000,1029000
اخزا7184,اسنادخزانه-م18بودجه97-000525,2,2498000,2.27416E+12,910076,910709,910076,0,0,910392,316.00,0.03,910076,910709
اراد644,مرابحه عام دولتي64-ش.خ0111,2,6000000,5.66796E+12,944500,944820,944500,0,0,944660,160.00,0.02,944500,944820
اخزا720,اسنادخزانه-م20بودجه97-000324,2,210,198660000,939837,946000,946000,"6,163.00",0.66,946000,"6,163.00",0.66,946000,946000
اخزا7214,اسنادخزانه-م21بودجه97-000728,2,3164000,2.78772E+12,879516,882633,879516,0,0,881074,"1,558.00",0.18,879516,882633
ضشنا2010,اختيارخ شپنا-8000-1400/02/27,2,33,137790000,4100,4290,3030,"-1,070.00",-26.10,4175,75.00,1.83,3030,4290
ضگل3002,اختيارخ كگل-16000-1400/03/23,2,25,95500000,1,3900,3800,"3,799.00","379,900.00",3820,"3,819.00","381,900.00",3800,3900
فولاد2,فولاد مباركه اصفهان,2,655000000,6.75175E+12,10810,11350,10300,-510.00,-4.72,10308,-502.00,-4.64,10300,11350
وسيلام,شركت س استان ايلام,2,12713,15001340,1240,1180,1180,-60.00,-4.84,1240,0,0,1180,1180
اراد214,مرابحه عام دولت2ش.خ صادرات0212,2,56000000,5.28676E+13,1000000,942351,945778,"-54,222.00",-5.42,944064,"-55,936.00",-5.59,942351,945778
اراد424,مرابحه عام دولت4-ش.خ 0106,2,18252000,1.69319E+13,1056250,894903,960442,"-95,808.00",-9.07,927672,"-128,578.00",-12.17,894903,960442
اراد324,مرابحه عام دولت3-ش.خ0211,2,2000000,1.76847E+12,1000000,883389,885080,"-114,920.00",-11.49,884234,"-115,766.00",-11.58,883389,885080
اخزا8134,اسنادخزانه-م13بودجه98-010219,2,434000,3.4933E+11,800522,809295,800522,0,0,804908,"4,386.00",0.55,800522,809295
شستا0042,اجاره تامين اجتماعي-نوين000523,2,850000,8.381E+11,990000,986000,986000,"-4,000.00",-0.40,986000,"-4,000.00",-0.40,986000,986000
وسلرستا,شركت س استان لرستان,2,15900,13674000,900,860,860,-40.00,-4.44,900,0,0,860,860
ضخوز2013,اختيارخ فخوز-12000-1400/02/15,2,102,230400000,2252,2600,2252,0,0,2259,7.00,0.31,2252,2600
صخود412,ص مرابحه خودرو412- 3ماهه 18%,2,15000,14914800000,994320,994320,994320,0,0,994320,0,0,994320,994320
اراد344,مرابحه عام دولت3-ش.خ 0305,2,19586000,1.68507E+13,1000000,860352,860335,"-139,665.00",-13.97,860343,"-139,657.00",-13.97,860335,860352
اخزا8094,اسنادخزانه-م9بودجه98-000923,2,670000,5.77596E+11,860969,863199,860969,0,0,862084,"1,115.00",0.13,860969,863199
خاتم2,صندوق س خاتم ايساتيس پويا-ثابت,2,1500000,1500000,10508,1,1,"-10,507.00",-99.99,1,"-10,507.00",-99.99,1,1
افاد614,منفعت دولت6-ش.خاص140109,1,5000000,4.8875E+12,979000,977499,977499,"-1,501.00",-0.15,977499,"-1,501.00",-0.15,977499,977499
اراد354,مرابحه عام دولت3-ش.خ 0103,1,6215000,5.95844E+12,955100,958720,958720,"3,620.00",0.38,958720,"3,620.00",0.38,958720,958720
پارسيانح,ح.بيمه پارسيان,1,700,6300000,9000,9000,9000,0,0,9000,0,0,9000,9000
تملي709,تسهيلات مسكن ب. ملي-آذر97,1,9,5349852,625713,594428,594428,"-31,285.00",-5.00,594428,"-31,285.00",-5.00,594428,594428
ضملي3001,اختيارخ فملي-9000-1400/03/02,1,3,7200000,2400,2400,2400,0,0,2400,0,0,2400,2400
اراد434,مرابحه عام دولت4-ش.خ 0205,1,490000,4.5619E+11,955000,931000,931000,"-24,000.00",-2.51,931000,"-24,000.00",-2.51,931000,931000
ضجار2004,اختيارخ وتجارت-3500-1400/02/22,1,70,35000000,219,500,500,281.00,128.31,500,281.00,128.31,500,500
پست0008پ09,پسته بادامي30-28مه ولات0008(پ),1,30,39000000,1300000,1300000,1300000,0,0,1300000,0,0,1300000,1300000
بتك,كارخانجات كابل سازي‌ تك‌,1,150,5280900,33852,35206,35206,"1,354.00",4.00,33853,1.00,0,35206,35206
ضملت3004,اختيارخ وبملت-5000-1400/03/19,1,3,2997000,1,999,999,998.00,"99,800.00",999,998.00,"99,800.00",999,999
آوا2,صندوق س.سهام آواي معيار-س,1,5000000,5000000,8501,1,1,"-8,500.00",-99.99,1,"-8,500.00",-99.99,1,1
ضغدر3000,اختيارخ وغدير-7000-1400/03/26,1,3,15750000,4405,5250,5250,845.00,19.18,5250,845.00,19.18,5250,5250
ضملت3001,اختيارخ وبملت-3500-1400/03/19,1,10,9500000,550,950,950,400.00,72.73,950,400.00,72.73,950,950
وهنر2,گروه توسعه هنر ايران,1,9000000,87165000000,9224,9685,9685,461.00,5.00,9685,461.00,5.00,9685,9685
پارسا306,صكوك اجاره پارسيان-6ماهه16%,1,200,183262000,929657,916310,916310,"-13,347.00",-1.44,916310,"-13,347.00",-1.44,916310,916310
وپارس2,بانك‌پارسيان‌,1,71940641,2.17261E+11,2940,3020,3020,80.00,2.72,3020,80.00,2.72,3020,3020
فجوش,جوش‌ و اكسيژن‌ ايران‌,1,5000,8035000,1531,1607,1607,76.00,4.96,1531,0,0,1607,1607
ضفار3001,اختيارخ فارس-9000-1400/03/05,1,5,10000000,1973,2000,2000,27.00,1.37,2000,27.00,1.37,2000,2000
ضپيك2009,اختيارخ تاپيكو-10000-00/02/19,1,5,12750000,2900,2550,2550,-350.00,-12.07,2550,-350.00,-12.07,2550,2550
اخزا723,اسنادخزانه-م23بودجه97-000824,1,71,61779585,869297,870135,870135,838.00,0.10,870135,838.00,0.10,870135,870135
همراه2,شركت ارتباطات سيار ايران,1,2529690,66505550100,26290,26290,26290,0,0,26290,0,0,26290,26290
اشاد10,مشاركت دولتي10-شرايط خاص001226,1,100,96890000,960000,968900,968900,"8,900.00",0.93,968900,"8,900.00",0.93,968900,968900
ونوين2,بانك‌اقتصادنوين‌,1,11092499,43593521070,3800,3930,3930,130.00,3.42,3930,130.00,3.42,3930,3930
وسينا2,بانك سينا,1,18847383,66154314330,3540,3510,3510,-30.00,-0.85,3510,-30.00,-0.85,3510,3510
اخزا9072,اسنادخزانه-م7بودجه99-020704,1,386734,2.38228E+11,612903,616000,616000,"3,097.00",0.51,616000,"3,097.00",0.51,616000,616000
تملي806,تسهيلات مسكن ب. ملي-شهريور98,1,7,5119856,769903,731408,731408,"-38,495.00",-5.00,731408,"-38,495.00",-5.00,731408,731408
اراد55,مرابحه عام دولت5-ش.خ 0209,1,3000,2880000000,950000,960000,960000,"10,000.00",1.05,960000,"10,000.00",1.05,960000,960000
شلرد02,كود شيميايي اوره لردگان,1,10,9930000,993000,993000,993000,0,0,993000,0,0,993000,993000
عفولاد3,اوراق سلف موازي ورق گرم فولاد,1,10,8350660,829280,835066,835066,"5,786.00",0.70,835066,"5,786.00",0.70,835066,835066
فملي2,ملي‌ صنايع‌ مس‌ ايران‌,1,5000000,52100000000,9930,10420,10420,490.00,4.93,10420,490.00,4.93,10420,10420
شستا994,اجاره تامين اجتماعي-نوين991226,1,26,25831000,993500,993500,993500,0,0,993500,0,0,993500,993500
شستا003,اجاره تامين اجتماعي-سپهر000523,1,90,89100000,990001,990000,990000,-1.00,0,990000,-1.00,0,990000,990000
ضصاد3003,اختيارخ وبصادر-3000-1400/03/12,1,1,488000,399,488,488,89.00,22.31,488,89.00,22.31,488,488
اراد604,مرابحه عام دولتي6-ش.خ0210,1,3300000,3.02449E+12,927000,916513,916513,"-10,487.00",-1.13,916513,"-10,487.00",-1.13,916513,916513
اراد544,مرابحه عام دولت5-ش.خ 0109,1,3000000,2.8539E+12,964500,951300,951300,"-13,200.00",-1.37,951300,"-13,200.00",-1.37,951300,951300
فنوال2,نورد آلومينيوم‌,1,18000000,4.716E+11,27510,26200,26200,"-1,310.00",-4.76,26200,"-1,310.00",-4.76,26200,26200
اراد374,مرابحه عام دولت3-ش.خ 0005,1,500000,4.95917E+11,1049977,991833,991833,"-58,144.00",-5.54,991833,"-58,144.00",-5.54,991833,991833
ضترا3000,اختيارخ شتران-6000-1400/03/09,1,2,7800000,2450,3900,3900,"1,450.00",59.18,3900,"1,450.00",59.18,3900,3900
تصميم2,صندوق س با درآمد ثابت تصميم,1,1000000,1000000,15581,1,1,"-15,580.00",-99.99,1,"-15,580.00",-99.99,1,1
اراد494,مرابحه عام دولت4-ش.خ 0206,1,5920000,5.57305E+12,983405,941393,941393,"-42,012.00",-4.27,941393,"-42,012.00",-4.27,941393,941393
وپاسار2,بانك  پاسارگاد,1,5000000,60250000000,11950,12050,12050,100.00,0.84,12050,100.00,0.84,12050,12050
زعف0008پ12,زعفران0008پوشالمعمول سحرخيز(پ),1,65,5252000,82999,80800,80800,"-2,199.00",-2.65,80800,"-2,199.00",-2.65,80800,80800
اراد534,مرابحه عام دولت5-ش.خ 0207,1,4755000,4.50299E+12,958293,947000,947000,"-11,293.00",-1.18,947000,"-11,293.00",-1.18,947000,947000
اراد364,مرابحه عام دولت3-ش.خ 0104,1,550000,5.2349E+11,950400,951800,951800,"1,400.00",0.15,951800,"1,400.00",0.15,951800,951800
اراد22,مرابحه عام دولت2-ش.خ لوتوس0212,1,3000,2940000000,990000,980000,980000,"-10,000.00",-1.01,980000,"-10,000.00",-1.01,980000,980000
شپنا2,پالايش نفت اصفهان,1,350000000,3.752E+12,11170,10720,10720,-450.00,-4.03,10720,-450.00,-4.03,10720,10720
اراد404,مرابحه عام دولت4-ش.خ 0207,1,3500000,3.28957E+12,999000,939878,939878,"-59,122.00",-5.92,939878,"-59,122.00",-5.92,939878,939878
زير0003پ04,زيره سبز0003شركت مينوبذر(پ),1,95,46550000,482463,490000,490000,"7,537.00",1.56,490000,"7,537.00",1.56,490000,490000
,,,,,,,,,,,,,,
,,,,,,,,,,,,,,
