<?xml version="1.0" encoding="utf-8"?>
<!-- Generator: Adobe Illustrator 15.1.0, SVG Export Plug-In . SVG Version: 6.00 Build 0)  -->
<!DOCTYPE svg PUBLIC "-//W3C//DTD SVG 1.1//EN" "http://www.w3.org/Graphics/SVG/1.1/DTD/svg11.dtd">
<svg version="1.1" id="Layer_1" xmlns="http://www.w3.org/2000/svg" xmlns:xlink="http://www.w3.org/1999/xlink" x="0px" y="0px"
	 width="612px" height="792px" viewBox="0 0 612 792" enable-background="new 0 0 612 792" xml:space="preserve">
<path fill="#fff" fill-rule="evenodd" clip-rule="evenodd" stroke="#000" stroke-width="3" stroke-linecap="round" stroke-linejoin="round" stroke-miterlimit="22.9256" d="
	M328.28,201.577c-4.503,0.063-9.016-0.06-13.528-0.325c1.637-11.718,2-21.972,8.511-34.288c1.76-3.328,3.969-6.806,6.358-10.373
	c10.647,4.011,28.776,7.286,48.504,7.621c24.893,0.424,52.326-3.836,80.472-16.605c28.145-12.771,57.003-34.052,77.465-45.111
	c20.464-11.06,32.531-11.898,27.267-14.521c-5.264-2.625-27.857-7.036-50.501-9.022c-22.643-1.987-45.335-1.548-74.226,4.905
	c-28.892,6.453-63.984,18.92-83.499,28.738c-1.734,0.872-3.343,1.724-4.843,2.555c0.328-9.706-4.168-17.581-12.203-20.393
	c-10.576-3.701-27.28,1.372-36.708,10.975c-9.427,9.604-11.578,23.737-13.879,41.638c-2.158,16.795-4.451,36.904-4.712,50.187
	c-20.68-3.204-40.91-7.217-59.805-7.673c-32.647-0.789-61.313,9.042-92.897,35.174c-31.586,26.131-66.094,68.564-82.483,124.644
	C31.181,405.78,32.908,475.506,53.296,536.6c20.387,61.092,59.437,113.552,103.152,143.571
	c43.716,30.02,92.101,37.598,126.755,34.155c34.654-3.44,55.577-17.905,70.891-22.409c15.312-4.503,25.015,0.951,47.448-0.517
	c22.432-1.469,57.596-9.862,91.449-37.44c33.854-27.579,66.397-74.341,78.29-140.472c11.892-66.132,3.134-151.632-22.978-211.068
	s-69.574-92.809-109.041-103.286C399.799,188.657,364.329,201.073,328.28,201.577z"/>
</svg>
