{
    "jungian": {
        "ISFJ": {
            "Quadra": "Alpha",
            "MBTI": ["I", "S", "F", "J"],
            "Jung": ["Si", "Fe", "Ti", "Ne"],
            "Socionics": ["S", "E", "I"],
            "Keirsey": "Protector",
            "Pierce": "Dedication"
        },
        "ESFJ": {
            "Quadra": "Alpha",
            "MBTI": ["E", "S", "F", "J"],
            "Jung": ["Fe", "Si", "Ne", "Ti"],
            "Socionics": ["E", "S", "E"],
            "Keirsey": "Provider",
            "Pierce": "Cooperation"
        },
        "INTP": {
            "Quadra": "Alpha",
            "MBTI": ["I", "N", "T", "P"],
            "Jung": ["Ti", "Ne", "Si", "Fe"],
            "Socionics": ["L", "I", "I"],
            "Keirsey": "Architect",
            "Pierce": "Abstracting"
        },
        "ENTP": {
            "Quadra": "Alpha",
            "MBTI": ["E", "N", "T", "P"],
            "Jung": ["Ne", "Ti", "Fe", "Si"],
            "Socionics": ["I", "L", "E"],
            "Keirsey": "Inventor",
            "Pierce": "Multifaceted"
        },
        "ENFJ": {
            "Quadra": "Beta",
            "MBTI": ["E", "N", "F", "J"],
            "Jung": ["Fe", "Ni", "Se", "Ti"],
            "Socionics": ["E", "I", "E"],
            "Keirsey": "Teacher",
            "Pierce": "Persuasion"
        },
        "INFJ": {
            "Quadra": "Beta",
            "MBTI": ["I", "N", "F", "J"],
            "Jung": ["Ni", "Fe", "Ti", "Se"],
            "Socionics": ["I", "E", "I"],
            "Keirsey": "Counselor",
            "Pierce": "Idealistic"
        },
        "ESTP": {
            "Quadra": "Beta",
            "MBTI": ["E", "S", "T", "P"],
            "Jung": ["Se", "Ti", "Fe", "Ni"],
            "Socionics": ["S", "L", "E"],
            "Keirsey": "Promotor",
            "Pierce": "Conquering"
        },
        "ISTP": {
            "Quadra": "Beta",
            "MBTI": ["I", "S", "T", "P"],
            "Jung": ["Ti", "Se", "Ni", "Fe"],
            "Socionics": ["L", "S", "I"],
            "Keirsey": "Crafter",
            "Pierce": "Mastering"
        },
        "ENTJ": {
            "Quadra": "Gamma",
            "MBTI": ["E", "N", "T", "J"],
            "Jung": ["Te", "Ni", "Se", "Fi"],
            "Socionics": ["L", "I", "E"],
            "Keirsey": "Fieldmarshal",
            "Pierce": "Subjugation"
        },
        "INTJ": {
            "Quadra": "Gamma",
            "MBTI": ["I", "N", "T", "J"],
            "Jung": ["Ni", "Te", "Fi", "Se"],
            "Socionics": ["I", "L", "I"],
            "Keirsey": "Mastermind",
            "Pierce": "Visionary"
        },
        "ISFP": {
            "Quadra": "Gamma",
            "MBTI": ["I", "S", "F", "P"],
            "Jung": ["Fi", "Se", "Ni", "Te"],
            "Socionics": ["E", "S", "I"],
            "Keirsey": "Composer",
            "Pierce": "Expression"
        },
        "ESFP": {
            "Quadra": "Gamma",
            "MBTI": ["E", "S", "F", "P"],
            "Jung": ["Se", "Fi", "Te", "Ni"],
            "Socionics": ["S", "E", "E"],
            "Keirsey": "Performer",
            "Pierce": "Energy"
        },
        "ESTJ": {
            "Quadra": "Delta",
            "MBTI": ["E", "S", "T", "J"],
            "Jung": ["Te", "Si", "Ne", "Fi"],
            "Socionics": ["L", "S", "E"],
            "Keirsey": "Supervisor",
            "Pierce": "Responsibility"
        },
        "ISTJ": {
            "Quadra": "Delta",
            "MBTI": ["I", "S", "T", "J"],
            "Jung": ["Si", "Te", "Fi", "Ne"],
            "Socionics": ["S", "L", "I"],
            "Keirsey": "Inspector",
            "Pierce": "Solidifying"
        },
        "INFP": {
            "Quadra": "Delta",
            "MBTI": ["I", "N", "F", "P"],
            "Jung": ["Fi", "Ne", "Si", "Te"],
            "Socionics": ["E", "I", "I"],
            "Keirsey": "Healer",
            "Pierce": "Dream-world"
        },
        "ENFP": {
            "Quadra": "Delta",
            "MBTI": ["E", "N", "F", "P"],
            "Jung": ["Ne", "Fi", "Te", "Si"],
            "Socionics": ["I", "E", "E"],
            "Keirsey": "Champion",
            "Pierce": "Child-like"
        }
    },
    "tritypes": {
        "125": {
            "Name": "Mentor"
        },
        "126": {
            "Name": "Supporter"
        },
        "127": {
            "Name": "Teacher"
        },
        "135": {
            "Name": "Technical Expert"
        },
        "136": {
            "Name": "Taskmaster"
        },
        "137": {
            "Name": "Systems Builder"
        },
        "145": {
            "Name": "Researcher"
        },
        "146": {
            "Name": "Philosopher"
        },
        "147": {
            "Name": "Visionary"
        },
        "258": {
            "Name": "Strategist"
        },
        "259": {
            "Name": "Problem Solver"
        },
        "268": {
            "Name": "Rescuer"
        },
        "269": {
            "Name": "Good Samaritan"
        },
        "278": {
            "Name": "Free Spirit"
        },
        "279": {
            "Name": "Peacemaker"
        },
        "358": {
            "Name": "Solution Master"
        },
        "359": {
            "Name": "Thinker"
        },
        "368": {
            "Name": "Justice Fighter"
        },
        "369": {
            "Name": "Mediator"
        },
        "378": {
            "Name": "Mover Shaker"
        },
        "379": {
            "Name": "Ambassador"
        },
        "458": {
            "Name": "Scholar"
        },
        "459": {
            "Name": "Contemplative"
        },
        "468": {
            "Name": "Truth Teller"
        },
        "469": {
            "Name": "Seeker"
        },
        "478": {
            "Name": "Messenger"
        },
        "479": {
            "Name": "Gentle Spirit"
        }
    },
    "cores": {
        "1w9": {

        },
        "1w2": {

        },
        "2w1": {

        },
        "2w3": {

        },
        "3w2": {

        },
        "3w4": {

        },
        "4w3": {

        },
        "4w5": {

        },
        "5w4": {

        },
        "5w6": {

        },
        "6w5": {

        },
        "6w7": {

        },
        "7w6": {

        },
        "7w8": {

        },
        "8w7": {

        },
        "8w9": {

        },
        "9w8": {

        },
        "9w1": {

        }
    },
    "instincts": {
        "so/sp": {
            "Letters": ["so", "sp"]
        },
        "so/sx": {
            "Letters": ["so", "sx"]
        },
        "sp/so": {
            "Letters": ["sp", "so"]
        },
        "sp/sx": {
            "Letters": ["sp", "sx"]
        },
        "sx/so": {
            "Letters": ["sx", "so"]
        },
        "sx/sp": {
            "Letters": ["sx", "sp"]
        }
    },
    "functions": {
        "Ni": {
            "Letters": ["I", "N"]
        },
        "Ne": {
            "Letters": ["E", "N"]
        },
        "Si": {
            "Letters": ["I", "S"]
        },
        "Se": {
            "Letters": ["E", "S"]
        },
        "Ti": {
            "Letters": ["I", "T"]
        },
        "Te": {
            "Letters": ["E", "T"]
        },
        "Fi": {
            "Letters": ["I", "F"]
        },
        "Fe": {
            "Letters": ["E", "F"]
        }
    }
}