{ "bans": [
	"567841771137269770",
	"567845742480326656",
	"567845783915724819",
	"567856033771421698",
	"567856148921843715",
	"567856986687930428",
	"567857339714109460",
	"567859090303221760",
	"567859193554403350",
	"567860726803333150",
	"567861494276947971",
	"567861871554592780",
	"567862676701839401",
	"567863441461608470",
	"567863811432775721",
	"567864550024675345",
	"567867481306300430",
	"567867880239267850",
	"567867925017395210",
	"567868159596560408",
	"567869298920521789",
	"567869578697244691",
	"567871151825485825",
	"567871642080903168",
	"567871752672247818",
	"567872851085099029",
	"567873324131024908",
	"567873923304128523",
	"567902736440492036",
	"567903269196791808",
	"567903637595226123",
	"567908091912519680",
	"567909950626594837",
	"567926262413262880",
	"567929285474648064",
	"567929299454263296",
	"567934687469633571",
	"567935614805082135",
	"567937908502167555",
	"567938982826999869",
	"567943033518161940",
	"567944133428117525",
	"567947621931548690",
	"567953479080083486",
	"567956090302627840",
	"567956550723829762",
	"567963582592188416",
	"567963761504419840",
	"567963929184305153",
	"567965129434595348",
	"567967558800637953",
	"567967628677742602",
	"567967772705816602",
	"567968151959109652",
	"567970554515161109",
	"567992048838508575",
	"567994260058669077",
	"567995423168528385",
	"567997383301136384",
	"567999901926162453",
	"568362114335375360",
	"568362376047624203",
	"568365840185950208",
	"568366493465706496",
	"568367225640058880",
	"568367572018266118",
	"568369908048592926",
	"568371051512332298",
	"568372051790790676",
	"568373128456175617",
	"568374164315045888",
	"568376128067076115",
	"568376167049199617",
	"568376370632196097",
	"568377410672656395",
	"568378114355494922",
	"568378299508850699",
	"568379593111764992",
	"568379679367757824",
	"568379754001072139",
	"568379762628755467",
	"568381226482794506",
	"568383498767826965",
	"568385357070991361",
	"568385599330058240",
	"568388028444442634",
	"568389270625189888",
	"568389779092144128",
	"568392941299826698",
	"568394374447235082",
	"568394738047123496",
	"568395235294445578",
	"568395458561703978"
]}