7.8676e+06 1.5087e+07 2.039e+07
7.8321e+06 1.5156e+07 2.0352e+07
7.7969e+06 1.5225e+07 2.0315e+07
7.7618e+06 1.5294e+07 2.0276e+07
7.7269e+06 1.5363e+07 2.0238e+07
7.6922e+06 1.5431e+07 2.0199e+07
7.6577e+06 1.55e+07 2.0159e+07
7.6234e+06 1.5568e+07 2.012e+07
7.5892e+06 1.5637e+07 2.008e+07
7.5553e+06 1.5705e+07 2.0039e+07
7.5216e+06 1.5774e+07 1.9998e+07
7.488e+06 1.5842e+07 1.9957e+07
7.4546e+06 1.591e+07 1.9915e+07
7.4215e+06 1.5978e+07 1.9873e+07
7.3885e+06 1.6046e+07 1.9831e+07
7.3557e+06 1.6114e+07 1.9788e+07
7.3231e+06 1.6182e+07 1.9745e+07
7.2907e+06 1.6249e+07 1.9701e+07
7.2584e+06 1.6317e+07 1.9657e+07
7.2264e+06 1.6384e+07 1.9613e+07
7.1946e+06 1.6452e+07 1.9568e+07
7.1629e+06 1.6519e+07 1.9523e+07
7.1315e+06 1.6586e+07 1.9477e+07
7.1002e+06 1.6653e+07 1.9432e+07
7.0691e+06 1.672e+07 1.9385e+07
7.0383e+06 1.6787e+07 1.9339e+07
7.0076e+06 1.6854e+07 1.9292e+07
6.9771e+06 1.6921e+07 1.9244e+07
6.9468e+06 1.6987e+07 1.9197e+07
6.9166e+06 1.7054e+07 1.9149e+07
