2.0773e+07 1.3718e+07 -8.8945e+06
2.0788e+07 1.3752e+07 -8.8105e+06
2.0804e+07 1.3786e+07 -8.7262e+06
2.0819e+07 1.382e+07 -8.6419e+06
2.0835e+07 1.3853e+07 -8.5573e+06
2.085e+07 1.3887e+07 -8.4726e+06
2.0865e+07 1.392e+07 -8.3877e+06
2.088e+07 1.3952e+07 -8.3027e+06
2.0894e+07 1.3985e+07 -8.2175e+06
2.0909e+07 1.4017e+07 -8.1321e+06
2.0923e+07 1.4049e+07 -8.0466e+06
2.0937e+07 1.4081e+07 -7.9609e+06
2.0951e+07 1.4112e+07 -7.8751e+06
2.0965e+07 1.4143e+07 -7.7891e+06
2.0978e+07 1.4174e+07 -7.7029e+06
2.0992e+07 1.4205e+07 -7.6167e+06
2.1005e+07 1.4235e+07 -7.5302e+06
2.1018e+07 1.4265e+07 -7.4437e+06
2.1031e+07 1.4295e+07 -7.3569e+06
2.1044e+07 1.4324e+07 -7.2701e+06
2.1057e+07 1.4353e+07 -7.1831e+06
2.1069e+07 1.4382e+07 -7.0959e+06
2.1081e+07 1.4411e+07 -7.0086e+06
2.1093e+07 1.444e+07 -6.9212e+06
2.1105e+07 1.4468e+07 -6.8337e+06
2.1117e+07 1.4496e+07 -6.746e+06
2.1128e+07 1.4524e+07 -6.6582e+06
2.114e+07 1.4551e+07 -6.5702e+06
2.1151e+07 1.4578e+07 -6.4822e+06
2.1162e+07 1.4605e+07 -6.394e+06
