----------------------------  Polynomial -----------------------------


----------------------------  Polynomial Params ----------------------
[[-114.99167611]]
[[0.06005287]]
[[3.6178614e-05]]
[[5.6680849e-10]]
[[-9.94369381e-09]]
[[5.40424464e-10]]
[[114.99551241]]
[[-3.34360858e-05]]
[[-0.06004689]]
[[9.48714228e-09]]
[[-2.5076571e-09]]
[[-6.23741483e-10]]
 ---------------------------- V Check ----------------------- 
Vx1 = [[-0.05453566]]
Vy1 = [[-0.00074157]]
Vx4 = [[-0.00459808]]
Vy4 = [[0.06158804]]
 ---------------------------- RMSE Check ---------------------------- 
RMSE Check Point = 0.08239488365494572

 ---------------------------- V Control ----------------------------- 
Vx2 = [[6.67910172e-13]]
Vy2 = [[4.50086149e-13]]
Vx3 = [[6.33730915e-13]]
Vy3 = [[4.68958206e-13]]
Vx5 = [[1.98951966e-13]]
Vy5 = [[-1.56319402e-13]]
Vx6 = [[6.67910172e-13]]
Vy6 = [[9.9475983e-14]]
Vx7 = [[7.2475359e-13]]
Vy7 = [[6.11066753e-13]]
Vx8 = [[1.70530257e-13]]
Vy8 = [[-5.40012479e-13]]
 ---------------------------- RMSE Control ----------------------------
RMSE Control Point = 3.4696395824334324e-13
