1 3797.0845671855623 1914.9753500010834
2 33.056094224005264 1914.9475264512196
3 1915.011827885264 32.92695366018324
4 1915.0388373810747 3797.4024758853893
5 3797.012437121607 33.49056072630833
6 32.459236919975666 3797.4741892557518
7 32.50935412351347 33.038215865968276
8 3797.482715358035 3796.9369635471126
