----------------------------  Affine -----------------------------


----------------------------  Affine Params ----------------------
[[0.06003151]]
[[-2.5215347e-06]]
[[-114.94173198]]
[[1.23773007e-06]]
[[-0.06004071]]
[[114.97818817]]
 ---------------------------- V Check ----------------------- 
Vx1 = [[0.0178454]]
Vy1 = [[-0.00441205]]
Vx4 = [[-0.00336338]]
Vy4 = [[0.01017489]]
 ---------------------------- RMSE Check ---------------------------- 
RMSE Check Point = 0.021278279921066425

 ---------------------------- V Control ----------------------------- 
Vx2 = [[-0.01484662]]
Vy2 = [[-0.00542374]]
Vx3 = [[-0.00623421]]
Vy3 = [[-0.01360083]]
Vx5 = [[0.00943125]]
Vy5 = [[0.02290913]]
Vx6 = [[0.01373048]]
Vy6 = [[0.01881073]]
Vx7 = [[0.00422971]]
Vy7 = [[-0.00659054]]
Vx8 = [[-0.0063106]]
Vy8 = [[-0.01610476]]
 ---------------------------- RMSE Control ----------------------------
RMSE Control Point = 0.008922659280945976
