----------------------------  Polynomial -----------------------------


----------------------------  Polynomial Params ----------------------
[[-114.93745583]]
[[0.06002206]]
[[-2.51613421e-05]]
[[2.84340777e-09]]
[[6.72301036e-09]]
[[-1.78142247e-09]]
[[114.96655978]]
[[2.23319932e-06]]
[[-0.06004356]]
[[1.82603825e-09]]
[[3.25273956e-09]]
[[-4.54550173e-09]]
 ---------------------------- V Check ----------------------- 
Vx1 = [[0.04009042]]
Vy1 = [[0.00370146]]
 ---------------------------- RMSE Check ---------------------------- 
RMSE Check Point = 0.04026092888195265

 ---------------------------- V Control ----------------------------- 
Vx2 = [[-2.98860144e-07]]
Vy2 = [[-1.52371927e-06]]
Vx3 = [[-0.00200026]]
Vy3 = [[-0.01019822]]
Vx4 = [[0.00199971]]
Vy4 = [[0.0101954]]
Vx5 = [[0.00100054]]
Vy5 = [[0.00510119]]
Vx6 = [[-0.00099968]]
Vy6 = [[-0.00509681]]
Vx7 = [[0.00100016]]
Vy7 = [[0.00509925]]
Vx8 = [[-0.00100017]]
Vy8 = [[-0.00509928]]
 ---------------------------- RMSE Control ----------------------------
RMSE Control Point = 0.0029997938152236665
