{
    "source": "mockoon:1.10.0",
    "data": [
        {
            "type": "environment",
            "item": {
                "uuid": "",
                "lastMigration": 12,
                "name": "7. News Micro-Service (copy) (copy)",
                "endpointPrefix": "api/v1/news",
                "latency": 0,
                "port": 3006,
                "routes": [
                    {
                        "uuid": "",
                        "documentation": "Get all media resource",
                        "method": "get",
                        "endpoint": "",
                        "responses": [
                            {
                                "uuid": "",
                                "body": "{\n  \"success\": true,\n  \"pages\": {\n    \"total\": \"{{faker 'random.number'}}\",\n    \"per_page\": \"{{ queryParam 'per_page' }}\",\n    \"current_page\": \"{{ queryParam 'page'}}\",\n    \"last_page\": \"{{faker 'random.number'}}\",\n    \"first_page_url\": \"http://localhost:3006/api/v1/news?page=1\",\n    \"last_page_url\": \"http://localhost:3006/api/v1/news?page={{faker 'random.number'}}\",\n    \"next_page_url\": \"http://localhost:3006/api/v1/news?page={{faker 'random.number'}}\",\n    \"prev_page_url\": \"http://localhost:3006/api/v1/news?page={{faker 'random.number'}}\",\n    \"path\": \"http://localhost:3006/api/v1/news\",\n    \"from\": \"{{faker 'random.number'}}\",\n    \"to\": \"{{faker 'random.number'}}\"\n    },\n    \"data\": [\n      {{#repeat (queryParam 'per_page') }}\n      {\n        \"id\": {{#if (queryParam 'title' queryParam 'slug' queryParam 'created_by') }} \"{{faker 'random.number'}}\" {{^}} \"{{@index}}\" {{/if}},\n        \"created_at\": \"{{faker 'date.past'}}\",\n        \"updated_at\": \"{{faker 'date.past'}}\",\n        \"deleted_at\": \"\",\n        \"title\": {{#if (queryParam 'title') }} \"{{queryParam 'title'}}\" {{^}} \"{{faker 'lorem.sentence'}}\" {{/if}},\n        \"slug\": {{#if (queryParam 'slug') }} \"{{queryParam 'slug'}}\" {{^}} \"{{faker 'lorem.slug'}}\" {{/if}},\n        \"thumbnail\": \"{{faker 'system.fileName'}}\".\"{{faker 'system.commonFileExt'}}\",\n        \"header\": \"{{faker 'system.fileName'}}\".\"{{faker 'system.commonFileExt'}}\",\n        \"description\": \"{{faker 'lorem.sentence'}}\",\n        \"content\": \"{{faker 'lorem.paragraphs'}}\",\n        \"status\": \"{{faker 'random.number' 4}}\",\n        \"user\": {\n          \"id\": {{#if (queryParam 'created_by') }} \"{{ queryParam 'created_by' }}\" {{^}} \"{{faker 'name.firstName'}} {{faker 'name.lastName'}}\" {{/if}},\n          \"created_at\": \"{{faker 'date.past'}}\",\n          \"updated_at\": \"{{faker 'date.past'}}\",\n          \"deleted_at\": \"\",\n          \"name\": \"{{faker 'name.firstName'}} {{faker 'name.lastName'}}\",\n          \"email\": \"{{faker 'internet.email'}}\",\n          \"email_verified_at\": \"{{faker 'date.past'}}\",\n          \"remember_token\": \"{{faker 'random.alphaNumeric'}}\",\n          \"whatsapp\": \"{{faker 'phone.phoneNumber'}}\",\n          \"address\": \"{{faker 'address.streetName'}}, {{faker 'address.country'}}\",\n          \"instagram\": \"@{{faker 'internet.userName'}}\",\n          \"birth_place\": \"{{faker 'address.city'}}\",\n          \"notes\": \"\",\n          \"activation_code\": \"{{faker 'random.alphaNumeric'}}\",\n          \"profession_id\": \"\",\n          \"birth_date\": \"{{faker 'date.past'}}\",\n          \"coin\": \"{{faker 'random.number'}}\",\n          \"hold_coin\": \"\",\n          \"expired_at\": \"{{faker 'date.past'}}\",\n          \"photo\": \"{{faker 'image.imageUrl'}}\",\n          \"agreed_at\": \"{{faker 'date.past'}}\",\n          \"city\": \"{{faker 'address.city'}}\",\n          \"phone\": \"{{faker 'phone.phoneNumber'}}\",\n          \"original_photo\": \"{{faker 'image.avatar'}}\",\n          \"telegram_id\": \"{{faker 'internet.userName'}}\",\n          \"prev_request\": \"\",\n          \"telegram_authorized\": \"\"\n        }\n      }\n      {{/repeat}}\n    ]\n}\n}",
                                "latency": 0,
                                "statusCode": 200,
                                "label": "",
                                "headers": [
                                    {
                                        "key": "",
                                        "value": ""
                                    }
                                ],
                                "filePath": "",
                                "sendFileAsBody": false,
                                "rules": [
                                    {
                                        "target": "query",
                                        "modifier": "page",
                                        "value": "int",
                                        "isRegex": false
                                    },
                                    {
                                        "target": "query",
                                        "modifier": "per_page",
                                        "value": "int",
                                        "isRegex": false
                                    },
                                    {
                                        "target": "query",
                                        "modifier": "title",
                                        "value": "string",
                                        "isRegex": false
                                    },
                                    {
                                        "target": "query",
                                        "modifier": "slug",
                                        "value": "string",
                                        "isRegex": false
                                    },
                                    {
                                        "target": "query",
                                        "modifier": "created_by",
                                        "value": "int",
                                        "isRegex": false
                                    }
                                ],
                                "rulesOperator": "OR",
                                "disableTemplating": false
                            }
                        ],
                        "enabled": true
                    },
                    {
                        "uuid": "",
                        "documentation": "Get one media resource",
                        "method": "get",
                        "endpoint": "show",
                        "responses": [
                            {
                                "uuid": "",
                                "body": "{\n  \"success\": true,\n  \"data\": {\n      \"id\": \"{{urlParam 'id'}}\",\n      \"created_at\": \"{{faker 'date.past'}}\",\n      \"updated_at\": \"{{faker 'date.past'}}\",\n      \"deleted_at\": \"\",\n      \"title\": \"{{faker 'lorem.sentence'}}\",\n      \"slug\": \"{{faker 'lorem.slug'}}\",\n      \"thumbnail\": \"{{faker 'system.fileName'}}\".\"{{faker 'system.commonFileExt'}}\",\n      \"header\": \"{{faker 'system.fileName'}}\".\"{{faker 'system.commonFileExt'}}\",\n      \"description\": \"{{faker 'lorem.sentence'}}\",\n      \"content\": \"{{faker 'lorem.paragraphs'}}\",\n      \"status\": \"{{faker 'random.number' 4}}\",\n      \"user\": {\n          \"id\": \"{{faker 'random.number' 500}}\",\n          \"created_at\": \"{{faker 'date.past'}}\",\n          \"updated_at\": \"{{faker 'date.past'}}\",\n          \"deleted_at\": \"\",\n          \"name\": \"{{faker 'name.firstName'}} {{faker 'name.lastName'}}\",\n          \"email\": \"{{faker 'internet.email'}}\",\n          \"email_verified_at\": \"{{faker 'date.past'}}\",\n          \"remember_token\": \"{{faker 'random.alphaNumeric'}}\",\n          \"whatsapp\": \"{{faker 'phone.phoneNumber'}}\",\n          \"address\": \"{{faker 'address.streetName'}}, {{faker 'address.country'}}\",\n          \"instagram\": \"@{{faker 'internet.userName'}}\",\n          \"birth_place\": \"{{faker 'address.city'}}\",\n          \"notes\": \"\",\n          \"activation_code\": \"{{faker 'random.alphaNumeric'}}\",\n          \"profession_id\": \"\",\n          \"birth_date\": \"{{faker 'date.past'}}\",\n          \"coin\": \"{{faker 'random.number'}}\",\n          \"hold_coin\": \"\",\n          \"expired_at\": \"{{faker 'date.past'}}\",\n          \"photo\": \"{{faker 'image.imageUrl'}}\",\n          \"agreed_at\": \"{{faker 'date.past'}}\",\n          \"city\": \"{{faker 'address.city'}}\",\n          \"phone\": \"{{faker 'phone.phoneNumber'}}\",\n          \"original_photo\": \"{{faker 'image.avatar'}}\",\n          \"telegram_id\": \"{{faker 'internet.userName'}}\",\n          \"prev_request\": \"\",\n          \"telegram_authorized\": \"\"\n        }\n    }\n}",
                                "latency": 0,
                                "statusCode": 200,
                                "label": "",
                                "headers": [
                                    {
                                        "key": "Content-Type",
                                        "value": "application/json"
                                    }
                                ],
                                "filePath": "",
                                "sendFileAsBody": false,
                                "rules": [
                                    {
                                        "target": "body",
                                        "modifier": "id",
                                        "value": "int",
                                        "isRegex": false
                                    }
                                ],
                                "rulesOperator": "OR",
                                "disableTemplating": false
                            }
                        ],
                        "enabled": true
                    },
                    {
                        "uuid": "",
                        "documentation": "Create new resource for media",
                        "method": "post",
                        "endpoint": "",
                        "responses": [
                            {
                                "uuid": "",
                                "body": "{\n  \"success\": true,\n  \"data\": {\n      \"id\": \"{{faker 'random.number' 500}}\",\n      \"created_at\": \"{{faker 'date.recent' 0}}\",\n      \"updated_at\": \"{{faker 'date.recent' 0}}\",\n      \"deleted_at\": \"\",\n      \"title\": \"{{body 'title'}}\",\n      \"slug\": \"{{body 'slug'}}\",\n      \"thumbnail\": \"\",\n      \"header\": \"\",\n      \"description\": \"{{body 'description'}}\",\n      \"content\": \"{{body 'content'}}\",\n      \"status\": \"{{body 'status'}}\",\n      \"user\": {\n        \"id\": \"{{ body 'created_by' }}\",\n        \"created_at\": \"{{faker 'date.past'}}\",\n        \"updated_at\": \"{{faker 'date.past'}}\",\n        \"deleted_at\": \"\",\n        \"name\": \"{{faker 'name.firstName'}} {{faker 'name.lastName'}}\",\n        \"email\": \"{{faker 'internet.email'}}\",\n        \"email_verified_at\": \"{{faker 'date.past'}}\",\n        \"remember_token\": \"{{faker 'random.alphaNumeric'}}\",\n        \"whatsapp\": \"{{faker 'phone.phoneNumber'}}\",\n        \"address\": \"{{faker 'address.streetName'}}, {{faker 'address.country'}}\",\n        \"instagram\": \"@{{faker 'internet.userName'}}\",\n        \"birth_place\": \"{{faker 'address.city'}}\",\n        \"notes\": \"\",\n        \"activation_code\": \"{{faker 'random.alphaNumeric'}}\",\n        \"profession_id\": \"\",\n        \"birth_date\": \"{{faker 'date.past'}}\",\n        \"coin\": \"{{faker 'random.number'}}\",\n        \"hold_coin\": \"\",\n        \"expired_at\": \"{{faker 'date.past'}}\",\n        \"photo\": \"{{faker 'image.imageUrl'}}\",\n        \"agreed_at\": \"{{faker 'date.past'}}\",\n        \"city\": \"{{faker 'address.city'}}\",\n        \"phone\": \"{{faker 'phone.phoneNumber'}}\",\n        \"original_photo\": \"{{faker 'image.avatar'}}\",\n        \"telegram_id\": \"{{faker 'internet.userName'}}\",\n        \"prev_request\": \"\",\n        \"telegram_authorized\": \"\"\n      }\n    }\n}",
                                "latency": 0,
                                "statusCode": 200,
                                "label": "",
                                "headers": [
                                    {
                                        "key": "Content-Type",
                                        "value": "application/json"
                                    }
                                ],
                                "filePath": "",
                                "sendFileAsBody": false,
                                "rules": [
                                    {
                                        "target": "body",
                                        "modifier": "title",
                                        "value": "string",
                                        "isRegex": false
                                    },
                                    {
                                        "target": "body",
                                        "modifier": "created_by",
                                        "value": "int",
                                        "isRegex": false
                                    },
                                    {
                                        "target": "body",
                                        "modifier": "slug",
                                        "value": "string",
                                        "isRegex": false
                                    },
                                    {
                                        "target": "body",
                                        "modifier": "description",
                                        "value": "string",
                                        "isRegex": false
                                    },
                                    {
                                        "target": "body",
                                        "modifier": "content",
                                        "value": "string",
                                        "isRegex": false
                                    },
                                    {
                                        "target": "body",
                                        "modifier": "status",
                                        "value": "int",
                                        "isRegex": false
                                    }
                                ],
                                "rulesOperator": "AND",
                                "disableTemplating": false
                            }
                        ],
                        "enabled": true
                    },
                    {
                        "uuid": "",
                        "documentation": "Create new resource for media",
                        "method": "put",
                        "endpoint": "upload",
                        "responses": [
                            {
                                "uuid": "",
                                "body": "{\n  \"success\": true,\n  \"data\": {\n      \"id\": \"{{body 'id'}}\",\n      \"created_at\": \"{{faker 'date.past'}}\",\n      \"updated_at\": \"{{faker 'date.recent' 0}}\",\n      \"deleted_at\": \"\",\n      \"title\": \"{{faker 'lorem.sentence'}}\",\n      \"slug\": \"{{faker 'lorem.slug'}}\",\n      \"thumbnail\": \"{{body 'thumbnail'}}\",\n      \"header\": \"{{body 'header'}}\",\n      \"description\": \"{{faker 'lorem.sentence'}}\",\n      \"content\": \"{{faker 'lorem.paragraphs'}}\",\n      \"status\": \"{{faker 'random.number' 4}}\",\n      \"user\": {\n        \"id\": \"{{ faker 'random.number' 500}}\",\n        \"created_at\": \"{{faker 'date.past'}}\",\n        \"updated_at\": \"{{faker 'date.past'}}\",\n        \"deleted_at\": \"\",\n        \"name\": \"{{faker 'name.firstName'}} {{faker 'name.lastName'}}\",\n        \"email\": \"{{faker 'internet.email'}}\",\n        \"email_verified_at\": \"{{faker 'date.past'}}\",\n        \"remember_token\": \"{{faker 'random.alphaNumeric'}}\",\n        \"whatsapp\": \"{{faker 'phone.phoneNumber'}}\",\n        \"address\": \"{{faker 'address.streetName'}}, {{faker 'address.country'}}\",\n        \"instagram\": \"@{{faker 'internet.userName'}}\",\n        \"birth_place\": \"{{faker 'address.city'}}\",\n        \"notes\": \"\",\n        \"activation_code\": \"{{faker 'random.alphaNumeric'}}\",\n        \"profession_id\": \"\",\n        \"birth_date\": \"{{faker 'date.past'}}\",\n        \"coin\": \"{{faker 'random.number'}}\",\n        \"hold_coin\": \"\",\n        \"expired_at\": \"{{faker 'date.past'}}\",\n        \"photo\": \"{{faker 'image.imageUrl'}}\",\n        \"agreed_at\": \"{{faker 'date.past'}}\",\n        \"city\": \"{{faker 'address.city'}}\",\n        \"phone\": \"{{faker 'phone.phoneNumber'}}\",\n        \"original_photo\": \"{{faker 'image.avatar'}}\",\n        \"telegram_id\": \"{{faker 'internet.userName'}}\",\n        \"prev_request\": \"\",\n        \"telegram_authorized\": \"\"\n      }\n    }\n}",
                                "latency": 0,
                                "statusCode": 200,
                                "label": "",
                                "headers": [
                                    {
                                        "key": "Accept",
                                        "value": "application/x-www-form-urlencoded"
                                    }
                                ],
                                "filePath": "",
                                "sendFileAsBody": false,
                                "rules": [
                                    {
                                        "target": "body",
                                        "modifier": "thumbnail",
                                        "value": "string",
                                        "isRegex": false
                                    },
                                    {
                                        "target": "body",
                                        "modifier": "id",
                                        "value": "int",
                                        "isRegex": false
                                    },
                                    {
                                        "target": "body",
                                        "modifier": "header",
                                        "value": "string",
                                        "isRegex": false
                                    }
                                ],
                                "rulesOperator": "AND",
                                "disableTemplating": false
                            }
                        ],
                        "enabled": true
                    },
                    {
                        "uuid": "",
                        "documentation": "Update the resource using json request",
                        "method": "put",
                        "endpoint": "",
                        "responses": [
                            {
                                "uuid": "",
                                "body": "{\n  \"success\": true,\n  \"data\": {\n      \"id\": \"{{body 'id'}}\",\n      \"created_at\": \"{{faker 'date.past'}}\",\n      \"updated_at\": \"{{faker 'date.recent' 0}}\",\n      \"deleted_at\": \"\",\n      \"title\": {{#if (queryParam 'title') }} \"{{queryParam 'title'}}\" {{^}} \"{{faker 'lorem.sentence'}}\" {{/if}},\n      \"slug\": {{#if (queryParam 'slug') }} \"{{queryParam 'slug'}}\" {{^}} \"{{faker 'lorem.slug'}}\" {{/if}},\n      \"thumbnail\": \"{{faker 'system.fileName'}}\".\"{{faker 'system.commonFileExt'}}\",\n      \"header\": \"{{faker 'system.fileName'}}\".\"{{faker 'system.commonFileExt'}}\"\n      \"description\": {{#if (queryParam 'description') }} \"{{queryParam 'description'}}\" {{^}} \"{{faker 'lorem.sentence'}}\" {{/if}},\n      \"content\": {{#if (queryParam 'content') }} \"{{queryParam 'content'}}\" {{^}} \"{{faker 'lorem.paragraphs'}}\" {{/if}},\n      \"status\": {{#if (queryParam 'status') }} \"{{queryParam 'status'}}\" {{^}} \"{{faker 'random.number' 4}}\" {{/if}},\n      \"user\": {\n        \"id\": \"{{ faker 'random' 500}}\",\n        \"created_at\": \"{{faker 'date.past'}}\",\n        \"updated_at\": \"{{faker 'date.past'}}\",\n        \"deleted_at\": \"\",\n        \"name\": \"{{faker 'name.firstName'}} {{faker 'name.lastName'}}\",\n        \"email\": \"{{faker 'internet.email'}}\",\n        \"email_verified_at\": \"{{faker 'date.past'}}\",\n        \"remember_token\": \"{{faker 'random.alphaNumeric'}}\",\n        \"whatsapp\": \"{{faker 'phone.phoneNumber'}}\",\n        \"address\": \"{{faker 'address.streetName'}}, {{faker 'address.country'}}\",\n        \"instagram\": \"@{{faker 'internet.userName'}}\",\n        \"birth_place\": \"{{faker 'address.city'}}\",\n        \"notes\": \"\",\n        \"activation_code\": \"{{faker 'random.alphaNumeric'}}\",\n        \"profession_id\": \"\",\n        \"birth_date\": \"{{faker 'date.past'}}\",\n        \"coin\": \"{{faker 'random.number'}}\",\n        \"hold_coin\": \"\",\n        \"expired_at\": \"{{faker 'date.past'}}\",\n        \"photo\": \"{{faker 'image.imageUrl'}}\",\n        \"agreed_at\": \"{{faker 'date.past'}}\",\n        \"city\": \"{{faker 'address.city'}}\",\n        \"phone\": \"{{faker 'phone.phoneNumber'}}\",\n        \"original_photo\": \"{{faker 'image.avatar'}}\",\n        \"telegram_id\": \"{{faker 'internet.userName'}}\",\n        \"prev_request\": \"\",\n        \"telegram_authorized\": \"\"\n      }\n    }\n}",
                                "latency": 0,
                                "statusCode": 200,
                                "label": "",
                                "headers": [
                                    {
                                        "key": "Content-Type",
                                        "value": "application/json"
                                    }
                                ],
                                "filePath": "",
                                "sendFileAsBody": false,
                                "rules": [
                                    {
                                        "target": "body",
                                        "modifier": "id",
                                        "value": "int",
                                        "isRegex": false
                                    },
                                    {
                                        "target": "body",
                                        "modifier": "title",
                                        "value": "string",
                                        "isRegex": false
                                    },
                                    {
                                        "target": "body",
                                        "modifier": "slug",
                                        "value": "string",
                                        "isRegex": false
                                    },
                                    {
                                        "target": "body",
                                        "modifier": "description",
                                        "value": "string",
                                        "isRegex": false
                                    },
                                    {
                                        "target": "body",
                                        "modifier": "content",
                                        "value": "string",
                                        "isRegex": false
                                    },
                                    {
                                        "target": "body",
                                        "modifier": "status",
                                        "value": "string",
                                        "isRegex": false
                                    }
                                ],
                                "rulesOperator": "AND",
                                "disableTemplating": false
                            }
                        ],
                        "enabled": true
                    },
                    {
                        "uuid": "",
                        "documentation": "Delete the resource using json request",
                        "method": "delete",
                        "endpoint": "",
                        "responses": [
                            {
                                "uuid": "",
                                "body": "{\n  \"success\": true,\n  \"data\": {\n    \"id\": \"{{urlParam 'id'}}\"\n  }\n}",
                                "latency": 0,
                                "statusCode": 200,
                                "label": "",
                                "headers": [
                                    {
                                        "key": "",
                                        "value": ""
                                    }
                                ],
                                "filePath": "",
                                "sendFileAsBody": false,
                                "rules": [
                                    {
                                        "target": "params",
                                        "modifier": "id",
                                        "value": "int",
                                        "isRegex": false
                                    }
                                ],
                                "rulesOperator": "OR",
                                "disableTemplating": false
                            }
                        ],
                        "enabled": true
                    }
                ],
                "proxyMode": false,
                "proxyHost": "",
                "https": false,
                "cors": true,
                "headers": [
                    {
                        "key": "Content-Type",
                        "value": "application/json"
                    }
                ],
                "proxyReqHeaders": [
                    {
                        "key": "",
                        "value": ""
                    }
                ],
                "proxyResHeaders": [
                    {
                        "key": "",
                        "value": ""
                    }
                ]
            }
        }
    ]
}
