{
    "source": "mockoon:1.10.0",
    "data": [
        {
            "type": "environment",
            "item": {
                "uuid": "",
                "lastMigration": 12,
                "name": "9. Accessory Micro-Service (copy) (copy) (copy) (copy)",
                "endpointPrefix": "api/v1/accessory",
                "latency": 0,
                "port": 3008,
                "routes": [
                    {
                        "uuid": "",
                        "documentation": "Get all media resource",
                        "method": "get",
                        "endpoint": "accessory",
                        "responses": [
                            {
                                "uuid": "",
                                "body": "{\n  \"success\": true,\n  \"pages\": {\n    \"total\": \"{{faker 'random.number'}}\",\n    \"per_page\": \"{{ queryParam 'per_page' }}\",\n    \"current_page\": \"{{ queryParam 'page'}}\",\n    \"last_page\": \"{{faker 'random.number'}}\",\n    \"first_page_url\": \"http://localhost:3008/api/v1/accessory?page=1\",\n    \"last_page_url\": \"http://localhost:3008/api/v1/accessory?page={{faker 'random.number'}}\",\n    \"next_page_url\": \"http://localhost:3008/api/v1/accessory?page={{faker 'random.number'}}\",\n    \"prev_page_url\": \"http://localhost:3008/api/v1/accessory?page={{faker 'random.number'}}\",\n    \"path\": \"http://localhost:3008/api/v1/accessory\",\n    \"from\": \"{{faker 'random.number'}}\",\n    \"to\": \"{{faker 'random.number'}}\"\n    },\n    \"data\": [\n      {{#repeat (queryParam 'per_page') }}\n      {\n        \"id\": {{#if (queryParam 'name' queryParam 'slug' queryParam'created_by') }} \"{{faker 'random.number' 500}}\" {{^}} \"{{@index}}\" {{/if}},\n        \"created_at\": \"{{faker 'date.past'}}\",\n        \"updated_at\": \"{{faker 'date.past'}}\",\n        \"deleted_at\": \"\",\n        \"name\": {{#if (queryParam 'name') }} \"{{queryParam 'name'}}\" {{^}} \"{{faker 'name.title'}}\" {{/if}},\n        \"slug\": {{#if (queryParam 'slug') }} \"{{queryParam 'slug'}}\" {{^}} \"{{faker 'lorem.slug'}}\" {{/if}},\n        \"short_description\": \"{{faker 'lorem.sentence'}}\",\n        \"description\": \"{{faker 'lorem.paragraph'}}\",\n        \"price\": \"{{faker 'random.number'}}\",\n        \"thumbnail\": \"{{faker 'image.image' 200 300}}\",\n        \"file\": \"{{faker 'system.fileName'}}.{{faker 'system.fileExt'}}\",\n        \"started_at\": \"{{faker 'date.past'}}\",\n        \"expired_at\": \"{{faker 'date.past'}}\",\n        \"period_day\": \"{{faker 'random.number' 5}}\",\n        \"period_week\":\"{{faker 'random.number' 5}}\",\n        \"period_month\":\"{{faker 'random.number' 5}}\",\n        \"period_year\":\"{{faker 'random.number' 5}}\",\n        \"user\": {\n          \"id\": {{#if (queryParam 'created_by') }} \"{{ queryParam 'created_by' }}\" {{^}} \"{{faker 'name.firstName'}} {{faker 'name.lastName'}}\" {{/if}},\n          \"created_at\": \"{{faker 'date.past'}}\",\n          \"updated_at\": \"{{faker 'date.past'}}\",\n          \"deleted_at\": \"\",\n          \"name\": \"{{faker 'name.firstName'}} {{faker 'name.lastName'}}\",\n          \"email\": \"{{faker 'internet.email'}}\",\n          \"email_verified_at\": \"{{faker 'date.past'}}\",\n          \"remember_token\": \"{{faker 'random.alphaNumeric'}}\",\n          \"whatsapp\": \"{{faker 'phone.phoneNumber'}}\",\n          \"address\": \"{{faker 'address.streetName'}}, {{faker 'address.country'}}\",\n          \"instagram\": \"@{{faker 'internet.userName'}}\",\n          \"birth_place\": \"{{faker 'address.city'}}\",\n          \"notes\": \"\",\n          \"activation_code\": \"{{faker 'random.alphaNumeric'}}\",\n          \"profession_id\": \"\",\n          \"birth_date\": \"{{faker 'date.past'}}\",\n          \"coin\": \"{{faker 'random.number'}}\",\n          \"hold_coin\": \"\",\n          \"expired_at\": \"{{faker 'date.past'}}\",\n          \"photo\": \"{{faker 'image.imageUrl'}}\",\n          \"agreed_at\": \"{{faker 'date.past'}}\",\n          \"city\": \"{{faker 'address.city'}}\",\n          \"phone\": \"{{faker 'phone.phoneNumber'}}\",\n          \"original_photo\": \"{{faker 'image.avatar'}}\",\n          \"telegram_id\": \"{{faker 'internet.userName'}}\",\n          \"prev_request\": \"\",\n          \"telegram_authorized\": \"\"\n        }\n      }\n      {{/repeat}}\n    ]\n}\n}",
                                "latency": 0,
                                "statusCode": 200,
                                "label": "",
                                "headers": [
                                    {
                                        "key": "",
                                        "value": ""
                                    }
                                ],
                                "filePath": "",
                                "sendFileAsBody": false,
                                "rules": [
                                    {
                                        "target": "query",
                                        "modifier": "page",
                                        "value": "int",
                                        "isRegex": false
                                    },
                                    {
                                        "target": "query",
                                        "modifier": "per_page",
                                        "value": "int",
                                        "isRegex": false
                                    },
                                    {
                                        "target": "query",
                                        "modifier": "name",
                                        "value": "string",
                                        "isRegex": false
                                    },
                                    {
                                        "target": "query",
                                        "modifier": "slug",
                                        "value": "string",
                                        "isRegex": false
                                    },
                                    {
                                        "target": "query",
                                        "modifier": "created_by",
                                        "value": "int",
                                        "isRegex": false
                                    }
                                ],
                                "rulesOperator": "OR",
                                "disableTemplating": false
                            }
                        ],
                        "enabled": true
                    },
                    {
                        "uuid": "",
                        "documentation": "Get one media resource",
                        "method": "get",
                        "endpoint": "show",
                        "responses": [
                            {
                                "uuid": "",
                                "body": "{\n  \"success\": true,\n  \"data\": {\n      \"id\": \"{{urlParam 'id'}}\",\n      \"created_at\": \"{{faker 'date.past'}}\",\n      \"updated_at\": \"{{faker 'date.past'}}\",\n      \"deleted_at\": \"\",\n      \"name\": \"{{faker 'name.title'}}\",\n      \"slug\": \"{{faker 'lorem.slug'}}\",\n      \"short_description\": \"{{faker 'lorem.sentence'}}\",\n      \"description\": \"{{faker 'lorem.paragraph'}}\",\n      \"price\": \"{{faker 'random.number'}}\",\n      \"thumbnail\": \"{{faker 'image.image' 200 300}}\",\n      \"file\": \"{{faker 'system.fileName'}}.{{faker 'system.fileExt'}}\",\n      \"started_at\": \"{{faker 'date.past'}}\",\n      \"expired_at\": \"{{faker 'date.past'}}\",\n      \"period_day\": \"{{faker 'random.number' 5}}\",\n      \"period_week\":\"{{faker 'random.number' 5}}\",\n      \"period_month\":\"{{faker 'random.number' 5}}\",\n      \"period_year\":\"{{faker 'random.number' 5}}\",\n      \"user\": {\n          \"id\": \"{{faker 'random.number' 500}}\",\n          \"created_at\": \"{{faker 'date.past'}}\",\n          \"updated_at\": \"{{faker 'date.past'}}\",\n          \"deleted_at\": \"\",\n          \"name\": \"{{faker 'name.firstName'}} {{faker 'name.lastName'}}\",\n          \"email\": \"{{faker 'internet.email'}}\",\n          \"email_verified_at\": \"{{faker 'date.past'}}\",\n          \"remember_token\": \"{{faker 'random.alphaNumeric'}}\",\n          \"whatsapp\": \"{{faker 'phone.phoneNumber'}}\",\n          \"address\": \"{{faker 'address.streetName'}}, {{faker 'address.country'}}\",\n          \"instagram\": \"@{{faker 'internet.userName'}}\",\n          \"birth_place\": \"{{faker 'address.city'}}\",\n          \"notes\": \"\",\n          \"activation_code\": \"{{faker 'random.alphaNumeric'}}\",\n          \"profession_id\": \"\",\n          \"birth_date\": \"{{faker 'date.past'}}\",\n          \"coin\": \"{{faker 'random.number'}}\",\n          \"hold_coin\": \"\",\n          \"expired_at\": \"{{faker 'date.past'}}\",\n          \"photo\": \"{{faker 'image.imageUrl'}}\",\n          \"agreed_at\": \"{{faker 'date.past'}}\",\n          \"city\": \"{{faker 'address.city'}}\",\n          \"phone\": \"{{faker 'phone.phoneNumber'}}\",\n          \"original_photo\": \"{{faker 'image.avatar'}}\",\n          \"telegram_id\": \"{{faker 'internet.userName'}}\",\n          \"prev_request\": \"\",\n          \"telegram_authorized\": \"\"\n        }\n    }\n}",
                                "latency": 0,
                                "statusCode": 200,
                                "label": "",
                                "headers": [
                                    {
                                        "key": "Content-Type",
                                        "value": "application/json"
                                    }
                                ],
                                "filePath": "",
                                "sendFileAsBody": false,
                                "rules": [
                                    {
                                        "target": "body",
                                        "modifier": "id",
                                        "value": "int",
                                        "isRegex": false
                                    }
                                ],
                                "rulesOperator": "OR",
                                "disableTemplating": false
                            }
                        ],
                        "enabled": true
                    },
                    {
                        "uuid": "",
                        "documentation": "Create new resource for media",
                        "method": "post",
                        "endpoint": "",
                        "responses": [
                            {
                                "uuid": "",
                                "body": "{\n  \"success\": true,\n  \"data\": {\n      \"id\": \"{{faker 'random.number' 500}}\",\n      \"created_at\": \"{{faker 'date.recent' 0}}\",\n      \"updated_at\": \"{{faker 'date.recent' 0}}\",\n      \"deleted_at\": \"\",\n      \"name\": \"{{body 'name'}}\",\n      \"slug\": \"{{body 'slug'}}\",\n      \"short_description\": \"{{body 'short_description'}}\",\n      \"description\": \"{{body 'lorem.description'}}\",\n      \"price\": \"{{body 'price' 100}}\",\n      \"thumbnail\": \"\",\n      \"file\": \"\",\n      \"started_at\": \"{{body 'started_at'}}\",\n      \"expired_at\": \"{{body 'expired_at'}}\",\n      \"period_day\": \"{{body 'period_day' 0}}\",\n      \"period_week\":\"{{body 'period_week' 0}}\",\n      \"period_month\":\"{{body 'period_month' 0}}\",\n      \"period_year\":\"{{body 'period_year' 0}}\",\n      \"user\": {\n        \"id\": \"{{ body 'created_by' }}\",\n        \"created_at\": \"{{faker 'date.past'}}\",\n        \"updated_at\": \"{{faker 'date.past'}}\",\n        \"deleted_at\": \"\",\n        \"name\": \"{{faker 'name.firstName'}} {{faker 'name.lastName'}}\",\n        \"email\": \"{{faker 'internet.email'}}\",\n        \"email_verified_at\": \"{{faker 'date.past'}}\",\n        \"remember_token\": \"{{faker 'random.alphaNumeric'}}\",\n        \"whatsapp\": \"{{faker 'phone.phoneNumber'}}\",\n        \"address\": \"{{faker 'address.streetName'}}, {{faker 'address.country'}}\",\n        \"instagram\": \"@{{faker 'internet.userName'}}\",\n        \"birth_place\": \"{{faker 'address.city'}}\",\n        \"notes\": \"\",\n        \"activation_code\": \"{{faker 'random.alphaNumeric'}}\",\n        \"profession_id\": \"\",\n        \"birth_date\": \"{{faker 'date.past'}}\",\n        \"coin\": \"{{faker 'random.number'}}\",\n        \"hold_coin\": \"\",\n        \"expired_at\": \"{{faker 'date.past'}}\",\n        \"photo\": \"{{faker 'image.imageUrl'}}\",\n        \"agreed_at\": \"{{faker 'date.past'}}\",\n        \"city\": \"{{faker 'address.city'}}\",\n        \"phone\": \"{{faker 'phone.phoneNumber'}}\",\n        \"original_photo\": \"{{faker 'image.avatar'}}\",\n        \"telegram_id\": \"{{faker 'internet.userName'}}\",\n        \"prev_request\": \"\",\n        \"telegram_authorized\": \"\"\n      }\n    }\n}",
                                "latency": 0,
                                "statusCode": 200,
                                "label": "",
                                "headers": [
                                    {
                                        "key": "Content-Type",
                                        "value": "application/json"
                                    }
                                ],
                                "filePath": "",
                                "sendFileAsBody": false,
                                "rules": [
                                    {
                                        "target": "body",
                                        "modifier": "name",
                                        "value": "string",
                                        "isRegex": false
                                    },
                                    {
                                        "target": "body",
                                        "modifier": "created_by",
                                        "value": "int",
                                        "isRegex": false
                                    },
                                    {
                                        "target": "body",
                                        "modifier": "slug",
                                        "value": "string",
                                        "isRegex": false
                                    },
                                    {
                                        "target": "body",
                                        "modifier": "description",
                                        "value": "string",
                                        "isRegex": false
                                    },
                                    {
                                        "target": "body",
                                        "modifier": "short_description",
                                        "value": "string",
                                        "isRegex": false
                                    },
                                    {
                                        "target": "body",
                                        "modifier": "price",
                                        "value": "int",
                                        "isRegex": false
                                    },
                                    {
                                        "target": "body",
                                        "modifier": "started_at",
                                        "value": "string",
                                        "isRegex": false
                                    },
                                    {
                                        "target": "body",
                                        "modifier": "expired_at",
                                        "value": "string",
                                        "isRegex": false
                                    },
                                    {
                                        "target": "body",
                                        "modifier": "period_day",
                                        "value": "int",
                                        "isRegex": false
                                    },
                                    {
                                        "target": "body",
                                        "modifier": "period_week",
                                        "value": "int",
                                        "isRegex": false
                                    },
                                    {
                                        "target": "body",
                                        "modifier": "period_month",
                                        "value": "int",
                                        "isRegex": false
                                    },
                                    {
                                        "target": "body",
                                        "modifier": "period_year",
                                        "value": "int",
                                        "isRegex": false
                                    }
                                ],
                                "rulesOperator": "AND",
                                "disableTemplating": false
                            }
                        ],
                        "enabled": true
                    },
                    {
                        "uuid": "",
                        "documentation": "Update the resource using json request",
                        "method": "put",
                        "endpoint": "",
                        "responses": [
                            {
                                "uuid": "",
                                "body": "{\n  \"success\": true,\n  \"data\": {\n      \"id\": \"{{body 'id'}}\",\n      \"created_at\": \"{{faker 'date.past'}}\",\n      \"updated_at\": \"{{faker 'date.recent' 0}}\",\n      \"deleted_at\": \"\",\n      \"name\": {{#if (body 'name') }} \"{{body 'name'}}\" {{^}} \"{{faker 'name.title'}}\" {{/if}},\n      \"slug\": {{#if (body 'slug') }} \"{{body 'slug'}}\" {{^}} \"{{faker 'lorem.slug'}}\" {{/if}},\n      \"short_description\": {{#if (body 'short_description') }} \"{{body 'short_description'}}\" {{^}} \"{{faker 'lorem.sentence'}}\" {{/if}},\n      \"description\": {{#if (body 'description') }} \"{{body 'description'}}\" {{^}} \"{{faker 'lorem.paragraph'}}\" {{/if}},\n      \"price\": {{#if (body 'price') }} \"{{body 'price'}}\" {{^}} \"{{faker 'random.number'}}\" {{/if}},\n      \"thumbnail\": \"\",\n      \"file\": \"\",\n      \"started_at\": {{#if (body 'started_at') }} \"{{body 'started_at'}}\" {{^}} \"{{faker 'time.past'}}\" {{/if}},\n      \"expired_at\": {{#if (body 'expired_at') }} \"{{body 'expired_at'}}\" {{^}} \"{{faker 'time.past'}}\" {{/if}},\n      \"period_day\": {{#if (body 'period_day') }} \"{{body 'period_day'}}\" {{^}} \"{{faker 'random.number' 5}}\" {{/if}},\n      \"period_week\": {{#if (body 'period_week') }} \"{{body 'period_week'}}\" {{^}} \"{{faker 'random.number' 5}}\" {{/if}},\n      \"period_month\": {{#if (body 'period_month') }} \"{{body 'period_month'}}\" {{^}} \"{{faker 'random.number' 5}}\" {{/if}},\n      \"period_year\":{{#if (body 'period_year') }} \"{{body 'period_year'}}\" {{^}} \"{{faker 'random.number' 5}}\" {{/if}},\n      \"user\": {\n        \"id\": \"{{ body 'updated_by'}}\",\n        \"created_at\": \"{{faker 'date.past'}}\",\n        \"updated_at\": \"{{faker 'date.past'}}\",\n        \"deleted_at\": \"\",\n        \"name\": \"{{faker 'name.firstName'}} {{faker 'name.lastName'}}\",\n        \"email\": \"{{faker 'internet.email'}}\",\n        \"email_verified_at\": \"{{faker 'date.past'}}\",\n        \"remember_token\": \"{{faker 'random.alphaNumeric'}}\",\n        \"whatsapp\": \"{{faker 'phone.phoneNumber'}}\",\n        \"address\": \"{{faker 'address.streetName'}}, {{faker 'address.country'}}\",\n        \"instagram\": \"@{{faker 'internet.userName'}}\",\n        \"birth_place\": \"{{faker 'address.city'}}\",\n        \"notes\": \"\",\n        \"activation_code\": \"{{faker 'random.alphaNumeric'}}\",\n        \"profession_id\": \"\",\n        \"birth_date\": \"{{faker 'date.past'}}\",\n        \"coin\": \"{{faker 'random.number'}}\",\n        \"hold_coin\": \"\",\n        \"expired_at\": \"{{faker 'date.past'}}\",\n        \"photo\": \"{{faker 'image.imageUrl'}}\",\n        \"agreed_at\": \"{{faker 'date.past'}}\",\n        \"city\": \"{{faker 'address.city'}}\",\n        \"phone\": \"{{faker 'phone.phoneNumber'}}\",\n        \"original_photo\": \"{{faker 'image.avatar'}}\",\n        \"telegram_id\": \"{{faker 'internet.userName'}}\",\n        \"prev_request\": \"\",\n        \"telegram_authorized\": \"\"\n      }\n    }\n}",
                                "latency": 0,
                                "statusCode": 200,
                                "label": "",
                                "headers": [
                                    {
                                        "key": "Content-Type",
                                        "value": "application/json"
                                    }
                                ],
                                "filePath": "",
                                "sendFileAsBody": false,
                                "rules": [
                                    {
                                        "target": "body",
                                        "modifier": "id",
                                        "value": "int",
                                        "isRegex": false
                                    },
                                    {
                                        "target": "body",
                                        "modifier": "name",
                                        "value": "string",
                                        "isRegex": false
                                    },
                                    {
                                        "target": "body",
                                        "modifier": "slug",
                                        "value": "string",
                                        "isRegex": false
                                    },
                                    {
                                        "target": "body",
                                        "modifier": "short_descrioption",
                                        "value": "string",
                                        "isRegex": false
                                    },
                                    {
                                        "target": "body",
                                        "modifier": "description",
                                        "value": "string",
                                        "isRegex": false
                                    },
                                    {
                                        "target": "body",
                                        "modifier": "started_at",
                                        "value": "string",
                                        "isRegex": false
                                    },
                                    {
                                        "target": "body",
                                        "modifier": "expired_at",
                                        "value": "string",
                                        "isRegex": false
                                    },
                                    {
                                        "target": "body",
                                        "modifier": "period_day",
                                        "value": "int",
                                        "isRegex": false
                                    },
                                    {
                                        "target": "body",
                                        "modifier": "period_week",
                                        "value": "int",
                                        "isRegex": false
                                    },
                                    {
                                        "target": "body",
                                        "modifier": "period_month",
                                        "value": "int",
                                        "isRegex": false
                                    },
                                    {
                                        "target": "body",
                                        "modifier": "period_year",
                                        "value": "int",
                                        "isRegex": false
                                    },
                                    {
                                        "target": "body",
                                        "modifier": "updated_by",
                                        "value": "int",
                                        "isRegex": false
                                    }
                                ],
                                "rulesOperator": "AND",
                                "disableTemplating": false
                            }
                        ],
                        "enabled": true
                    },
                    {
                        "uuid": "",
                        "documentation": "Update the resource using json request",
                        "method": "put",
                        "endpoint": "upload",
                        "responses": [
                            {
                                "uuid": "",
                                "body": "{\n  \"success\": true,\n  \"data\": {\n      \"id\": \"{{body 'id'}}\",\n      \"created_at\": \"{{faker 'date.past'}}\",\n      \"updated_at\": \"{{faker 'date.recent' 0}}\",\n      \"deleted_at\": \"\",\n      \"name\": \"{{faker 'name.title'}}\",\n      \"slug\": \"{{faker 'lorem.slug'}}\",\n      \"short_description\": \"{{faker 'lorem.sentence'}}\",\n      \"description\": \"{{faker 'lorem.paragraph'}}\",\n      \"price\": \"{{faker 'random.number'}}\",\n      \"thumbnail\": {{#if (body 'thumbnail') }} \"{{body 'thumbnail'}}\" {{^}} \"{{faker 'image.image'}}\" {{/if}},\n      \"file\":{{#if (body 'file') }} \"{{body 'file'}}\" {{^}} \"{{faker 'system.fileName'}}\".\"{{faker 'system.fileExt'}}\" {{/if}},\n      \"started_at\": \"{{faker 'time.past'}}\",\n      \"expired_at\": \"{{faker 'time.past'}}\",\n      \"period_day\": \"{{faker 'random.number' 5}}\",\n      \"period_week\": \"{{faker 'random.number' 5}}\",\n      \"period_month\": \"{{faker 'random.number' 5}}\",\n      \"period_year\":\"{{faker 'random.number' 5}}\",\n      \"user\": {\n        \"id\": \"{{ body 'updated_by'}}\",\n        \"created_at\": \"{{faker 'date.past'}}\",\n        \"updated_at\": \"{{faker 'date.past'}}\",\n        \"deleted_at\": \"\",\n        \"name\": \"{{faker 'name.firstName'}} {{faker 'name.lastName'}}\",\n        \"email\": \"{{faker 'internet.email'}}\",\n        \"email_verified_at\": \"{{faker 'date.past'}}\",\n        \"remember_token\": \"{{faker 'random.alphaNumeric'}}\",\n        \"whatsapp\": \"{{faker 'phone.phoneNumber'}}\",\n        \"address\": \"{{faker 'address.streetName'}}, {{faker 'address.country'}}\",\n        \"instagram\": \"@{{faker 'internet.userName'}}\",\n        \"birth_place\": \"{{faker 'address.city'}}\",\n        \"notes\": \"\",\n        \"activation_code\": \"{{faker 'random.alphaNumeric'}}\",\n        \"profession_id\": \"\",\n        \"birth_date\": \"{{faker 'date.past'}}\",\n        \"coin\": \"{{faker 'random.number'}}\",\n        \"hold_coin\": \"\",\n        \"expired_at\": \"{{faker 'date.past'}}\",\n        \"photo\": \"{{faker 'image.imageUrl'}}\",\n        \"agreed_at\": \"{{faker 'date.past'}}\",\n        \"city\": \"{{faker 'address.city'}}\",\n        \"phone\": \"{{faker 'phone.phoneNumber'}}\",\n        \"original_photo\": \"{{faker 'image.avatar'}}\",\n        \"telegram_id\": \"{{faker 'internet.userName'}}\",\n        \"prev_request\": \"\",\n        \"telegram_authorized\": \"\"\n      }\n    }\n}",
                                "latency": 0,
                                "statusCode": 200,
                                "label": "",
                                "headers": [
                                    {
                                        "key": "Content-Type",
                                        "value": "application/json"
                                    }
                                ],
                                "filePath": "",
                                "sendFileAsBody": false,
                                "rules": [
                                    {
                                        "target": "body",
                                        "modifier": "id",
                                        "value": "int",
                                        "isRegex": false
                                    },
                                    {
                                        "target": "body",
                                        "modifier": "name",
                                        "value": "string",
                                        "isRegex": false
                                    },
                                    {
                                        "target": "body",
                                        "modifier": "slug",
                                        "value": "string",
                                        "isRegex": false
                                    },
                                    {
                                        "target": "body",
                                        "modifier": "short_descrioption",
                                        "value": "string",
                                        "isRegex": false
                                    },
                                    {
                                        "target": "body",
                                        "modifier": "description",
                                        "value": "string",
                                        "isRegex": false
                                    },
                                    {
                                        "target": "body",
                                        "modifier": "started_at",
                                        "value": "string",
                                        "isRegex": false
                                    },
                                    {
                                        "target": "body",
                                        "modifier": "expired_at",
                                        "value": "string",
                                        "isRegex": false
                                    },
                                    {
                                        "target": "body",
                                        "modifier": "period_day",
                                        "value": "int",
                                        "isRegex": false
                                    },
                                    {
                                        "target": "body",
                                        "modifier": "period_week",
                                        "value": "int",
                                        "isRegex": false
                                    },
                                    {
                                        "target": "body",
                                        "modifier": "period_month",
                                        "value": "int",
                                        "isRegex": false
                                    },
                                    {
                                        "target": "body",
                                        "modifier": "period_year",
                                        "value": "int",
                                        "isRegex": false
                                    },
                                    {
                                        "target": "body",
                                        "modifier": "updated_by",
                                        "value": "int",
                                        "isRegex": false
                                    }
                                ],
                                "rulesOperator": "AND",
                                "disableTemplating": false
                            }
                        ],
                        "enabled": true
                    },
                    {
                        "uuid": "",
                        "documentation": "Delete the resource using json request",
                        "method": "delete",
                        "endpoint": "",
                        "responses": [
                            {
                                "uuid": "",
                                "body": "{\n  \"success\": true,\n  \"data\": {\n    \"id\": \"{{urlParam 'id'}}\"\n  }\n}",
                                "latency": 0,
                                "statusCode": 200,
                                "label": "",
                                "headers": [
                                    {
                                        "key": "",
                                        "value": ""
                                    }
                                ],
                                "filePath": "",
                                "sendFileAsBody": false,
                                "rules": [
                                    {
                                        "target": "params",
                                        "modifier": "id",
                                        "value": "int",
                                        "isRegex": false
                                    }
                                ],
                                "rulesOperator": "OR",
                                "disableTemplating": false
                            }
                        ],
                        "enabled": true
                    },
                    {
                        "uuid": "",
                        "documentation": "Get all media resource",
                        "method": "get",
                        "endpoint": "user-accessory",
                        "responses": [
                            {
                                "uuid": "",
                                "body": "{\n  \"success\": true,\n  \"pages\": {\n    \"total\": \"{{faker 'random.number'}}\",\n    \"per_page\": \"{{ queryParam 'per_page' }}\",\n    \"current_page\": \"{{ queryParam 'page'}}\",\n    \"last_page\": \"{{faker 'random.number'}}\",\n    \"first_page_url\": \"http://localhost:3008/api/v1/accessory/user-accessory?page=1\",\n    \"last_page_url\": \"http://localhost:3008/api/v1/accessory/user-accessory?page={{faker 'random.number'}}\",\n    \"next_page_url\": \"http://localhost:3008/api/v1/accessory/user-accessory?page={{faker 'random.number'}}\",\n    \"prev_page_url\": \"http://localhost:3008/api/v1/accessory/user-accessory?page={{faker 'random.number'}}\",\n    \"path\": \"http://localhost:3008/api/v1/accessory/user-accessory\",\n    \"from\": \"{{faker 'random.number'}}\",\n    \"to\": \"{{faker 'random.number'}}\"\n    },\n    \"data\": [\n      {{#repeat (queryParam 'per_page') }}\n      {\n        \"id\": {{#if (queryParam 'purchased_at' queryParam 'accessory_id' queryParam 'user_id') }} \"{{faker 'random.number' 500}}\" {{^}} \"{{@index}}\" {{/if}},\n        \"created_at\": \"{{faker 'date.past'}}\",\n        \"updated_at\": \"{{faker 'date.past'}}\",\n        \"deleted_at\": \"\",\n        \"price\": \"{{faker 'random.number'}}\",\n        \"purchased_at\": \"{{faker 'time.past'}}\",\n        \"expired_at\": \"{{faker 'time.past'}}\",\n        \"accessory\": {\n          \"id\": {{#if (queryParam 'accessory_id') }} \"{{queryParam 'accessory_id'}}\" {{^}} \"{{faker 'random.number' 500}}\" {{/if}},\n          \"name\": \"{{faker 'name.title'}}\",\n          \"slug\": \"{{faker 'lorem.slug'}}\",\n          \"short_description\": \"{{faker 'lorem.sentence'}}\",\n          \"description\": \"{{faker 'lorem.paragraph'}}\",\n          \"price\": \"{{faker 'random.number'}}\",\n          \"thumbnail\": \"{{faker 'image.image' 200 300}}\",\n          \"file\": \"{{faker 'system.fileName'}}.{{faker 'system.fileExt'}}\",\n          \"started_at\": \"{{faker 'date.past'}}\",\n          \"expired_at\": \"{{faker 'date.past'}}\",\n          \"period_day\": \"{{faker 'random.number' 5}}\",\n          \"period_week\":\"{{faker 'random.number' 5}}\",\n          \"period_month\":\"{{faker 'random.number' 5}}\",\n          \"period_year\":\"{{faker 'random.number' 5}}\",\n        },\n        \"user\": {\n          \"id\": {{#if (queryParam 'user_id') }} \"{{queryParam 'user_id'}}\" {{^}} \"{{faker 'random.number' 500}}\" {{/if}}\n          \"created_at\": \"{{faker 'date.past'}}\",\n          \"updated_at\": \"{{faker 'date.past'}}\",\n          \"deleted_at\": \"\",\n          \"name\": \"{{faker 'name.firstName'}} {{faker 'name.lastName'}}\",\n          \"email\": \"{{faker 'internet.email'}}\",\n          \"email_verified_at\": \"{{faker 'date.past'}}\",\n          \"remember_token\": \"{{faker 'random.alphaNumeric'}}\",\n          \"whatsapp\": \"{{faker 'phone.phoneNumber'}}\",\n          \"address\": \"{{faker 'address.streetName'}}, {{faker 'address.country'}}\",\n          \"instagram\": \"@{{faker 'internet.userName'}}\",\n          \"birth_place\": \"{{faker 'address.city'}}\",\n          \"notes\": \"\",\n          \"activation_code\": \"{{faker 'random.alphaNumeric'}}\",\n          \"profession_id\": \"\",\n          \"birth_date\": \"{{faker 'date.past'}}\",\n          \"coin\": \"{{faker 'random.number'}}\",\n          \"hold_coin\": \"\",\n          \"expired_at\": \"{{faker 'date.past'}}\",\n          \"photo\": \"{{faker 'image.imageUrl'}}\",\n          \"agreed_at\": \"{{faker 'date.past'}}\",\n          \"city\": \"{{faker 'address.city'}}\",\n          \"phone\": \"{{faker 'phone.phoneNumber'}}\",\n          \"original_photo\": \"{{faker 'image.avatar'}}\",\n          \"telegram_id\": \"{{faker 'internet.userName'}}\",\n          \"prev_request\": \"\",\n          \"telegram_authorized\": \"\"\n        }\n      }\n      {{/repeat}}\n    ]\n}\n}",
                                "latency": 0,
                                "statusCode": 200,
                                "label": "",
                                "headers": [
                                    {
                                        "key": "",
                                        "value": ""
                                    }
                                ],
                                "filePath": "",
                                "sendFileAsBody": false,
                                "rules": [
                                    {
                                        "target": "query",
                                        "modifier": "page",
                                        "value": "int",
                                        "isRegex": false
                                    },
                                    {
                                        "target": "query",
                                        "modifier": "per_page",
                                        "value": "int",
                                        "isRegex": false
                                    },
                                    {
                                        "target": "query",
                                        "modifier": "purchased_aat",
                                        "value": "string",
                                        "isRegex": false
                                    },
                                    {
                                        "target": "query",
                                        "modifier": "acccessory_id",
                                        "value": "int",
                                        "isRegex": false
                                    },
                                    {
                                        "target": "query",
                                        "modifier": "user_id",
                                        "value": "int",
                                        "isRegex": false
                                    }
                                ],
                                "rulesOperator": "OR",
                                "disableTemplating": false
                            }
                        ],
                        "enabled": true
                    },
                    {
                        "uuid": "",
                        "documentation": "Get one media resource",
                        "method": "get",
                        "endpoint": "user-accessory/show",
                        "responses": [
                            {
                                "uuid": "",
                                "body": "{\n  \"success\": true,\n  \"data\": {\n      \"id\": \"{{urlParam 'id'}}\",\n      \"created_at\": \"{{faker 'date.past'}}\",\n      \"updated_at\": \"{{faker 'date.past'}}\",\n      \"deleted_at\": \"\",\n      \"price\": \"{{faker 'random.number'}}\",\n      \"purchased_at\": \"{{faker 'time.past'}}\",\n      \"expired_at\": \"{{faker 'time.past'}}\",\n      \"accessory\": {\n        \"id\": \"{{faker 'random.number' 500}}\",\n        \"name\": \"{{faker 'name.title'}}\",\n        \"slug\": \"{{faker 'lorem.slug'}}\",\n        \"short_description\": \"{{faker 'lorem.sentence'}}\",\n        \"description\": \"{{faker 'lorem.paragraph'}}\",\n        \"price\": \"{{faker 'random.number'}}\",\n        \"thumbnail\": \"{{faker 'image.image' 200 300}}\",\n        \"file\": \"{{faker 'system.fileName'}}.{{faker 'system.fileExt'}}\",\n        \"started_at\": \"{{faker 'date.past'}}\",\n        \"expired_at\": \"{{faker 'date.past'}}\",\n        \"period_day\": \"{{faker 'random.number' 5}}\",\n        \"period_week\":\"{{faker 'random.number' 5}}\",\n        \"period_month\":\"{{faker 'random.number' 5}}\",\n        \"period_year\":\"{{faker 'random.number' 5}}\",\n      },\n      \"user\": {\n          \"id\": \"{{faker 'random.number' 500}}\",\n          \"created_at\": \"{{faker 'date.past'}}\",\n          \"updated_at\": \"{{faker 'date.past'}}\",\n          \"deleted_at\": \"\",\n          \"name\": \"{{faker 'name.firstName'}} {{faker 'name.lastName'}}\",\n          \"email\": \"{{faker 'internet.email'}}\",\n          \"email_verified_at\": \"{{faker 'date.past'}}\",\n          \"remember_token\": \"{{faker 'random.alphaNumeric'}}\",\n          \"whatsapp\": \"{{faker 'phone.phoneNumber'}}\",\n          \"address\": \"{{faker 'address.streetName'}}, {{faker 'address.country'}}\",\n          \"instagram\": \"@{{faker 'internet.userName'}}\",\n          \"birth_place\": \"{{faker 'address.city'}}\",\n          \"notes\": \"\",\n          \"activation_code\": \"{{faker 'random.alphaNumeric'}}\",\n          \"profession_id\": \"\",\n          \"birth_date\": \"{{faker 'date.past'}}\",\n          \"coin\": \"{{faker 'random.number'}}\",\n          \"hold_coin\": \"\",\n          \"expired_at\": \"{{faker 'date.past'}}\",\n          \"photo\": \"{{faker 'image.imageUrl'}}\",\n          \"agreed_at\": \"{{faker 'date.past'}}\",\n          \"city\": \"{{faker 'address.city'}}\",\n          \"phone\": \"{{faker 'phone.phoneNumber'}}\",\n          \"original_photo\": \"{{faker 'image.avatar'}}\",\n          \"telegram_id\": \"{{faker 'internet.userName'}}\",\n          \"prev_request\": \"\",\n          \"telegram_authorized\": \"\"\n        }\n    }\n}",
                                "latency": 0,
                                "statusCode": 200,
                                "label": "",
                                "headers": [
                                    {
                                        "key": "Content-Type",
                                        "value": "application/json"
                                    }
                                ],
                                "filePath": "",
                                "sendFileAsBody": false,
                                "rules": [
                                    {
                                        "target": "body",
                                        "modifier": "id",
                                        "value": "int",
                                        "isRegex": false
                                    }
                                ],
                                "rulesOperator": "OR",
                                "disableTemplating": false
                            }
                        ],
                        "enabled": true
                    },
                    {
                        "uuid": "",
                        "documentation": "Create new resource for media",
                        "method": "post",
                        "endpoint": "user-accessory",
                        "responses": [
                            {
                                "uuid": "",
                                "body": "{\n  \"success\": true,\n  \"data\": {\n      \"id\": \"{{faker 'random.number' 500}}\",\n      \"created_at\": \"{{faker 'date.recent' 0}}\",\n      \"updated_at\": \"{{faker 'date.recent' 0}}\",\n      \"deleted_at\": \"\",\n      \"price\": \"{{body 'price'}}\",\n      \"purchased_at\": \"{{body 'purchased_at'}}\",\n      \"expired_at\": \"{{body 'expired_at'}}\",\n      \"accessory\": {\n        \"id\": \"{{body 'accessory_id'}}\",\n        \"name\": \"{{faker 'name.title'}}\",\n        \"slug\": \"{{faker 'lorem.slug'}}\",\n        \"short_description\": \"{{faker 'lorem.sentence'}}\",\n        \"description\": \"{{faker 'lorem.paragraph'}}\",\n        \"price\": \"{{faker 'random.number'}}\",\n        \"thumbnail\": \"{{faker 'image.image' 200 300}}\",\n        \"file\": \"{{faker 'system.fileName'}}.{{faker 'system.fileExt'}}\",\n        \"started_at\": \"{{faker 'date.past'}}\",\n        \"expired_at\": \"{{faker 'date.past'}}\",\n        \"period_day\": \"{{faker 'random.number' 5}}\",\n        \"period_week\":\"{{faker 'random.number' 5}}\",\n        \"period_month\":\"{{faker 'random.number' 5}}\",\n        \"period_year\":\"{{faker 'random.number' 5}}\",\n      },\n      \"user\": {\n        \"id\": \"{{ body 'user_id'}}\",\n        \"created_at\": \"{{faker 'date.past'}}\",\n        \"updated_at\": \"{{faker 'date.past'}}\",\n        \"deleted_at\": \"\",\n        \"name\": \"{{faker 'name.firstName'}} {{faker 'name.lastName'}}\",\n        \"email\": \"{{faker 'internet.email'}}\",\n        \"email_verified_at\": \"{{faker 'date.past'}}\",\n        \"remember_token\": \"{{faker 'random.alphaNumeric'}}\",\n        \"whatsapp\": \"{{faker 'phone.phoneNumber'}}\",\n        \"address\": \"{{faker 'address.streetName'}}, {{faker 'address.country'}}\",\n        \"instagram\": \"@{{faker 'internet.userName'}}\",\n        \"birth_place\": \"{{faker 'address.city'}}\",\n        \"notes\": \"\",\n        \"activation_code\": \"{{faker 'random.alphaNumeric'}}\",\n        \"profession_id\": \"\",\n        \"birth_date\": \"{{faker 'date.past'}}\",\n        \"coin\": \"{{faker 'random.number'}}\",\n        \"hold_coin\": \"\",\n        \"expired_at\": \"{{faker 'date.past'}}\",\n        \"photo\": \"{{faker 'image.imageUrl'}}\",\n        \"agreed_at\": \"{{faker 'date.past'}}\",\n        \"city\": \"{{faker 'address.city'}}\",\n        \"phone\": \"{{faker 'phone.phoneNumber'}}\",\n        \"original_photo\": \"{{faker 'image.avatar'}}\",\n        \"telegram_id\": \"{{faker 'internet.userName'}}\",\n        \"prev_request\": \"\",\n        \"telegram_authorized\": \"\"\n      }\n    }\n}",
                                "latency": 0,
                                "statusCode": 200,
                                "label": "",
                                "headers": [
                                    {
                                        "key": "Content-Type",
                                        "value": "application/json"
                                    }
                                ],
                                "filePath": "",
                                "sendFileAsBody": false,
                                "rules": [
                                    {
                                        "target": "body",
                                        "modifier": "accessory_id",
                                        "value": "int",
                                        "isRegex": false
                                    },
                                    {
                                        "target": "body",
                                        "modifier": "user_id",
                                        "value": "int",
                                        "isRegex": false
                                    },
                                    {
                                        "target": "body",
                                        "modifier": "price",
                                        "value": "string",
                                        "isRegex": false
                                    },
                                    {
                                        "target": "body",
                                        "modifier": "expired_at",
                                        "value": "string",
                                        "isRegex": false
                                    },
                                    {
                                        "target": "body",
                                        "modifier": "purchased_at",
                                        "value": "string",
                                        "isRegex": false
                                    }
                                ],
                                "rulesOperator": "AND",
                                "disableTemplating": false
                            }
                        ],
                        "enabled": true
                    },
                    {
                        "uuid": "",
                        "documentation": "Update the resource using json request",
                        "method": "put",
                        "endpoint": "user-accessory",
                        "responses": [
                            {
                                "uuid": "",
                                "body": "{\n  \"success\": true,\n  \"data\": {\n      \"id\": \"{{body 'id'}}\",\n      \"created_at\": \"{{faker 'date.past'}}\",\n      \"updated_at\": \"{{faker 'date.recent' 0}}\",\n      \"deleted_at\": \"\",\n      \"price\": {{#if (body 'price') }} \"{{body 'price'}}\" {{^}} \"{{faker 'random.number' }}\" {{/if}},\n      \"purchased_at\": {{#if (body 'purchased_at') }} \"{{body 'purchased_at'}}\" {{^}} \"{{faker 'time.past' }}\" {{/if}},\n      \"expired_at\": {{#if (body 'expired_at') }} \"{{body 'expired_at'}}\" {{^}} \"{{faker 'time.past' }}\" {{/if}},\n      \"accessory\": {\n        \"id\": \"{{faker 'random.number' 500}}\",\n        \"name\": \"{{faker 'name.title'}}\",\n        \"slug\": \"{{faker 'lorem.slug'}}\",\n        \"short_description\": \"{{faker 'lorem.sentence'}}\",\n        \"description\": \"{{faker 'lorem.paragraph'}}\",\n        \"price\": \"{{faker 'random.number'}}\",\n        \"thumbnail\": \"{{faker 'image.image' 200 300}}\",\n        \"file\": \"{{faker 'system.fileName'}}.{{faker 'system.fileExt'}}\",\n        \"started_at\": \"{{faker 'date.past'}}\",\n        \"expired_at\": \"{{faker 'date.past'}}\",\n        \"period_day\": \"{{faker 'random.number' 5}}\",\n        \"period_week\":\"{{faker 'random.number' 5}}\",\n        \"period_month\":\"{{faker 'random.number' 5}}\",\n        \"period_year\":\"{{faker 'random.number' 5}}\",\n      },\n      \"user\": {\n        \"id\": \"{{ faker 'random' 500}}\",\n        \"created_at\": \"{{faker 'date.past'}}\",\n        \"updated_at\": \"{{faker 'date.past'}}\",\n        \"deleted_at\": \"\",\n        \"name\": \"{{faker 'name.firstName'}} {{faker 'name.lastName'}}\",\n        \"email\": \"{{faker 'internet.email'}}\",\n        \"email_verified_at\": \"{{faker 'date.past'}}\",\n        \"remember_token\": \"{{faker 'random.alphaNumeric'}}\",\n        \"whatsapp\": \"{{faker 'phone.phoneNumber'}}\",\n        \"address\": \"{{faker 'address.streetName'}}, {{faker 'address.country'}}\",\n        \"instagram\": \"@{{faker 'internet.userName'}}\",\n        \"birth_place\": \"{{faker 'address.city'}}\",\n        \"notes\": \"\",\n        \"activation_code\": \"{{faker 'random.alphaNumeric'}}\",\n        \"profession_id\": \"\",\n        \"birth_date\": \"{{faker 'date.past'}}\",\n        \"coin\": \"{{faker 'random.number'}}\",\n        \"hold_coin\": \"\",\n        \"expired_at\": \"{{faker 'date.past'}}\",\n        \"photo\": \"{{faker 'image.imageUrl'}}\",\n        \"agreed_at\": \"{{faker 'date.past'}}\",\n        \"city\": \"{{faker 'address.city'}}\",\n        \"phone\": \"{{faker 'phone.phoneNumber'}}\",\n        \"original_photo\": \"{{faker 'image.avatar'}}\",\n        \"telegram_id\": \"{{faker 'internet.userName'}}\",\n        \"prev_request\": \"\",\n        \"telegram_authorized\": \"\"\n      }\n    }\n}",
                                "latency": 0,
                                "statusCode": 200,
                                "label": "",
                                "headers": [
                                    {
                                        "key": "Content-Type",
                                        "value": "application/json"
                                    }
                                ],
                                "filePath": "",
                                "sendFileAsBody": false,
                                "rules": [
                                    {
                                        "target": "body",
                                        "modifier": "id",
                                        "value": "int",
                                        "isRegex": false
                                    },
                                    {
                                        "target": "body",
                                        "modifier": "price",
                                        "value": "string",
                                        "isRegex": false
                                    },
                                    {
                                        "target": "body",
                                        "modifier": "purchased_at",
                                        "value": "string",
                                        "isRegex": false
                                    },
                                    {
                                        "target": "body",
                                        "modifier": "expired_at",
                                        "value": "string",
                                        "isRegex": false
                                    }
                                ],
                                "rulesOperator": "AND",
                                "disableTemplating": false
                            }
                        ],
                        "enabled": true
                    },
                    {
                        "uuid": "",
                        "documentation": "Delete the resource using json request",
                        "method": "delete",
                        "endpoint": "user-accessory",
                        "responses": [
                            {
                                "uuid": "",
                                "body": "{\n  \"success\": true,\n  \"data\": {\n    \"id\": \"{{urlParam 'id'}}\"\n  }\n}",
                                "latency": 0,
                                "statusCode": 200,
                                "label": "",
                                "headers": [
                                    {
                                        "key": "",
                                        "value": ""
                                    }
                                ],
                                "filePath": "",
                                "sendFileAsBody": false,
                                "rules": [
                                    {
                                        "target": "params",
                                        "modifier": "id",
                                        "value": "int",
                                        "isRegex": false
                                    }
                                ],
                                "rulesOperator": "OR",
                                "disableTemplating": false
                            }
                        ],
                        "enabled": true
                    }
                ],
                "proxyMode": false,
                "proxyHost": "",
                "https": false,
                "cors": true,
                "headers": [
                    {
                        "key": "Content-Type",
                        "value": "application/json"
                    }
                ],
                "proxyReqHeaders": [
                    {
                        "key": "",
                        "value": ""
                    }
                ],
                "proxyResHeaders": [
                    {
                        "key": "",
                        "value": ""
                    }
                ]
            }
        }
    ]
}
