{
    "source": "mockoon:1.10.0",
    "data": [
        {
            "type": "environment",
            "item": {
                "uuid": "",
                "lastMigration": 12,
                "name": "6. Slider Micro-Service",
                "endpointPrefix": "api/v1/slider",
                "latency": 0,
                "port": 3005,
                "routes": [
                    {
                        "uuid": "",
                        "documentation": "Get all media resource",
                        "method": "get",
                        "endpoint": "",
                        "responses": [
                            {
                                "uuid": "",
                                "body": "{\n  \"success\": true,\n  \"pages\": {\n    \"total\": \"{{faker 'random.number'}}\",\n    \"per_page\": \"{{ queryParam 'per_page' }}\",\n    \"current_page\": \"{{ queryParam 'page'}}\",\n    \"last_page\": \"{{faker 'random.number'}}\",\n    \"first_page_url\": \"http://localhost:3005/api/v1/slider?page=1\",\n    \"last_page_url\": \"http://localhost:3005/api/v1/slider?page={{faker 'random.number'}}\",\n    \"next_page_url\": \"http://localhost:3005/api/v1/slider?page={{faker 'random.number'}}\",\n    \"prev_page_url\": \"http://localhost:3005/api/v1/slider?page={{faker 'random.number'}}\",\n    \"path\": \"http://localhost:3005/api/v1/slider\",\n    \"from\": \"{{faker 'random.number'}}\",\n    \"to\": \"{{faker 'random.number'}}\"\n    },\n    \"data\": [\n      {{#repeat (queryParam 'per_page') }}\n      {\n        \"id\": {{#if (queryParam 'image' queryParam 'route' queryParam 'created_by') }} \"{{faker 'random.number'}}\" {{^}} \"{{@index}}\" {{/if}},\n        \"created_at\": \"{{faker 'date.past'}}\",\n        \"updated_at\": \"{{faker 'date.past'}}\",\n        \"deleted_at\": \"\",\n        \"image\": {{#if (queryParam 'image') }} \"{{ queryParam 'image' }}\" {{^}} \"{{faker 'system.fileName'}}\" \"{{faker 'system.commonFileExt'}}\" {{/if}},\n        \"route\": {{#if (queryParam 'route') }} \"{{ queryParam 'route' }}\" {{^}} \"{{faker 'lorem.word'}}.{{faker 'lorem.word'}}\" {{/if}},\n        \"clicked\": \"{{faker 'random.number' 1000}}\",\n        \"started_at\": \"{{faker 'date.past'}}\",\n        \"expired_at\": \"{{faker 'date.past'}}\",\n        \"user\": {\n          \"id\": {{#if (queryParam 'created_by') }} \"{{ queryParam 'created_by' }}\" {{^}} \"{{faker 'name.firstName'}} {{faker 'name.lastName'}}\" {{/if}},\n          \"created_at\": \"{{faker 'date.past'}}\",\n          \"updated_at\": \"{{faker 'date.past'}}\",\n          \"deleted_at\": \"\",\n          \"name\": \"{{faker 'name.firstName'}} {{faker 'name.lastName'}}\",\n          \"email\": \"{{faker 'internet.email'}}\",\n          \"email_verified_at\": \"{{faker 'date.past'}}\",\n          \"remember_token\": \"{{faker 'random.alphaNumeric'}}\",\n          \"whatsapp\": \"{{faker 'phone.phoneNumber'}}\",\n          \"address\": \"{{faker 'address.streetName'}}, {{faker 'address.country'}}\",\n          \"instagram\": \"@{{faker 'internet.userName'}}\",\n          \"birth_place\": \"{{faker 'address.city'}}\",\n          \"notes\": \"\",\n          \"activation_code\": \"{{faker 'random.alphaNumeric'}}\",\n          \"profession_id\": \"\",\n          \"birth_date\": \"{{faker 'date.past'}}\",\n          \"coin\": \"{{faker 'random.number' 1000}}\",\n          \"hold_coin\": \"{{faker 'random.number' 1000}}\",\n          \"expired_at\": \"{{faker 'date.past'}}\",\n          \"photo\": \"{{faker 'image.imageUrl'}}\",\n          \"agreed_at\": \"{{faker 'date.past'}}\",\n          \"city\": \"{{faker 'address.city'}}\",\n          \"phone\": \"{{faker 'phone.phoneNumber'}}\",\n          \"original_photo\": \"{{faker 'image.avatar'}}\",\n          \"telegram_id\": \"{{faker 'internet.userName'}}\",\n          \"prev_request\": \"\",\n          \"telegram_authorized\": \"\"\n        }\n      }\n      {{/repeat}}\n    ]\n}\n}",
                                "latency": 0,
                                "statusCode": 200,
                                "label": "",
                                "headers": [
                                    {
                                        "key": "",
                                        "value": ""
                                    }
                                ],
                                "filePath": "",
                                "sendFileAsBody": false,
                                "rules": [
                                    {
                                        "target": "query",
                                        "modifier": "page",
                                        "value": "int",
                                        "isRegex": false
                                    },
                                    {
                                        "target": "query",
                                        "modifier": "per_page",
                                        "value": "int",
                                        "isRegex": false
                                    },
                                    {
                                        "target": "query",
                                        "modifier": "image",
                                        "value": "string",
                                        "isRegex": false
                                    },
                                    {
                                        "target": "query",
                                        "modifier": "route",
                                        "value": "string",
                                        "isRegex": false
                                    },
                                    {
                                        "target": "query",
                                        "modifier": "created_by",
                                        "value": "int",
                                        "isRegex": false
                                    }
                                ],
                                "rulesOperator": "OR",
                                "disableTemplating": false
                            },
                            {
                                "uuid": "",
                                "body": "{\n  \"success\": false,\n  \"errors\": [\n      {\n        \"type\": \"service\",\n        \"source\": \"slider service\",\n        \"message\": \"Servis tidak dapat mengolah permintaan\"\n      },\n      {\n        \"type\": \"service\",\n        \"source\": \"parameter\",\n        \"message\": \"Parameter tidak ditemukan\"\n      }\n    ]\n}",
                                "latency": 0,
                                "statusCode": 400,
                                "label": "",
                                "headers": [
                                    {
                                        "key": "",
                                        "value": ""
                                    }
                                ],
                                "filePath": "",
                                "sendFileAsBody": false,
                                "rules": [],
                                "rulesOperator": "OR",
                                "disableTemplating": false
                            }
                        ],
                        "enabled": true
                    },
                    {
                        "uuid": "",
                        "documentation": "Get one media resource",
                        "method": "get",
                        "endpoint": "show",
                        "responses": [
                            {
                                "uuid": "",
                                "body": "{\n  \"success\": true,\n  \"data\": {\n      \"id\": \"{{urlParam 'id'}}\",\n      \"created_at\": \"{{faker 'date.past'}}\",\n      \"updated_at\": \"{{faker 'date.past'}}\",\n      \"deleted_at\": \"\",\n      \"image\": \"{{faker 'system.fileName'}}\".\"{{faker 'system.commonFileExt'}}\",\n      \"route\": \"{{faker 'lorem.word'}}.{{faker 'lorem.word'}}\",\n      \"clicked\": \"{{faker 'random.number' 1000}}\",\n      \"started_at\": \"{{faker 'date.past'}}\",\n      \"expired_at\": \"{{faker 'date.past'}}\",\n      \"user\": {\n          \"id\": \"{{faker 'random.number' 500}}\",\n          \"created_at\": \"{{faker 'date.past'}}\",\n          \"updated_at\": \"{{faker 'date.past'}}\",\n          \"deleted_at\": \"\",\n          \"name\": \"{{faker 'name.firstName'}} {{faker 'name.lastName'}}\",\n          \"email\": \"{{faker 'internet.email'}}\",\n          \"email_verified_at\": \"{{faker 'date.past'}}\",\n          \"remember_token\": \"{{faker 'random.alphaNumeric'}}\",\n          \"whatsapp\": \"{{faker 'phone.phoneNumber'}}\",\n          \"address\": \"{{faker 'address.streetName'}}, {{faker 'address.country'}}\",\n          \"instagram\": \"@{{faker 'internet.userName'}}\",\n          \"birth_place\": \"{{faker 'address.city'}}\",\n          \"notes\": \"\",\n          \"activation_code\": \"{{faker 'random.alphaNumeric'}}\",\n          \"profession_id\": \"\",\n          \"birth_date\": \"{{faker 'date.past'}}\",\n          \"coin\": \"{{faker 'random.number' 1000}}\",\n          \"hold_coin\": \"{{faker 'random.number' 1000}}\",\n          \"expired_at\": \"{{faker 'date.past'}}\",\n          \"photo\": \"{{faker 'image.imageUrl'}}\",\n          \"agreed_at\": \"{{faker 'date.past'}}\",\n          \"city\": \"{{faker 'address.city'}}\",\n          \"phone\": \"{{faker 'phone.phoneNumber'}}\",\n          \"original_photo\": \"{{faker 'image.avatar'}}\",\n          \"telegram_id\": \"{{faker 'internet.userName'}}\",\n          \"prev_request\": \"\",\n          \"telegram_authorized\": \"\"\n        }\n    }\n}",
                                "latency": 0,
                                "statusCode": 200,
                                "label": "",
                                "headers": [
                                    {
                                        "key": "Content-Type",
                                        "value": "application/json"
                                    }
                                ],
                                "filePath": "",
                                "sendFileAsBody": false,
                                "rules": [
                                    {
                                        "target": "params",
                                        "modifier": "id",
                                        "value": "int",
                                        "isRegex": false
                                    }
                                ],
                                "rulesOperator": "OR",
                                "disableTemplating": false
                            },
                            {
                                "uuid": "",
                                "body": "{\n  \"success\": false,\n  \"errors\": [\n      {\n        \"type\": \"server\",\n        \"source\": \"resource\",\n        \"message\": \"Terjadi kesalahan relasi data\"\n      }\n    ]\n}",
                                "latency": 0,
                                "statusCode": 400,
                                "label": "",
                                "headers": [
                                    {
                                        "key": "",
                                        "value": ""
                                    }
                                ],
                                "filePath": "",
                                "sendFileAsBody": false,
                                "rules": [],
                                "rulesOperator": "OR",
                                "disableTemplating": false
                            }
                        ],
                        "enabled": true
                    },
                    {
                        "uuid": "",
                        "documentation": "Create new resource for media",
                        "method": "post",
                        "endpoint": "",
                        "responses": [
                            {
                                "uuid": "",
                                "body": "{\n  \"success\": true,\n  \"data\": {\n      \"id\": \"{{faker 'random.number' 500}}\",\n      \"created_at\": \"{{faker 'date.recent' 0}}\",\n      \"updated_at\": \"{{faker 'date.recent' 0}}\",\n      \"deleted_at\": \"\",\n      \"image\": \"\",\n      \"route\": \"{{body 'route'}}\",\n      \"clicked\": \"0\",\n      \"started_at\": \"{{body 'started_at'}}\",\n      \"expired_at\": \"{{body 'expired_at'}}\",\n      \"user\": {\n        \"id\": \"{{ body 'created_by' }}\",\n        \"created_at\": \"{{faker 'date.past'}}\",\n        \"updated_at\": \"{{faker 'date.past'}}\",\n        \"deleted_at\": \"\",\n        \"name\": \"{{faker 'name.firstName'}} {{faker 'name.lastName'}}\",\n        \"email\": \"{{faker 'internet.email'}}\",\n        \"email_verified_at\": \"{{faker 'date.past'}}\",\n        \"remember_token\": \"{{faker 'random.alphaNumeric'}}\",\n        \"whatsapp\": \"{{faker 'phone.phoneNumber'}}\",\n        \"address\": \"{{faker 'address.streetName'}}, {{faker 'address.country'}}\",\n        \"instagram\": \"@{{faker 'internet.userName'}}\",\n        \"birth_place\": \"{{faker 'address.city'}}\",\n        \"notes\": \"\",\n        \"activation_code\": \"{{faker 'random.alphaNumeric'}}\",\n        \"profession_id\": \"\",\n        \"birth_date\": \"{{faker 'date.past'}}\",\n        \"coin\": \"{{faker 'random.number' 1000}}\",\n        \"hold_coin\": \"{{faker 'random.number' 1000}}\",\n        \"expired_at\": \"{{faker 'date.past'}}\",\n        \"photo\": \"{{faker 'image.imageUrl'}}\",\n        \"agreed_at\": \"{{faker 'date.past'}}\",\n        \"city\": \"{{faker 'address.city'}}\",\n        \"phone\": \"{{faker 'phone.phoneNumber'}}\",\n        \"original_photo\": \"{{faker 'image.avatar'}}\",\n        \"telegram_id\": \"{{faker 'internet.userName'}}\",\n        \"prev_request\": \"\",\n        \"telegram_authorized\": \"\"\n      }\n    }\n}",
                                "latency": 0,
                                "statusCode": 200,
                                "label": "",
                                "headers": [
                                    {
                                        "key": "Content-Type",
                                        "value": "application/json"
                                    }
                                ],
                                "filePath": "",
                                "sendFileAsBody": false,
                                "rules": [
                                    {
                                        "target": "body",
                                        "modifier": "route",
                                        "value": "string",
                                        "isRegex": false
                                    },
                                    {
                                        "target": "body",
                                        "modifier": "created_by",
                                        "value": "int",
                                        "isRegex": false
                                    },
                                    {
                                        "target": "body",
                                        "modifier": "started_at",
                                        "value": "string",
                                        "isRegex": false
                                    },
                                    {
                                        "target": "body",
                                        "modifier": "expired_at",
                                        "value": "string",
                                        "isRegex": false
                                    }
                                ],
                                "rulesOperator": "AND",
                                "disableTemplating": false
                            },
                            {
                                "uuid": "",
                                "body": "{\n  \"success\": false,\n  \"errors\": [\n      {\n        \"type\": \"validation\",\n        \"source\": \"input parameter\",\n        \"message\": \"Parameter tidak sesuai\"\n      },\n      {\n        \"type\": \"server\",\n        \"source\": \"slider\",\n        \"message\": \"Gagal membuat slider\"\n      }\n    ]\n}",
                                "latency": 0,
                                "statusCode": 400,
                                "label": "",
                                "headers": [
                                    {
                                        "key": "",
                                        "value": ""
                                    }
                                ],
                                "filePath": "",
                                "sendFileAsBody": false,
                                "rules": [],
                                "rulesOperator": "OR",
                                "disableTemplating": false
                            }
                        ],
                        "enabled": true
                    },
                    {
                        "uuid": "",
                        "documentation": "Create new resource for media",
                        "method": "put",
                        "endpoint": "upload",
                        "responses": [
                            {
                                "uuid": "",
                                "body": "{\n  \"success\": true,\n  \"data\": {\n      \"id\": \"{{body 'id'}}\",\n      \"created_at\": \"{{faker 'date.past'}}\",\n      \"updated_at\": \"{{faker 'date.recent' 0}}\",\n      \"deleted_at\": \"\",\n      \"image\": \"{{body 'image'}}\",\n      \"route\": \"{{faker 'lorem.word'}}.{{faker 'lorem.word'}}\",\n      \"clicked\": \"{{faker 'random.number' 1000}}\",\n      \"started_at\": \"{{faker 'date.past'}}\",\n      \"expired_at\": \"{{faker 'date.past'}}\",\n      \"user\": {\n        \"id\": \"{{ faker 'random.number' 500}}\",\n        \"created_at\": \"{{faker 'date.past'}}\",\n        \"updated_at\": \"{{faker 'date.past'}}\",\n        \"deleted_at\": \"\",\n        \"name\": \"{{faker 'name.firstName'}} {{faker 'name.lastName'}}\",\n        \"email\": \"{{faker 'internet.email'}}\",\n        \"email_verified_at\": \"{{faker 'date.past'}}\",\n        \"remember_token\": \"{{faker 'random.alphaNumeric'}}\",\n        \"whatsapp\": \"{{faker 'phone.phoneNumber'}}\",\n        \"address\": \"{{faker 'address.streetName'}}, {{faker 'address.country'}}\",\n        \"instagram\": \"@{{faker 'internet.userName'}}\",\n        \"birth_place\": \"{{faker 'address.city'}}\",\n        \"notes\": \"\",\n        \"activation_code\": \"{{faker 'random.alphaNumeric'}}\",\n        \"profession_id\": \"\",\n        \"birth_date\": \"{{faker 'date.past'}}\",\n        \"coin\": \"{{faker 'random.number' 1000}}\",\n        \"hold_coin\": \"{{faker 'random.number' 1000}}\",\n        \"expired_at\": \"{{faker 'date.past'}}\",\n        \"photo\": \"{{faker 'image.imageUrl'}}\",\n        \"agreed_at\": \"{{faker 'date.past'}}\",\n        \"city\": \"{{faker 'address.city'}}\",\n        \"phone\": \"{{faker 'phone.phoneNumber'}}\",\n        \"original_photo\": \"{{faker 'image.avatar'}}\",\n        \"telegram_id\": \"{{faker 'internet.userName'}}\",\n        \"prev_request\": \"\",\n        \"telegram_authorized\": \"\"\n      }\n    }\n}",
                                "latency": 0,
                                "statusCode": 200,
                                "label": "",
                                "headers": [
                                    {
                                        "key": "Accept",
                                        "value": "application/x-www-form-urlencoded"
                                    }
                                ],
                                "filePath": "",
                                "sendFileAsBody": false,
                                "rules": [
                                    {
                                        "target": "body",
                                        "modifier": "image",
                                        "value": "string",
                                        "isRegex": false
                                    },
                                    {
                                        "target": "body",
                                        "modifier": "id",
                                        "value": "int",
                                        "isRegex": false
                                    }
                                ],
                                "rulesOperator": "AND",
                                "disableTemplating": false
                            },
                            {
                                "uuid": "",
                                "body": "{\n  \"success\": false,\n  \"errors\": [\n      {\n        \"type\": \"validation\",\n        \"source\": \"file\",\n        \"message\": \"Format file tidak sesuai\"\n      },\n      {\n        \"type\": \"validation\",\n        \"source\": \"file\",\n        \"message\": \"Ukuran file terlalu besar\"\n      },\n      {\n        \"type\": \"server\",\n        \"source\": \"slider\",\n        \"message\": \"Gagal mengunggah file\"\n      }\n    ]\n}",
                                "latency": 0,
                                "statusCode": 400,
                                "label": "",
                                "headers": [
                                    {
                                        "key": "",
                                        "value": ""
                                    }
                                ],
                                "filePath": "",
                                "sendFileAsBody": false,
                                "rules": [],
                                "rulesOperator": "OR",
                                "disableTemplating": false
                            }
                        ],
                        "enabled": true
                    },
                    {
                        "uuid": "",
                        "documentation": "Update the resource using json request",
                        "method": "put",
                        "endpoint": "",
                        "responses": [
                            {
                                "uuid": "",
                                "body": "{\n  \"success\": true,\n  \"data\": {\n      \"id\": \"{{body 'id'}}\",\n      \"created_at\": \"{{faker 'date.past'}}\",\n      \"updated_at\": \"{{faker 'date.recent' 0}}\",\n      \"deleted_at\": \"\",\n      \"image\": \"{{faker 'system.fileName'}}\".\"{{faker 'system.commonFileExt'}}\",\n      \"route\": {{#if (body 'route') }} \"{{body 'route'}}\" {{^}} \"{{faker 'lorem.word'}}.{{faker 'lorem.word'}}\" {{/if}},\n      \"clicked\": \"{{faker 'random.number' 1000}}\",\n      \"started_at\": {{#if (body 'started_at') }} \"{{body 'started_at'}}\" {{^}} \"{{faker 'time.past'}}\" {{/if}},\n      \"expired_at\": {{#if (body 'expired_at') }} \"{{body 'expired_at'}}\" {{^}} \"{{faker 'time.past'}}\" {{/if}},\n      \"user\": {\n        \"id\": \"{{ faker 'random' 500}}\",\n        \"created_at\": \"{{faker 'date.past'}}\",\n        \"updated_at\": \"{{faker 'date.past'}}\",\n        \"deleted_at\": \"\",\n        \"name\": \"{{faker 'name.firstName'}} {{faker 'name.lastName'}}\",\n        \"email\": \"{{faker 'internet.email'}}\",\n        \"email_verified_at\": \"{{faker 'date.past'}}\",\n        \"remember_token\": \"{{faker 'random.alphaNumeric'}}\",\n        \"whatsapp\": \"{{faker 'phone.phoneNumber'}}\",\n        \"address\": \"{{faker 'address.streetName'}}, {{faker 'address.country'}}\",\n        \"instagram\": \"@{{faker 'internet.userName'}}\",\n        \"birth_place\": \"{{faker 'address.city'}}\",\n        \"notes\": \"\",\n        \"activation_code\": \"{{faker 'random.alphaNumeric'}}\",\n        \"profession_id\": \"\",\n        \"birth_date\": \"{{faker 'date.past'}}\",\n        \"coin\": \"{{faker 'random.number' 1000}}\",\n        \"hold_coin\": \"{{faker 'random.number' 1000}}\",\n        \"expired_at\": \"{{faker 'date.past'}}\",\n        \"photo\": \"{{faker 'image.imageUrl'}}\",\n        \"agreed_at\": \"{{faker 'date.past'}}\",\n        \"city\": \"{{faker 'address.city'}}\",\n        \"phone\": \"{{faker 'phone.phoneNumber'}}\",\n        \"original_photo\": \"{{faker 'image.avatar'}}\",\n        \"telegram_id\": \"{{faker 'internet.userName'}}\",\n        \"prev_request\": \"\",\n        \"telegram_authorized\": \"\"\n      }\n    }\n}",
                                "latency": 0,
                                "statusCode": 200,
                                "label": "",
                                "headers": [
                                    {
                                        "key": "Content-Type",
                                        "value": "application/json"
                                    }
                                ],
                                "filePath": "",
                                "sendFileAsBody": false,
                                "rules": [
                                    {
                                        "target": "body",
                                        "modifier": "id",
                                        "value": "int",
                                        "isRegex": false
                                    },
                                    {
                                        "target": "body",
                                        "modifier": "started_at",
                                        "value": "string",
                                        "isRegex": false
                                    },
                                    {
                                        "target": "body",
                                        "modifier": "expired_at",
                                        "value": "string",
                                        "isRegex": false
                                    },
                                    {
                                        "target": "body",
                                        "modifier": "route",
                                        "value": "string",
                                        "isRegex": false
                                    }
                                ],
                                "rulesOperator": "AND",
                                "disableTemplating": false
                            },
                            {
                                "uuid": "",
                                "body": "{\n  \"success\": false,\n  \"errors\": [\n      {\n        \"type\": \"validation\",\n        \"source\": \"input parameter\",\n        \"message\": \"Parameter tidak sesuai\"\n      },\n      {\n        \"type\": \"server\",\n        \"source\": \"slider\",\n        \"message\": \"Gagal memperbarui data slider\"\n      }\n    ]\n}",
                                "latency": 0,
                                "statusCode": 400,
                                "label": "",
                                "headers": [
                                    {
                                        "key": "",
                                        "value": ""
                                    }
                                ],
                                "filePath": "",
                                "sendFileAsBody": false,
                                "rules": [],
                                "rulesOperator": "OR",
                                "disableTemplating": false
                            }
                        ],
                        "enabled": true
                    },
                    {
                        "uuid": "",
                        "documentation": "Delete the resource using json request",
                        "method": "delete",
                        "endpoint": "",
                        "responses": [
                            {
                                "uuid": "",
                                "body": "{\n  \"success\": true,\n  \"data\": {\n    \"id\": \"{{urlParam 'id'}}\"\n  }\n}",
                                "latency": 0,
                                "statusCode": 200,
                                "label": "",
                                "headers": [
                                    {
                                        "key": "",
                                        "value": ""
                                    }
                                ],
                                "filePath": "",
                                "sendFileAsBody": false,
                                "rules": [
                                    {
                                        "target": "params",
                                        "modifier": "id",
                                        "value": "int",
                                        "isRegex": false
                                    }
                                ],
                                "rulesOperator": "OR",
                                "disableTemplating": false
                            },
                            {
                                "uuid": "",
                                "body": "{\n  \"success\": false,\n  \"errors\": [\n      {\n        \"type\": \"service\",\n        \"source\": \"slider service\",\n        \"message\": \"Servis tidak dapat mengolah permintaan\"\n      },\n      {\n        \"type\": \"server\",\n        \"source\": \"slider\",\n        \"message\": \"Data tidak dapat dihapus\"\n      }\n    ]\n}",
                                "latency": 0,
                                "statusCode": 400,
                                "label": "",
                                "headers": [
                                    {
                                        "key": "",
                                        "value": ""
                                    }
                                ],
                                "filePath": "",
                                "sendFileAsBody": false,
                                "rules": [],
                                "rulesOperator": "OR",
                                "disableTemplating": false
                            }
                        ],
                        "enabled": true
                    }
                ],
                "proxyMode": false,
                "proxyHost": "",
                "https": false,
                "cors": true,
                "headers": [
                    {
                        "key": "Content-Type",
                        "value": "application/json"
                    }
                ],
                "proxyReqHeaders": [
                    {
                        "key": "",
                        "value": ""
                    }
                ],
                "proxyResHeaders": [
                    {
                        "key": "",
                        "value": ""
                    }
                ]
            }
        }
    ]
}
