{
    "source": "mockoon:1.10.0",
    "data": [
        {
            "type": "environment",
            "item": {
                "uuid": "",
                "lastMigration": 12,
                "name": "2. CoinPromo Micro-Service",
                "endpointPrefix": "api/v1/coin-promo",
                "latency": 0,
                "port": 3001,
                "routes": [
                    {
                        "uuid": "",
                        "documentation": "Get all coin-promo resource",
                        "method": "get",
                        "endpoint": "",
                        "responses": [
                            {
                                "uuid": "",
                                "body": "{\n  \"success\": true,\n  \"pages\": {\n    \"total\": \"{{faker 'random.number'}}\",\n    \"per_page\": \"{{ queryParam 'per_page' }}\",\n    \"current_page\": \"{{ queryParam 'page'}}\",\n    \"last_page\": \"{{faker 'random.number'}}\",\n    \"first_page_url\": \"http://localhost:3001/api/v1/ticket-support/coin-promo?page=1\",\n    \"last_page_url\": \"http://localhost:3001/api/v1/ticket-support/coin-promo?page={{faker 'random.number'}}\",\n    \"next_page_url\": \"http://localhost:3001/api/v1/ticket-support/coin-promo?page={{faker 'random.number'}}\",\n    \"prev_page_url\": \"http://localhost:3001/api/v1/ticket-support/coin-promo?page={{faker 'random.number'}}\",\n    \"path\": \"http://localhost:3001/api/v1/ticket-support/coin-promo\",\n    \"from\": \"{{faker 'random.number'}}\",\n    \"to\": \"{{faker 'random.number'}}\"\n    },\n    \"data\": [\n      {{#repeat (queryParam 'per_page') }}\n      {\n        \"id\": {{#if (queryParam 'code') }} \"{{faker 'random.number'}}\" {{^}} \"{{@index}}\" {{/if}},\n        \"created_at\": \"{{faker 'date.past'}}\",\n        \"updated_at\": \"{{faker 'date.past'}}\",\n        \"deleted_at\": \"\",\n        \"code\": {{#if (queryParam 'code') }} \"{{ queryParam 'code' }}\" {{^}} \"{{faker 'random.alphaNumeric' 10}}\" {{/if}},\n        \"nominal\": \"{{faker 'random.number' 1000000}}\",\n        \"price\": \"{{faker 'random.number' 1000000}}\",\n        \"description\": \"{{faker 'lorem.paragraph'}}\",\n        \"period_hour\": \"{{faker 'random.number' 10}}\",\n        \"period_day\": \"{{faker 'random.number' 10}}\",\n        \"period_week\": \"{{faker 'random.number' 10}}\",\n        \"period_month\": \"{{faker 'random.number' 10}}\",\n        \"period_year\": \"{{faker 'random.number' 2}}\",\n        \"expired_at\": \"{{faker 'date.past'}}\",\n        \"thumbnail\": \"{{faker 'image.image'}}\",\n        \"actual_price\": \"{{faker 'random.number' 1000000}}\",\n        \"is_private\": \"{{faker 'random.boolean'}}\",\n        \"addition\": \"{{faker 'random.number' 500}}\"\n      }\n      {{/repeat}}\n    ]\n}\n}",
                                "latency": 0,
                                "statusCode": 200,
                                "label": "",
                                "headers": [
                                    {
                                        "key": "",
                                        "value": ""
                                    }
                                ],
                                "filePath": "",
                                "sendFileAsBody": false,
                                "rules": [
                                    {
                                        "target": "query",
                                        "modifier": "code",
                                        "value": "string",
                                        "isRegex": false
                                    },
                                    {
                                        "target": "query",
                                        "modifier": "page",
                                        "value": "int",
                                        "isRegex": false
                                    },
                                    {
                                        "target": "query",
                                        "modifier": "per_page",
                                        "value": "int",
                                        "isRegex": false
                                    }
                                ],
                                "rulesOperator": "OR",
                                "disableTemplating": false
                            },
                            {
                                "uuid": "",
                                "body": "{\n  \"success\": false,\n  \"errors\": [\n      {\n        \"type\": \"service\",\n        \"source\": \"coin-promo service\",\n        \"message\": \"Servis tidak dapat mengolah permintaan\"\n      },\n      {\n        \"type\": \"service\",\n        \"source\": \"parameter\",\n        \"message\": \"Parameter tidak ditemukan\"\n      }\n    ]\n}",
                                "latency": 0,
                                "statusCode": 400,
                                "label": "",
                                "headers": [
                                    {
                                        "key": "",
                                        "value": ""
                                    }
                                ],
                                "filePath": "",
                                "sendFileAsBody": false,
                                "rules": [],
                                "rulesOperator": "OR",
                                "disableTemplating": false
                            }
                        ],
                        "enabled": true
                    },
                    {
                        "uuid": "",
                        "documentation": "Get one coin-promo resource",
                        "method": "get",
                        "endpoint": "show",
                        "responses": [
                            {
                                "uuid": "",
                                "body": "{\n  \"success\": true,\n  \"data\": {\n      \"id\": \"{{urlParam 'id'}}\",\n      \"created_at\": \"{{faker 'date.past'}}\",\n      \"updated_at\": \"{{faker 'date.past'}}\",\n      \"deleted_at\": \"\",\n      \"code\": \"{{faker 'random.alphaNumeric' 10}}\",\n      \"nominal\": \"{{faker 'random.number' 1000000}}\",\n      \"price\": \"{{faker 'random.number' 1000000}}\",\n      \"description\": \"{{faker 'lorem.paragraph'}}\",\n      \"period_hour\": \"{{faker 'random.number' 10}}\",\n      \"period_day\": \"{{faker 'random.number' 10}}\",\n      \"period_week\": \"{{faker 'random.number' 10}}\",\n      \"period_month\": \"{{faker 'random.number' 10}}\",\n      \"period_year\": \"{{faker 'random.number' 2}}\",\n      \"expired_at\": \"{{faker 'date.past'}}\",\n      \"thumbnail\": \"{{faker 'image.image'}}\",\n      \"actual_price\": \"{{faker 'random.number' 1000000}}\",\n      \"is_private\": \"{{faker 'random.boolean'}}\",\n      \"addition\": \"{{faker 'random.number' 500}}\"\n    }\n}",
                                "latency": 0,
                                "statusCode": 200,
                                "label": "",
                                "headers": [
                                    {
                                        "key": "Content-Type",
                                        "value": "application/json"
                                    }
                                ],
                                "filePath": "",
                                "sendFileAsBody": false,
                                "rules": [
                                    {
                                        "target": "params",
                                        "modifier": "id",
                                        "value": "int",
                                        "isRegex": false
                                    }
                                ],
                                "rulesOperator": "OR",
                                "disableTemplating": false
                            },
                            {
                                "uuid": "",
                                "body": "",
                                "latency": 0,
                                "statusCode": 400,
                                "label": "",
                                "headers": [
                                    {
                                        "key": "",
                                        "value": ""
                                    }
                                ],
                                "filePath": "",
                                "sendFileAsBody": false,
                                "rules": [],
                                "rulesOperator": "OR",
                                "disableTemplating": false
                            }
                        ],
                        "enabled": true
                    },
                    {
                        "uuid": "",
                        "documentation": "Create new resource for coin-promo",
                        "method": "post",
                        "endpoint": "",
                        "responses": [
                            {
                                "uuid": "",
                                "body": "{\n  \"success\": true,\n  \"data\": {\n      \"id\": \"{{faker 'random.number' 500}}\",\n      \"created_at\": \"{{faker 'date.recent' 0}}\",\n      \"updated_at\": \"{{faker 'date.recent' 0}}\",\n      \"deleted_at\": \"\",\n      \"code\": \"{{body 'code'}}\",\n      \"nominal\": \"{{body 'nominal'}}\",\n      \"price\": \"{{body 'price'}}\",\n      \"description\": \"{{body 'descripion'}}\",\n      \"period_hour\": \"{{body 'period_hour'}}\",\n      \"period_day\": \"{{body 'period_day'}}\",\n      \"period_week\": \"{{body 'period_week'}}\",\n      \"period_month\": \"{{body 'period_month'}}\",\n      \"period_year\": \"{{body 'period_year'}}\",\n      \"expired_at\": \"{{faker 'date.past'}}\",\n      \"thumbnail\": \"\",\n      \"actual_price\": \"{{body 'actual_price'}}\",\n      \"is_private\": \"{{body 'is_private'}}\",\n      \"addition\": \"{{body 'addition'}}\"\n    },\n}",
                                "latency": 0,
                                "statusCode": 200,
                                "label": "",
                                "headers": [
                                    {
                                        "key": "Content-Type",
                                        "value": "application/json"
                                    }
                                ],
                                "filePath": "",
                                "sendFileAsBody": false,
                                "rules": [
                                    {
                                        "target": "body",
                                        "modifier": "code",
                                        "value": "string",
                                        "isRegex": false
                                    },
                                    {
                                        "target": "body",
                                        "modifier": "nominal",
                                        "value": "string",
                                        "isRegex": false
                                    },
                                    {
                                        "target": "body",
                                        "modifier": "price",
                                        "value": "string",
                                        "isRegex": false
                                    },
                                    {
                                        "target": "body",
                                        "modifier": "description",
                                        "value": "string",
                                        "isRegex": false
                                    },
                                    {
                                        "target": "body",
                                        "modifier": "period_hour",
                                        "value": "sring",
                                        "isRegex": false
                                    },
                                    {
                                        "target": "body",
                                        "modifier": "period_day",
                                        "value": "string",
                                        "isRegex": false
                                    },
                                    {
                                        "target": "body",
                                        "modifier": "period_week",
                                        "value": "string",
                                        "isRegex": false
                                    },
                                    {
                                        "target": "body",
                                        "modifier": "period_month",
                                        "value": "string",
                                        "isRegex": false
                                    },
                                    {
                                        "target": "body",
                                        "modifier": "period_year",
                                        "value": "string",
                                        "isRegex": false
                                    },
                                    {
                                        "target": "body",
                                        "modifier": "actual_price",
                                        "value": "string",
                                        "isRegex": false
                                    },
                                    {
                                        "target": "body",
                                        "modifier": "addition",
                                        "value": "string",
                                        "isRegex": false
                                    },
                                    {
                                        "target": "body",
                                        "modifier": "is_private",
                                        "value": "bool",
                                        "isRegex": false
                                    },
                                    {
                                        "target": "body",
                                        "modifier": "expired_at",
                                        "value": "string",
                                        "isRegex": false
                                    }
                                ],
                                "rulesOperator": "AND",
                                "disableTemplating": false
                            },
                            {
                                "uuid": "",
                                "body": "{\n  \"success\": false,\n  \"errors\": [\n      {\n        \"type\": \"validation\",\n        \"source\": \"input parameter\",\n        \"message\": \"Parameter tidak sesuai\"\n      },\n      {\n        \"type\": \"server\",\n        \"source\": \"coin-promo\",\n        \"message\": \"Gagal membuat promo coin\"\n      }\n    ]\n}",
                                "latency": 0,
                                "statusCode": 400,
                                "label": "",
                                "headers": [
                                    {
                                        "key": "",
                                        "value": ""
                                    }
                                ],
                                "filePath": "",
                                "sendFileAsBody": false,
                                "rules": [],
                                "rulesOperator": "OR",
                                "disableTemplating": false
                            }
                        ],
                        "enabled": true
                    },
                    {
                        "uuid": "",
                        "documentation": "Get one coin-promo resource",
                        "method": "put",
                        "endpoint": "upload",
                        "responses": [
                            {
                                "uuid": "",
                                "body": "{\n  \"success\": true,\n  \"data\": {\n      \"id\": \"{{body 'id'}}\",\n      \"created_at\": \"{{faker 'date.past'}}\",\n      \"updated_at\": \"{{faker 'date.recent' 0}}\",\n      \"deleted_at\": \"\",\n      \"code\": \"{{faker 'random.alphaNumeric' 10}}\",\n      \"nominal\": \"{{faker 'random.number' 1000000}}\",\n      \"price\": \"{{faker 'random.number' 1000000}}\",\n      \"description\": \"{{faker 'lorem.paragraph'}}\",\n      \"period_hour\": \"{{faker 'random.number' 10}}\",\n      \"period_day\": \"{{faker 'random.number' 10}}\",\n      \"period_week\": \"{{faker 'random.number' 10}}\",\n      \"period_month\": \"{{faker 'random.number' 10}}\",\n      \"period_year\": \"{{faker 'random.number' 2}}\",\n      \"expired_at\": \"{{faker 'date.past'}}\",\n      \"thumbnail\": \"{{body 'image'}}\",\n      \"actual_price\": \"{{faker 'random.number' 1000000}}\",\n      \"is_private\": \"{{faker 'random.boolean'}}\",\n      \"addition\": \"{{faker 'random.number' 500}}\"\n    }\n}",
                                "latency": 0,
                                "statusCode": 200,
                                "label": "",
                                "headers": [
                                    {
                                        "key": "Accept",
                                        "value": "application/x-www-form-urlencoded"
                                    }
                                ],
                                "filePath": "",
                                "sendFileAsBody": false,
                                "rules": [
                                    {
                                        "target": "body",
                                        "modifier": "image",
                                        "value": "string",
                                        "isRegex": false
                                    },
                                    {
                                        "target": "body",
                                        "modifier": "id",
                                        "value": "int",
                                        "isRegex": false
                                    }
                                ],
                                "rulesOperator": "OR",
                                "disableTemplating": false
                            },
                            {
                                "uuid": "",
                                "body": "{\n  \"success\": false,\n  \"errors\": [\n      {\n        \"type\": \"validation\",\n        \"source\": \"file\",\n        \"message\": \"Format file tidak sesuai\"\n      },\n      {\n        \"type\": \"validation\",\n        \"source\": \"file\",\n        \"message\": \"Ukuran file terlalu besar\"\n      },\n      {\n        \"type\": \"server\",\n        \"source\": \"coin-promo\",\n        \"message\": \"Gagal mengunggah file\"\n      }\n    ]\n}",
                                "latency": 0,
                                "statusCode": 400,
                                "label": "",
                                "headers": [
                                    {
                                        "key": "",
                                        "value": ""
                                    }
                                ],
                                "filePath": "",
                                "sendFileAsBody": false,
                                "rules": [],
                                "rulesOperator": "OR",
                                "disableTemplating": false
                            }
                        ],
                        "enabled": true
                    },
                    {
                        "uuid": "",
                        "documentation": "Update the resource using json request",
                        "method": "put",
                        "endpoint": "",
                        "responses": [
                            {
                                "uuid": "",
                                "body": "{\n  \"success\": true,\n  \"data\": {\n      \"id\": \"{{body 'id'}}\",\n      \"created_at\": \"{{faker 'date.past'}}\",\n      \"updated_at\": \"{{faker 'date.revent' 0}}\",\n      \"deleted_at\": \"\",\n      \"code\": {{#if (body 'code') }} \"{{body 'code'}}\" {{^}} \"{{faker 'random.alphaNumeric' 10}}\" {{/if}},\n      \"nominal\": {{#if (body 'nominal') }} \"{{body 'nominal'}}\" {{^}} \"{{faker 'random.number' 1000000}}\" {{/if}},\n      \"price\": {{#if (body 'price') }} \"{{body 'price'}}\" {{^}} \"{{faker 'random.number' 1000000}}\" {{/if}},\n      \"description\": {{#if (body 'description') }} \"{{body 'description'}}\" {{^}} \"{{faker 'lorem.paragraph'}}\" {{/if}},\n      \"period_hour\": {{#if (body 'period_hour') }} \"{{body 'period_hour'}}\" {{^}} \"{{faker 'random.number' 10}}\" {{/if}},\n      \"period_day\": {{#if (body 'period_day') }} \"{{body 'period_day'}}\" {{^}} \"{{faker 'random.number' 10}}\" {{/if}},\n      \"period_week\": {{#if (body 'period_week') }} \"{{body 'period_week'}}\" {{^}} \"{{faker 'random.number' 10}}\" {{/if}},\n      \"period_month\": {{#if (body 'period_month') }} \"{{body 'period_month'}}\" {{^}} \"{{faker 'random.number' 10}}\" {{/if}},\n      \"period_year\": {{#if (body 'period_year') }} \"{{body 'period_year'}}\" {{^}} \"{{faker 'random.number' 2}}\" {{/if}},\n      \"expired_at\": \"{{faker 'date.past'}}\",\n      \"thumbnail\": \"{{faker 'image.image'}}\",\n      \"actual_price\": {{#if (body 'actual_price') }} \"{{body 'actual_price'}}\" {{^}} \"{{faker 'random.number' 1000000}}\" {{/if}},\n      \"is_private\": {{#if (body 'is_private') }} \"{{body 'is_private'}}\" {{^}} \"{{faker 'random.boolean'}}\" {{/if}},\n      \"addition\": {{#if (body 'addition') }} \"{{body 'addition'}}\" {{^}} \"{{faker 'random.number' 500}}\" {{/if}}\n    },\n}",
                                "latency": 0,
                                "statusCode": 200,
                                "label": "",
                                "headers": [
                                    {
                                        "key": "Content-Type",
                                        "value": "application/json"
                                    }
                                ],
                                "filePath": "",
                                "sendFileAsBody": false,
                                "rules": [
                                    {
                                        "target": "body",
                                        "modifier": "code",
                                        "value": "string",
                                        "isRegex": false
                                    },
                                    {
                                        "target": "body",
                                        "modifier": "nominal",
                                        "value": "string",
                                        "isRegex": false
                                    },
                                    {
                                        "target": "body",
                                        "modifier": "price",
                                        "value": "string",
                                        "isRegex": false
                                    },
                                    {
                                        "target": "body",
                                        "modifier": "description",
                                        "value": "string",
                                        "isRegex": false
                                    },
                                    {
                                        "target": "body",
                                        "modifier": "period_hour",
                                        "value": "sring",
                                        "isRegex": false
                                    },
                                    {
                                        "target": "body",
                                        "modifier": "period_day",
                                        "value": "string",
                                        "isRegex": false
                                    },
                                    {
                                        "target": "body",
                                        "modifier": "period_week",
                                        "value": "string",
                                        "isRegex": false
                                    },
                                    {
                                        "target": "body",
                                        "modifier": "period_month",
                                        "value": "string",
                                        "isRegex": false
                                    },
                                    {
                                        "target": "body",
                                        "modifier": "period_year",
                                        "value": "string",
                                        "isRegex": false
                                    },
                                    {
                                        "target": "body",
                                        "modifier": "actual_price",
                                        "value": "string",
                                        "isRegex": false
                                    },
                                    {
                                        "target": "body",
                                        "modifier": "addition",
                                        "value": "string",
                                        "isRegex": false
                                    },
                                    {
                                        "target": "body",
                                        "modifier": "is_private",
                                        "value": "bool",
                                        "isRegex": false
                                    },
                                    {
                                        "target": "body",
                                        "modifier": "expired_at",
                                        "value": "string",
                                        "isRegex": false
                                    },
                                    {
                                        "target": "body",
                                        "modifier": "id",
                                        "value": "int",
                                        "isRegex": false
                                    }
                                ],
                                "rulesOperator": "AND",
                                "disableTemplating": false
                            },
                            {
                                "uuid": "",
                                "body": "{\n  \"success\": false,\n  \"errors\": [\n      {\n        \"type\": \"validation\",\n        \"source\": \"input parameter\",\n        \"message\": \"Parameter tidak sesuai\"\n      },\n      {\n        \"type\": \"server\",\n        \"source\": \"coin-promo\",\n        \"message\": \"Gagal memperbarui data promo koin\"\n      }\n    ]\n}",
                                "latency": 0,
                                "statusCode": 400,
                                "label": "",
                                "headers": [
                                    {
                                        "key": "",
                                        "value": ""
                                    }
                                ],
                                "filePath": "",
                                "sendFileAsBody": false,
                                "rules": [],
                                "rulesOperator": "OR",
                                "disableTemplating": false
                            }
                        ],
                        "enabled": true
                    },
                    {
                        "uuid": "",
                        "documentation": "Delete the resource using json request",
                        "method": "delete",
                        "endpoint": "",
                        "responses": [
                            {
                                "uuid": "",
                                "body": "{\n  \"success\": true,\n  \"data\": {\n    \"id\": \"{{urlParam 'id'}}\"\n  }\n}",
                                "latency": 0,
                                "statusCode": 200,
                                "label": "",
                                "headers": [
                                    {
                                        "key": "",
                                        "value": ""
                                    }
                                ],
                                "filePath": "",
                                "sendFileAsBody": false,
                                "rules": [
                                    {
                                        "target": "params",
                                        "modifier": "id",
                                        "value": "int",
                                        "isRegex": false
                                    }
                                ],
                                "rulesOperator": "OR",
                                "disableTemplating": false
                            },
                            {
                                "uuid": "",
                                "body": "{\n  \"success\": false,\n  \"errors\": [\n      {\n        \"type\": \"service\",\n        \"source\": \"coin-promo service\",\n        \"message\": \"Servis tidak dapat mengolah permintaan\"\n      },\n      {\n        \"type\": \"server\",\n        \"source\": \"coin-promo\",\n        \"message\": \"Data tidak dapat dihapus\"\n      }\n    ]\n}",
                                "latency": 0,
                                "statusCode": 400,
                                "label": "",
                                "headers": [
                                    {
                                        "key": "",
                                        "value": ""
                                    }
                                ],
                                "filePath": "",
                                "sendFileAsBody": false,
                                "rules": [],
                                "rulesOperator": "OR",
                                "disableTemplating": false
                            }
                        ],
                        "enabled": true
                    }
                ],
                "proxyMode": false,
                "proxyHost": "",
                "https": false,
                "cors": true,
                "headers": [
                    {
                        "key": "Content-Type",
                        "value": "application/json"
                    }
                ],
                "proxyReqHeaders": [
                    {
                        "key": "",
                        "value": ""
                    }
                ],
                "proxyResHeaders": [
                    {
                        "key": "",
                        "value": ""
                    }
                ]
            }
        }
    ]
}
