EVENT:   Log link established.
EVENT:   Communications link established.
MESSAGE: Ready for command input.
EVENT:   Verbose Logging Disabled
EVENT:   Logging Enabled
EVENT:   AutoExclusion Enabled
MESSAGE: Monitoring Assemblies: OpenAirLibrary;
MESSAGE: Excluding Types and Methods with these Attributes: CoverageExcludeAttribute;System.Diagnostics.CodeAnalysis.ExcludeFromCodeCoverageAttribute;System.Runtime.CompilerServices.CompilerGeneratedAttribute;
MESSAGE: Received driver ready event.
MESSAGE: v4.0.30319
EVENT:   Profiler Initialize
MESSAGE: AssemblyLoadStarted ---- Assembly: 0x004887c8; 0x00000001
MESSAGE:   ModuleLoadStarted ---- Module: 0x5ace1000; 0x00000001
MESSAGE:   Failed to load symbols for module [C:\Windows\Microsoft.Net\assembly\GAC_32\mscorlib\v4.0_4.0.0.0__b77a5c561934e089\mscorlib.dll] in [C:\Windows\Microsoft.Net\assembly\GAC_32\mscorlib\v4.0_4.0.0.0__b77a5c561934e089].
MESSAGE:   ModuleLoadFinished ---- Module[C:\Windows\Microsoft.Net\assembly\GAC_32\mscorlib\v4.0_4.0.0.0__b77a5c561934e089\mscorlib.dll]: 0x5ace1000; 0x00000001
DUMP:    Module; NcModuleId: 0x00000001; PrfModuleId: 0x5ace1000; ModuleName: 'C:\Windows\Microsoft.Net\assembly\GAC_32\mscorlib\v4.0_4.0.0.0__b77a5c561934e089\mscorlib.dll'; Loaded: 1; AssemblyID: 0x00000000
MESSAGE:   ModuleAttachedToAssembly ---- Module[C:\Windows\Microsoft.Net\assembly\GAC_32\mscorlib\v4.0_4.0.0.0__b77a5c561934e089\mscorlib.dll]: 0x5ace1000; 0x00000001 attached To Assembly[]: 0x004887c8; 0x00000001
MESSAGE:   Assembly Identity [mscorlib, Version=4.0.0.0, Culture=neutral, PublicKeyToken=b77a5c561934e089, processorArchitecture=x86].
EVENT:     Loaded Unmonitored Assembly [mscorlib][0x004887c8]
MESSAGE: AssemblyLoadFinished ---- Assembly[mscorlib]: 0x004887c8; 0x00000001
DUMP:    Assembly; NcAssemblyID: 0x00000001; PrfAssemblyID: 0x004887c8; AssemblyName: 'mscorlib'; Loaded: 1; AssemblyIdentity: 'mscorlib, Version=4.0.0.0, Culture=neutral, PublicKeyToken=b77a5c561934e089, processorArchitecture=x86'; Instrument: 0
MESSAGE: AppDomainCreationStarted ---- AppDomain: 0x5f4ae888; 0x00000001
MESSAGE: AppDomainCreationFinished ---- AppDomain[mscorlib.dll]: 0x5f4ae888; 0x00000001
DUMP:    AppDomain; NcAppDomainId: 0x00000001; PrfAppDomainId: 0x5f4ae888; AppDomainName: 'mscorlib.dll'; Loaded: 1
MESSAGE: AppDomainCreationStarted ---- AppDomain: 0x0049b028; 0x00000002
MESSAGE: AppDomainCreationFinished ---- AppDomain[DefaultDomain]: 0x0049b028; 0x00000002
DUMP:    AppDomain; NcAppDomainId: 0x00000002; PrfAppDomainId: 0x0049b028; AppDomainName: 'DefaultDomain'; Loaded: 1
MESSAGE: AppDomainCreationStarted ---- AppDomain: 0x5f4ae4e0; 0x00000003
MESSAGE: AppDomainCreationFinished ---- AppDomain[EE Shared Assembly Repository]: 0x5f4ae4e0; 0x00000003
DUMP:    AppDomain; NcAppDomainId: 0x00000003; PrfAppDomainId: 0x5f4ae4e0; AppDomainName: 'EE Shared Assembly Repository'; Loaded: 1
MESSAGE: AssemblyLoadStarted ---- Assembly: 0x004d1c90; 0x00000002
MESSAGE:   ModuleLoadStarted ---- Module: 0x00282eac; 0x00000002
MESSAGE:   Failed to load symbols for module [C:\Program Files (x86)\TestDriven.NET 3\ProcessInvocation86.exe] in [C:\Program Files (x86)\TestDriven.NET 3].
MESSAGE:   ModuleLoadFinished ---- Module[C:\Program Files (x86)\TestDriven.NET 3\ProcessInvocation86.exe]: 0x00282eac; 0x00000002
DUMP:    Module; NcModuleId: 0x00000002; PrfModuleId: 0x00282eac; ModuleName: 'C:\Program Files (x86)\TestDriven.NET 3\ProcessInvocation86.exe'; Loaded: 1; AssemblyID: 0x00000000
MESSAGE:   ModuleAttachedToAssembly ---- Module[C:\Program Files (x86)\TestDriven.NET 3\ProcessInvocation86.exe]: 0x00282eac; 0x00000002 attached To Assembly[]: 0x004d1c90; 0x00000002
MESSAGE:   Assembly Identity [ProcessInvocation, Version=3.7.2842.0, Culture=neutral, PublicKeyToken=null].
EVENT:     Loaded Unmonitored Assembly [ProcessInvocation][0x004d1c90]
MESSAGE: AssemblyLoadFinished ---- Assembly[ProcessInvocation]: 0x004d1c90; 0x00000002
DUMP:    Assembly; NcAssemblyID: 0x00000002; PrfAssemblyID: 0x004d1c90; AssemblyName: 'ProcessInvocation'; Loaded: 1; AssemblyIdentity: 'ProcessInvocation, Version=3.7.2842.0, Culture=neutral, PublicKeyToken=null'; Instrument: 0
MESSAGE: AssemblyLoadStarted ---- Assembly: 0x004dc330; 0x00000003
MESSAGE:   ModuleLoadStarted ---- Module: 0x00283bbc; 0x00000003
MESSAGE:   Failed to load symbols for module [C:\Program Files (x86)\TestDriven.NET 3\TestDriven.TestRunner.Server.dll] in [C:\Program Files (x86)\TestDriven.NET 3].
MESSAGE:   ModuleLoadFinished ---- Module[C:\Program Files (x86)\TestDriven.NET 3\TestDriven.TestRunner.Server.dll]: 0x00283bbc; 0x00000003
DUMP:    Module; NcModuleId: 0x00000003; PrfModuleId: 0x00283bbc; ModuleName: 'C:\Program Files (x86)\TestDriven.NET 3\TestDriven.TestRunner.Server.dll'; Loaded: 1; AssemblyID: 0x00000000
MESSAGE:   ModuleAttachedToAssembly ---- Module[C:\Program Files (x86)\TestDriven.NET 3\TestDriven.TestRunner.Server.dll]: 0x00283bbc; 0x00000003 attached To Assembly[]: 0x004dc330; 0x00000003
MESSAGE:   Assembly Identity [TestDriven.TestRunner.Server, Version=3.7.2842.0, Culture=neutral, PublicKeyToken=50ecb853f8c6b8d2].
EVENT:     Loaded Unmonitored Assembly [TestDriven.TestRunner.Server][0x004dc330]
MESSAGE: AssemblyLoadFinished ---- Assembly[TestDriven.TestRunner.Server]: 0x004dc330; 0x00000003
DUMP:    Assembly; NcAssemblyID: 0x00000003; PrfAssemblyID: 0x004dc330; AssemblyName: 'TestDriven.TestRunner.Server'; Loaded: 1; AssemblyIdentity: 'TestDriven.TestRunner.Server, Version=3.7.2842.0, Culture=neutral, PublicKeyToken=50ecb853f8c6b8d2'; Instrument: 0
MESSAGE: AssemblyLoadStarted ---- Assembly: 0x004dc4b8; 0x00000004
MESSAGE:   ModuleLoadStarted ---- Module: 0x5a341000; 0x00000004
MESSAGE:   Failed to load symbols for module [C:\Windows\Microsoft.Net\assembly\GAC_MSIL\System\v4.0_4.0.0.0__b77a5c561934e089\System.dll] in [C:\Windows\Microsoft.Net\assembly\GAC_MSIL\System\v4.0_4.0.0.0__b77a5c561934e089].
MESSAGE:   ModuleLoadFinished ---- Module[C:\Windows\Microsoft.Net\assembly\GAC_MSIL\System\v4.0_4.0.0.0__b77a5c561934e089\System.dll]: 0x5a341000; 0x00000004
DUMP:    Module; NcModuleId: 0x00000004; PrfModuleId: 0x5a341000; ModuleName: 'C:\Windows\Microsoft.Net\assembly\GAC_MSIL\System\v4.0_4.0.0.0__b77a5c561934e089\System.dll'; Loaded: 1; AssemblyID: 0x00000000
MESSAGE:   ModuleAttachedToAssembly ---- Module[C:\Windows\Microsoft.Net\assembly\GAC_MSIL\System\v4.0_4.0.0.0__b77a5c561934e089\System.dll]: 0x5a341000; 0x00000004 attached To Assembly[]: 0x004dc4b8; 0x00000004
MESSAGE:   Assembly Identity [System, Version=4.0.0.0, Culture=neutral, PublicKeyToken=b77a5c561934e089, processorArchitecture=MSIL].
EVENT:     Loaded Unmonitored Assembly [System][0x004dc4b8]
MESSAGE: AssemblyLoadFinished ---- Assembly[System]: 0x004dc4b8; 0x00000004
DUMP:    Assembly; NcAssemblyID: 0x00000004; PrfAssemblyID: 0x004dc4b8; AssemblyName: 'System'; Loaded: 1; AssemblyIdentity: 'System, Version=4.0.0.0, Culture=neutral, PublicKeyToken=b77a5c561934e089, processorArchitecture=MSIL'; Instrument: 0
MESSAGE: AssemblyLoadStarted ---- Assembly: 0x004e90d0; 0x00000005
MESSAGE:   ModuleLoadStarted ---- Module: 0x00285228; 0x00000005
MESSAGE:   Failed to load symbols for module [C:\Program Files (x86)\TestDriven.NET 3\TestDriven.TestRunner.dll] in [C:\Program Files (x86)\TestDriven.NET 3].
MESSAGE:   ModuleLoadFinished ---- Module[C:\Program Files (x86)\TestDriven.NET 3\TestDriven.TestRunner.dll]: 0x00285228; 0x00000005
DUMP:    Module; NcModuleId: 0x00000005; PrfModuleId: 0x00285228; ModuleName: 'C:\Program Files (x86)\TestDriven.NET 3\TestDriven.TestRunner.dll'; Loaded: 1; AssemblyID: 0x00000000
MESSAGE:   ModuleAttachedToAssembly ---- Module[C:\Program Files (x86)\TestDriven.NET 3\TestDriven.TestRunner.dll]: 0x00285228; 0x00000005 attached To Assembly[]: 0x004e90d0; 0x00000005
MESSAGE:   Assembly Identity [TestDriven.TestRunner, Version=3.7.2842.0, Culture=neutral, PublicKeyToken=50ecb853f8c6b8d2].
EVENT:     Loaded Unmonitored Assembly [TestDriven.TestRunner][0x004e90d0]
MESSAGE: AssemblyLoadFinished ---- Assembly[TestDriven.TestRunner]: 0x004e90d0; 0x00000005
DUMP:    Assembly; NcAssemblyID: 0x00000005; PrfAssemblyID: 0x004e90d0; AssemblyName: 'TestDriven.TestRunner'; Loaded: 1; AssemblyIdentity: 'TestDriven.TestRunner, Version=3.7.2842.0, Culture=neutral, PublicKeyToken=50ecb853f8c6b8d2'; Instrument: 0
MESSAGE: AssemblyLoadStarted ---- Assembly: 0x005138f0; 0x00000006
MESSAGE:   ModuleLoadStarted ---- Module: 0x64051000; 0x00000006
MESSAGE:   Failed to load symbols for module [C:\Windows\Microsoft.Net\assembly\GAC_MSIL\System.Runtime.Remoting\v4.0_4.0.0.0__b77a5c561934e089\System.Runtime.Remoting.dll] in [C:\Windows\Microsoft.Net\assembly\GAC_MSIL\System.Runtime.Remoting\v4.0_4.0.0.0__b77a5c561934e089].
MESSAGE:   ModuleLoadFinished ---- Module[C:\Windows\Microsoft.Net\assembly\GAC_MSIL\System.Runtime.Remoting\v4.0_4.0.0.0__b77a5c561934e089\System.Runtime.Remoting.dll]: 0x64051000; 0x00000006
DUMP:    Module; NcModuleId: 0x00000006; PrfModuleId: 0x64051000; ModuleName: 'C:\Windows\Microsoft.Net\assembly\GAC_MSIL\System.Runtime.Remoting\v4.0_4.0.0.0__b77a5c561934e089\System.Runtime.Remoting.dll'; Loaded: 1; AssemblyID: 0x00000000
MESSAGE:   ModuleAttachedToAssembly ---- Module[C:\Windows\Microsoft.Net\assembly\GAC_MSIL\System.Runtime.Remoting\v4.0_4.0.0.0__b77a5c561934e089\System.Runtime.Remoting.dll]: 0x64051000; 0x00000006 attached To Assembly[]: 0x005138f0; 0x00000006
MESSAGE:   Assembly Identity [System.Runtime.Remoting, Version=4.0.0.0, Culture=neutral, PublicKeyToken=b77a5c561934e089, processorArchitecture=MSIL].
EVENT:     Loaded Unmonitored Assembly [System.Runtime.Remoting][0x005138f0]
MESSAGE: AssemblyLoadFinished ---- Assembly[System.Runtime.Remoting]: 0x005138f0; 0x00000006
DUMP:    Assembly; NcAssemblyID: 0x00000006; PrfAssemblyID: 0x005138f0; AssemblyName: 'System.Runtime.Remoting'; Loaded: 1; AssemblyIdentity: 'System.Runtime.Remoting, Version=4.0.0.0, Culture=neutral, PublicKeyToken=b77a5c561934e089, processorArchitecture=MSIL'; Instrument: 0
MESSAGE: AssemblyLoadStarted ---- Assembly: 0x00513570; 0x00000007
MESSAGE:   ModuleLoadStarted ---- Module: 0x58041000; 0x00000007
MESSAGE:   Failed to load symbols for module [C:\Windows\Microsoft.Net\assembly\GAC_MSIL\System.Xml\v4.0_4.0.0.0__b77a5c561934e089\System.Xml.dll] in [C:\Windows\Microsoft.Net\assembly\GAC_MSIL\System.Xml\v4.0_4.0.0.0__b77a5c561934e089].
MESSAGE:   ModuleLoadFinished ---- Module[C:\Windows\Microsoft.Net\assembly\GAC_MSIL\System.Xml\v4.0_4.0.0.0__b77a5c561934e089\System.Xml.dll]: 0x58041000; 0x00000007
DUMP:    Module; NcModuleId: 0x00000007; PrfModuleId: 0x58041000; ModuleName: 'C:\Windows\Microsoft.Net\assembly\GAC_MSIL\System.Xml\v4.0_4.0.0.0__b77a5c561934e089\System.Xml.dll'; Loaded: 1; AssemblyID: 0x00000000
MESSAGE:   ModuleAttachedToAssembly ---- Module[C:\Windows\Microsoft.Net\assembly\GAC_MSIL\System.Xml\v4.0_4.0.0.0__b77a5c561934e089\System.Xml.dll]: 0x58041000; 0x00000007 attached To Assembly[]: 0x00513570; 0x00000007
MESSAGE:   Assembly Identity [System.Xml, Version=4.0.0.0, Culture=neutral, PublicKeyToken=b77a5c561934e089, processorArchitecture=MSIL].
EVENT:     Loaded Unmonitored Assembly [System.Xml][0x00513570]
MESSAGE: AssemblyLoadFinished ---- Assembly[System.Xml]: 0x00513570; 0x00000007
DUMP:    Assembly; NcAssemblyID: 0x00000007; PrfAssemblyID: 0x00513570; AssemblyName: 'System.Xml'; Loaded: 1; AssemblyIdentity: 'System.Xml, Version=4.0.0.0, Culture=neutral, PublicKeyToken=b77a5c561934e089, processorArchitecture=MSIL'; Instrument: 0
MESSAGE: AssemblyLoadStarted ---- Assembly: 0x005184b8; 0x00000008
MESSAGE:   ModuleLoadStarted ---- Module: 0x574b1000; 0x00000008
MESSAGE:   Failed to load symbols for module [C:\Windows\Microsoft.Net\assembly\GAC_MSIL\System.Configuration\v4.0_4.0.0.0__b03f5f7f11d50a3a\System.Configuration.dll] in [C:\Windows\Microsoft.Net\assembly\GAC_MSIL\System.Configuration\v4.0_4.0.0.0__b03f5f7f11d50a3a].
MESSAGE:   ModuleLoadFinished ---- Module[C:\Windows\Microsoft.Net\assembly\GAC_MSIL\System.Configuration\v4.0_4.0.0.0__b03f5f7f11d50a3a\System.Configuration.dll]: 0x574b1000; 0x00000008
DUMP:    Module; NcModuleId: 0x00000008; PrfModuleId: 0x574b1000; ModuleName: 'C:\Windows\Microsoft.Net\assembly\GAC_MSIL\System.Configuration\v4.0_4.0.0.0__b03f5f7f11d50a3a\System.Configuration.dll'; Loaded: 1; AssemblyID: 0x00000000
MESSAGE:   ModuleAttachedToAssembly ---- Module[C:\Windows\Microsoft.Net\assembly\GAC_MSIL\System.Configuration\v4.0_4.0.0.0__b03f5f7f11d50a3a\System.Configuration.dll]: 0x574b1000; 0x00000008 attached To Assembly[]: 0x005184b8; 0x00000008
MESSAGE:   Assembly Identity [System.Configuration, Version=4.0.0.0, Culture=neutral, PublicKeyToken=b03f5f7f11d50a3a, processorArchitecture=MSIL].
EVENT:     Loaded Unmonitored Assembly [System.Configuration][0x005184b8]
MESSAGE: AssemblyLoadFinished ---- Assembly[System.Configuration]: 0x005184b8; 0x00000008
DUMP:    Assembly; NcAssemblyID: 0x00000008; PrfAssemblyID: 0x005184b8; AssemblyName: 'System.Configuration'; Loaded: 1; AssemblyIdentity: 'System.Configuration, Version=4.0.0.0, Culture=neutral, PublicKeyToken=b03f5f7f11d50a3a, processorArchitecture=MSIL'; Instrument: 0
MESSAGE: AppDomainCreationStarted ---- AppDomain: 0x0052fd28; 0x00000004
MESSAGE: AppDomainCreationFinished ---- AppDomain[AssemblyReflector]: 0x0052fd28; 0x00000004
DUMP:    AppDomain; NcAppDomainId: 0x00000004; PrfAppDomainId: 0x0052fd28; AppDomainName: 'AssemblyReflector'; Loaded: 1
MESSAGE: AssemblyLoadStarted ---- Assembly: 0x005345e0; 0x00000009
MESSAGE:   ModuleLoadStarted ---- Module: 0x006d33f4; 0x00000009
MESSAGE:   Failed to load symbols for module [C:\Program Files (x86)\TestDriven.NET 3\TestDriven.TestRunner.dll] in [C:\Program Files (x86)\TestDriven.NET 3].
MESSAGE:   ModuleLoadFinished ---- Module[C:\Program Files (x86)\TestDriven.NET 3\TestDriven.TestRunner.dll]: 0x006d33f4; 0x00000009
DUMP:    Module; NcModuleId: 0x00000009; PrfModuleId: 0x006d33f4; ModuleName: 'C:\Program Files (x86)\TestDriven.NET 3\TestDriven.TestRunner.dll'; Loaded: 1; AssemblyID: 0x00000000
MESSAGE:   ModuleAttachedToAssembly ---- Module[C:\Program Files (x86)\TestDriven.NET 3\TestDriven.TestRunner.dll]: 0x006d33f4; 0x00000009 attached To Assembly[]: 0x005345e0; 0x00000009
MESSAGE:   Assembly Identity [TestDriven.TestRunner, Version=3.7.2842.0, Culture=neutral, PublicKeyToken=50ecb853f8c6b8d2].
EVENT:     Loaded Unmonitored Assembly [TestDriven.TestRunner][0x005345e0]
MESSAGE: AssemblyLoadFinished ---- Assembly[TestDriven.TestRunner]: 0x005345e0; 0x00000009
DUMP:    Assembly; NcAssemblyID: 0x00000009; PrfAssemblyID: 0x005345e0; AssemblyName: 'TestDriven.TestRunner'; Loaded: 1; AssemblyIdentity: 'TestDriven.TestRunner, Version=3.7.2842.0, Culture=neutral, PublicKeyToken=50ecb853f8c6b8d2'; Instrument: 0
MESSAGE: AssemblyLoadStarted ---- Assembly: 0x00534698; 0x0000000a
MESSAGE:   ModuleLoadStarted ---- Module: 0x006d3dd8; 0x0000000a
MESSAGE:   Loaded symbols for module [C:\Users\user\Desktop\yzu2014-team3\OpenAirLibrary\bin\Debug\OpenAirLibrary.dll] in [C:\Users\user\Desktop\yzu2014-team3\OpenAirLibrary\bin\Debug].
MESSAGE:   Found Attribute [System.Runtime.CompilerServices.CompilerGeneratedAttribute], Excluding Item from Coverage
MESSAGE:   ModuleLoadFinished ---- Module[C:\Users\user\Desktop\yzu2014-team3\OpenAirLibrary\bin\Debug\OpenAirLibrary.dll]: 0x006d3dd8; 0x0000000a
DUMP:    Module; NcModuleId: 0x0000000a; PrfModuleId: 0x006d3dd8; ModuleName: 'C:\Users\user\Desktop\yzu2014-team3\OpenAirLibrary\bin\Debug\OpenAirLibrary.dll'; Loaded: 1; AssemblyID: 0x00000000
MESSAGE:   ModuleAttachedToAssembly ---- Module[C:\Users\user\Desktop\yzu2014-team3\OpenAirLibrary\bin\Debug\OpenAirLibrary.dll]: 0x006d3dd8; 0x0000000a attached To Assembly[]: 0x00534698; 0x0000000a
MESSAGE:   Assembly Identity [OpenAirLibrary, Version=1.0.0.0, Culture=neutral, PublicKeyToken=null, processorArchitecture=MSIL].
EVENT:     Monitoring Assembly [OpenAirLibrary][0x00534698]
MESSAGE: AssemblyLoadFinished ---- Assembly[OpenAirLibrary]: 0x00534698; 0x0000000a
DUMP:    Assembly; NcAssemblyID: 0x0000000a; PrfAssemblyID: 0x00534698; AssemblyName: 'OpenAirLibrary'; Loaded: 1; AssemblyIdentity: 'OpenAirLibrary, Version=1.0.0.0, Culture=neutral, PublicKeyToken=null, processorArchitecture=MSIL'; Instrument: 1
MESSAGE: AppDomainShutdownStarted ---- AppDomain[AssemblyReflector]: 0x0052fd28; 0x00000004
MESSAGE:   AssemblyUnloadStarted ---- Assembly[TestDriven.TestRunner]: 0x005345e0; 0x00000009
MESSAGE:     ModuleUnloadStarted ---- Module[C:\Program Files (x86)\TestDriven.NET 3\TestDriven.TestRunner.dll]: 0x006d33f4; 0x00000009
MESSAGE:       AssemblyUnloadStarted ---- Assembly[OpenAirLibrary]: 0x00534698; 0x0000000a
MESSAGE:         ModuleUnloadStarted ---- Module[C:\Users\user\Desktop\yzu2014-team3\OpenAirLibrary\bin\Debug\OpenAirLibrary.dll]: 0x006d3dd8; 0x0000000a
MESSAGE:         AppDomainShutdownFinished ---- AppDomain[AssemblyReflector]: 0x0052fd28; 0x00000004
MESSAGE:         AssemblyLoadStarted ---- Assembly: 0x00534a30; 0x0000000b
MESSAGE:           ModuleLoadStarted ---- Module: 0x00287d44; 0x0000000b
MESSAGE:           Failed to load symbols for module [C:\Program Files (x86)\TestDriven.NET 3\TestDriven.Framework.dll] in [C:\Program Files (x86)\TestDriven.NET 3].
MESSAGE:           ModuleLoadFinished ---- Module[C:\Program Files (x86)\TestDriven.NET 3\TestDriven.Framework.dll]: 0x00287d44; 0x0000000b
DUMP:    Module; NcModuleId: 0x0000000b; PrfModuleId: 0x00287d44; ModuleName: 'C:\Program Files (x86)\TestDriven.NET 3\TestDriven.Framework.dll'; Loaded: 1; AssemblyID: 0x00000000
MESSAGE:           ModuleAttachedToAssembly ---- Module[C:\Program Files (x86)\TestDriven.NET 3\TestDriven.Framework.dll]: 0x00287d44; 0x0000000b attached To Assembly[]: 0x00534a30; 0x0000000b
MESSAGE:           Assembly Identity [TestDriven.Framework, Version=2.0.0.0, Culture=neutral, PublicKeyToken=50ecb853f8c6b8d2].
EVENT:             Loaded Unmonitored Assembly [TestDriven.Framework][0x00534a30]
MESSAGE:         AssemblyLoadFinished ---- Assembly[TestDriven.Framework]: 0x00534a30; 0x0000000b
DUMP:    Assembly; NcAssemblyID: 0x0000000b; PrfAssemblyID: 0x00534a30; AssemblyName: 'TestDriven.Framework'; Loaded: 1; AssemblyIdentity: 'TestDriven.Framework, Version=2.0.0.0, Culture=neutral, PublicKeyToken=50ecb853f8c6b8d2'; Instrument: 0
MESSAGE:         AppDomainCreationStarted ---- AppDomain: 0x0053ac98; 0x00000005
MESSAGE:         AppDomainCreationFinished ---- AppDomain[domain-nunit.tdnet.dll]: 0x0053ac98; 0x00000005
DUMP:    AppDomain; NcAppDomainId: 0x00000005; PrfAppDomainId: 0x0053ac98; AppDomainName: 'domain-nunit.tdnet.dll'; Loaded: 1
MESSAGE:         AssemblyLoadStarted ---- Assembly: 0x00534750; 0x0000000c
MESSAGE:           ModuleLoadStarted ---- Module: 0x008733cc; 0x0000000c
MESSAGE:           Failed to load symbols for module [C:\Program Files (x86)\TestDriven.NET 3\TestDriven.TestRunner.dll] in [C:\Program Files (x86)\TestDriven.NET 3].
MESSAGE:           ModuleLoadFinished ---- Module[C:\Program Files (x86)\TestDriven.NET 3\TestDriven.TestRunner.dll]: 0x008733cc; 0x0000000c
DUMP:    Module; NcModuleId: 0x0000000c; PrfModuleId: 0x008733cc; ModuleName: 'C:\Program Files (x86)\TestDriven.NET 3\TestDriven.TestRunner.dll'; Loaded: 1; AssemblyID: 0x00000000
MESSAGE:           ModuleAttachedToAssembly ---- Module[C:\Program Files (x86)\TestDriven.NET 3\TestDriven.TestRunner.dll]: 0x008733cc; 0x0000000c attached To Assembly[]: 0x00534750; 0x0000000c
MESSAGE:           Assembly Identity [TestDriven.TestRunner, Version=3.7.2842.0, Culture=neutral, PublicKeyToken=50ecb853f8c6b8d2].
EVENT:             Loaded Unmonitored Assembly [TestDriven.TestRunner][0x00534750]
MESSAGE:         AssemblyLoadFinished ---- Assembly[TestDriven.TestRunner]: 0x00534750; 0x0000000c
DUMP:    Assembly; NcAssemblyID: 0x0000000c; PrfAssemblyID: 0x00534750; AssemblyName: 'TestDriven.TestRunner'; Loaded: 1; AssemblyIdentity: 'TestDriven.TestRunner, Version=3.7.2842.0, Culture=neutral, PublicKeyToken=50ecb853f8c6b8d2'; Instrument: 0
MESSAGE:         AssemblyLoadStarted ---- Assembly: 0x00534c58; 0x0000000d
MESSAGE:           ModuleLoadStarted ---- Module: 0x008740b8; 0x0000000d
MESSAGE:           Failed to load symbols for module [C:\Program Files (x86)\TestDriven.NET 3\NUnit\2.6\nunit.tdnet.dll] in [C:\Program Files (x86)\TestDriven.NET 3\NUnit\2.6].
MESSAGE:           ModuleLoadFinished ---- Module[C:\Program Files (x86)\TestDriven.NET 3\NUnit\2.6\nunit.tdnet.dll]: 0x008740b8; 0x0000000d
DUMP:    Module; NcModuleId: 0x0000000d; PrfModuleId: 0x008740b8; ModuleName: 'C:\Program Files (x86)\TestDriven.NET 3\NUnit\2.6\nunit.tdnet.dll'; Loaded: 1; AssemblyID: 0x00000000
MESSAGE:           ModuleAttachedToAssembly ---- Module[C:\Program Files (x86)\TestDriven.NET 3\NUnit\2.6\nunit.tdnet.dll]: 0x008740b8; 0x0000000d attached To Assembly[]: 0x00534c58; 0x0000000d
MESSAGE:           Assembly Identity [nunit.tdnet, Version=2.6.0.0, Culture=neutral, PublicKeyToken=null, processorArchitecture=MSIL].
EVENT:             Loaded Unmonitored Assembly [nunit.tdnet][0x00534c58]
MESSAGE:         AssemblyLoadFinished ---- Assembly[nunit.tdnet]: 0x00534c58; 0x0000000d
DUMP:    Assembly; NcAssemblyID: 0x0000000d; PrfAssemblyID: 0x00534c58; AssemblyName: 'nunit.tdnet'; Loaded: 1; AssemblyIdentity: 'nunit.tdnet, Version=2.6.0.0, Culture=neutral, PublicKeyToken=null, processorArchitecture=MSIL'; Instrument: 0
MESSAGE:         AssemblyLoadStarted ---- Assembly: 0x00534ba0; 0x0000000e
MESSAGE:           ModuleLoadStarted ---- Module: 0x00874618; 0x0000000e
MESSAGE:           Failed to load symbols for module [C:\Program Files (x86)\TestDriven.NET 3\TestDriven.Framework.dll] in [C:\Program Files (x86)\TestDriven.NET 3].
MESSAGE:           ModuleLoadFinished ---- Module[C:\Program Files (x86)\TestDriven.NET 3\TestDriven.Framework.dll]: 0x00874618; 0x0000000e
DUMP:    Module; NcModuleId: 0x0000000e; PrfModuleId: 0x00874618; ModuleName: 'C:\Program Files (x86)\TestDriven.NET 3\TestDriven.Framework.dll'; Loaded: 1; AssemblyID: 0x00000000
MESSAGE:           ModuleAttachedToAssembly ---- Module[C:\Program Files (x86)\TestDriven.NET 3\TestDriven.Framework.dll]: 0x00874618; 0x0000000e attached To Assembly[]: 0x00534ba0; 0x0000000e
MESSAGE:           Assembly Identity [TestDriven.Framework, Version=2.0.0.0, Culture=neutral, PublicKeyToken=50ecb853f8c6b8d2].
EVENT:             Loaded Unmonitored Assembly [TestDriven.Framework][0x00534ba0]
MESSAGE:         AssemblyLoadFinished ---- Assembly[TestDriven.Framework]: 0x00534ba0; 0x0000000e
DUMP:    Assembly; NcAssemblyID: 0x0000000e; PrfAssemblyID: 0x00534ba0; AssemblyName: 'TestDriven.Framework'; Loaded: 1; AssemblyIdentity: 'TestDriven.Framework, Version=2.0.0.0, Culture=neutral, PublicKeyToken=50ecb853f8c6b8d2'; Instrument: 0
MESSAGE:         AssemblyLoadStarted ---- Assembly: 0x00534ae8; 0x0000000f
MESSAGE:           ModuleLoadStarted ---- Module: 0x008758e8; 0x0000000f
MESSAGE:           Failed to load symbols for module [C:\Windows\Microsoft.Net\assembly\GAC_MSIL\System\v4.0_4.0.0.0__b77a5c561934e089\System.dll] in [C:\Windows\Microsoft.Net\assembly\GAC_MSIL\System\v4.0_4.0.0.0__b77a5c561934e089].
MESSAGE:           ModuleLoadFinished ---- Module[C:\Windows\Microsoft.Net\assembly\GAC_MSIL\System\v4.0_4.0.0.0__b77a5c561934e089\System.dll]: 0x008758e8; 0x0000000f
DUMP:    Module; NcModuleId: 0x0000000f; PrfModuleId: 0x008758e8; ModuleName: 'C:\Windows\Microsoft.Net\assembly\GAC_MSIL\System\v4.0_4.0.0.0__b77a5c561934e089\System.dll'; Loaded: 1; AssemblyID: 0x00000000
MESSAGE:           ModuleAttachedToAssembly ---- Module[C:\Windows\Microsoft.Net\assembly\GAC_MSIL\System\v4.0_4.0.0.0__b77a5c561934e089\System.dll]: 0x008758e8; 0x0000000f attached To Assembly[]: 0x00534ae8; 0x0000000f
MESSAGE:           Assembly Identity [System, Version=4.0.0.0, Culture=neutral, PublicKeyToken=b77a5c561934e089, processorArchitecture=MSIL].
EVENT:             Loaded Unmonitored Assembly [System][0x00534ae8]
MESSAGE:         AssemblyLoadFinished ---- Assembly[System]: 0x00534ae8; 0x0000000f
DUMP:    Assembly; NcAssemblyID: 0x0000000f; PrfAssemblyID: 0x00534ae8; AssemblyName: 'System'; Loaded: 1; AssemblyIdentity: 'System, Version=4.0.0.0, Culture=neutral, PublicKeyToken=b77a5c561934e089, processorArchitecture=MSIL'; Instrument: 0
MESSAGE:         AssemblyLoadStarted ---- Assembly: 0x00534d10; 0x00000010
MESSAGE:           ModuleLoadStarted ---- Module: 0x0258ac8c; 0x00000010
MESSAGE:           Failed to load symbols for module [C:\Windows\Microsoft.Net\assembly\GAC_MSIL\System.Configuration\v4.0_4.0.0.0__b03f5f7f11d50a3a\System.Configuration.dll] in [C:\Windows\Microsoft.Net\assembly\GAC_MSIL\System.Configuration\v4.0_4.0.0.0__b03f5f7f11d50a3a].
MESSAGE:           ModuleLoadFinished ---- Module[C:\Windows\Microsoft.Net\assembly\GAC_MSIL\System.Configuration\v4.0_4.0.0.0__b03f5f7f11d50a3a\System.Configuration.dll]: 0x0258ac8c; 0x00000010
DUMP:    Module; NcModuleId: 0x00000010; PrfModuleId: 0x0258ac8c; ModuleName: 'C:\Windows\Microsoft.Net\assembly\GAC_MSIL\System.Configuration\v4.0_4.0.0.0__b03f5f7f11d50a3a\System.Configuration.dll'; Loaded: 1; AssemblyID: 0x00000000
MESSAGE:           ModuleAttachedToAssembly ---- Module[C:\Windows\Microsoft.Net\assembly\GAC_MSIL\System.Configuration\v4.0_4.0.0.0__b03f5f7f11d50a3a\System.Configuration.dll]: 0x0258ac8c; 0x00000010 attached To Assembly[]: 0x00534d10; 0x00000010
MESSAGE:           Assembly Identity [System.Configuration, Version=4.0.0.0, Culture=neutral, PublicKeyToken=b03f5f7f11d50a3a, processorArchitecture=MSIL].
EVENT:             Loaded Unmonitored Assembly [System.Configuration][0x00534d10]
MESSAGE:         AssemblyLoadFinished ---- Assembly[System.Configuration]: 0x00534d10; 0x00000010
DUMP:    Assembly; NcAssemblyID: 0x00000010; PrfAssemblyID: 0x00534d10; AssemblyName: 'System.Configuration'; Loaded: 1; AssemblyIdentity: 'System.Configuration, Version=4.0.0.0, Culture=neutral, PublicKeyToken=b03f5f7f11d50a3a, processorArchitecture=MSIL'; Instrument: 0
MESSAGE:         AssemblyLoadStarted ---- Assembly: 0x00534e80; 0x00000011
MESSAGE:           ModuleLoadStarted ---- Module: 0x025a3854; 0x00000011
MESSAGE:           Failed to load symbols for module [C:\Windows\Microsoft.Net\assembly\GAC_MSIL\System.Xml\v4.0_4.0.0.0__b77a5c561934e089\System.Xml.dll] in [C:\Windows\Microsoft.Net\assembly\GAC_MSIL\System.Xml\v4.0_4.0.0.0__b77a5c561934e089].
MESSAGE:           ModuleLoadFinished ---- Module[C:\Windows\Microsoft.Net\assembly\GAC_MSIL\System.Xml\v4.0_4.0.0.0__b77a5c561934e089\System.Xml.dll]: 0x025a3854; 0x00000011
DUMP:    Module; NcModuleId: 0x00000011; PrfModuleId: 0x025a3854; ModuleName: 'C:\Windows\Microsoft.Net\assembly\GAC_MSIL\System.Xml\v4.0_4.0.0.0__b77a5c561934e089\System.Xml.dll'; Loaded: 1; AssemblyID: 0x00000000
MESSAGE:           ModuleAttachedToAssembly ---- Module[C:\Windows\Microsoft.Net\assembly\GAC_MSIL\System.Xml\v4.0_4.0.0.0__b77a5c561934e089\System.Xml.dll]: 0x025a3854; 0x00000011 attached To Assembly[]: 0x00534e80; 0x00000011
MESSAGE:           Assembly Identity [System.Xml, Version=4.0.0.0, Culture=neutral, PublicKeyToken=b77a5c561934e089, processorArchitecture=MSIL].
EVENT:             Loaded Unmonitored Assembly [System.Xml][0x00534e80]
MESSAGE:         AssemblyLoadFinished ---- Assembly[System.Xml]: 0x00534e80; 0x00000011
DUMP:    Assembly; NcAssemblyID: 0x00000011; PrfAssemblyID: 0x00534e80; AssemblyName: 'System.Xml'; Loaded: 1; AssemblyIdentity: 'System.Xml, Version=4.0.0.0, Culture=neutral, PublicKeyToken=b77a5c561934e089, processorArchitecture=MSIL'; Instrument: 0
MESSAGE:         AssemblyLoadStarted ---- Assembly: 0x00535160; 0x00000012
MESSAGE:           ModuleLoadStarted ---- Module: 0x027144a0; 0x00000012
MESSAGE:           Loaded symbols for module [C:\Users\user\Desktop\yzu2014-team3\OpenAirLibrary\bin\Debug\OpenAirLibrary.dll] in [C:\Users\user\Desktop\yzu2014-team3\OpenAirLibrary\bin\Debug].
MESSAGE:           Found Attribute [System.Runtime.CompilerServices.CompilerGeneratedAttribute], Excluding Item from Coverage
MESSAGE:           ModuleLoadFinished ---- Module[C:\Users\user\Desktop\yzu2014-team3\OpenAirLibrary\bin\Debug\OpenAirLibrary.dll]: 0x027144a0; 0x00000012
DUMP:    Module; NcModuleId: 0x00000012; PrfModuleId: 0x027144a0; ModuleName: 'C:\Users\user\Desktop\yzu2014-team3\OpenAirLibrary\bin\Debug\OpenAirLibrary.dll'; Loaded: 1; AssemblyID: 0x00000000
MESSAGE:           ModuleAttachedToAssembly ---- Module[C:\Users\user\Desktop\yzu2014-team3\OpenAirLibrary\bin\Debug\OpenAirLibrary.dll]: 0x027144a0; 0x00000012 attached To Assembly[]: 0x00535160; 0x00000012
MESSAGE:           Assembly Identity [OpenAirLibrary, Version=1.0.0.0, Culture=neutral, PublicKeyToken=null, processorArchitecture=MSIL].
EVENT:             Monitoring Assembly [OpenAirLibrary][0x00535160]
MESSAGE:         AssemblyLoadFinished ---- Assembly[OpenAirLibrary]: 0x00535160; 0x00000012
DUMP:    Assembly; NcAssemblyID: 0x00000012; PrfAssemblyID: 0x00535160; AssemblyName: 'OpenAirLibrary'; Loaded: 1; AssemblyIdentity: 'OpenAirLibrary, Version=1.0.0.0, Culture=neutral, PublicKeyToken=null, processorArchitecture=MSIL'; Instrument: 1
MESSAGE:         AssemblyLoadStarted ---- Assembly: 0x005352d0; 0x00000013
MESSAGE:           ModuleLoadStarted ---- Module: 0x027158ac; 0x00000013
MESSAGE:           Failed to load symbols for module [C:\Program Files (x86)\TestDriven.NET 3\NUnit\2.6\lib\nunit.core.interfaces.dll] in [C:\Program Files (x86)\TestDriven.NET 3\NUnit\2.6\lib].
MESSAGE:           ModuleLoadFinished ---- Module[C:\Program Files (x86)\TestDriven.NET 3\NUnit\2.6\lib\nunit.core.interfaces.dll]: 0x027158ac; 0x00000013
DUMP:    Module; NcModuleId: 0x00000013; PrfModuleId: 0x027158ac; ModuleName: 'C:\Program Files (x86)\TestDriven.NET 3\NUnit\2.6\lib\nunit.core.interfaces.dll'; Loaded: 1; AssemblyID: 0x00000000
MESSAGE:           ModuleAttachedToAssembly ---- Module[C:\Program Files (x86)\TestDriven.NET 3\NUnit\2.6\lib\nunit.core.interfaces.dll]: 0x027158ac; 0x00000013 attached To Assembly[]: 0x005352d0; 0x00000013
MESSAGE:           Assembly Identity [nunit.core.interfaces, Version=2.6.2.12296, Culture=neutral, PublicKeyToken=96d09a1eb7f44a77, processorArchitecture=MSIL].
EVENT:             Loaded Unmonitored Assembly [nunit.core.interfaces][0x005352d0]
MESSAGE:         AssemblyLoadFinished ---- Assembly[nunit.core.interfaces]: 0x005352d0; 0x00000013
DUMP:    Assembly; NcAssemblyID: 0x00000013; PrfAssemblyID: 0x005352d0; AssemblyName: 'nunit.core.interfaces'; Loaded: 1; AssemblyIdentity: 'nunit.core.interfaces, Version=2.6.2.12296, Culture=neutral, PublicKeyToken=96d09a1eb7f44a77, processorArchitecture=MSIL'; Instrument: 0
MESSAGE:         AssemblyLoadStarted ---- Assembly: 0x005354f8; 0x00000014
MESSAGE:           ModuleLoadStarted ---- Module: 0x02716540; 0x00000014
MESSAGE:           Failed to load symbols for module [C:\Program Files (x86)\TestDriven.NET 3\NUnit\2.6\lib\nunit.util.dll] in [C:\Program Files (x86)\TestDriven.NET 3\NUnit\2.6\lib].
MESSAGE:           ModuleLoadFinished ---- Module[C:\Program Files (x86)\TestDriven.NET 3\NUnit\2.6\lib\nunit.util.dll]: 0x02716540; 0x00000014
DUMP:    Module; NcModuleId: 0x00000014; PrfModuleId: 0x02716540; ModuleName: 'C:\Program Files (x86)\TestDriven.NET 3\NUnit\2.6\lib\nunit.util.dll'; Loaded: 1; AssemblyID: 0x00000000
MESSAGE:           ModuleAttachedToAssembly ---- Module[C:\Program Files (x86)\TestDriven.NET 3\NUnit\2.6\lib\nunit.util.dll]: 0x02716540; 0x00000014 attached To Assembly[]: 0x005354f8; 0x00000014
MESSAGE:           Assembly Identity [nunit.util, Version=2.6.2.12296, Culture=neutral, PublicKeyToken=96d09a1eb7f44a77, processorArchitecture=MSIL].
EVENT:             Loaded Unmonitored Assembly [nunit.util][0x005354f8]
MESSAGE:         AssemblyLoadFinished ---- Assembly[nunit.util]: 0x005354f8; 0x00000014
DUMP:    Assembly; NcAssemblyID: 0x00000014; PrfAssemblyID: 0x005354f8; AssemblyName: 'nunit.util'; Loaded: 1; AssemblyIdentity: 'nunit.util, Version=2.6.2.12296, Culture=neutral, PublicKeyToken=96d09a1eb7f44a77, processorArchitecture=MSIL'; Instrument: 0
MESSAGE:         AssemblyLoadStarted ---- Assembly: 0x00535440; 0x00000015
MESSAGE:           ModuleLoadStarted ---- Module: 0x027173c8; 0x00000015
MESSAGE:           Failed to load symbols for module [C:\Program Files (x86)\TestDriven.NET 3\NUnit\2.6\lib\nunit.core.dll] in [C:\Program Files (x86)\TestDriven.NET 3\NUnit\2.6\lib].
MESSAGE:           ModuleLoadFinished ---- Module[C:\Program Files (x86)\TestDriven.NET 3\NUnit\2.6\lib\nunit.core.dll]: 0x027173c8; 0x00000015
DUMP:    Module; NcModuleId: 0x00000015; PrfModuleId: 0x027173c8; ModuleName: 'C:\Program Files (x86)\TestDriven.NET 3\NUnit\2.6\lib\nunit.core.dll'; Loaded: 1; AssemblyID: 0x00000000
MESSAGE:           ModuleAttachedToAssembly ---- Module[C:\Program Files (x86)\TestDriven.NET 3\NUnit\2.6\lib\nunit.core.dll]: 0x027173c8; 0x00000015 attached To Assembly[]: 0x00535440; 0x00000015
MESSAGE:           Assembly Identity [nunit.core, Version=2.6.2.12296, Culture=neutral, PublicKeyToken=96d09a1eb7f44a77, processorArchitecture=MSIL].
EVENT:             Loaded Unmonitored Assembly [nunit.core][0x00535440]
MESSAGE:         AssemblyLoadFinished ---- Assembly[nunit.core]: 0x00535440; 0x00000015
DUMP:    Assembly; NcAssemblyID: 0x00000015; PrfAssemblyID: 0x00535440; AssemblyName: 'nunit.core'; Loaded: 1; AssemblyIdentity: 'nunit.core, Version=2.6.2.12296, Culture=neutral, PublicKeyToken=96d09a1eb7f44a77, processorArchitecture=MSIL'; Instrument: 0
MESSAGE:         AssemblyLoadStarted ---- Assembly: 0x005357d8; 0x00000016
MESSAGE:           ModuleLoadStarted ---- Module: 0x0271ec4c; 0x00000016
MESSAGE:           Failed to load symbols for module [C:\Users\user\Desktop\yzu2014-team3\OpenAirLibrary\bin\Debug\nunit.framework.dll] in [C:\Users\user\Desktop\yzu2014-team3\OpenAirLibrary\bin\Debug].
MESSAGE:           ModuleLoadFinished ---- Module[C:\Users\user\Desktop\yzu2014-team3\OpenAirLibrary\bin\Debug\nunit.framework.dll]: 0x0271ec4c; 0x00000016
DUMP:    Module; NcModuleId: 0x00000016; PrfModuleId: 0x0271ec4c; ModuleName: 'C:\Users\user\Desktop\yzu2014-team3\OpenAirLibrary\bin\Debug\nunit.framework.dll'; Loaded: 1; AssemblyID: 0x00000000
MESSAGE:           ModuleAttachedToAssembly ---- Module[C:\Users\user\Desktop\yzu2014-team3\OpenAirLibrary\bin\Debug\nunit.framework.dll]: 0x0271ec4c; 0x00000016 attached To Assembly[]: 0x005357d8; 0x00000016
MESSAGE:           Assembly Identity [nunit.framework, Version=2.6.3.13283, Culture=neutral, PublicKeyToken=96d09a1eb7f44a77, processorArchitecture=MSIL].
EVENT:             Loaded Unmonitored Assembly [nunit.framework][0x005357d8]
MESSAGE:         AssemblyLoadFinished ---- Assembly[nunit.framework]: 0x005357d8; 0x00000016
DUMP:    Assembly; NcAssemblyID: 0x00000016; PrfAssemblyID: 0x005357d8; AssemblyName: 'nunit.framework'; Loaded: 1; AssemblyIdentity: 'nunit.framework, Version=2.6.3.13283, Culture=neutral, PublicKeyToken=96d09a1eb7f44a77, processorArchitecture=MSIL'; Instrument: 0
MESSAGE:         AssemblyLoadStarted ---- Assembly: 0x00535890; 0x00000017
MESSAGE:           ModuleLoadStarted ---- Module: 0x04918578; 0x00000017
MESSAGE:           Failed to load symbols for module [C:\Windows\Microsoft.Net\assembly\GAC_MSIL\System.Core\v4.0_4.0.0.0__b77a5c561934e089\System.Core.dll] in [C:\Windows\Microsoft.Net\assembly\GAC_MSIL\System.Core\v4.0_4.0.0.0__b77a5c561934e089].
MESSAGE:           ModuleLoadFinished ---- Module[C:\Windows\Microsoft.Net\assembly\GAC_MSIL\System.Core\v4.0_4.0.0.0__b77a5c561934e089\System.Core.dll]: 0x04918578; 0x00000017
DUMP:    Module; NcModuleId: 0x00000017; PrfModuleId: 0x04918578; ModuleName: 'C:\Windows\Microsoft.Net\assembly\GAC_MSIL\System.Core\v4.0_4.0.0.0__b77a5c561934e089\System.Core.dll'; Loaded: 1; AssemblyID: 0x00000000
MESSAGE:           ModuleAttachedToAssembly ---- Module[C:\Windows\Microsoft.Net\assembly\GAC_MSIL\System.Core\v4.0_4.0.0.0__b77a5c561934e089\System.Core.dll]: 0x04918578; 0x00000017 attached To Assembly[]: 0x00535890; 0x00000017
MESSAGE:           Assembly Identity [System.Core, Version=4.0.0.0, Culture=neutral, PublicKeyToken=b77a5c561934e089, processorArchitecture=MSIL].
EVENT:             Loaded Unmonitored Assembly [System.Core][0x00535890]
MESSAGE:         AssemblyLoadFinished ---- Assembly[System.Core]: 0x00535890; 0x00000017
DUMP:    Assembly; NcAssemblyID: 0x00000017; PrfAssemblyID: 0x00535890; AssemblyName: 'System.Core'; Loaded: 1; AssemblyIdentity: 'System.Core, Version=4.0.0.0, Culture=neutral, PublicKeyToken=b77a5c561934e089, processorArchitecture=MSIL'; Instrument: 0
MESSAGE:         AppDomainShutdownStarted ---- AppDomain[domain-nunit.tdnet.dll]: 0x0053ac98; 0x00000005
MESSAGE:           AssemblyUnloadStarted ---- Assembly[TestDriven.TestRunner]: 0x00534750; 0x0000000c
MESSAGE:             ModuleUnloadStarted ---- Module[C:\Program Files (x86)\TestDriven.NET 3\TestDriven.TestRunner.dll]: 0x008733cc; 0x0000000c
MESSAGE:               AssemblyUnloadStarted ---- Assembly[nunit.tdnet]: 0x00534c58; 0x0000000d
MESSAGE:                 ModuleUnloadStarted ---- Module[C:\Program Files (x86)\TestDriven.NET 3\NUnit\2.6\nunit.tdnet.dll]: 0x008740b8; 0x0000000d
MESSAGE:                   AssemblyUnloadStarted ---- Assembly[TestDriven.Framework]: 0x00534ba0; 0x0000000e
MESSAGE:                     ModuleUnloadStarted ---- Module[C:\Program Files (x86)\TestDriven.NET 3\TestDriven.Framework.dll]: 0x00874618; 0x0000000e
MESSAGE:                       AssemblyUnloadStarted ---- Assembly[System]: 0x00534ae8; 0x0000000f
MESSAGE:                         ModuleUnloadStarted ---- Module[C:\Windows\Microsoft.Net\assembly\GAC_MSIL\System\v4.0_4.0.0.0__b77a5c561934e089\System.dll]: 0x008758e8; 0x0000000f
MESSAGE:                           AssemblyUnloadStarted ---- Assembly[System.Configuration]: 0x00534d10; 0x00000010
MESSAGE:                             ModuleUnloadStarted ---- Module[C:\Windows\Microsoft.Net\assembly\GAC_MSIL\System.Configuration\v4.0_4.0.0.0__b03f5f7f11d50a3a\System.Configuration.dll]: 0x0258ac8c; 0x00000010
MESSAGE:                               AssemblyUnloadStarted ---- Assembly[System.Xml]: 0x00534e80; 0x00000011
MESSAGE:                                 ModuleUnloadStarted ---- Module[C:\Windows\Microsoft.Net\assembly\GAC_MSIL\System.Xml\v4.0_4.0.0.0__b77a5c561934e089\System.Xml.dll]: 0x025a3854; 0x00000011
MESSAGE:                                   AssemblyUnloadStarted ---- Assembly[OpenAirLibrary]: 0x00535160; 0x00000012
MESSAGE:                                     ModuleUnloadStarted ---- Module[C:\Users\user\Desktop\yzu2014-team3\OpenAirLibrary\bin\Debug\OpenAirLibrary.dll]: 0x027144a0; 0x00000012
MESSAGE:                                       AssemblyUnloadStarted ---- Assembly[nunit.core.interfaces]: 0x005352d0; 0x00000013
MESSAGE:                                         ModuleUnloadStarted ---- Module[C:\Program Files (x86)\TestDriven.NET 3\NUnit\2.6\lib\nunit.core.interfaces.dll]: 0x027158ac; 0x00000013
MESSAGE:                                           AssemblyUnloadStarted ---- Assembly[nunit.util]: 0x005354f8; 0x00000014
MESSAGE:                                             ModuleUnloadStarted ---- Module[C:\Program Files (x86)\TestDriven.NET 3\NUnit\2.6\lib\nunit.util.dll]: 0x02716540; 0x00000014
MESSAGE:                                               AssemblyUnloadStarted ---- Assembly[nunit.core]: 0x00535440; 0x00000015
MESSAGE:                                                 ModuleUnloadStarted ---- Module[C:\Program Files (x86)\TestDriven.NET 3\NUnit\2.6\lib\nunit.core.dll]: 0x027173c8; 0x00000015
MESSAGE:                                                   AssemblyUnloadStarted ---- Assembly[nunit.framework]: 0x005357d8; 0x00000016
MESSAGE:                                                     ModuleUnloadStarted ---- Module[C:\Users\user\Desktop\yzu2014-team3\OpenAirLibrary\bin\Debug\nunit.framework.dll]: 0x0271ec4c; 0x00000016
MESSAGE:                                                       AssemblyUnloadStarted ---- Assembly[System.Core]: 0x00535890; 0x00000017
MESSAGE:                                                         ModuleUnloadStarted ---- Module[C:\Windows\Microsoft.Net\assembly\GAC_MSIL\System.Core\v4.0_4.0.0.0__b77a5c561934e089\System.Core.dll]: 0x04918578; 0x00000017
MESSAGE:                                                         AppDomainShutdownFinished ---- AppDomain[domain-nunit.tdnet.dll]: 0x0053ac98; 0x00000005
EVENT:                                                           Profiler Shutdown
MESSAGE:                                                         Signalling Shutdown.
EVENT:                                                           Data link established.
MESSAGE:                                                         Received driver ready event.
