{
  "source": {
    "include": ["./"],
    "includePattern": ".js$",
    "excludePattern": "(node_modules/|docs)"
  },
  "plugins": [
    "plugins/markdown"
  ],
  "opts": {
    "encoding": "utf8",
    "readme": "./README.md",
    "destination": "docs/",
    "recurse": true,
    "verbose": true
  }
}
