{
    "Subject": "Invitation to Participate in the Negotiation Process",
    "Message": "Dear {{firstname}}, <br><br> We are pleased to inform you that the negotiation process has been initiated for your account. You are invited to participate in this process by accessing your dedicated space. <br><br> To access your negotiation space, please click on the link below: <a href=\"{{url}}\">{{url}}</a> <br><br> In your space, you will be able to view the details of the negotiation, download relevant documents, and interact with other involved parties. <br><br> We thank you for your participation and collaboration in this negotiation process. <br><br> Sincerely,"
}