Name,WeightClassKg,Division,Sex,Best3SquatKg,Best3BenchKg,Best3DeadliftKg,TotalKg,Event,Equipment,Place
H. Van Nguyen,52,Open,M,150,87.5,157.5,395,SBD,Single-ply,1
Victor Vann,52,Open,M,95,90,102.5,287.5,SBD,Single-ply,2
Harold Sackett,56,Open,M,162.5,115,187.5,465,SBD,Single-ply,1
Robert Barnett,60,Open,M,192.5,105,205,502.5,SBD,Single-ply,1
Dan Trejo,60,Open,M,167.5,100,202.5,470,SBD,Single-ply,2
Alan O'Shea,60,Open,M,145,90,180,415,SBD,Single-ply,3
W. Frazier,60,Open,M,105,95,152.5,352.5,SBD,Single-ply,5
Jeff Rodriguez,67.5,Open,M,252.5,137.5,220,610,SBD,Single-ply,1
Todd Hayataka,67.5,Open,M,225,150,212.5,587.5,SBD,Single-ply,2
Frank Restivo,67.5,Open,M,182.5,142.5,215,540,SBD,Single-ply,3
Gaddis Capps,67.5,Open,M,195,115,212.5,522.5,SBD,Single-ply,4
Karl Floyd,67.5,Open,M,180,127,210,517,SBD,Single-ply,5
Alex Flores,67.5,Open,M,182.5,105,202.5,490,SBD,Single-ply,6
G. Gutierrez,67.5,Open,M,165,85,207.5,457.5,SBD,Single-ply,7
John Tyree,75,Open,M,265,155,282.5,702.5,SBD,Single-ply,1
J. Safdarina,75,Open,M,260,170,240,670,SBD,Single-ply,2
Ray Baxter-Vonna,75,Open,M,250,145,272.5,667.5,SBD,Single-ply,3
J. Jackson,75,Open,M,287.5,115,260,662.5,SBD,Single-ply,4
Dean Lontos,75,Open,M,237.5,142.5,257.5,637.5,SBD,Single-ply,5
Tony Springer,75,Open,M,235,150,217.5,602.5,SBD,Single-ply,6
Rick Cain,75,Open,M,235,117.5,230,582.5,SBD,Single-ply,7
Greg Ramirez,75,Open,M,182.5,110,220,512.5,SBD,Single-ply,8
Kevin McIntosh,75,Open,M,187.5,105,197.5,490,SBD,Single-ply,9
Eddie Mooney,82.5,Open,M,287.5,190,305,782.5,SBD,Single-ply,1
Stan Venable,82.5,Open,M,260,190,272.5,722.5,SBD,Single-ply,2
Don Cole,82.5,Open,M,287.5,130,277.5,695,SBD,Single-ply,3
Robert Johnson,82.5,Open,M,277.5,135,272.5,685,SBD,Single-ply,4
Lynn Branam,82.5,Open,M,272.5,137.5,250,660,SBD,Single-ply,5
David Kremmer,82.5,Open,M,255,130,265,650,SBD,Single-ply,6
Kevin Kish,82.5,Open,M,240,127.5,230,597.5,SBD,Single-ply,8
Ken O'Brien,82.5,Open,M,237.5,125,237.5,600,SBD,Single-ply,7
Andy Fife,82.5,Open,M,220,152.5,225,597.5,SBD,Single-ply,9
John Lawrence,82.5,Open,M,227.5,152.5,205,585,SBD,Single-ply,10
Jack Dyer,82.5,Open,M,212.5,135,197.5,545,SBD,Single-ply,11
Todd Walker,82.5,Open,M,137.5,135,185,457.5,SBD,Single-ply,12
Richard Fly,82.5,Open,M,150,97.5,162.5,410,SBD,Single-ply,13
Jas Anderson,82.5,Open,M,265,142.5,,,SBD,Single-ply,DQ
Stump Barnett,82.5,Open,M,292.5,160,,,SBD,Single-ply,DQ
Larry Mistric,90,Open,M,320,187.5,307.5,815,SBD,Single-ply,1
David Georges,90,Open,M,282.5,192.5,272.5,747.5,SBD,Single-ply,2
Pat Roberts,90,Open,M,287.5,172.5,275,735,SBD,Single-ply,3
Gary Bissell,90,Open,M,260,152.5,295,707.5,SBD,Single-ply,4
Tony Meyer,90,Open,M,265,192.5,250,707.5,SBD,Single-ply,5
Joe Smith,90,Open,M,202.5,150,242.5,595,SBD,Single-ply,6
John Haynes,90,Open,M,,,,,SBD,Single-ply,DQ
Ken Harrison,90,Open,M,250,167.5,,,SBD,Single-ply,DQ
Phil Castaneda,90,Open,M,317.5,,,,SBD,Single-ply,DQ
Chris Garcia,90,Open,M,,,,,SBD,Single-ply,DQ
Gil Thompson,100,Open,M,337.5,222.5,290,850,SBD,Single-ply,1
Pat Brown,100,Open,M,305,192.5,310,807.5,SBD,Single-ply,2
Cliff King,100,Open,M,307.5,175,302.5,785,SBD,Single-ply,3
Tom Allen,100,Open,M,322.5,187.5,272.5,782.5,SBD,Single-ply,4
B. Murray,100,Open,M,272.5,180,250,702.5,SBD,Single-ply,5
Rich Revilla,100,Open,M,240,167.5,277.5,685,SBD,Single-ply,6
Bill Griffin,100,Open,M,265,167.5,250,682.5,SBD,Single-ply,7
Freezy Small,100,Open,M,235,157.5,260,652.5,SBD,Single-ply,8
Shannon Rice,100,Open,M,220,152.5,247.5,620,SBD,Single-ply,9
Steve Wheeler,100,Open,M,227.5,122.5,242.5,592.5,SBD,Single-ply,10
Matt Henderson,100,Open,M,197.5,142.5,232.5,572.5,SBD,Single-ply,11
Tony Galavez,100,Open,M,,,,,SBD,Single-ply,DQ
E. Riley,100,Open,M,,,,,SBD,Single-ply,DQ
Rick Osburn,100,Open,M,,,,,SBD,Single-ply,DQ
Stacy Schaaf,100,Open,M,,,,,SBD,Single-ply,DQ
Scott Warman,110,Open,M,342.5,205,350,897.5,SBD,Single-ply,1
Rich Keller,110,Open,M,265,207.5,300,772.5,SBD,Single-ply,2
Dane Olson,110,Open,M,290,192.5,282.5,765,SBD,Single-ply,3
James LeRibeus,110,Open,M,277.5,165,302.5,745,SBD,Single-ply,4
Scott Lane,110,Open,M,255,197.5,265,717.5,SBD,Single-ply,5
Chandler George,110,Open,M,267.5,147.5,275,690,SBD,Single-ply,7
Chris Linblad,110,Open,M,262.5,170,275,707.5,SBD,Single-ply,6
Chas Bandy,110,Open,M,262.5,147.5,272.5,682.5,SBD,Single-ply,8
Larry Reed,110,Open,M,250,140,290,680,SBD,Single-ply,9
Mike Bandera,110,Open,M,332.5,160,,,SBD,Single-ply,DQ
Warren Vogel,125,Open,M,257.5,162.5,317.5,737.5,SBD,Single-ply,2
Hal Hudson,125,Open,M,282.5,165,287.5,735,SBD,Single-ply,3
Justin Turner,125,Open,M,252.5,207.5,267.5,727.5,SBD,Single-ply,4
Anthony Clark,125,Open,M,245,200,242.5,687.5,SBD,Single-ply,5
Mitch Walls,125,Open,M,250,170,260,680,SBD,Single-ply,6
Bill Lobins,125,Open,M,237.5,160,260,657.5,SBD,Single-ply,7
John Brace,125,Open,M,310,227.5,277.5,815,SBD,Single-ply,1
John Brick,125,Open,M,,,,,SBD,Single-ply,DQ
Craig Young,125+,Open,M,327.5,222.5,340,890,SBD,Single-ply,1
Doug Young,125+,Open,M,320,257.5,300,877.5,SBD,Single-ply,2
Robert Shultz,125+,Open,M,295,205,285,785,SBD,Single-ply,3
Jeff Ellwanger,125+,Open,M,,,,,SBD,Single-ply,DQ
Lindy Champion,,Open,F,152.5,82.5,165,400,SBD,Single-ply,1
Tam Thompson,,Open,F,137.5,85,162.5,385,SBD,Single-ply,2
Sally Aden,60,Open,F,130,70,155,355,SBD,Single-ply,3
M. Murdock,,Open,F,132.5,80,157.5,370,SBD,Single-ply,4
Teresa Mims-DeVoltz,52,Open,F,85,52.5,142.5,280,SBD,Single-ply,5
V. Jernigan,56,Open,F,90,,,,SBD,Single-ply,DQ
Rich Keller,110,Masters 40-49,M,265,207.5,300,772.5,SBD,Single-ply,1
Ed Bittick,,Masters 40-49,M,245,145,275,665,SBD,Single-ply,4
Hal Hudson,125,Masters 40-49,M,282.5,165,287.5,735,SBD,Single-ply,2
Jim Haga,,Masters 40-49,M,237.5,192.5,245,675,SBD,Single-ply,3
Gene Satsky,,Masters 40-49,M,205,107.5,212.5,525,SBD,Single-ply,5
Jim Griffith,,Masters 40-49,M,147.5,100,192.5,440,SBD,Single-ply,6
Richard Fly,82.5,Masters 50+,M,150,97.5,162.5,410,SBD,Single-ply,2
John Bowen,,Masters 50+,M,155,92.5,182.5,430,SBD,Single-ply,1
Steve Helton,,Masters 50+,M,75,167.5,75,317.5,SBD,Single-ply,3
