[api-updater (non-obsolete-error-filter)] 9/4/2021 11:14:53 AM : Starting C:/Program Files/Unity/Hub/Editor/2020.2.2f1/Editor/Data/Tools/ScriptUpdater/APIUpdater.NonObsoleteApiUpdaterDetector.exe
[api-updater (non-obsolete-error-filter)] 
----------------------------------
jit/startup time      : 184.4096ms
moved types parse time: 82ms
candidates parse time : 2ms
C# parse time         : 316ms
candidates check time : 133ms
console write time    : 0ms

[api-updater (non-obsolete-error-filter)] 9/4/2021 11:15:30 AM : Starting C:/Program Files/Unity/Hub/Editor/2020.2.2f1/Editor/Data/Tools/ScriptUpdater/APIUpdater.NonObsoleteApiUpdaterDetector.exe
[api-updater (non-obsolete-error-filter)] 
----------------------------------
jit/startup time      : 106.6864ms
moved types parse time: 96ms
candidates parse time : 1ms
C# parse time         : 300ms
candidates check time : 84ms
console write time    : 0ms

[api-updater (non-obsolete-error-filter)] 9/4/2021 11:15:39 AM : Starting C:/Program Files/Unity/Hub/Editor/2020.2.2f1/Editor/Data/Tools/ScriptUpdater/APIUpdater.NonObsoleteApiUpdaterDetector.exe
[api-updater (non-obsolete-error-filter)] 
----------------------------------
jit/startup time      : 103.7219ms
moved types parse time: 108ms
candidates parse time : 1ms
C# parse time         : 277ms
candidates check time : 72ms
console write time    : 0ms

[api-updater (non-obsolete-error-filter)] 9/4/2021 11:16:25 AM : Starting C:/Program Files/Unity/Hub/Editor/2020.2.2f1/Editor/Data/Tools/ScriptUpdater/APIUpdater.NonObsoleteApiUpdaterDetector.exe
[api-updater (non-obsolete-error-filter)] 
----------------------------------
jit/startup time      : 109.7331ms
moved types parse time: 80ms
candidates parse time : 1ms
C# parse time         : 265ms
candidates check time : 60ms
console write time    : 0ms

[api-updater (non-obsolete-error-filter)] 9/4/2021 11:16:42 AM : Starting C:/Program Files/Unity/Hub/Editor/2020.2.2f1/Editor/Data/Tools/ScriptUpdater/APIUpdater.NonObsoleteApiUpdaterDetector.exe
[api-updater (non-obsolete-error-filter)] 
----------------------------------
jit/startup time      : 93.7766ms
moved types parse time: 78ms
candidates parse time : 2ms
C# parse time         : 266ms
candidates check time : 58ms
console write time    : 0ms

[api-updater (non-obsolete-error-filter)] 9/4/2021 11:18:54 AM : Starting C:/Program Files/Unity/Hub/Editor/2020.2.2f1/Editor/Data/Tools/ScriptUpdater/APIUpdater.NonObsoleteApiUpdaterDetector.exe
[api-updater (non-obsolete-error-filter)] 
----------------------------------
jit/startup time      : 462.7574ms
moved types parse time: 80ms
candidates parse time : 2ms
C# parse time         : 308ms
candidates check time : 55ms
console write time    : 0ms

[api-updater (non-obsolete-error-filter)] 9/4/2021 11:26:15 AM : Starting C:/Program Files/Unity/Hub/Editor/2020.2.2f1/Editor/Data/Tools/ScriptUpdater/APIUpdater.NonObsoleteApiUpdaterDetector.exe
[api-updater (non-obsolete-error-filter)] 
----------------------------------
jit/startup time      : 202.4575ms
moved types parse time: 230ms
candidates parse time : 5ms
C# parse time         : 470ms
candidates check time : 119ms
console write time    : 1ms

[api-updater (non-obsolete-error-filter)] 9/4/2021 9:30:11 PM : Starting C:/Program Files/Unity/Hub/Editor/2020.2.2f1/Editor/Data/Tools/ScriptUpdater/APIUpdater.NonObsoleteApiUpdaterDetector.exe
[api-updater (non-obsolete-error-filter)] 
----------------------------------
jit/startup time      : 103.2302ms
moved types parse time: 79ms
candidates parse time : 1ms
C# parse time         : 286ms
candidates check time : 73ms
console write time    : 0ms

