module gitlab.com/yusuf.manshur/simple-bank

go 1.19

require (
	cloud.google.com/go/pubsub v1.30.0
	cloud.google.com/go/storage v1.28.1
	github.com/Shopify/sarama v1.34.1
	github.com/aws/aws-sdk-go v1.34.28
	github.com/brainlabs/snowflake v0.3.0
	github.com/go-ozzo/ozzo-validation/v4 v4.3.0
	github.com/go-redis/redis/v8 v8.11.5
	github.com/go-sql-driver/mysql v1.7.0
	github.com/gorilla/mux v1.8.0
	github.com/gorilla/schema v1.2.0
	github.com/jmoiron/sqlx v1.3.5
	github.com/lib/pq v1.10.7
	github.com/opentracing/opentracing-go v1.2.0
	github.com/pressly/goose/v3 v3.7.0
	github.com/sirupsen/logrus v1.9.0
	github.com/spf13/cast v1.5.0
	github.com/spf13/cobra v1.6.1
	github.com/stretchr/testify v1.8.1
	github.com/xdg/scram v1.0.3
	golang.org/x/crypto v0.0.0-20220722155217-630584e8d5aa
	golang.org/x/mod v0.8.0
	golang.org/x/sync v0.1.0
	google.golang.org/api v0.114.0
	gopkg.in/DataDog/dd-trace-go.v1 v1.43.1
	gopkg.in/yaml.v3 v3.0.1
)

require (
	cloud.google.com/go v0.110.0 // indirect
	cloud.google.com/go/compute v1.19.0 // indirect
	cloud.google.com/go/compute/metadata v0.2.3 // indirect
	cloud.google.com/go/iam v0.13.0 // indirect
	cloud.google.com/go/kms v1.10.1 // indirect
	github.com/DataDog/datadog-agent/pkg/obfuscate v0.0.0-20211129110424-6491aa3bf583 // indirect
	github.com/DataDog/datadog-go v4.8.2+incompatible // indirect
	github.com/DataDog/datadog-go/v5 v5.0.2 // indirect
	github.com/DataDog/sketches-go v1.2.1 // indirect
	github.com/Microsoft/go-winio v0.5.2 // indirect
	github.com/cespare/xxhash/v2 v2.2.0 // indirect
	github.com/davecgh/go-spew v1.1.1 // indirect
	github.com/dgraph-io/ristretto v0.1.0 // indirect
	github.com/dgryski/go-rendezvous v0.0.0-20200823014737-9f7001d12a5f // indirect
	github.com/dustin/go-humanize v1.0.0 // indirect
	github.com/eapache/go-resiliency v1.2.0 // indirect
	github.com/eapache/go-xerial-snappy v0.0.0-20180814174437-776d5712da21 // indirect
	github.com/eapache/queue v1.1.0 // indirect
	github.com/golang/glog v1.0.0 // indirect
	github.com/golang/groupcache v0.0.0-20200121045136-8c9f03a8e57e // indirect
	github.com/golang/protobuf v1.5.3 // indirect
	github.com/golang/snappy v0.0.4 // indirect
	github.com/google/go-cmp v0.5.9 // indirect
	github.com/google/uuid v1.3.0 // indirect
	github.com/googleapis/enterprise-certificate-proxy v0.2.3 // indirect
	github.com/googleapis/gax-go/v2 v2.7.1 // indirect
	github.com/hashicorp/errwrap v1.1.0 // indirect
	github.com/hashicorp/go-multierror v1.1.1 // indirect
	github.com/hashicorp/go-uuid v1.0.2 // indirect
	github.com/inconshreveable/mousetrap v1.0.1 // indirect
	github.com/jcmturner/aescts/v2 v2.0.0 // indirect
	github.com/jcmturner/dnsutils/v2 v2.0.0 // indirect
	github.com/jcmturner/gofork v1.0.0 // indirect
	github.com/jcmturner/gokrb5/v8 v8.4.2 // indirect
	github.com/jcmturner/rpc/v2 v2.0.3 // indirect
	github.com/jmespath/go-jmespath v0.4.0 // indirect
	github.com/josharian/intern v1.0.0 // indirect
	github.com/klauspost/compress v1.15.6 // indirect
	github.com/mailru/easyjson v0.7.7 // indirect
	github.com/philhofer/fwd v1.1.1 // indirect
	github.com/pierrec/lz4/v4 v4.1.15 // indirect
	github.com/pkg/errors v0.9.1 // indirect
	github.com/pmezard/go-difflib v1.0.0 // indirect
	github.com/rcrowley/go-metrics v0.0.0-20201227073835-cf1acfcdf475 // indirect
	github.com/spf13/pflag v1.0.5 // indirect
	github.com/tinylib/msgp v1.1.2 // indirect
	github.com/xdg/stringprep v1.0.3 // indirect
	go.opencensus.io v0.24.0 // indirect
	go4.org/intern v0.0.0-20211027215823-ae77deb06f29 // indirect
	go4.org/unsafe/assume-no-moving-gc v0.0.0-20220617031537-928513b29760 // indirect
	golang.org/x/net v0.8.0 // indirect
	golang.org/x/oauth2 v0.6.0 // indirect
	golang.org/x/sys v0.6.0 // indirect
	golang.org/x/text v0.8.0 // indirect
	golang.org/x/time v0.3.0 // indirect
	golang.org/x/xerrors v0.0.0-20220907171357-04be3eba64a2 // indirect
	google.golang.org/appengine v1.6.7 // indirect
	google.golang.org/genproto v0.0.0-20230330154414-c0448cd141ea // indirect
	google.golang.org/grpc v1.54.0 // indirect
	google.golang.org/protobuf v1.30.0 // indirect
	inet.af/netaddr v0.0.0-20220617031823-097006376321 // indirect
)
