^C:\DOCUMENTS AND SETTINGS\ADMIN\MY DOCUMENTS\VISUAL STUDIO 2010\PROJECTS\BMSS\BMSS\MY PROJECT\RESOURCES.RESX
^C:\DOCUMENTS AND SETTINGS\ADMIN\MY DOCUMENTS\VISUAL STUDIO 2010\PROJECTS\BMSS\BMSS\PRINTPO.RESX
C:\WINDOWS\ASSEMBLY\PUBPOL63.DAT
