^C:\DOCUMENTS AND SETTINGS\ADMIN\MY DOCUMENTS\VISUAL STUDIO 2010\PROJECTS\BMSS\BMSS\MY PROJECT\RESOURCES.RESX|C:\DOCUMENTS AND SETTINGS\ADMIN\MY DOCUMENTS\VISUAL STUDIO 2010\PROJECTS\BMSS\BMSS\PRINTPO.RESX
C:\DOCUMENTS AND SETTINGS\ADMIN\MY DOCUMENTS\VISUAL STUDIO 2010\PROJECTS\BMSS\BMSS\OBJ\DEBUG\BMSS.RESOURCES.RESOURCES
C:\DOCUMENTS AND SETTINGS\ADMIN\MY DOCUMENTS\VISUAL STUDIO 2010\PROJECTS\BMSS\BMSS\OBJ\DEBUG\BMSS.PRINTPO.RESOURCES
