{
    "pipelines":[
        {
            "startId":"org.unidata.mdm.data[RECORD_GET_START]",
            "subjectId":"",
            "description":"org.unidata.mdm.data.record.get.start.description",
            "segments":[
                {
                    "segmentType":"START",
                    "id":"org.unidata.mdm.data[RECORD_GET_START]"
                },
                {
                    "segmentType":"POINT",
                    "id":"org.unidata.mdm.data[RECORD_READ_ACCESS]"
                },
                {
                    "segmentType":"POINT",
                    "id":"org.unidata.mdm.data[RECORD_GET_DIFF]"
                },
                {
                    "segmentType":"POINT",
                    "id":"org.unidata.mdm.data[RECORD_GET_ATTRIBUTES_POSTPROCESSING]"
                },
                {
                    "segmentType":"CONNECTOR",
                    "id":"org.unidata.mdm.data[RELATIONS_GET_CONNECTOR]"
                },
                {
                    "id":"org.unidata.mdm.dq.data[RECORD_GET_QUALITY_CONNECTOR]",
                    "segmentType":"CONNECTOR"
                },
                {
                    "segmentType":"FINISH",
                    "id":"org.unidata.mdm.data[RECORD_GET_FINISH]"
                }
            ]
        },
        {
            "startId":"org.unidata.mdm.data[RELATION_GET_START]",
            "subjectId":"",
            "description":"org.unidata.mdm.data.relations.get.start.description",
            "segments":[
                {
                    "segmentType":"START",
                    "id":"org.unidata.mdm.data[RELATION_GET_START]"
                },
                {
                    "segmentType":"POINT",
                    "id":"org.unidata.mdm.data[RELATION_GET_ACCESS]"
                },
                {
                    "segmentType":"FINISH",
                    "id":"org.unidata.mdm.data[RELATION_GET_FINISH]"
                }
            ]
        },
        {
            "startId":"org.unidata.mdm.data[RECORD_UPSERT_START]",
            "subjectId":"",
            "description":"org.unidata.mdm.data.record.upsert.start.description",
            "segments":[
                {
                    "id":"org.unidata.mdm.data[RECORD_UPSERT_START]",
                    "segmentType":"START"
                },
                {
                    "id":"org.unidata.mdm.data[RECORD_UPSERT_ACCESS]",
                    "segmentType":"POINT"
                },
                {
                    "id":"org.unidata.mdm.data[RECORD_UPSERT_MEASURED]",
                    "segmentType":"POINT"
                },
                {
                    "id":"org.unidata.mdm.data[RECORD_UPSERT_PERIOD_CHECK]",
                    "segmentType":"POINT"
                },
                {
                    "id":"org.unidata.mdm.data[RECORD_UPSERT_SELECTOR]",
                    "segmentType":"SELECTOR",
                    "outcomeSegments" : {
                        "[DRAFT]" : [
                            {
                                "id":"org.unidata.mdm.data[RECORD_UPSERT_MODBOX]",
                                "segmentType":"POINT"
                            },
                            {
                                "id":"org.unidata.mdm.data[RECORD_UPSERT_TIMELINE]",
                                "segmentType":"POINT"
                            },
                            {
                                "id":"org.unidata.mdm.data[RECORD_UPSERT_DRAFT]",
                                "segmentType":"POINT"
                            }
                        ],
                        "[REGULAR]" : [
                            {
                                "id":"org.unidata.mdm.data[RECORD_UPSERT_VALIDATE]",
                                "segmentType":"POINT"
                            },
                            {
                                "id":"org.unidata.mdm.data[RECORD_UPSERT_MODBOX]",
                                "segmentType":"POINT"
                            },
                            {
                                "id":"org.unidata.mdm.data[RECORD_UPSERT_TIMELINE]",
                                "segmentType":"POINT"
                            },
                            {
                                "id":"org.unidata.mdm.data[RECORD_UPSERT_INDEXING]",
                                "segmentType":"POINT"
                            },
                            {
                                "id":"org.unidata.mdm.data[RECORD_UPSERT_LOB_SUBMIT]",
                                "segmentType":"POINT"
                            },
                            {
                                "id":"org.unidata.mdm.dq.data[RECORD_UPSERT_QUALITY_CONNECTOR]",
                                "segmentType":"CONNECTOR"
                            },
                            {
                                "id":"org.unidata.mdm.data[RECORD_UPSERT_PERSISTENCE]",
                                "segmentType":"POINT"
                            }
                        ]
                    }
                },
                {
                    "id":"org.unidata.mdm.data[RECORD_UPSERT_POSTPROCESSING]",
                    "segmentType":"POINT"
                },
                {
                    "id":"org.unidata.mdm.data[RELATIONS_UPSERT_CONNECTOR]",
                    "segmentType":"CONNECTOR"
                },
                {
                    "segmentType":"CONNECTOR",
                    "id":"org.unidata.mdm.data[RELATIONS_DELETE_CONNECTOR]"
                },
                {
                    "id":"org.unidata.mdm.data[RECORD_UPSERT_FINISH]",
                    "segmentType":"FINISH"
                }
            ]
        },
        {
            "startId":"org.unidata.mdm.data[RELATION_UPSERT_START]",
            "subjectId":"",
            "description":"org.unidata.mdm.data.relation.upsert.start.description",
            "segments":[
                {
                    "segmentType":"START",
                    "id":"org.unidata.mdm.data[RELATION_UPSERT_START]"
                },
                {
                    "segmentType":"POINT",
                    "id":"org.unidata.mdm.data[RELATION_UPSERT_ACCESS]"
                },
                {
                    "segmentType":"POINT",
                    "id":"org.unidata.mdm.data[RELATION_UPSERT_MEASURED]"
                },
                {
                    "segmentType":"POINT",
                    "id":"org.unidata.mdm.data[RELATION_UPSERT_PERIOD_CHECK]"
                },
                {
                    "id":"org.unidata.mdm.data[RELATION_UPSERT_SELECTOR]",
                    "segmentType":"SELECTOR",
                    "outcomeSegments" : {
                        "[DRAFT]" : [
                            {
                                "segmentType":"POINT",
                                "id":"org.unidata.mdm.data[RELATION_UPSERT_MODBOX]"
                            },
                            {
                                "segmentType":"POINT",
                                "id":"org.unidata.mdm.data[RELATION_UPSERT_TIMELINE]"
                            },
                            {
                                "id":"org.unidata.mdm.data[RELATION_UPSERT_DRAFT]",
                                "segmentType":"POINT"
                            }
                        ],
                        "[REGULAR]" : [
                            {
                                "segmentType":"POINT",
                                "id":"org.unidata.mdm.data[RELATION_UPSERT_VALIDATE]"
                            },
                            {
                                "segmentType":"POINT",
                                "id":"org.unidata.mdm.data[RELATION_UPSERT_MODBOX]"
                            },
                            {
                                "segmentType":"POINT",
                                "id":"org.unidata.mdm.data[RELATION_UPSERT_TIMELINE]"
                            },
                            {
                                "segmentType":"POINT",
                                "id":"org.unidata.mdm.data[RELATION_UPSERT_INDEXING]"
                            },
                            {
                                "segmentType":"POINT",
                                "id":"org.unidata.mdm.data[RELATION_UPSERT_PERSISTENCE]"
                            }
                        ]
                    }
                },
                {
                    "segmentType":"FINISH",
                    "id":"org.unidata.mdm.data[RELATION_UPSERT_FINISH]"
                }
            ]
        },
        {
            "startId":"org.unidata.mdm.data[RECORD_DELETE_START]",
            "subjectId":"",
            "description":"org.unidata.mdm.data.record.delete.start.description",
            "segments":[
                {
                    "segmentType":"START",
                    "id":"org.unidata.mdm.data[RECORD_DELETE_START]"
                },
                {
                    "segmentType":"POINT",
                    "id":"org.unidata.mdm.data[RECORD_DELETE_ACCESS]"
                },
                {
                    "segmentType":"CONNECTOR",
                    "id":"org.unidata.mdm.data[RELATIONS_DELETE_CONNECTOR]"
                },
                {
                    "segmentType":"POINT",
                    "id":"org.unidata.mdm.data[RECORD_DELETE_MEASURED]"
                },
                {
                    "segmentType":"POINT",
                    "id":"org.unidata.mdm.data[RECORD_DELETE_PERIOD_CHECK]"
                },
                {
                    "id":"org.unidata.mdm.data[RECORD_DELETE_SELECTOR]",
                    "segmentType":"SELECTOR",
                    "outcomeSegments" : {
                        "[DRAFT]" : [
                            {
                                "segmentType":"POINT",
                                "id":"org.unidata.mdm.data[RECORD_DELETE_MODBOX]"
                            },
                            {
                                "segmentType":"POINT",
                                "id":"org.unidata.mdm.data[RECORD_DELETE_TIMELINE]"
                            },
                            {
                                "id":"org.unidata.mdm.data[RECORD_DELETE_DRAFT]",
                                "segmentType":"POINT"
                            }
                        ],
                        "[REGULAR]" : [
                            {
                                "segmentType":"POINT",
                                "id":"org.unidata.mdm.data[RECORD_DELETE_DATA_CONSISTENCY]"
                            },
                            {
                                "segmentType":"POINT",
                                "id":"org.unidata.mdm.data[RECORD_DELETE_MODBOX]"
                            },
                            {
                                "segmentType":"POINT",
                                "id":"org.unidata.mdm.data[RECORD_DELETE_TIMELINE]"
                            },
                            {
                                "segmentType":"POINT",
                                "id":"org.unidata.mdm.data[RECORD_DELETE_INDEXING]"
                            },
                            {
                                "segmentType":"POINT",
                                "id":"org.unidata.mdm.data[RECORD_DELETE_PERSISTENCE]"
                            }
                        ]
                    }
                },
                {
                    "segmentType":"FINISH",
                    "id":"org.unidata.mdm.data[RECORD_DELETE_FINISH]"
                }
            ]
        },
        {
            "startId":"org.unidata.mdm.data[RELATION_DELETE_START]",
            "subjectId":"",
            "description":"org.unidata.mdm.data.relation.delete.start.description",
            "segments":[
                {
                    "segmentType":"START",
                    "id":"org.unidata.mdm.data[RELATION_DELETE_START]"
                },
                {
                    "segmentType":"POINT",
                    "id":"org.unidata.mdm.data[RELATION_DELETE_ACCESS]"
                },
                {
                    "segmentType":"POINT",
                    "id":"org.unidata.mdm.data[RELATION_DELETE_MEASURED]"
                },
                {
                    "segmentType":"POINT",
                    "id":"org.unidata.mdm.data[RELATION_DELETE_PERIOD_CHECK]"
                },
                {
                    "segmentType":"POINT",
                    "id":"org.unidata.mdm.data[RELATION_DELETE_MODBOX]"
                },
                {
                    "segmentType":"POINT",
                    "id":"org.unidata.mdm.data[RELATION_DELETE_TIMELINE]"
                },
                {
                    "id":"org.unidata.mdm.data[RELATION_DELETE_SELECTOR]",
                    "segmentType":"SELECTOR",
                    "outcomeSegments" : {
                        "[DRAFT]" : [
                            {
                                "id":"org.unidata.mdm.data[RELATION_DELETE_DRAFT]",
                                "segmentType":"POINT"
                            }
                        ],
                        "[REGULAR]" : [
                            {
                                "segmentType":"POINT",
                                "id":"org.unidata.mdm.data[RELATION_DELETE_INDEXING]"
                            },
                            {
                                "segmentType":"POINT",
                                "id":"org.unidata.mdm.data[RELATION_DELETE_PERSISTENCE]"
                            }
                        ]
                    }
                },
                {
                    "segmentType":"FINISH",
                    "id":"org.unidata.mdm.data[RELATION_DELETE_FINISH]"
                }
            ]
        },
        {
           "startId":"org.unidata.mdm.data[RELATION_MERGE_START]",
           "subjectId":"",
           "description":"org.unidata.mdm.data.relations.merge.start.description",
           "segments":[
              {
                 "segmentType":"START",
                 "id":"org.unidata.mdm.data[RELATION_MERGE_START]"
              },
              {
                 "segmentType":"POINT",
                 "id":"org.unidata.mdm.data[RELATION_MERGE_ACCESS]"
              },
              {
                 "segmentType":"POINT",
                 "id":"org.unidata.mdm.data[RELATION_MERGE_TIMELINE]"
              },
              {
                 "segmentType":"POINT",
                 "id":"org.unidata.mdm.data[RELATION_MERGE_INDEXING]"
              },
              {
                 "segmentType":"POINT",
                 "id":"org.unidata.mdm.data[RELATION_MERGE_PERSISTENCE]"
              },
              {
                 "segmentType":"FINISH",
                 "id":"org.unidata.mdm.data[RELATION_MERGE_FINISH]"
              }
           ]
        },
        {
           "startId":"org.unidata.mdm.data[RECORD_MERGE_START]",
           "subjectId":"",
           "description":"org.unidata.mdm.data.record.merge.start.description",
           "segments":[
              {
                 "segmentType":"START",
                 "id":"org.unidata.mdm.data[RECORD_MERGE_START]"
              },
              {
                 "segmentType":"POINT",
                 "id":"org.unidata.mdm.data[RECORD_MERGE_ACCESS]"
              },
              {
                 "segmentType":"POINT",
                 "id":"org.unidata.mdm.data[RECORD_MERGE_TIMELINE]"
              },
              {
                 "segmentType":"POINT",
                 "id":"org.unidata.mdm.data[RECORD_MERGE_INDEXING]"
              },
              {
                 "segmentType":"CONNECTOR",
                 "id":"org.unidata.mdm.data[RELATIONS_MERGE_CONNECTOR]"
              },
              {
                 "segmentType":"POINT",
                 "id":"org.unidata.mdm.data[RECORD_MERGE_PERSISTENCE]"
              },
              {
                 "segmentType":"POINT",
                 "id":"org.unidata.mdm.data[RECORD_MERGE_FAVORITES]"
              },
              {
                 "segmentType":"FINISH",
                 "id":"org.unidata.mdm.data[RECORD_MERGE_FINISH]"
              }
           ]
        },
        {
            "startId":"org.unidata.mdm.data[RECORD_PREVIEW_START]",
            "subjectId":"",
            "description":"org.unidata.mdm.data.record.preview.start.description",
            "segments":[
                {
                    "segmentType":"START",
                    "id":"org.unidata.mdm.data[RECORD_PREVIEW_START]"
                },
                {
                    "segmentType":"POINT",
                    "id":"org.unidata.mdm.data[RECORD_READ_ACCESS]"
                },
                {
                    "segmentType":"POINT",
                    "id":"org.unidata.mdm.data[RECORD_MERGE_TIMELINE]"
                },
                {
                    "segmentType":"FINISH",
                    "id":"org.unidata.mdm.data[RECORD_PREVIEW_FINISH]"
                }
            ]
        },
        {
            "startId":"org.unidata.mdm.data[RELATION_RESTORE_START]",
            "subjectId":"",
            "description":"org.unidata.mdm.data.relation.restore.start.description",
            "segments":[
                {
                    "segmentType":"START",
                    "id":"org.unidata.mdm.data[RELATION_RESTORE_START]"
                },
                {
                    "segmentType":"POINT",
                    "id":"org.unidata.mdm.data[RELATION_RESTORE_ACCESS]"
                },
                {
                    "segmentType":"POINT",
                    "id":"org.unidata.mdm.data[RELATION_RESTORE_MEASURED]"
                },
                {
                    "segmentType":"POINT",
                    "id":"org.unidata.mdm.data[RELATION_RESTORE_PERIOD_CHECK]"
                },
                {
                    "segmentType":"POINT",
                    "id":"org.unidata.mdm.data[RELATION_RESTORE_MODBOX]"
                },
                {
                    "segmentType":"POINT",
                    "id":"org.unidata.mdm.data[RELATION_RESTORE_TIMELINE]"
                },
                {
                    "id":"org.unidata.mdm.data[RELATION_RESTORE_SELECTOR]",
                    "segmentType":"SELECTOR",
                    "outcomeSegments" : {
                        "[DRAFT]" : [
                            {
                                "id":"org.unidata.mdm.data[RELATION_RESTORE_DRAFT]",
                                "segmentType":"POINT"
                            }
                        ],
                        "[REGULAR]" : [
                            {
                                "segmentType":"POINT",
                                "id":"org.unidata.mdm.data[RELATION_RESTORE_INDEXING]"
                            },
                            {
                                "segmentType":"POINT",
                                "id":"org.unidata.mdm.data[RELATION_RESTORE_PERSISTENCE]"
                            }
                        ]
                    }
                },
                {
                    "segmentType":"FINISH",
                    "id":"org.unidata.mdm.data[RELATION_RESTORE_FINISH]"
                }
            ]
        },
        {
            "startId":"org.unidata.mdm.data[RECORD_RESTORE_START]",
            "subjectId":"",
            "description":"org.unidata.mdm.data.record.restore.start.description",
            "segments":[
                {
                    "segmentType":"START",
                    "id":"org.unidata.mdm.data[RECORD_RESTORE_START]"
                },
                {
                    "segmentType":"POINT",
                    "id":"org.unidata.mdm.data[RECORD_RESTORE_ACCESS]"
                },
                {
                    "segmentType":"POINT",
                    "id":"org.unidata.mdm.data[RECORD_RESTORE_MEASURED]"
                },
                {
                    "segmentType":"POINT",
                    "id":"org.unidata.mdm.data[RECORD_RESTORE_PERIOD_CHECK]"
                },
                {
                    "id":"org.unidata.mdm.data[RECORD_RESTORE_SELECTOR]",
                    "segmentType":"SELECTOR",
                    "outcomeSegments" : {
                        "[DRAFT]" : [
                            {
                                "segmentType":"POINT",
                                "id":"org.unidata.mdm.data[RECORD_RESTORE_MODBOX]"
                            },
                            {
                                "segmentType":"POINT",
                                "id":"org.unidata.mdm.data[RECORD_RESTORE_TIMELINE]"
                            },
                            {
                                "id":"org.unidata.mdm.data[RECORD_RESTORE_DRAFT]",
                                "segmentType":"POINT"
                            }
                        ],
                        "[REGULAR]" : [
                            {
                                "segmentType":"POINT",
                                "id":"org.unidata.mdm.data[RECORD_RESTORE_MODBOX]"
                            },
                            {
                                "segmentType":"POINT",
                                "id":"org.unidata.mdm.data[RECORD_RESTORE_TIMELINE]"
                            },
                            {
                                "segmentType":"POINT",
                                "id":"org.unidata.mdm.data[RECORD_RESTORE_VALIDATE]"
                            },
                            {
                                "segmentType":"POINT",
                                "id":"org.unidata.mdm.data[RECORD_RESTORE_INDEXING]"
                            },
                            {
                                "segmentType":"POINT",
                                "id":"org.unidata.mdm.data[RECORD_RESTORE_PERSISTENCE]"
                            }
                        ]
                    }
                },
                {
                    "segmentType":"CONNECTOR",
                    "id":"org.unidata.mdm.data[RELATIONS_RESTORE_CONNECTOR]"
                },
                {
                    "segmentType":"FINISH",
                    "id":"org.unidata.mdm.data[RECORD_RESTORE_FINISH]"
                }
            ]
        },
        {
            "startId":"org.unidata.mdm.core[MODEL_UPSERT_START]",
            "subjectId":"",
            "description":"org.unidata.mdm.core.model.get.start.description",
            "segments":[
                {
                    "segmentType":"START",
                    "id":"org.unidata.mdm.core[MODEL_UPSERT_START]"
                },
                {
                    "segmentType":"POINT",
                    "id":"org.unidata.mdm.core[MODEL_UPSERT_POINT]"
                },
                {
                    "segmentType":"FINISH",
                    "id":"org.unidata.mdm.core[MODEL_UPSERT_FINISH]"
                }
            ]
        },
        {
           "startId":"org.unidata.mdm.meta[MODEL_DRAFT_UPSERT_START]",
           "subjectId":"",
           "description":"org.unidata.mdm.meta.model.draft.upsert.start.description",
           "segments":[
              {
                 "segmentType":"START",
                 "id":"org.unidata.mdm.meta[MODEL_DRAFT_UPSERT_START]"
              },
              {
                 "segmentType":"FINISH",
                 "id":"org.unidata.mdm.meta[MODEL_DRAFT_UPSERT_FINISH]"
              }
           ]
        },
        {
           "startId":"org.unidata.mdm.core[MODEL_GET_START]",
           "subjectId":"",
           "description":"org.unidata.mdm.core.model.get.start.description",
           "segments":[
              {
                 "segmentType":"START",
                 "id":"org.unidata.mdm.core[MODEL_GET_START]"
              },
              {
                 "segmentType":"FINISH",
                 "id":"org.unidata.mdm.core[MODEL_GET_FINISH]"
              }
           ]
        },
        {
           "startId":"org.unidata.mdm.meta[MODEL_DRAFT_GET_START]",
           "subjectId":"",
           "description":"org.unidata.mdm.meta.model.get.start.description",
           "segments":[
              {
                 "segmentType":"START",
                 "id":"org.unidata.mdm.meta[MODEL_DRAFT_GET_START]"
              },
              {
                 "segmentType":"FINISH",
                 "id":"org.unidata.mdm.meta[MODEL_DRAFT_GET_FINISH]"
              }
           ]
        },
        {
           "startId":"org.unidata.mdm.meta[MODEL_DRAFT_PUBLISH_START]",
           "subjectId":"",
           "description":"org.unidata.mdm.meta.model.draft.publish.start.description",
           "segments":[
              {
                 "segmentType":"START",
                 "id":"org.unidata.mdm.meta[MODEL_DRAFT_PUBLISH_START]"
              },
              {
                 "segmentType":"FINISH",
                 "id":"org.unidata.mdm.meta[MODEL_DRAFT_PUBLISH_FINISH]"
              }
           ]
        },
        {
           "startId":"org.unidata.mdm.core[MODEL_REFRESH_START]",
           "subjectId":"",
           "description":"org.unidata.mdm.core.model.refresh.start.description",
           "segments":[
              {
                 "segmentType":"START",
                 "id":"org.unidata.mdm.core[MODEL_REFRESH_START]"
              },
              {
                 "segmentType":"POINT",
                 "id":"org.unidata.mdm.core[MODEL_REFRESH_POINT]"
              },
              {
                 "segmentType":"FINISH",
                 "id":"org.unidata.mdm.core[MODEL_REFRESH_FINISH]"
              }
           ]
        },
        {
            "startId":"org.unidata.mdm.data[RECORD_DRAFT_UPSERT_START]",
            "subjectId":"",
            "description":"org.unidata.mdm.data.record.draft.upsert.start.description",
            "segments":[
                {
                    "segmentType":"START",
                    "id":"org.unidata.mdm.data[RECORD_DRAFT_UPSERT_START]"
                },
                {
                    "segmentType":"POINT",
                    "id":"org.unidata.mdm.data[RECORD_DRAFT_UPSERT_PROCESS]"
                },
                {
                    "segmentType":"FINISH",
                    "id":"org.unidata.mdm.data[RECORD_DRAFT_UPSERT_FINISH]"
                }
            ]
        },
        {
            "startId":"org.unidata.mdm.data[RECORD_DRAFT_GET_START]",
            "subjectId":"",
            "description":"org.unidata.mdm.data.record.draft.get.start.description",
            "segments":[
                {
                    "segmentType":"START",
                    "id":"org.unidata.mdm.data[RECORD_DRAFT_GET_START]"
                },
                {
                    "segmentType":"FINISH",
                    "id":"org.unidata.mdm.data[RECORD_DRAFT_GET_FINISH]"
                }
            ]
        },
        {
            "startId":"org.unidata.mdm.data[RECORD_DRAFT_PUBLISH_START]",
            "subjectId":"",
            "description":"org.unidata.mdm.data.record.draft.publish.start.description",
            "segments":[
                {
                    "segmentType":"START",
                    "id":"org.unidata.mdm.data[RECORD_DRAFT_PUBLISH_START]"
                },
                {
                    "segmentType":"FINISH",
                    "id":"org.unidata.mdm.data[RECORD_DRAFT_PUBLISH_FINISH]"
                }
            ]
        },
        {
            "startId":"org.unidata.mdm.data[RELATION_DRAFT_UPSERT_START]",
            "subjectId":"",
            "description":"org.unidata.mdm.data.relation.draft.upsert.start.description",
            "segments":[
                {
                    "segmentType":"START",
                    "id":"org.unidata.mdm.data[RELATION_DRAFT_UPSERT_START]"
                },
                {
                    "segmentType":"POINT",
                    "id":"org.unidata.mdm.data[RELATION_DRAFT_UPSERT_PROCESS]"
                },
                {
                    "segmentType":"FINISH",
                    "id":"org.unidata.mdm.data[RELATION_DRAFT_UPSERT_FINISH]"
                }
            ]
        },
        {
            "startId":"org.unidata.mdm.data[RELATION_DRAFT_GET_START]",
            "subjectId":"",
            "description":"org.unidata.mdm.data.relation.draft.get.start.description",
            "segments":[
                {
                    "segmentType":"START",
                    "id":"org.unidata.mdm.data[RELATION_DRAFT_GET_START]"
                },
                {
                    "segmentType":"FINISH",
                    "id":"org.unidata.mdm.data[RELATION_DRAFT_GET_FINISH]"
                }
            ]
        },
        {
            "startId":"org.unidata.mdm.data[RELATION_DRAFT_PUBLISH_START]",
            "subjectId":"",
            "description":"org.unidata.mdm.data.relation.draft.publish.start.description",
            "segments":[
                {
                    "segmentType":"START",
                    "id":"org.unidata.mdm.data[RELATION_DRAFT_PUBLISH_START]"
                },
                {
                    "segmentType":"FINISH",
                    "id":"org.unidata.mdm.data[RELATION_DRAFT_PUBLISH_FINISH]"
                }
            ]
        },
        {
           "startId":"org.unidata.mdm.dq.core[QUALITY_DRAFT_UPSERT_START]",
           "subjectId":"",
           "description":"org.unidata.mdm.dq.core.dq.draft.upsert.start.description",
           "segments":[
              {
                 "segmentType":"START",
                 "id":"org.unidata.mdm.dq.core[QUALITY_DRAFT_UPSERT_START]"
              },
              {
                 "segmentType":"FINISH",
                 "id":"org.unidata.mdm.dq.core[QUALITY_DRAFT_UPSERT_FINISH]"
              }
           ]
        },
        {
           "startId":"org.unidata.mdm.dq.core[QUALITY_DRAFT_GET_START]",
           "subjectId":"",
           "description":"org.unidata.mdm.dq.core.dq.get.start.description",
           "segments":[
              {
                 "segmentType":"START",
                 "id":"org.unidata.mdm.dq.core[QUALITY_DRAFT_GET_START]"
              },
              {
                 "segmentType":"FINISH",
                 "id":"org.unidata.mdm.dq.core[QUALITY_DRAFT_GET_FINISH]"
              }
           ]
        },
        {
           "startId":"org.unidata.mdm.dq.core[QUALITY_DRAFT_PUBLISH_START]",
           "subjectId":"",
           "description":"org.unidata.mdm.dq.core.dq.draft.publish.start.description",
           "segments":[
              {
                 "segmentType":"START",
                 "id":"org.unidata.mdm.dq.core[QUALITY_DRAFT_PUBLISH_START]"
              },
              {
                 "segmentType":"FINISH",
                 "id":"org.unidata.mdm.dq.core[QUALITY_DRAFT_PUBLISH_FINISH]"
              }
           ]
        },
        {
           "startId":"org.unidata.mdm.dq.data[RECORD_UPSERT_QUALITY_START]",
           "subjectId":"",
           "description":"org.unidata.mdm.dq.data.record.upsert.quality.start.description",
           "segments":[
              {
                 "segmentType":"START",
                 "id":"org.unidata.mdm.dq.data[RECORD_UPSERT_QUALITY_START]"
              },
              {
                 "segmentType":"POINT",
                 "id":"org.unidata.mdm.dq.data[RECORD_UPSERT_QUALITY_POINT]"
              },
              {
                 "segmentType":"POINT",
                 "id":"org.unidata.mdm.dq.data[RECORD_UPSERT_QUALITY_GATE]"
              },
              {
                 "segmentType":"FINISH",
                 "id":"org.unidata.mdm.dq.data[RECORD_UPSERT_QUALITY_FINISH]"
              }
           ]
        },
        {
           "startId":"org.unidata.mdm.data[BATCH_RECORD_UPSERT_START]",
           "subjectId":"",
           "description":"org.unidata.mdm.data.batch.record.upsert.start.description",
           "segments":[
              {
                 "segmentType":"START",
                 "id":"org.unidata.mdm.data[BATCH_RECORD_UPSERT_START]"
              },
              {
                 "segmentType":"POINT",
                 "id":"org.unidata.mdm.data[BATCH_RECORD_UPSERT_PROCESS]"
              },
              {
                 "segmentType":"POINT",
                 "id":"org.unidata.mdm.data[BATCH_RECORD_UPSERT_PERSISTENCE]"
              },
              {
                 "segmentType":"CONNECTOR",
                 "id":"org.unidata.mdm.data[BATCH_RELATIONS_UPSERT_CONNECTOR]"
              },
              {
                 "segmentType":"FINISH",
                 "id":"org.unidata.mdm.data[BATCH_RECORD_UPSERT_FINISH]"
              }
           ]
        },
        {
           "startId":"org.unidata.mdm.data[BATCH_RECORD_DELETE_START]",
           "subjectId":"",
           "description":"org.unidata.mdm.data.batch.record.delete.start.description",
           "segments":[
              {
                 "segmentType":"START",
                 "id":"org.unidata.mdm.data[BATCH_RECORD_DELETE_START]"
              },
              {
                 "segmentType":"POINT",
                 "id":"org.unidata.mdm.data[BATCH_RECORD_DELETE_PROCESS]"
              },
              {
                 "segmentType":"POINT",
                 "id":"org.unidata.mdm.data[BATCH_RECORD_DELETE_PERSISTENCE]"
              },
              {
                 "segmentType":"CONNECTOR",
                 "id":"org.unidata.mdm.data[BATCH_RELATIONS_DELETE_CONNECTOR]"
              },
              {
                 "segmentType":"FINISH",
                 "id":"org.unidata.mdm.data[BATCH_RECORD_DELETE_FINISH]"
              }
           ]
        },
        {
           "startId":"org.unidata.mdm.data[BATCH_RELATIONS_UPSERT_START]",
           "subjectId":"",
           "description":"org.unidata.mdm.data.batch.relations.upsert.start.description",
           "segments":[
              {
                 "segmentType":"START",
                 "id":"org.unidata.mdm.data[BATCH_RELATIONS_UPSERT_START]"
              },
              {
                 "segmentType":"POINT",
                 "id":"org.unidata.mdm.data[BATCH_RELATIONS_UPSERT_PROCESS]"
              },
              {
                 "segmentType":"POINT",
                 "id":"org.unidata.mdm.data[BATCH_RELATIONS_UPSERT_PERSISTENCE]"
              },
              {
                 "segmentType":"FINISH",
                 "id":"org.unidata.mdm.data[BATCH_RELATIONS_UPSERT_FINISH]"
              }
           ]
        },
        {
           "startId":"org.unidata.mdm.data[BATCH_RELATIONS_DELETE_START]",
           "subjectId":"",
           "description":"org.unidata.mdm.data.batch.record.delete.start.description",
           "segments":[
              {
                 "segmentType":"START",
                 "id":"org.unidata.mdm.data[BATCH_RELATIONS_DELETE_START]"
              },
              {
                 "segmentType":"POINT",
                 "id":"org.unidata.mdm.data[BATCH_RELATIONS_DELETE_PROCESS]"
              },
              {
                 "segmentType":"POINT",
                 "id":"org.unidata.mdm.data[BATCH_RELATIONS_DELETE_PERSISTENCE]"
              },
              {
                 "segmentType":"FINISH",
                 "id":"org.unidata.mdm.data[BATCH_RELATIONS_DELETE_FINISH]"
              }
           ]
        }
    ]
}