module gitlab/task3281

go 1.19

require (
	github.com/go-chi/chi v1.5.5
	github.com/go-chi/jwtauth/v5 v5.3.1
	github.com/stretchr/testify v1.9.0
	github.com/swaggo/http-swagger v1.3.4
	github.com/swaggo/swag v1.16.3
	golang.org/x/crypto v0.21.0

)

require (
	github.com/KyleBanks/depth v1.2.1 // indirect
	github.com/davecgh/go-spew v1.1.1 // indirect
	github.com/decred/dcrd/dcrec/secp256k1/v4 v4.2.0 // indirect
	github.com/go-openapi/jsonpointer v0.19.5 // indirect
	github.com/go-openapi/jsonreference v0.20.0 // indirect
	github.com/go-openapi/spec v0.20.6 // indirect
	github.com/go-openapi/swag v0.19.15 // indirect
	github.com/goccy/go-json v0.10.2 // indirect
	github.com/josharian/intern v1.0.0 // indirect
	github.com/lestrrat-go/blackmagic v1.0.2 // indirect
	github.com/lestrrat-go/httpcc v1.0.1 // indirect
	github.com/lestrrat-go/httprc v1.0.4 // indirect
	github.com/lestrrat-go/iter v1.0.2 // indirect
	github.com/lestrrat-go/jwx/v2 v2.0.20 // indirect
	github.com/lestrrat-go/option v1.0.1 // indirect
	github.com/mailru/easyjson v0.7.6 // indirect
	github.com/pmezard/go-difflib v1.0.0 // indirect
	github.com/segmentio/asm v1.2.0 // indirect
	github.com/swaggo/files v0.0.0-20220610200504-28940afbdbfe // indirect
	golang.org/x/net v0.21.0 // indirect
	golang.org/x/sys v0.18.0 // indirect
	golang.org/x/tools v0.7.0 // indirect
	gopkg.in/yaml.v2 v2.4.0 // indirect
	gopkg.in/yaml.v3 v3.0.1 // indirect
)
