module gitlab/controller

go 1.19

require (
	github.com/go-chi/chi/v5 v5.0.7
	github.com/go-chi/jwtauth/v5 v5.3.1
	github.com/joho/godotenv v1.4.0
	github.com/json-iterator/go v1.1.12
	github.com/ptflp/godecoder v0.0.1
	github.com/stretchr/testify v1.9.0
	github.com/swaggo/http-swagger v1.3.4
	github.com/swaggo/http-swagger/v2 v2.0.2
	github.com/swaggo/swag v1.16.3
	go.uber.org/zap v1.27.0
	golang.org/x/crypto v0.23.0
	golang.org/x/sync v0.7.0

)

require (
	github.com/KyleBanks/depth v1.2.1 // indirect
	github.com/davecgh/go-spew v1.1.1 // indirect
	github.com/decred/dcrd/dcrec/secp256k1/v4 v4.2.0 // indirect
	github.com/go-openapi/jsonpointer v0.21.0 // indirect
	github.com/go-openapi/jsonreference v0.21.0 // indirect
	github.com/go-openapi/spec v0.21.0 // indirect
	github.com/go-openapi/swag v0.23.0 // indirect
	github.com/goccy/go-json v0.10.2 // indirect
	github.com/josharian/intern v1.0.0 // indirect
	github.com/lestrrat-go/blackmagic v1.0.2 // indirect
	github.com/lestrrat-go/httpcc v1.0.1 // indirect
	github.com/lestrrat-go/httprc v1.0.4 // indirect
	github.com/lestrrat-go/iter v1.0.2 // indirect
	github.com/lestrrat-go/jwx/v2 v2.0.20 // indirect
	github.com/lestrrat-go/option v1.0.1 // indirect
	github.com/mailru/easyjson v0.7.7 // indirect
	github.com/modern-go/concurrent v0.0.0-20180306012644-bacd9c7ef1dd // indirect
	github.com/modern-go/reflect2 v1.0.2 // indirect
	github.com/pmezard/go-difflib v1.0.0 // indirect
	github.com/segmentio/asm v1.2.0 // indirect
	github.com/swaggo/files v1.0.1 // indirect
	github.com/swaggo/files/v2 v2.0.0 // indirect
	go.uber.org/multierr v1.10.0 // indirect
	golang.org/x/net v0.25.0 // indirect
	golang.org/x/sys v0.20.0 // indirect
	golang.org/x/tools v0.21.0 // indirect
	gopkg.in/yaml.v3 v3.0.1 // indirect
)
