{
    "swagger": "2.0",
    "info": {
        "description": "Геосервис API с авторизацией",
        "title": "задача Реализация кэширования истории поиска",
        "contact": {},
        "version": "2.0"
    },
    "host": "localhost:8080",
    "basePath": "/",
    "paths": {
        "/api/address/search": {
            "post": {
                "description": "Поиск адреса./",
                "consumes": [
                    "application/json"
                ],
                "produces": [
                    "application/json"
                ],
                "tags": [
                    "geocode"
                ],
                "summary": "Поиск адреса",
                "operationId": "search",
                "parameters": [
                    {
                        "description": "Search request",
                        "name": "request",
                        "in": "body",
                        "required": true,
                        "schema": {
                            "$ref": "#/definitions/models.SearchRequest"
                        }
                    }
                ],
                "responses": {
                    "200": {
                        "description": "OK",
                        "schema": {
                            "$ref": "#/definitions/models.GeoResponse"
                        }
                    },
                    "400": {
                        "description": "Bad request",
                        "schema": {
                            "type": "string"
                        }
                    },
                    "500": {
                        "description": "Internal server error",
                        "schema": {
                            "type": "string"
                        }
                    }
                }
            }
        }
    },
    "definitions": {
        "models.Address": {
            "type": "object",
            "properties": {
                "value": {
                    "type": "string"
                }
            }
        },
        "models.GeoResponse": {
            "type": "object",
            "properties": {
                "suggestions": {
                    "type": "array",
                    "items": {
                        "$ref": "#/definitions/models.Address"
                    }
                }
            }
        },
        "models.SearchRequest": {
            "type": "object",
            "properties": {
                "query": {
                    "type": "string"
                }
            }
        }
    }
}