<svg width="52" height="52" viewBox="0 0 52 52" fill="none" xmlns="http://www.w3.org/2000/svg">
<path d="M39.7886 16.8076L36.7245 13.7435L24.468 26L36.7244 38.2564L39.7885 35.1923L30.5962 26L39.7886 16.8076Z" fill="#152F70"/>
<path d="M24.4679 13.7435L27.532 16.8076L18.3395 26L27.532 35.1923L24.4677 38.2564L12.2113 26L24.4679 13.7435Z" fill="#152F70"/>
</svg>
