<svg xmlns="http://www.w3.org/2000/svg" width="28" height="28" viewBox="0 0 28 28">
  <g id="Group_5298" data-name="Group 5298" transform="translate(18866 -1038)">
    <rect id="Rectangle_615" data-name="Rectangle 615" width="28" height="28" transform="translate(-18866 1038)" fill="none"/>
    <g id="Group_5263" data-name="Group 5263" transform="translate(-18864.988 1037.997)">
      <path id="Path_996" data-name="Path 996" d="M24,68.266V66.071a9.967,9.967,0,1,1,19.933-.105v2.3a.767.767,0,0,1-.767.767h-18.4A.767.767,0,0,1,24,68.266Z" transform="translate(-21.012 -48.995)" fill="none" stroke="#fff" stroke-linecap="round" stroke-linejoin="round" stroke-width="1"/>
      <line id="Line_84" data-name="Line 84" y2="2.053" transform="translate(13.006 7.694)" fill="none" stroke="#fff" stroke-linecap="round" stroke-linejoin="round" stroke-width="1"/>
      <line id="Line_85" data-name="Line 85" x2="2.971" y2="0.795" transform="translate(3.324 14.393)" fill="none" stroke="#fff" stroke-linecap="round" stroke-linejoin="round" stroke-width="1"/>
      <line id="Line_86" data-name="Line 86" x1="2.971" y2="0.795" transform="translate(19.614 14.393)" fill="none" stroke="#fff" stroke-linecap="round" stroke-linejoin="round" stroke-width="1"/>
      <line id="Line_87" data-name="Line 87" y1="8.539" x2="6.555" transform="translate(10.597 11.499)" fill="none" stroke="#fff" stroke-linecap="round" stroke-linejoin="round" stroke-width="1"/>
    </g>
  </g>
</svg>
