<svg xmlns="http://www.w3.org/2000/svg" xmlns:xlink="http://www.w3.org/1999/xlink" width="142" height="20">
    <linearGradient id="s" x2="0" y2="100%">
        <stop offset="0" stop-color="#bbb" stop-opacity=".1"/>
        <stop offset="1" stop-opacity=".1"/>
    </linearGradient>
    <clipPath id="r">
        <rect width="142" height="20" rx="3" fill="#fff"/>
    </clipPath>
    <g clip-path="url(#r)">
        <rect width="99" height="20" fill="#555"/>
        <rect x="99" width="43" height="20" fill="#a4a61d"/>
        <rect width="142" height="20" fill="url(#s)"/>
    </g>
    <g fill="#fff" text-anchor="middle" font-family="Verdana,Geneva,DejaVu Sans,sans-serif" font-size="110">
        <text x="505" y="150" fill="#010101" fill-opacity=".3" transform="scale(.1)" textLength="890">docstr-coverage</text>
        <text x="505" y="140" transform="scale(.1)" textLength="890">docstr-coverage</text>
        <text x="1195" y="150" fill="#010101" fill-opacity=".3" transform="scale(.1)">81%</text>
        <text x="1195" y="140" transform="scale(.1)">81%</text>
    </g>
</svg>