................
----------------------------------------------------------------------
Ran 16 tests in 0.773s

OK
Name             Stmts   Miss Branch BrPart  Cover   Missing
------------------------------------------------------------
Collatz.py          47      0     18      1    98%   42->47
TestCollatz.py      70      0      0      0   100%
------------------------------------------------------------
TOTAL              117      0     18      1    99%
