.......
----------------------------------------------------------------------
Ran 7 tests in 0.092s

OK
Name             Stmts   Miss Branch BrPart  Cover   Missing
------------------------------------------------------------
Collatz.py          48      3     28      3    89%   137-139, 39->exit, 127->130, 136->137
TestCollatz.py      48      0      0      0   100%
------------------------------------------------------------
TOTAL               96      3     28      3    94%
