// Online Java Compiler
// Use this editor to write, compile and run your Java code online
import java.util.*;

class HelloWorld {
    public static void main(String[] args) {
        
        //Collection 3, name, State Salary 
        
        //1. Fill collection with some data. Largest salary in collection
        
        List<Integer> salary=new ArrayList<Integer>();
        
        salary.add(1000);
        salary.add(5000);
        salary.add(3000);
        salary.add(4000);
        int maximumSalary=0;
       for(int each=0;each<salary.size();each++){
           if(each<salary.size()-1){
           if(salary.get(each)>salary.get(each+1)&&salary.get(each)>maximumSalary){
               maximumSalary=salary.get(each);
           }else if(salary.get(each+1)>maximumSalary){
               maximumSalary=salary.get(each+1);
           }
           }
           
           
       }System.out.println(maximumSalary);
    }
}



import java.util.*;

class HelloWorld {
    public static void main(String[] args) {
        
        //Collection 3, name, State Salary 
        
        //1. Fill collection with some data. Largest salary in collection
        Dictionary<Integer, HashMap<String, Object>> dataTable=new Hashtable<Integer, HashMap<String, Object>>();
        
        HashMap<String, Object> eachRow=new HashMap<String, Object>();
        eachRow.put("Name","Venkata");
        eachRow.put("State","A.P");
        eachRow.put("Salary",10000);
        
        dataTable.put(eachRow);
        
        HashMap<String, Object> eachRow2=new HashMap<String, Object>();
        eachRow.put("Name","Yugandhar");
        eachRow.put("State","Telangana");
        eachRow.put("Salary",20000);
        dataTable.put(eachRow2);
          for(int eachrecord=0;eachrecord<dataTable.size();eachrecord++){
            if(dataTable.get(eachRecord).get("State").equalsignorecase("A.P")){
                dataTable.get(eachRecord).get("Salary")= dataTable.get(eachRecord).get("Salary")+2000;
            }
        }
        
        for(int each=0;each<dataTable.size();each++){
           for(EntrySet<String, Object> eachSet:dataTable.get(each).entrySet()){
               System.out.println(eachSet.getKey()+"--->"+eachSet.getValue());
               
           }
         }
       }
}