﻿object={
	name="palm_dense_generator_2_0"
	clamp_to_water_level=no
	render_under_water=no
	generated_content=yes
	layer="semidynamic_medium"
	pdxmesh="tree_palm_01_mesh"
	count=7
	transform="5485.942871 0.000000 1264.597168 0.000000 0.392880 0.000000 0.919590 0.294157 0.294157 0.294157
5487.448242 0.000000 1267.163818 0.000000 0.728043 0.000000 0.685532 0.371299 0.371299 0.371299
4783.436035 0.000000 2407.065186 0.000000 0.825051 0.000000 0.565059 0.393183 0.393183 0.393183
4836.952637 0.000000 2412.820557 0.000000 0.812080 0.000000 0.583546 0.383566 0.383566 0.383566
4844.194824 0.000000 2440.905518 0.000000 0.115954 0.000000 0.993255 0.219472 0.219472 0.219472
4847.645996 0.000000 2436.526123 0.000000 0.007004 0.000000 0.999975 0.314527 0.314527 0.314527
4846.421387 0.000000 2437.875244 0.000000 0.752471 0.000000 0.658626 0.443854 0.443854 0.443854
"}
object={
	name="palm_dense_generator_2_1"
	clamp_to_water_level=no
	render_under_water=no
	generated_content=yes
	layer="semidynamic_medium"
	pdxmesh="tree_palm_02_mesh"
	count=10
	transform="5529.681152 0.000000 1219.949341 0.000000 0.907362 0.000000 -0.420350 0.583668 0.583668 0.583668
5487.537109 0.000000 1269.784668 0.000000 0.933512 0.000000 0.358547 0.430101 0.430101 0.430101
4771.765137 0.000000 2398.190918 0.000000 0.999955 0.000000 -0.009438 0.502011 0.502011 0.502011
4789.994141 0.000000 2393.629883 0.000000 0.969121 0.000000 0.246585 0.448216 0.448216 0.448216
4782.693848 0.000000 2404.402344 0.000000 0.883896 0.000000 0.467684 0.416348 0.416348 0.416348
4782.782227 0.000000 2414.407959 0.000000 0.989490 0.000000 0.144598 0.472232 0.472232 0.472232
4772.144531 0.000000 2421.305176 0.000000 0.939153 0.000000 0.343500 0.446295 0.446295 0.446295
4766.288086 0.000000 2426.806152 0.000000 0.951293 0.000000 0.308289 0.447070 0.447070 0.447070
4792.708984 0.000000 2392.787354 0.000000 0.956273 0.000000 0.292477 0.452093 0.452093 0.452093
4827.678223 0.000000 2433.842285 0.000000 0.904153 0.000000 -0.427208 0.580169 0.580169 0.580169
"}
object={
	name="palm_dense_generator_2_2"
	clamp_to_water_level=no
	render_under_water=no
	generated_content=yes
	layer="semidynamic_medium"
	pdxmesh="tree_palm_03_mesh"
	count=11
	transform="5527.955566 0.000000 1219.962402 0.000000 0.456117 0.000000 -0.889920 0.677544 0.677544 0.677544
5516.552734 0.000000 1268.850342 0.000000 0.111112 0.000000 -0.993808 0.806609 0.806609 0.806609
4772.620605 0.000000 2419.052246 0.000000 0.645156 0.000000 -0.764051 0.670960 0.670960 0.670960
4789.860840 0.000000 2420.410156 0.000000 0.335474 0.000000 -0.942049 0.718558 0.718558 0.718558
4791.819336 0.000000 2391.174561 0.000000 0.029887 0.000000 -0.999553 0.813333 0.813333 0.813333
4772.550293 0.000000 2403.137695 0.000000 0.381130 0.000000 -0.924522 0.685117 0.685117 0.685117
4773.577148 0.000000 2420.512207 0.000000 0.342124 0.000000 -0.939655 0.687107 0.687107 0.687107
4782.867676 0.000000 2402.803467 0.000000 0.562102 0.000000 -0.827068 0.708414 0.708414 0.708414
4832.618164 0.000000 2432.193848 0.000000 0.859709 0.000000 -0.510784 0.605800 0.605800 0.605800
4834.934570 0.000000 2432.397217 0.000000 0.542167 0.000000 -0.840271 0.673748 0.673748 0.673748
4841.963379 0.000000 2436.357422 0.000000 0.144817 0.000000 -0.989458 0.710856 0.710856 0.710856
"}
