30

3 2
17
0 1
2 1
1 0
2 1
1 0
0 1
0 1
0 1
2 0
0 0
0 0
0 1
2 0
2 0
0 0
1 1
1 1
1752 187

3 5
5
0 0
1 0
0 4
2 0
2 2
1467 40

2 4
19
1 0
0 3
1 2
0 3
1 3
0 1
0 1
0 1
1 3
0 0
0 1
1 1
0 3
0 0
0 3
0 1
0 1
1 1
0 1
124 44

7 5
10
0 2
5 3
5 2
5 0
2 2
6 2
5 0
3 0
2 2
3 2
759 120

7 7
12
1 0
3 6
3 3
0 4
5 3
4 4
0 0
1 1
1 6
5 0
3 1
0 6
1796 71

3 1
7
2 0
1 0
1 0
0 0
2 0
0 0
2 0
385 112

7 5
3
4 2
1 4
3 0
216 107

7 1
17
3 0
2 0
6 0
1 0
6 0
3 0
2 0
3 0
5 0
5 0
5 0
6 0
2 0
5 0
6 0
3 0
0 0
1812 146

3 2
4
2 0
1 1
1 0
2 0
390 62

4 1
13
1 0
3 0
3 0
2 0
2 0
1 0
0 0
0 0
2 0
1 0
2 0
1 0
0 0
1332 2

6 2
10
0 1
0 1
5 1
0 0
1 1
1 0
1 1
0 0
4 0
0 1
158 66

5 7
7
1 1
4 2
4 2
2 6
4 2
4 2
4 3
918 168

2 5
16
1 2
1 4
0 2
1 0
1 3
1 1
1 2
0 0
1 4
0 2
1 4
1 0
1 4
1 4
1 3
1 0
1462 56

2 5
11
0 2
1 3
1 0
1 2
1 0
1 0
0 1
0 0
1 0
0 0
0 1
406 53

3 3
4
0 1
2 1
2 2
1 1
1888 191

2 3
4
1 2
1 1
1 1
0 2
616 92

2 1
1
0 0
92 135

4 1
6
3 0
0 0
2 0
3 0
3 0
3 0
1600 166

2 1
19
1 0
0 0
0 0
1 0
1 0
0 0
1 0
0 0
0 0
0 0
0 0
0 0
0 0
1 0
1 0
1 0
0 0
0 0
1 0
1441 164

4 1
2
0 0
2 0
1251 74

2 5
6
0 2
0 1
1 2
1 4
1 0
0 4
1507 119

4 7
14
1 5
1 2
1 2
0 3
1 5
1 4
1 3
2 3
3 4
2 0
0 2
0 0
3 3
2 3
532 190

2 4
9
0 1
0 0
0 2
1 2
0 0
0 1
0 0
0 3
0 0
1743 198

2 1
15
1 0
0 0
1 0
0 0
1 0
1 0
1 0
1 0
1 0
1 0
0 0
1 0
1 0
0 0
1 0
760 178

6 1
9
0 0
1 0
2 0
3 0
1 0
5 0
2 0
1 0
0 0
1984 19

1 2
18
0 0
0 1
0 0
0 0
0 1
0 1
0 0
0 0
0 0
0 1
0 1
0 1
0 1
0 1
0 1
0 1
0 0
0 1
520 144

7 6
8
0 3
6 4
6 1
4 5
6 2
0 5
4 4
6 4
521 141

2 3
3
1 1
0 2
1 1
1688 198

4 1
13
1 0
3 0
0 0
3 0
0 0
1 0
1 0
1 0
2 0
0 0
3 0
0 0
1 0
360 194

1 5
19
0 3
0 1
0 4
0 4
0 0
0 2
0 3
0 0
0 4
0 3
0 4
0 3
0 0
0 2
0 1
0 1
0 2
0 4
0 0
640 200
