module minimarktcp

go 1.18

require (
	github.com/go-redis/redis v6.15.9+incompatible // indirect
	github.com/go-sql-driver/mysql v1.6.0 // indirect
	github.com/onsi/ginkgo v1.16.5 // indirect
	github.com/onsi/gomega v1.19.0 // indirect
)
