module gitlab.com/ytopia/ops/snip

go 1.13

require (
	github.com/AlecAivazis/survey/v2 v2.0.7
	github.com/bramvdbogaerde/go-scp v0.0.0-20200518191442-5c8efdd1d925
	github.com/google/go-jsonnet v0.15.0
	github.com/google/goterm v0.0.0-20190703233501-fc88cf888a3f
	github.com/hairyhenderson/gomplate/v3 v3.8.0
	github.com/imdario/mergo v0.3.9
	github.com/joho/godotenv v1.3.0
	github.com/json-iterator/go v1.1.9
	github.com/kballard/go-shellquote v0.0.0-20180428030007-95032a82bc51
	github.com/kvz/logstreamer v0.0.0-20150507115422-a635b98146f0
	github.com/logrusorgru/aurora v2.0.3+incompatible
	github.com/mattn/go-isatty v0.0.12
	github.com/mgutz/ansi v0.0.0-20170206155736-9520e82c474b
	github.com/mitchellh/mapstructure v1.3.0
	github.com/orcaman/concurrent-map v0.0.0-20190826125027-8c72a8bb44f6
	github.com/patrickmn/go-cache v2.1.0+incompatible
	github.com/peterbourgon/diskv/v3 v3.0.0
	github.com/sirupsen/logrus v1.5.0
	github.com/spf13/cobra v1.0.0
	github.com/spf13/pflag v1.0.5
	github.com/spf13/viper v1.6.3
	github.com/yosuke-furukawa/json5 v0.1.1
	github.com/yuin/goldmark v1.1.30
	github.com/yuin/goldmark-meta v0.0.0-20191126180153-f0638e958b60
	gitlab.com/golang-commonmark/markdown v0.0.0-20191127184510-91b5b3c99c19
	go.uber.org/multierr v1.1.0
	golang.org/x/crypto v0.0.0-20200728195943-123391ffb6de
	google.golang.org/grpc v1.29.1
)
