module gitlab.com/youtopia.earth/ops/snip

go 1.13

require (
	github.com/google/go-jsonnet v0.15.0
	github.com/mitchellh/mapstructure v1.3.0
	github.com/sirupsen/logrus v1.5.0
	github.com/spf13/cobra v1.0.0
	github.com/spf13/pflag v1.0.5
	github.com/spf13/viper v1.6.3
	github.com/yosuke-furukawa/json5 v0.1.1
)
