A
B+
B+
B+
D+
A-
B+
B+
B+
B+
B+
A
A-
B+
B+
A
A-
B
C+
B+
A
A
A
C+
B+
B+
A
B+
B+
A
B+
C-
B+
B+
F
B+
B+
B+
C-
A
A
B+
A
B+
B+
A
B+
B
B+
B+
B+
B+
A
D+
A
B-
B+
B+
B+
B+
D-
A
B+
C+
A
A-
A
C+
B-
B-
B+
F
A
B+
B+
D+
D+
A
A-
B+
B
A-
B+
C+
B-
A
D+
B+
D+
A
A
C
B+
D+
B+
B+
A
B+
B+
D+
B+
A
B+
A-
B+
A
B+
B+
B+
B+
A
B-
B+
B+
A
B+
B+
A
D+
B+
F
A-
B+
A
A
A
B+
D+
B+
A-
D+
F
C+
D+
B+
A-
A
B+
B-
B+
B+
A
C-
B-
D+
B+
B-
B+
B+
A
B-
B+
B+
A
A-
A
C+
A
B-
B-
B+
B-
B+
C
A
D+
A
A-
B+
D+
B+
B
C
F
B+
B+
A
B+
B+
A
B-
C
A
B+
B+
F
A
C
A
A
B+
B+
B+
D+
B+
C
B+
A
B+
D+
C
B+
A
B+
A-
B+
B+
A
B+
A
B+
B+
A
A
B-
B-
B-
B+
B+
A-
B+
A
C+
B+
B+
B+
B+
A
B
A
A
B+
A
B
A-
B+
B+
A
D+
C+
A
B+
B-
A-
B+
C
B
B-
B-
B+
A-
D+
A
B
B+
B+
B+
B+
B-
A
B-
B+
B+
C+
B+
B+
A
B+
A
A
D+
D+
B+
B+
B+
B+
A-
B+
A
