A
D+
A
B+
B-
B+
B+
B+
B+
B+
B+
B+
B+
C+
B-
B-
A
A
C
C+
F
B-
B-
B+
B+
B+
B-
A
B+
C
A
A
B+
A
D+
A
B+
A
A-
B-
A-
B+
B+
A
B+
B+
A
A
B+
D+
B+
C+
B+
B+
B+
A-
A
A
B+
C+
A
B+
B+
C
B-
A
B+
A
A
B+
C+
B+
B+
B+
B+
B+
A
B-
A
B+
D+
C+
A
C
B+
A
D+
A
B+
D+
A
B+
B+
B+
B+
B+
B+
A
B+
B+
B-
A
B+
D+
B+
B+
A
C+
B+
C
B+
B+
C+
B+
B+
B-
B+
B+
B+
B+
B-
B-
A
B-
B+
A-
B+
A
B+
C-
A
B+
B+
B-
B+
B-
B+
A
C+
B+
A-
B+
C+
B+
B+
B-
A
B-
A
B
B+
B-
B+
B+
B+
A-
D+
A
A
B+
A
B-
B+
A-
B
B-
B
C+
B
B+
B+
B+
B+
B+
B-
B-
A
A
A
B-
C-
B+
B+
B+
B+
D+
B-
B+
D+
B-
B+
B+
B-
B+
A
B+
C+
A
D+
B+
B-
B+
A
A
B+
A
A
A
C+
A
B+
B+
B+
B-
A
B+
B+
D+
A
D+
B+
A
B+
A-
B+
B+
B+
D+
B+
A
A-
B+
A
B+
C
A
B-
C
B
D+
B+
B+
C+
D+
B
A-
B-
A
B+
B+
D+
D-
A-
B
A
B+
F
A-
A
B+
B+
B+
A
B+
A
B+
B+
B+
B+
A
A
