D:\ypinto\sesion05\aws-presencial\monolito\src\main\java\aws\mitocode\spring\model\TipoServicio.java
D:\ypinto\sesion05\aws-presencial\monolito\src\main\java\aws\mitocode\spring\service\impl\NotificacionSNSServiceImpl.java
D:\ypinto\sesion05\aws-presencial\monolito\src\main\java\aws\mitocode\spring\dao\INegocioDao.java
D:\ypinto\sesion05\aws-presencial\monolito\src\main\java\aws\mitocode\spring\controller\api\ApiSedeController.java
D:\ypinto\sesion05\aws-presencial\monolito\src\main\java\aws\mitocode\spring\dto\LoginDTO.java
D:\ypinto\sesion05\aws-presencial\monolito\src\main\java\aws\mitocode\spring\service\IColaSQSService.java
D:\ypinto\sesion05\aws-presencial\monolito\src\main\java\aws\mitocode\spring\dto\RenewPasswordFirstDTO.java
D:\ypinto\sesion05\aws-presencial\monolito\src\main\java\aws\mitocode\spring\model\Negocio.java
D:\ypinto\sesion05\aws-presencial\monolito\src\main\java\aws\mitocode\spring\service\impl\SedeServiceImpl.java
D:\ypinto\sesion05\aws-presencial\monolito\src\main\java\aws\mitocode\spring\service\impl\TipoNegocioServiceImpl.java
D:\ypinto\sesion05\aws-presencial\monolito\src\main\java\aws\mitocode\spring\service\IFeedBackService.java
D:\ypinto\sesion05\aws-presencial\monolito\src\main\java\aws\mitocode\spring\App.java
D:\ypinto\sesion05\aws-presencial\monolito\src\main\java\aws\mitocode\spring\dao\IFeedBackDao.java
D:\ypinto\sesion05\aws-presencial\monolito\src\main\java\aws\mitocode\spring\service\INegocioService.java
D:\ypinto\sesion05\aws-presencial\monolito\src\main\java\aws\mitocode\spring\dao\IProblemaDao.java
D:\ypinto\sesion05\aws-presencial\monolito\src\main\java\aws\mitocode\spring\service\impl\FeedBackServiceImpl.java
D:\ypinto\sesion05\aws-presencial\monolito\src\main\java\aws\mitocode\spring\controller\api\ApiTipoNegocio.java
D:\ypinto\sesion05\aws-presencial\monolito\src\main\java\aws\mitocode\spring\controller\StatusController.java
D:\ypinto\sesion05\aws-presencial\monolito\src\main\java\aws\mitocode\spring\service\IProblemaService.java
D:\ypinto\sesion05\aws-presencial\monolito\src\main\java\aws\mitocode\spring\SecurityConfiguration.java
D:\ypinto\sesion05\aws-presencial\monolito\src\main\java\aws\mitocode\spring\service\ISedeService.java
D:\ypinto\sesion05\aws-presencial\monolito\src\main\java\aws\mitocode\spring\model\Sede.java
D:\ypinto\sesion05\aws-presencial\monolito\src\main\java\aws\mitocode\spring\dao\ISedeDao.java
D:\ypinto\sesion05\aws-presencial\monolito\src\main\java\aws\mitocode\spring\service\impl\NegocioServiceImpl.java
D:\ypinto\sesion05\aws-presencial\monolito\src\main\java\aws\mitocode\spring\model\FeedBack.java
D:\ypinto\sesion05\aws-presencial\monolito\src\main\java\aws\mitocode\spring\security\AwsCognitoRSAKeyProvider.java
D:\ypinto\sesion05\aws-presencial\monolito\src\main\java\aws\mitocode\spring\dto\UpdatePasswordDTO.java
D:\ypinto\sesion05\aws-presencial\monolito\src\main\java\aws\mitocode\spring\service\impl\SQSServiceImpl.java
D:\ypinto\sesion05\aws-presencial\monolito\src\main\java\aws\mitocode\spring\service\impl\ProblemaServiceImpl.java
D:\ypinto\sesion05\aws-presencial\monolito\src\main\java\aws\mitocode\spring\dto\RespuestaApi.java
D:\ypinto\sesion05\aws-presencial\monolito\src\main\java\aws\mitocode\spring\service\SecurityService.java
D:\ypinto\sesion05\aws-presencial\monolito\src\main\java\aws\mitocode\spring\model\Problema.java
D:\ypinto\sesion05\aws-presencial\monolito\src\main\java\aws\mitocode\spring\service\ITipoNegocioService.java
D:\ypinto\sesion05\aws-presencial\monolito\src\main\java\aws\mitocode\spring\service\impl\EmailServiceImpl.java
D:\ypinto\sesion05\aws-presencial\monolito\src\main\java\aws\mitocode\spring\JmsConfig.java
D:\ypinto\sesion05\aws-presencial\monolito\src\main\java\aws\mitocode\spring\controller\AngularController.java
D:\ypinto\sesion05\aws-presencial\monolito\src\main\java\aws\mitocode\spring\SwaggerConfig.java
D:\ypinto\sesion05\aws-presencial\monolito\src\main\java\aws\mitocode\spring\dto\UserAttributesCognito.java
D:\ypinto\sesion05\aws-presencial\monolito\src\main\java\aws\mitocode\spring\service\IEmailService.java
D:\ypinto\sesion05\aws-presencial\monolito\src\main\java\aws\mitocode\spring\security\AwsCognitoJwtAuthenticationFilter.java
D:\ypinto\sesion05\aws-presencial\monolito\src\main\java\aws\mitocode\spring\dto\SNSMessage.java
D:\ypinto\sesion05\aws-presencial\monolito\src\main\java\aws\mitocode\spring\model\TipoNegocio.java
D:\ypinto\sesion05\aws-presencial\monolito\src\main\java\aws\mitocode\spring\controller\api\ApiSecurityController.java
D:\ypinto\sesion05\aws-presencial\monolito\src\main\java\aws\mitocode\spring\dao\ITipoNegocioDao.java
D:\ypinto\sesion05\aws-presencial\monolito\src\main\java\aws\mitocode\spring\dto\BasicAccessDTO.java
D:\ypinto\sesion05\aws-presencial\monolito\src\main\java\aws\mitocode\spring\controller\api\ApiNegocio.java
D:\ypinto\sesion05\aws-presencial\monolito\src\main\java\aws\mitocode\spring\service\impl\SecurityServiceImpl.java
D:\ypinto\sesion05\aws-presencial\monolito\src\main\java\aws\mitocode\spring\controller\api\ApiFeedBackController.java
D:\ypinto\sesion05\aws-presencial\monolito\src\main\java\aws\mitocode\spring\service\INotificacionSNS.java
