{
  "gitlab_workhorse": {
    "secret_token": "NSCixSyqijXUjhfTLB0fWs63ESoLIfvrjkVpUCP3300="
  },
  "gitlab_shell": {
    "secret_token": "8d9a12acc10860083598bf987e80797d4dfae66d0a281332b2b5dde19bd28653a323009733365961eea460270b18b91c2e7f6389d5e4bd539c4377f96f679cbf"
  },
  "gitlab_rails": {
    "secret_key_base": "832ecf894658ccef0c151a3389d01dfa84a1f0e8a0b163e95a35974270d5abcd4480142f6ee5be7fac2c0c8b7e1292cfd83cc5934818addc6e38d6f0c5384d9c",
    "db_key_base": "1fd9d3635ad88c3289e5e1025cb555933a6e1f4442c96a964d226e7f5cbca521b8491a30e151f741f5798a8a76a55fe1487f82acf4bfb41a5d5d1dc47e47349e",
    "otp_key_base": "97d2ecef52b8e9248555f5064c57cf641f88f171e7602120e527205f4f410d8c03797942a70592fb9bb7fcc1dfecac867d30f707b57fb6a778d756117763fdd0",
    "encrypted_settings_key_base": "70d37d31d3cef7e62a438b0d994012d3d7b2a932764f47c9c63db0ba0afafea751858afef104857c1ab1fd752d3d29aea6b8fadf74ceff1b5fcbe1ae65d35f30",
    "openid_connect_signing_key": "-----BEGIN RSA PRIVATE KEY-----\nMIIJKQIBAAKCAgEAt7wz/vm6+oPh7qu/4d+o+QkP4bYfWXFrgGCyQfNyNfifzD1U\nBi+ODOYZv9cE6wwbwfUIarLYoQTtPZcwxe3LoKKuZs9Z9HEpBWreJkyB5fMy4cnt\nBeCwilK52Bs7uNE54ORXSBmb9yDw4wvtIprXUob+3nyTSZz3gIEymNAhsq2+AUGp\niNmwvom0RWJYeQye28eUtztl49ceqec/ZSgqPUHBAeeUNBHY726ZMz9VMV4s8nug\nREgaDjgyVTacJFUn8mBsquBDttcKVuVSk99vh4BbCBaetNqiHqp5XNWmkX06dRJf\n9Nyu0i1Tq6yMGOAMQk8fpo0HYqY1zpU8oWSiE0NxOnBefwoIc+GNKjz4C5H5m/dM\nzaJrP9+FfCSxmYSJPQefJFgYBCY6zex2p+/Za4006VI5X0ushFNEAJpedWSj51jG\nos2J0tJOTbAn+DzNoP3VHsSXxP3LaUi55pxvMjjMQuwxSaRWqvkTTxepo1wPrSFx\n2qCrWPRP2quIXRSyjcVAkrNktRsJEpqxSPSBDBFlpUHWTdujpJYBpR/HaXNYogbZ\n+m2dMKF7ozq3sSp948Q/G0Bn1RQtPNieDrhNiO8I+9ihd+CMOjeOAoEik7yH4PQo\nUdQPDVPoKIpBlz5Nl/s8QODKhtMV8OOlh3j8btrLn48tNtfv3cct2BQLSIcCAwEA\nAQKCAgEAm6KmgMNVqULxrNR7U3+7iEgu1ckJwSAcKcC+/rKS+jjCU6VXeW3q6+41\nvZULq3a0RJWlLYyVh7++nj9lpyOJK2biSGA4GKGKV/Zwewyvs/NQFIaRajssD9+H\nYRGggytn1aJWdNKMlMeohQrjMj7rShLj7d6kfOSjmozWKS+Ue+BEZJgUXcHYv22x\n8FwgCVmxbwYeaR+9bUQZy14BC1T8gqsiLNTXa0v68MZEq25oYcseU8B4v547w/PC\nXwBFP1mK3vri0dPqSATb00OpsWzA8oy9j5ppkVTpowRQjVzFHdRwIh8QfUA6LfsL\nNw6QFbojaD/R1aj8qomUZotvsl6mEi8m0hytVtP7TC9U1dH/N2oYdyZ04d9vYQN7\njJzeLdNl0GIoqX/AKhGrXQdxmy46qgP7z7HsNHyQLkR1LMSXZvvunHAN9lQB9CAC\niJ+lE50aml0QIKqm6VYrfFe3VCGInSr7s3G7CPAZRoB66Oz4XS/t5SbvzHvn27rL\nwBI53V/zZZtfcgWSJMgMehILcqKXulc7apg/bKJvPvlCKvyJFdr4gagTQ1VBzUL7\nMU9NPbtxIuYg50dFnOhHg8d7KPTcniyovJne/ivXt7v5gVUBvjXoD8PkPhNZ9R55\ndJMK9GP6rYJ8nrBqzvWUjY2EHp+A2uNmGzHKeAuMKJQLAZihN4ECggEBAOZH+hkx\nRWrzPotKIYvuLcC+20j1InB+3hvtqb4lFhYbXbC4bupuTyvWDcxc/LxKKaoQZ4mp\np90W8LyDcUCyQUPh6yp5BwPEhMIuXp+P2MrstT3USYezV2fVpAsIV/YX5K9+Kwsl\nfnUbpuLHLuSWAkfK8MsdPttrSlo6CHe2/nx8TetcYN7yAGMMVJIkSNzlBNCvug23\niqJMLxdyeD1LO4T+PvFGyztyJsZeS0MQMoIj3TVU55T1qzzukDK7Z6XzZBgWkyG9\nmrho+w3rM5CNNuvpRJfYK9FIIY8l+Hs2nMdp+yIm503UWCEHX/iwoQYSMuOw2+VA\niqV0yGuLrq0ylSECggEBAMxBazFDi/nO0+AtJuSI0CureBxq5/tPDjzMPDQpGLlw\n0MbQ9nKpzM02k9L3W1A7+5GkAXwkEv5NOBOKY2LEAofAcXJr8N6anIzOWrkPovZp\nIIsd7FjLI5EpDCQeuFxoJl5Zmfrb1zvM5EwBSOHc9IRzasHBIxJhNwzuYUcAdEml\nz8e3qPnPLE+m7DXF2zzB9TL6lYPjkOLU1niIDdsKt68cKEIIx2+bGCXWId0Un+Jz\nsP3ZSi6XafV5vNIDOdOL0EvxxFA9uO9CtT6tSey95D7ebO/JhaBjElrurvHyYi5K\nbpJCmereDuSn7a5v/2FPlTbNci4QAZ6eS76UIEqMAKcCggEAcHGa9KwzakrGMnuL\nL+moW6KWLuTL4USBrf950AgJ5deNAxq7xisA67XE3RJWspZAC/Ogqv61oeZuvI4u\nQdoItl3dV8rrGvLdpHfB6oXx5Px6b2t2UBXJS0FtrZlwYhE+sFaaLAIt4n8TGU8L\nXcDF8kptE7D/HWMhVjdaJSKs1xpXbeKYxqRCfhrqPMYM8he+Jyx3W/VQc3lh0UAq\n6DsRIBqJn4Ti/e76cghfFasWDqf2fvErd3gSGlme/ba2oLjdGkoDpAkSQJO6awx7\nDE14EO/Bd6etla5z/JMc5wU+vrzITN/UOBPEyLPyL9wHdJB0WuvkI+hFCw+gQate\nKuI1IQKCAQAcTWBGBj8KEU+oe3ktJ4v40Rymi2Wzm+O0JvScoaksYOZ89g2AG+kl\n8k8PZ3j+qCEWsCwIgJMlK5v+kSluUQystMzDdxN8NN5GYH2PsQv6qtx4il/qedNm\n1NI62wreuwu9/Rpp+TZcsepcYb0wlsZG6Bs91749WL0hDJLsHLMAVXpyCQ/f9YYF\nT3LhjJXxWErakoBPMyQrWiSRtQB+foCvQe6OH9tKqqnw7DfrA2WYIkG/GvG9fPuQ\nqRqx2wKTPodRTqHOII9Uj+C/W5GnvTQ4RefAXiMm8zNi6DnTiqtyEJw7pgDf238i\nzeYQSrKPUFCztEoC+fLPgM2sDahfzAB3AoIBAQDiXMT9g1YKij3X+BWZ/zTmBGxk\nAJ1avhLtzXqdJsfQhU8ZpZKlAgOvrfSG0xiPT7h79cBjMpONofljZpcTiq+ew3L+\ncf9c2sjsdJN76pYj1Ff+GoRS++rYMU2au8+Kh2Q5C5XAPeR5EERtsa5M1UdFFgiv\np6JO6j0IEYyHDe8UqVNQnabyu/FuwROmbKYJlNFfzV0gdzvuH3chx9crQz0HTFxB\nowVMy7NwFvy/3AixwTAXmg+wZbNz2FOeAq2wgmUeN8/tLoY/GiQpH5tc2XVhQhTr\n5CkyHzlhl7awRREv4lS86J7kIH8n34thXZ+57UAiUVGqR0LC5LKUTwXkVOJJ\n-----END RSA PRIVATE KEY-----\n",
    "ci_jwt_signing_key": "-----BEGIN RSA PRIVATE KEY-----\nMIIJKAIBAAKCAgEAzoXBhVoTTdGgsEFJkBR4raQF3U6SwZlBmJqQy0QoLWnrFUzU\nnI5NKIkNtCGv958nRTr4w5gSZIZRvaj1Gpdr8b9ZVy3uKkAz9KffXvbtcTV/8yS0\naszWaQ/g8fU6ktVDGKwmmYeZ1r/X1UjjZnsQZAYYfvK51lcxKrNvUUZI+K8LbFBt\nL4FlZ6ETC4VQ5CKJELfYHqTT7w1ecf6bcxMy41bkEghnpdaAclEEFykq4CwMWilz\n40ZyagJR0u/bIXtScy59ZTVVO0xkzF1xo5mzEbHaZxegQTH4VvCnGH9HKAep0UvF\nrgl6Oh7iSOf3ULZz4GN91ncBEemTQ8B3on9Qe1i767+86IFq9jw6HQeaaYiLaASw\n1UjqMQEKgYzEdrMhUMziOeAOJESNFbUVsCCYKYTIMvcF8xGF7RD5D0nvbiPIx6Bz\nqIBVlqYquH3cxWDasLdqzlfdCNoOlvl45BHJqTIAcqmzRgNRXMvaYTMtwOY+r9jj\nexRrlGROzdTUgDV+BPOxoVU0T/8xKquVqoFdzc4i+jRM5c4G+doIvPN06jSNfFYe\nSKaGU4pXL6XrPwc4gxr5kEUevmAayGkfZg4q02GrM/6Q23/PusebSU30DK659l5L\nPMlEmIvD6iM5qVyO0FsF9nONB+NTuK06Q8zJDV0YdehF/YsZES6Ih/38JzsCAwEA\nAQKCAgBwKXKdwvri86uqrfqO1p9n5sIMnGTV4i8e+ysSShTr/S9gpRZ/ZEWBc1XO\n89DG0lgYoFuElu2+TLjOIZnkdEJ6y+pwj5Bev/m3sQh+Yes45c50tgWKT29PJgGM\nRxwlrM9A8hYQofWqDQziWDCwcrvHJwxcveSyBS69uzAE2wA8l4zDqbZy63qwWmmm\ngyQYkq0QOFiW4/v6Q698h8PTLqUflQxOwuPPzHx8GYX4MjKIB0Q6H3NCBvuSmWno\n/r1rJLf1uFUAB4QfrXC9ES7rpEj9njM4dDtjzQjL5u1JP67cjbTr55QX3ivUrvtE\njz7hRgYO4tnwBTe+i7WgQUJ4LV7+dL6cOK+fpec0yY/hHc9VxKAGqhtvif//Ytgq\nUtpY60PW2uVmsyW6UPTiuDzzV7nexBhITN19oSqkKPLFH3uT5XykaLS73iaftG6P\nF6dctLRL+zGIwIGCJmHNonxgGmbCOU5fpsRGuUOb838rpvi6i/tdGi8HHDFNCpT3\nWVn2PF/F2EXDrw/S9Up191qm56DTTSWWg6ea6l5z5GF7HrvWyx4V78c/LSEKDNEj\n5x8iq8DHm+we8QlEFj9R4ukiXKIxN8RRqJ2qzyaMSTVixRiXJrp5+4b8DpsguZyC\n1I5Rfkfznv4L3tE/CQJlEwsIldNv+ruHA+j15bup3q9dOQGnOQKCAQEA6OLScWw6\nJVPRnbDyell5Du0EMYN1JRLpNM4RSFAlE/AsGCvbo+Hs2CRnMV4hjbaVkXXLqIGS\nasN0rIUetEm+r7meBggbMWkEQFr/z9KC/e830o+BWNj4eQx0ric37I9ixzZUHj92\n/sGiStUbxeyPPvzUewMjZp8qVbIjT8jAMCaC2LPcYPXd+HfAL6P3FxPLyz0mKIjC\nyjjdD9XUJPKaDOW1y/dXo4BMU2zRg82WLq6/nVE3zznEtAOIq3dadBgb2+GmhHIX\nl8tWUfeFQCzz0jEqgHAVWHQ9mjerzlGtsY/Ky/u27FKsP8Iy3BaWDnL9bOW+dIOP\nx9v/QRFWUrQMfwKCAQEA4wUWhTOg5Eev2+7IemRSaiRgJDTWLdAfCEKWPG/rMKru\njlicTT6VJnYMLGOS8R86VUZyZ0+Wuf2A3F9pfp6E2/47d3iaI/Ih9UbeCv+4RufB\niofMDqhTusb/aoMz0y9EIv2Nes1sOdkEjnKuaeDw8fcy7GEBdFtZATKzWYeMkFez\nape5OXeliZ+X4lLpa80rYApcbyZ119BIXrST+khNajcG1W8U8UVmPBQK6j6snZBv\ng6TFmr1fdoLyiSMewcdMVY0Rh8pm+WuWEUO7k+KVtI3piQzoNTOk8OueesJEAUt+\nBmwb+iBJVu4YiDbve7hDCDPpkNw3CaX7SmAr9nq3RQKCAQBW5qTObCs6WI+kfy3M\nF+0Dc9AXxc0Fu4vIB4kNadKcIQfjMSJxgdGGSfczxcNRhStErycCxu7i5fJ4mef+\nMHJ2UhY0e/vhsSVD+nDwlMYKiaRT7va+N6BoUwyLG9lTbaHXYl97NgVqRMkRkXoe\nngpJ38BN8rrYBVafyaxBjlCg5w32XQ9EIxrkJ5NQc6e1Nc7bFQNTJs1A9n0O9qSF\n8P0pCOKQrMhIG4zfqIB55VJAMzcPNgpUSmMrJRJvoUbggUqL/yTK0WQaYWbhiTJw\n4xVMfso0SR699goyrMlwYKwm0NhEy7XTc3oRBJ9D3y25UJFefFBYW+tgEairGBQV\nIlhzAoIBAQCwXamLPfrGnjKvKCizfPDR6QSP3ERwPvl8z04sEb6jhofiKlDzaaUx\nxg/bBFiJ3nrQ+POz8w7j21+a1Lz+U2RgDHhibl1Bg8CB7tZdsSCWZUHkv272DCtQ\nNX0EYH2ImXXTwSuCtchYgJKbn9iEBO7q6+Kx5QLeRIE2/w56hWXcVWXbb5fEX4FJ\nE6VJfKQ+zZve9u2spDJ0wSkX+i3kCPurgqhac/vPHN0521BHfv1XQ3h+yymA95IM\nXdrSU2h3nr9cz0VJOyMYrk5dh0NYtnUbWgyOHmrfuglv6XyrXfS7FM0JbD+n6CFR\n2ZNRb2xJr3LUEpBnq81OP5ajx2cgC2IJAoIBADQtREjU7EH57oKdvqJ4I6ENbqnO\n/bQQ4YamEz6mQVLw9EtwZEz2MN/CaQdwKgpGTMmNwovTcATGxTK85eBRt1xrfYtq\nLUJ55POR6Q3mbKbM9VKLUXUmREysv+4vAjo5s/3vjUUiCMxA4GxdOuo7lpgZwJbv\nav4cqlOt2InplXM6jEFq/ND8M+lfE00mEEXP4S6RKYiYh/tmt4WUCaX1j3IbGFrh\n8hpefV00giDxUUZp9ovPNd2yJ+Q4XU7DbeCpBer8bLOm2XVlAmwwhCui9xZT8zlm\nMEipsMKIGDnNpAz808jAULOBY1lgdk6ZyPlK7TdAOLo4sTuPNnfo14xDjn0=\n-----END RSA PRIVATE KEY-----\n"
  },
  "gitlab_pages": {
    "gitlab_secret": null,
    "gitlab_id": null,
    "auth_secret": null,
    "api_secret_key": "6G+pXFl2BnYHsbzOwwr9P644DmRa3a4ofMfdv3pRbxY="
  },
  "gitlab_kas": {
    "api_secret_key": "M2NlYmMxZGM0N2VjNDU2MjEyMzA2NDhlNmQwNWM1ZmY="
  },
  "grafana": {
    "secret_key": "bb8645ee4bb28e82e38af72fc72aaf9d",
    "gitlab_secret": "0ebad736f065232cf0878df3f1989b7d989e63a762c5c7bb03ab8f9d04cc0e7b",
    "gitlab_application_id": "8af198a687e371cc6ce297edebb96287b71e45f88c18824ce88e869fca3ef471",
    "admin_password": "95988681b12a39a9dfe0a02346bf620f",
    "metrics_basic_auth_password": null
  },
  "registry": {
    "http_secret": "7d43636c5a0e2f16d285714b12ebdf5c80aff98f1832b8482a82f8f4a94138e02768f99d766a275071ddb5f10bcb36226926097402fe1f9467b8fb763d0fa94e",
    "internal_certificate": "-----BEGIN CERTIFICATE-----\nMIIFBTCCAu2gAwIBAgIBADANBgkqhkiG9w0BAQsFADBGMQwwCgYDVQQGEwNVU0Ex\nDzANBgNVBAoMBkdpdExhYjESMBAGA1UECwwJQ29udGFpbmVyMREwDwYDVQQDDAhS\nZWdpc3RyeTAeFw0yMTA5MTQwMzQ5NTBaFw0zMTA5MTIwMzQ5NTBaMEYxDDAKBgNV\nBAYTA1VTQTEPMA0GA1UECgwGR2l0TGFiMRIwEAYDVQQLDAlDb250YWluZXIxETAP\nBgNVBAMMCFJlZ2lzdHJ5MIICIjANBgkqhkiG9w0BAQEFAAOCAg8AMIICCgKCAgEA\nmaM3RdqzvvOKLYQj58fY7AqaGejEK6Uxt8W0IyGilJMtv9F7XRqyK0l0sPfHGb78\nk2zQRU+qBQaakWOd2TuZ6L13T6YkZKJf9Pz1BN5Zl/KFxZzLkqoK5XBEJanG6ATV\ne476qSB/ilUxzRFYhHixvELnNrnpARFl7N/jgiNiBjGzoNXMfcs8kP8lMISUpAGd\nbMSICrp6+o2/MfKtfMK6Fp5bmYQQNNPJbcuZZD4hGzHrEkMtJWFWZnO2oIeRmGUS\nTefHVAsbvACsezdVDlzg8blTK/JpZuTgrAML8YOfbxg6z8Y5lpMyXW96kMXFkhRK\nTMzgF99RQZ5IGXQQbaCAdhulB3BiJ2eWbDFZlqH1nGIvMN538pGvIC5zjuwu8qAR\noSklSnkSw1IWE+Cvi+CiqUP8in36HT9Md4bc6F7ly1GzT5FdGqbjENzJD65X8pkA\nZKgR9x5gxz4G8FJpo8ozh09bEE4QS+AbPhlFib/VX2g8Sz5SzWPIo4N3Jhbv4ps3\n+q4yrU7BwoUcDL2vW9ENaO2F2BndIuEKdpFmJWIbULJDCaP9ghXZglOUfk9htGCP\n83L/xQ0Id0sRVyp/CooP3edRcDu1w0BbGxCS2ZwVCZ8Z4ODHJMEf529zSXC5mG9I\ntaQHQRAkr9LMrOHaPqRxaOhJOjBX4adi9ny62miZHl8CAwEAATANBgkqhkiG9w0B\nAQsFAAOCAgEAhlSBT6cT8L4lJZa+jV5ra4tmp/4ohHuSXcd7lAZuBpfcFu0NgncJ\n9I0zj8a16b+rq2nDrYw5oJzLslDz0Q2AfuGYq1cstD7HtAbC5rzg+qpRglvo89PY\nkGQz81o94k1O2gOtRRWox5SXXC+tvcoLhCnUURkZlg/2uMtwX3Ifv9khgvdG8Oth\nRo2sDk5dMY9jK8FE4RktYyNoQMsUuF2+eLh56ZJIZW9k/wrH7kkhVaPBDX1sCpI+\nll8cVyKP6wCyLCCqbVvdphPBEpxujL/K86UKLQUD2Glt9+TH75XLhq8eJzWqRCzZ\nCpEIWutumWxRgBYpGaojTqWneEEdQUnSYIhKc/c8b0mkLNL+nFfE02JPJa3915PM\ne4DGmKiNhrlEOM/K/Frm33zOa1DwD2idXKAiARp0FRYb1hB8yQ2u88AtKAIjJJ15\nZe1I7gCfXkVycwTfyAZFn21nZNBQDfErGpC+FnGJ9Fc2V7Qk4IJgcrkuz0nOy968\nsHvijYeKza4YvODbgLi7wwxWlxh413+eGHT2U5QxV7aQFJdcMdbRMpMbotOm/dFX\nAvRC/vRqtVGFytv/QXER2NKu3FRu85oZCa9sWXJfuW8MirclPIBLQcku1X4+/i8z\nSsaipxOxRRBJFthLhrJONtl3zfeehOfED1lchL4hz7Q2LOtjzqFkeII=\n-----END CERTIFICATE-----\n",
    "internal_key": "-----BEGIN RSA PRIVATE KEY-----\nMIIJKAIBAAKCAgEAmaM3RdqzvvOKLYQj58fY7AqaGejEK6Uxt8W0IyGilJMtv9F7\nXRqyK0l0sPfHGb78k2zQRU+qBQaakWOd2TuZ6L13T6YkZKJf9Pz1BN5Zl/KFxZzL\nkqoK5XBEJanG6ATVe476qSB/ilUxzRFYhHixvELnNrnpARFl7N/jgiNiBjGzoNXM\nfcs8kP8lMISUpAGdbMSICrp6+o2/MfKtfMK6Fp5bmYQQNNPJbcuZZD4hGzHrEkMt\nJWFWZnO2oIeRmGUSTefHVAsbvACsezdVDlzg8blTK/JpZuTgrAML8YOfbxg6z8Y5\nlpMyXW96kMXFkhRKTMzgF99RQZ5IGXQQbaCAdhulB3BiJ2eWbDFZlqH1nGIvMN53\n8pGvIC5zjuwu8qARoSklSnkSw1IWE+Cvi+CiqUP8in36HT9Md4bc6F7ly1GzT5Fd\nGqbjENzJD65X8pkAZKgR9x5gxz4G8FJpo8ozh09bEE4QS+AbPhlFib/VX2g8Sz5S\nzWPIo4N3Jhbv4ps3+q4yrU7BwoUcDL2vW9ENaO2F2BndIuEKdpFmJWIbULJDCaP9\nghXZglOUfk9htGCP83L/xQ0Id0sRVyp/CooP3edRcDu1w0BbGxCS2ZwVCZ8Z4ODH\nJMEf529zSXC5mG9ItaQHQRAkr9LMrOHaPqRxaOhJOjBX4adi9ny62miZHl8CAwEA\nAQKCAgAZRq7rQSXdPnf3MQwvL8PSYZQkuxS7EXxyfYY7WWdEBkq6ih4/nQq+8GDQ\nVJNe+vrWzkodfRO9q+52COuJN7MEhVdBtVW7cLNUvOEaofIfe3jin/8l6+/K+4Na\npungdhshLs6yUHRrL8T3tejYMnsbO+6KJF/fGxunstXdLTENT9P7m/D+qRcXy8I0\njztdGB7sLBEtoqxk2DkiYIiGRAsVeYwcX4vDBSzYcWyU/1u2+6lu4bplsfPi+xqK\nooMjjU1Ln9w9SW6QqZO22c2WhVVEr3atfj40/WaxJfcrDrqGLnhOgpAq46Cfmp2R\nf9gXRltK81HS25ykrQOznFKvln5LrtEOyXFOsrlSnVQ+5Ce7b4j0SR+m7s0FW/z4\nztMKun39DFl4Q+f36B0ZcrLWG84kI0nO2KASfuqqjg02Nf5eWwRTRgSEt2Ad462C\nDrcBuNn2WSUX7YLVyzmvFc9w63vPi4arpGZbcxoLKdqOF0B6iSR7OsmrJIX2pUGF\ntyj2ivQbo1dTeMXh7QTGL2WAUNaKVatf2MrPhXLUWaPZ8SUsOMDfoAAkZoBxIpUN\nm6NU3BZZFuNQUZabbmtxw1Ow1NdoRXFXSAKbDxVocNZ7b2rGTyzJuGjDUTOq0Tvo\nvKKBO+e4z1mrONrilzcEVw/K8c5sRAA1n6dupGS9HQwqOrzLEQKCAQEAyYNE8Eis\nem9edDDFZVKmYG7/9SZnEQeMi/Pz79H8dEabk5/cbq5YXd/P2Y7d3DMqfLULJeVD\nEPLJQT0AbmY/X9iZox82kwCh+ja7sv6n8U92cyWJjH6TuZd9dbYm4s0ZLxZDWg3L\na6SH35U6+cqnMxWa/kY6/5sNvdDAS8FyXahl0cdTJSCXdrnArlrYjeX/8BQf0Bju\n2Q9CqOAOQEkT2fwhDEdKNDYrpdoHbzdI1EGDXRcU0/e6QohpPrIulUFCJVkOAC/B\ntKEQjq30X0JNlT4sdMpYtpA2MYiqdHDWllrtbURQj9qWP00BIP1p0gq8M0d/PQa1\nzsQ/aWa9Sj4oOwKCAQEAwy4FTVWMHaLFl2MgJmXnKTPriB1zaobm8x9tHl34LTNc\nVX8985fZpKXqwgcpCizroZOFLLRVPiLAWOji+OO8KH7FEhlbOVTkqBUcv+r4URVJ\n4IF2e6RLl3E+7IBsKqvUwp7ChzfVLwznzcIp+eI39Je+wD3RKfsUP056GgpbED5F\nPTi2VOe3c9ia4i2IelAgMCqxBMzixolVtSN4gNzjwwZFN9eLWPOln9ua/xrJA/Gf\nBTtJTFKsSy9ps0G4R/9yF4CzTrXxK5pU0WmE15/V31Tqq6fNd3jZ0ktyYfiOOEJW\nshKbuaaRwyMVK/EPei+i0d4HgIRa0IO0/b1EIY9kLQKCAQACqz5qgEvogzkZCNxU\nbzfM5yt0r8GFtDfkUqLUdk+Fqrm8xs1AmgaJl8FE/GNr2zGg3TT8l4C/5LdNqeUr\nkScdudyvEGbEo6mBiuAJit3mkErdU43y0mpadusud+8j6dt/iCf0NWKQVmmGSI+z\nZz+3qX2YCI4XfJI+BVnGpxVAsE5I7P7o6vmWlPc8V++uUXGGWH3jX7EqJs2XNwB5\nUX510KUPaJJPBrilRbH7gxvv075NqVSZShqpbu0V6346c9bQb9GDpx5Fqixx91PZ\nPyOP6nbkRRnPsTFGjqzTRftRmnqyi8kVXqvGwtpU+YZBResgMr44rLITvv2oA7hW\nF2SpAoIBABtlZ0semedDBLcmK8oX/aVz6ziU4bFvNBWmMJvVltNJZUl+7cQ2aU9K\nFrSbarBJ890fJs9KlLh/Cj6wmcNTvAJ3INRUiNB4UQwiwoFRyv8enNsNcQMT4aRl\nOe7aa9RlgBy9ShLOzHapOhRQj7HKhg4oCpdTVfutiX8FVfA3yeZyxyc7waQTTlXN\nbpgWyhRZENuR8nz5AU/a0RP24aA84R9rzuVytNWMhY/1tEDgkpyiGq8STkyPQi3f\nftexfttkSLBx2TlQIoT7SbKHPCVEAzIw6iukBxwg83ooKusDh3rwHNkr8X3Smp0o\nXH1pfcGp1BHfN3Bbo5+nDQ2ctmZ7iRUCggEBAMKVzMSuDWYSmqacZ0oR66I63f6q\n75qMZ9OoeVF7moN9eo+wvIh8qK8xMqHkHaC3LcqVDTjVlbv1UR5EcNOqwrzBb6f2\nLwW+8ggXlPaMLH2M65JZGCFiD/LKWpRMdNmojktcxGs15c9lw2pdvTLamjQMqFgp\nSLc1c0dq91V24zbFKHRv+pGR2/SJM/d9IMmow2gCb7uJRpJJzPhxxKi2W075Rcvo\nHpL6VB1tbzPqAkr3a+YTRIJKumthfrKYyU0ENoTjXFhSXYJXCzvd/I0+DR0CNj0x\nkQBr3b+8pLniUK2++3E+0/1AD8sXs1NM356V2j0lZnJgS5wr+c1fMUi7O1I=\n-----END RSA PRIVATE KEY-----\n"
  },
  "letsencrypt": {
    "auto_enabled": false
  },
  "mattermost": {
    "email_invite_salt": "fa39511a3b84ee61584b907b959381b7",
    "file_public_link_salt": "869151ffe6bfb779d45692abba67880d",
    "sql_at_rest_encrypt_key": "ddad86986af5ae5228e7cc2d366372de"
  },
  "postgresql": {
    "internal_certificate": "-----BEGIN CERTIFICATE-----\nMIIFBzCCAu+gAwIBAgIBADANBgkqhkiG9w0BAQsFADBHMQwwCgYDVQQGEwNVU0Ex\nDzANBgNVBAoMBkdpdExhYjERMA8GA1UECwwIRGF0YWJhc2UxEzARBgNVBAMMClBv\nc3RncmVTUUwwHhcNMjEwOTE0MDM0OTUxWhcNMzEwOTEyMDM0OTUxWjBHMQwwCgYD\nVQQGEwNVU0ExDzANBgNVBAoMBkdpdExhYjERMA8GA1UECwwIRGF0YWJhc2UxEzAR\nBgNVBAMMClBvc3RncmVTUUwwggIiMA0GCSqGSIb3DQEBAQUAA4ICDwAwggIKAoIC\nAQDBDadzBlV3NUEAlaz2v9G3anlCmvMU02WZrklBWwHp6jj0a33dZaEGXLGVwkKU\nP+6cNQAkfPHUOUCGCvGDPD7o/Pkj+Vlry1G6kle9jJZXjQvwmKY/wGxh5UO+NtON\n2WhtjVdjjm6Y4mWkPFS1a46BAvWZ0KMmffyfAY0iCzdnHfUDEm/SQLzvJheM7slH\nUNLZdHbbta3QMYCbF444SAvo0ws1fuGt0FbaYngMcKOrbIwvbv5hE3Yqw3SIiem5\nELSgqHTw58IJRb0qy4rANn4z7TT2onSXnK1EqvHUoA6cGRZm8uVmnq9tjYFH81yb\naXq9w2ly8gSHUkPuq/mxCBbDT4rht/xB3suySHalhXGGwKQiw0wwuBXWrFvfxEji\nlNPO0GcfcvAqvUa2/kNs3Q+lmerzLQMCkRTEnRJ308SoRxvo6CMi60yaNcDF8tv+\n1JbQB4mhbeZ4ETX3UPMKH9zcg79Kh95UDiH27eRNOl3mzvJD1IIFMy4cgoyyUiGD\n00ac+ZqywF02N4yGlQi2bceKvmXpA7Fa2fOGHU3PyNoOIu7JhtXsZXx98s1jajdK\nTgQ968mYfQOWw4vQxLraI4GzV/5bO+IONKwzY3OCkNFL2SuLhmovl4bpo/HpHF0L\noh+5mPFApZoxefddAiCybPSQVKskFQvIlFu8gvuHkns2uwIDAQABMA0GCSqGSIb3\nDQEBCwUAA4ICAQCmywIwnT2zSlgOdHw8jgS2xtaru9R8G1bwF2iVyzHKmw42aDx9\n+ff5NnBEaG8ETZj3rvA0xnutIvjjF4E6fFo/KVisGOhmdbQ9RMBg1QlrQOJZfCnL\nJc7/kLz/gqKWNdOBeeYxkcN8iflow3wC0Mupg6yMRFLZkBCEn3W8Zfa054lML+NB\njfD9jXnjt2R8VUTZ1CWNEtoyYON8tHa7Y1MYdHlORA3ppE68pCKReca5Uz5YQ5w4\nESLfmUQe1Zq2likzT2E83HLg7YwI0elI+UELXk2/mHHYgGkvDfSzji0C60QMQxF0\nPzEoYTfUc1EVnmPPHbPkY5iques4XWgMaBczPXAjds2PC3iC0hrEpSP8tqvl8q19\nKf4LGYMrkJuqL1h1Zku0IfB88yd5+i7oGWBe3pMVi+Hw/GqoAaiXLNI4N1PCa4Oy\nlhJYvmN5YFjQ5iKAsPGUZz2yh36JnRXeYMwR9ANd64fyucHn0cEW3QCLtXEGHZ+L\nghZRPUpn0PldhvXRwE29UqctVubdGyXOShAu4j5H+IbZFTR+8ej77f3LnYsKPszl\n1rbNG8T1+QrXhrPUoYwMklbUBDcQDJFRiURzPginkwc062u/nIn1DHPLgWbccKv9\nv7i0k9g4XgfBjDE9991TBsYE6sGCxfIfsVeXt1eA+NW5IQbo2gDeOQsQFQ==\n-----END CERTIFICATE-----\n",
    "internal_key": "-----BEGIN RSA PRIVATE KEY-----\nMIIJKAIBAAKCAgEAwQ2ncwZVdzVBAJWs9r/Rt2p5QprzFNNlma5JQVsB6eo49Gt9\n3WWhBlyxlcJClD/unDUAJHzx1DlAhgrxgzw+6Pz5I/lZa8tRupJXvYyWV40L8Jim\nP8BsYeVDvjbTjdlobY1XY45umOJlpDxUtWuOgQL1mdCjJn38nwGNIgs3Zx31AxJv\n0kC87yYXjO7JR1DS2XR227Wt0DGAmxeOOEgL6NMLNX7hrdBW2mJ4DHCjq2yML27+\nYRN2KsN0iInpuRC0oKh08OfCCUW9KsuKwDZ+M+009qJ0l5ytRKrx1KAOnBkWZvLl\nZp6vbY2BR/Ncm2l6vcNpcvIEh1JD7qv5sQgWw0+K4bf8Qd7Lskh2pYVxhsCkIsNM\nMLgV1qxb38RI4pTTztBnH3LwKr1Gtv5DbN0PpZnq8y0DApEUxJ0Sd9PEqEcb6Ogj\nIutMmjXAxfLb/tSW0AeJoW3meBE191DzCh/c3IO/SofeVA4h9u3kTTpd5s7yQ9SC\nBTMuHIKMslIhg9NGnPmassBdNjeMhpUItm3Hir5l6QOxWtnzhh1Nz8jaDiLuyYbV\n7GV8ffLNY2o3Sk4EPevJmH0DlsOL0MS62iOBs1f+WzviDjSsM2NzgpDRS9kri4Zq\nL5eG6aPx6RxdC6IfuZjxQKWaMXn3XQIgsmz0kFSrJBULyJRbvIL7h5J7NrsCAwEA\nAQKCAgAnvxzrpLEx8ufoK+jJgKK35ZcDrI1Bi2iOpIB2kTsqosuJHxxx2bu2aJ0z\nXSSCC0ugI5Vc7dCIRiVPs68Xuu6k33iX/H15oQm5pOmln+1QJzz/Ex6fX4mw+hfh\ncL5LpShH7eLBH5ELrwkIMFesZnGXhDl2qqr8gNHjFtms2axVcaiBMmmNW0DK6AfP\nP1Z3dV+D3+OcxqH7jEWTKN1iHws8qz7Si8YBGDTZj45x2TsJTzbpiSucZvpcQZOb\njPFu5c6aiTRSaRTc/du9lNyDSHThUgQmhzoEAQD3c06I3U9EujGPjpDGeQNbRdgJ\nLUSyxpu7uCDcxpFCHyDXYdbtqOGuhovFGXXJC5AlRp7ncDMzYVH43/vAWQns1AaC\ndfvVeSvrg+49BEmAV9ddMl1yPHvuKHCXy3nNRYgs0f2E8mXfOLqzKbJMg1Uqh9Fe\nI2E878B17sFO9la716UWhgI7IEtL2TZxC1TSCSmo14qWNWAaVzyBGQNC/XJFsK84\nyhIv4erKtKtXl9WdbdW/wkdk9ez6JQn+tj8xqRRTHJls5GiVjZwqgPmjS3AaAUau\nuFPwm8O2dVK3C34IG8fI7fk2zinVx1wVPqSgRME5YW6iPL6hEY/x9GbvnNYfzleZ\nPp8qQEVpeRIP90BPQ/gOj8Fyh0Aw8oKLL7n3INMS6D6IDYu9IQKCAQEA9j1jnbP3\n/tUdjcNO6bzFYRuKfiyI1Vzv/5p2F/kJHL9AY9Pj0Ky5tQWoRswUl9eZmA+x6mDC\n6lR15i8Qv8vnpGyETnAvwe/SUvoynwBkw2qmogFexv0cBGICrW32WlS1Hi3/Aou4\nU4LCsqc0t1JEbV76RZTcqE8i+JktbKxhAcSlVQ2OUOrO3LnrT1y0Z+YTKWsujEh0\n8OEv10z7JLpaqHikwqYKKjlO400bPBQ8mlAy8V8n3HKLvBc+kvjp37/bq9JVA4eI\nUsDjsFnqz9tYiS56WpVyu9+VP3yuNC4u1Aa2TolSQadnIxWKJzazODoCqRmwvzU8\n0vG/2RDb0C2ECwKCAQEAyLSUG1P8NmssAP3JVbQK2E7H7jdibiEVT5e4Zp6FYap8\nQEJkDg6b+uv7lAgiQZKvz7dQ5H+XEltAbLxz4t+e6M9iFqUnFAFQxmAV08jGWYvU\nHBpbNaF322e2bNNurecXUS9trRedavrXsn5ZE7niyZF1qQayGc6eHBmzz3zNSXqY\nFkX9Raoynu6BFtM9NkgSGJwsNCwEIQD0TKIvWmynznDA0KFpbiPVFZjoogxYI0uT\nDOk1j5p66lCuFsaIve4M2YAoPln5dSOGcVItCyWdGK68z8IRdkl1gpQ9T/Tddfm2\nbDSSNvCPjm2pf3vkcOpv3p1aLBhTzwhbp45Ei6WWEQKCAQBAthtiy3QGBW3R3pzz\nckeQ4JMB26ROJjFwQ+B7JlhNtLkwQvQg1/Op7gWuLV3QFbnoq18/UBSJTo75Yi8N\nqIGExXvzvSnf1q24XsZE4O6aKIIIG0IUG1pskHFRsI9IZ/B9MOtOePeFAt015BlH\ngBg5gfdVp+xhUwLGwEKex6Jqu4oTkw9ulnasrTN41M0YbO9mOCOwfC43S4auFy39\nFfhTQ/lQqiALvqnLtGzO2iafCyqIIlCwb23njVhFeaLEyX/qZMkwt0KNNOHha4/4\n9hULYCqJebMASp7HY3XIgsaNtAHfG9mBJYRGRRfcfFSXFy+xzu2TImOMsDmRywtp\nZzzHAoIBAEK2g2RyDiuog//wW7P5HIG57grorfcdWBAUxl6V4pAMMzDI4Kkrgf1t\n4znZWkmhkH7i2CiboIOhgVCjc4G+AvwvstMEInEr3sWRuq+i1Qt+xwpwWFEDUuvD\nFYgm32s+nSmHMlWOu+yLZJcYGFPOPevyRcHhT+H0I+oDQRl+yl3aOiNtMDqv0BO0\nA4SqwnYAjsNPZgIRf23Y+1tdrY/I/h5IrE6s2HabwoBjSzBSGhnhTQfFnOAW4TRx\njOxVIa7AKdVCHB5dmeWt4UpZnk9OOWGy81+7ikJfOIgm7hpdsh882b4t20wXuiAF\no4mUjOJbisPcWdS+YV030f9n8rDYYYECggEBALCTKveqQsfBagfVflDkfJ4p2FEQ\nZCEvrJXdziXjrzAvMZYJQlKtxEOAthgE//kwqMbmxb1iujcCAzoz/KzCEfRNP7Iv\nhCFmGxJoKYlrIU4vL8cIZRyQIR/3Kjy4yQ+iWlUaro7NSgWlPf/XyYihsDLhEDbv\nEc1vqXum6J2iEKpRMsYXqBPtovB4vBknTMpwA4wDyFm7dYPshr01HJF5IFysoSLN\np9kwXpU6qSiD3rp4Bj/7XwUTy3WGvx7HCAMv8tS8y4mf4+9Ibov/5zuPQxCh7wLP\nXhtAqrH6QFiicMnJjTQqPrJ8N1OCmYnJQySOPbO99PVIb9Ca3LuLSGWNDlE=\n-----END RSA PRIVATE KEY-----\n"
  }
}
