vhdl work "../../TrabajoP1/EJERCICIOS-VHDL-main/EjerciciosParte_01/Replica_03_ffd.vhd"
vhdl work "../../TrabajoP1/EJERCICIOS-VHDL-main/EjerciciosParte_01/Replica_02_latch.vhd"
vhdl work "../../TrabajoP1/EJERCICIOS-VHDL-main/EjerciciosParte_01/Replica_01_latch.vhd"
