%YAML 1.1
%TAG !u! tag:unity3d.com,2011:
--- !u!1 &2918916474855898644
GameObject:
  m_ObjectHideFlags: 0
  m_CorrespondingSourceObject: {fileID: 0}
  m_PrefabInstance: {fileID: 0}
  m_PrefabAsset: {fileID: 0}
  serializedVersion: 6
  m_Component:
  - component: {fileID: 2918916474856120884}
  m_Layer: 0
  m_Name: Car_14D
  m_TagString: Obstcle
  m_Icon: {fileID: 0}
  m_NavMeshLayer: 0
  m_StaticEditorFlags: 0
  m_IsActive: 1
--- !u!4 &2918916474856120884
Transform:
  m_ObjectHideFlags: 0
  m_CorrespondingSourceObject: {fileID: 0}
  m_PrefabInstance: {fileID: 0}
  m_PrefabAsset: {fileID: 0}
  m_GameObject: {fileID: 2918916474855898644}
  m_LocalRotation: {x: 0, y: 0, z: 0, w: 1}
  m_LocalPosition: {x: 0, y: 0.13, z: 7.12}
  m_LocalScale: {x: 1, y: 1, z: 1}
  m_Children:
  - {fileID: 6494591848957658017}
  m_Father: {fileID: 0}
  m_RootOrder: 0
  m_LocalEulerAnglesHint: {x: 0, y: 0, z: 0}
--- !u!65 &6494591847389356608
BoxCollider:
  m_ObjectHideFlags: 0
  m_CorrespondingSourceObject: {fileID: 0}
  m_PrefabInstance: {fileID: 0}
  m_PrefabAsset: {fileID: 0}
  m_GameObject: {fileID: 6494591848957566849}
  m_Material: {fileID: 0}
  m_IsTrigger: 0
  m_Enabled: 1
  serializedVersion: 2
  m_Size: {x: 2.647857, y: 1.5098618, z: 5.8943615}
  m_Center: {x: -1.861033e-16, y: 0.9428404, z: 0.034523964}
--- !u!95 &6494591847389356611
Animator:
  serializedVersion: 3
  m_ObjectHideFlags: 0
  m_CorrespondingSourceObject: {fileID: 0}
  m_PrefabInstance: {fileID: 0}
  m_PrefabAsset: {fileID: 0}
  m_GameObject: {fileID: 6494591848957566849}
  m_Enabled: 1
  m_Avatar: {fileID: 0}
  m_Controller: {fileID: 9100000, guid: c2251e97482d94749b78fc6918a98380, type: 2}
  m_CullingMode: 0
  m_UpdateMode: 0
  m_ApplyRootMotion: 0
  m_LinearVelocityBlending: 0
  m_WarningMessage: 
  m_HasTransformHierarchy: 1
  m_AllowConstantClipSamplingOptimization: 1
  m_KeepAnimatorControllerStateOnDisable: 0
--- !u!1001 &6494591848957532449
PrefabInstance:
  m_ObjectHideFlags: 0
  serializedVersion: 2
  m_Modification:
    m_TransformParent: {fileID: 2918916474856120884}
    m_Modifications:
    - target: {fileID: 100000, guid: dc5230bf3f40d4e93a85898471688ef2, type: 3}
      propertyPath: m_Name
      value: Car_14D
      objectReference: {fileID: 0}
    - target: {fileID: 100000, guid: dc5230bf3f40d4e93a85898471688ef2, type: 3}
      propertyPath: m_TagString
      value: Obstcle
      objectReference: {fileID: 0}
    - target: {fileID: 400000, guid: dc5230bf3f40d4e93a85898471688ef2, type: 3}
      propertyPath: m_LocalPosition.x
      value: 0
      objectReference: {fileID: 0}
    - target: {fileID: 400000, guid: dc5230bf3f40d4e93a85898471688ef2, type: 3}
      propertyPath: m_LocalPosition.y
      value: 0
      objectReference: {fileID: 0}
    - target: {fileID: 400000, guid: dc5230bf3f40d4e93a85898471688ef2, type: 3}
      propertyPath: m_LocalPosition.z
      value: 0
      objectReference: {fileID: 0}
    - target: {fileID: 400000, guid: dc5230bf3f40d4e93a85898471688ef2, type: 3}
      propertyPath: m_LocalRotation.x
      value: -0
      objectReference: {fileID: 0}
    - target: {fileID: 400000, guid: dc5230bf3f40d4e93a85898471688ef2, type: 3}
      propertyPath: m_LocalRotation.y
      value: -0
      objectReference: {fileID: 0}
    - target: {fileID: 400000, guid: dc5230bf3f40d4e93a85898471688ef2, type: 3}
      propertyPath: m_LocalRotation.z
      value: -0
      objectReference: {fileID: 0}
    - target: {fileID: 400000, guid: dc5230bf3f40d4e93a85898471688ef2, type: 3}
      propertyPath: m_LocalRotation.w
      value: 1
      objectReference: {fileID: 0}
    - target: {fileID: 400000, guid: dc5230bf3f40d4e93a85898471688ef2, type: 3}
      propertyPath: m_RootOrder
      value: 0
      objectReference: {fileID: 0}
    - target: {fileID: 400000, guid: dc5230bf3f40d4e93a85898471688ef2, type: 3}
      propertyPath: m_LocalEulerAnglesHint.x
      value: 0
      objectReference: {fileID: 0}
    - target: {fileID: 400000, guid: dc5230bf3f40d4e93a85898471688ef2, type: 3}
      propertyPath: m_LocalEulerAnglesHint.y
      value: -179.99998
      objectReference: {fileID: 0}
    - target: {fileID: 400000, guid: dc5230bf3f40d4e93a85898471688ef2, type: 3}
      propertyPath: m_LocalEulerAnglesHint.z
      value: 0
      objectReference: {fileID: 0}
    m_RemovedComponents: []
  m_SourcePrefab: {fileID: 100100000, guid: dc5230bf3f40d4e93a85898471688ef2, type: 3}
--- !u!1 &6494591848957566849 stripped
GameObject:
  m_CorrespondingSourceObject: {fileID: 100000, guid: dc5230bf3f40d4e93a85898471688ef2,
    type: 3}
  m_PrefabInstance: {fileID: 6494591848957532449}
  m_PrefabAsset: {fileID: 0}
--- !u!4 &6494591848957658017 stripped
Transform:
  m_CorrespondingSourceObject: {fileID: 400000, guid: dc5230bf3f40d4e93a85898471688ef2,
    type: 3}
  m_PrefabInstance: {fileID: 6494591848957532449}
  m_PrefabAsset: {fileID: 0}
