^D:\DOWNLOADS\VIDEO-SDK-SAMPLES-MASTER\NVENCDXGIOUTPUTDUPLICATIONSAMPLE\DDAIMPL.CPP|D:\DOWNLOADS\VIDEO-SDK-SAMPLES-MASTER\NVENCDXGIOUTPUTDUPLICATIONSAMPLE\MAIN.CPP|D:\DOWNLOADS\VIDEO-SDK-SAMPLES-MASTER\NVENCDXGIOUTPUTDUPLICATIONSAMPLE\PREPROC.CPP|D:\DOWNLOADS\VIDEO-SDK-SAMPLES-MASTER\SAMPLES\NVCODEC\NVENCODER\NVENCODER.CPP|D:\DOWNLOADS\VIDEO-SDK-SAMPLES-MASTER\SAMPLES\NVCODEC\NVENCODER\NVENCODERD3D11.CPP
D:\DOWNLOADS\VIDEO-SDK-SAMPLES-MASTER\NVENCDXGIOUTPUTDUPLICATIONSAMPLE\X64\RELEASE\VC142.PDB
D:\DOWNLOADS\VIDEO-SDK-SAMPLES-MASTER\NVENCDXGIOUTPUTDUPLICATIONSAMPLE\X64\RELEASE\PREPROC.OBJ
D:\DOWNLOADS\VIDEO-SDK-SAMPLES-MASTER\NVENCDXGIOUTPUTDUPLICATIONSAMPLE\X64\RELEASE\MAIN.OBJ
D:\DOWNLOADS\VIDEO-SDK-SAMPLES-MASTER\NVENCDXGIOUTPUTDUPLICATIONSAMPLE\X64\RELEASE\DDAIMPL.OBJ
D:\DOWNLOADS\VIDEO-SDK-SAMPLES-MASTER\NVENCDXGIOUTPUTDUPLICATIONSAMPLE\X64\RELEASE\NVENCODERD3D11.OBJ
D:\DOWNLOADS\VIDEO-SDK-SAMPLES-MASTER\NVENCDXGIOUTPUTDUPLICATIONSAMPLE\X64\RELEASE\NVENCODER.OBJ
^D:\DOWNLOADS\VIDEO-SDK-SAMPLES-MASTER\SAMPLES\NVCODEC\NVENCODER\NVENCODER.CPP
D:\DOWNLOADS\VIDEO-SDK-SAMPLES-MASTER\NVENCDXGIOUTPUTDUPLICATIONSAMPLE\X64\RELEASE\VC142.PDB
^D:\DOWNLOADS\VIDEO-SDK-SAMPLES-MASTER\SAMPLES\NVCODEC\NVENCODER\NVENCODERD3D11.CPP
D:\DOWNLOADS\VIDEO-SDK-SAMPLES-MASTER\NVENCDXGIOUTPUTDUPLICATIONSAMPLE\X64\RELEASE\VC142.PDB
^D:\DOWNLOADS\VIDEO-SDK-SAMPLES-MASTER\NVENCDXGIOUTPUTDUPLICATIONSAMPLE\PREPROC.CPP
D:\DOWNLOADS\VIDEO-SDK-SAMPLES-MASTER\NVENCDXGIOUTPUTDUPLICATIONSAMPLE\X64\RELEASE\VC142.PDB
^D:\DOWNLOADS\VIDEO-SDK-SAMPLES-MASTER\NVENCDXGIOUTPUTDUPLICATIONSAMPLE\DDAIMPL.CPP
D:\DOWNLOADS\VIDEO-SDK-SAMPLES-MASTER\NVENCDXGIOUTPUTDUPLICATIONSAMPLE\X64\RELEASE\VC142.PDB
D:\DOWNLOADS\VIDEO-SDK-SAMPLES-MASTER\NVENCDXGIOUTPUTDUPLICATIONSAMPLE\X64\RELEASE\DDAIMPL.OBJ
^D:\DOWNLOADS\BIEH-UDPSENDER-7576AD5248AA\DESKTOP\LIB\LIBUDP_API.CPP|D:\DOWNLOADS\VIDEO-SDK-SAMPLES-MASTER\NVENCDXGIOUTPUTDUPLICATIONSAMPLE\MAIN.CPP
D:\DOWNLOADS\VIDEO-SDK-SAMPLES-MASTER\NVENCDXGIOUTPUTDUPLICATIONSAMPLE\X64\RELEASE\VC142.PDB
D:\DOWNLOADS\VIDEO-SDK-SAMPLES-MASTER\NVENCDXGIOUTPUTDUPLICATIONSAMPLE\X64\RELEASE\MAIN.OBJ
D:\DOWNLOADS\VIDEO-SDK-SAMPLES-MASTER\NVENCDXGIOUTPUTDUPLICATIONSAMPLE\X64\RELEASE\LIBUDP_API.OBJ
^D:\DOWNLOADS\BIEH-UDPSENDER-7576AD5248AA\DESKTOP\LIB\LIBUDP_API.CPP
D:\DOWNLOADS\VIDEO-SDK-SAMPLES-MASTER\NVENCDXGIOUTPUTDUPLICATIONSAMPLE\X64\RELEASE\VC142.PDB
^D:\DOWNLOADS\VIDEO-SDK-SAMPLES-MASTER\NVENCDXGIOUTPUTDUPLICATIONSAMPLE\MAIN.CPP
D:\DOWNLOADS\VIDEO-SDK-SAMPLES-MASTER\NVENCDXGIOUTPUTDUPLICATIONSAMPLE\X64\RELEASE\VC142.PDB
