^D:\DOWNLOADS\BIEH-UDPSENDER-7576AD5248AA\DESKTOP\LIB\LIBUDP_API.CPP
/c /I"D:\DOWNLOADS\VIDEO-SDK-SAMPLES-MASTER\NVENCDXGIOUTPUTDUPLICATIONSAMPLE\PACKAGES\DIRECTXTEX_DESKTOP_WIN10.2019.10.17.1\BUILD\NATIVE\..\..\INCLUDE" /I..\SAMPLES\NVCODEC\ /I..\SAMPLES /I..\SAMPLES\UTILS /ZI /JMC /nologo /W3 /WX- /diagnostics:column /sdl /Od /D HAS_DIRECTXTEX /D WIN32 /D _DEBUG /D _CONSOLE /D _LIB /D _MBCS /Gm- /EHsc /RTC1 /MDd /GS /fp:precise /permissive- /Zc:wchar_t /Zc:forScope /Zc:inline /Fo"X64\DEBUG\\" /Fd"X64\DEBUG\VC142.PDB" /Gd /TP /FC D:\DOWNLOADS\BIEH-UDPSENDER-7576AD5248AA\DESKTOP\LIB\LIBUDP_API.CPP
^D:\DOWNLOADS\VIDEO-SDK-SAMPLES-MASTER\SAMPLES\NVCODEC\NVENCODER\NVENCODER.CPP
/c /I"D:\DOWNLOADS\VIDEO-SDK-SAMPLES-MASTER\NVENCDXGIOUTPUTDUPLICATIONSAMPLE\PACKAGES\DIRECTXTEX_DESKTOP_WIN10.2019.10.17.1\BUILD\NATIVE\..\..\INCLUDE" /I..\SAMPLES\NVCODEC\ /I..\SAMPLES /I..\SAMPLES\UTILS /ZI /JMC /nologo /W3 /WX- /diagnostics:column /sdl /Od /D HAS_DIRECTXTEX /D WIN32 /D _DEBUG /D _CONSOLE /D _LIB /D _MBCS /Gm- /EHsc /RTC1 /MDd /GS /fp:precise /permissive- /Zc:wchar_t /Zc:forScope /Zc:inline /Fo"X64\DEBUG\\" /Fd"X64\DEBUG\VC142.PDB" /Gd /TP /FC D:\DOWNLOADS\VIDEO-SDK-SAMPLES-MASTER\SAMPLES\NVCODEC\NVENCODER\NVENCODER.CPP
^D:\DOWNLOADS\VIDEO-SDK-SAMPLES-MASTER\SAMPLES\NVCODEC\NVENCODER\NVENCODERD3D11.CPP
/c /I"D:\DOWNLOADS\VIDEO-SDK-SAMPLES-MASTER\NVENCDXGIOUTPUTDUPLICATIONSAMPLE\PACKAGES\DIRECTXTEX_DESKTOP_WIN10.2019.10.17.1\BUILD\NATIVE\..\..\INCLUDE" /I..\SAMPLES\NVCODEC\ /I..\SAMPLES /I..\SAMPLES\UTILS /ZI /JMC /nologo /W3 /WX- /diagnostics:column /sdl /Od /D HAS_DIRECTXTEX /D WIN32 /D _DEBUG /D _CONSOLE /D _LIB /D _MBCS /Gm- /EHsc /RTC1 /MDd /GS /fp:precise /permissive- /Zc:wchar_t /Zc:forScope /Zc:inline /Fo"X64\DEBUG\\" /Fd"X64\DEBUG\VC142.PDB" /Gd /TP /FC D:\DOWNLOADS\VIDEO-SDK-SAMPLES-MASTER\SAMPLES\NVCODEC\NVENCODER\NVENCODERD3D11.CPP
^D:\DOWNLOADS\VIDEO-SDK-SAMPLES-MASTER\NVENCDXGIOUTPUTDUPLICATIONSAMPLE\DDAIMPL.CPP
/c /I"D:\DOWNLOADS\VIDEO-SDK-SAMPLES-MASTER\NVENCDXGIOUTPUTDUPLICATIONSAMPLE\PACKAGES\DIRECTXTEX_DESKTOP_WIN10.2019.10.17.1\BUILD\NATIVE\..\..\INCLUDE" /I..\SAMPLES\NVCODEC\ /I..\SAMPLES /I..\SAMPLES\UTILS /ZI /JMC /nologo /W3 /WX- /diagnostics:column /sdl /Od /D HAS_DIRECTXTEX /D WIN32 /D _DEBUG /D _CONSOLE /D _LIB /D _MBCS /Gm- /EHsc /RTC1 /MDd /GS /fp:precise /permissive- /Zc:wchar_t /Zc:forScope /Zc:inline /Fo"X64\DEBUG\\" /Fd"X64\DEBUG\VC142.PDB" /Gd /TP /FC D:\DOWNLOADS\VIDEO-SDK-SAMPLES-MASTER\NVENCDXGIOUTPUTDUPLICATIONSAMPLE\DDAIMPL.CPP
^D:\DOWNLOADS\VIDEO-SDK-SAMPLES-MASTER\NVENCDXGIOUTPUTDUPLICATIONSAMPLE\PREPROC.CPP
/c /I"D:\DOWNLOADS\VIDEO-SDK-SAMPLES-MASTER\NVENCDXGIOUTPUTDUPLICATIONSAMPLE\PACKAGES\DIRECTXTEX_DESKTOP_WIN10.2019.10.17.1\BUILD\NATIVE\..\..\INCLUDE" /I..\SAMPLES\NVCODEC\ /I..\SAMPLES /I..\SAMPLES\UTILS /ZI /JMC /nologo /W3 /WX- /diagnostics:column /sdl /Od /D HAS_DIRECTXTEX /D WIN32 /D _DEBUG /D _CONSOLE /D _LIB /D _MBCS /Gm- /EHsc /RTC1 /MDd /GS /fp:precise /permissive- /Zc:wchar_t /Zc:forScope /Zc:inline /Fo"X64\DEBUG\\" /Fd"X64\DEBUG\VC142.PDB" /Gd /TP /FC D:\DOWNLOADS\VIDEO-SDK-SAMPLES-MASTER\NVENCDXGIOUTPUTDUPLICATIONSAMPLE\PREPROC.CPP
^D:\DOWNLOADS\VIDEO-SDK-SAMPLES-MASTER\NVENCDXGIOUTPUTDUPLICATIONSAMPLE\CALLBACKTIMER.CPP
/c /I"D:\DOWNLOADS\VIDEO-SDK-SAMPLES-MASTER\NVENCDXGIOUTPUTDUPLICATIONSAMPLE\PACKAGES\DIRECTXTEX_DESKTOP_WIN10.2019.10.17.1\BUILD\NATIVE\..\..\INCLUDE" /I..\SAMPLES\NVCODEC\ /I..\SAMPLES /I..\SAMPLES\UTILS /ZI /JMC /nologo /W3 /WX- /diagnostics:column /sdl /Od /D HAS_DIRECTXTEX /D WIN32 /D _DEBUG /D _CONSOLE /D _LIB /D _MBCS /Gm- /EHsc /RTC1 /MDd /GS /fp:precise /permissive- /Zc:wchar_t /Zc:forScope /Zc:inline /Fo"X64\DEBUG\\" /Fd"X64\DEBUG\VC142.PDB" /Gd /TP /FC D:\DOWNLOADS\VIDEO-SDK-SAMPLES-MASTER\NVENCDXGIOUTPUTDUPLICATIONSAMPLE\CALLBACKTIMER.CPP
^D:\DOWNLOADS\VIDEO-SDK-SAMPLES-MASTER\NVENCDXGIOUTPUTDUPLICATIONSAMPLE\MAIN.CPP
/c /I"D:\DOWNLOADS\VIDEO-SDK-SAMPLES-MASTER\NVENCDXGIOUTPUTDUPLICATIONSAMPLE\PACKAGES\DIRECTXTEX_DESKTOP_WIN10.2019.10.17.1\BUILD\NATIVE\..\..\INCLUDE" /I..\SAMPLES\NVCODEC\ /I..\SAMPLES /I..\SAMPLES\UTILS /ZI /JMC /nologo /W3 /WX- /diagnostics:column /sdl /Od /D HAS_DIRECTXTEX /D WIN32 /D _DEBUG /D _CONSOLE /D _LIB /D _MBCS /Gm- /EHsc /RTC1 /MDd /GS /fp:precise /permissive- /Zc:wchar_t /Zc:forScope /Zc:inline /Fo"X64\DEBUG\\" /Fd"X64\DEBUG\VC142.PDB" /Gd /TP /FC D:\DOWNLOADS\VIDEO-SDK-SAMPLES-MASTER\NVENCDXGIOUTPUTDUPLICATIONSAMPLE\MAIN.CPP
