C:\Users\yhabach\Documents\MicroServiceEcom\product-service\src\main\java\com\microservices\productservice\service\ProductService.java
C:\Users\yhabach\Documents\MicroServiceEcom\product-service\src\main\java\com\microservices\productservice\controler\ProductController.java
C:\Users\yhabach\Documents\MicroServiceEcom\product-service\src\main\java\com\microservices\productservice\dto\ProductRequest.java
C:\Users\yhabach\Documents\MicroServiceEcom\product-service\src\main\java\com\microservices\productservice\ProductServiceApplication.java
C:\Users\yhabach\Documents\MicroServiceEcom\product-service\src\main\java\com\microservices\productservice\repository\ProductRepository.java
C:\Users\yhabach\Documents\MicroServiceEcom\product-service\src\main\java\com\microservices\productservice\model\Product.java
C:\Users\yhabach\Documents\MicroServiceEcom\product-service\src\main\java\com\microservices\productservice\dto\ProductResponse.java
