%YAML 1.1
%TAG !u! tag:unity3d.com,2011:
--- !u!114 &2752058429989466436
MonoBehaviour:
  m_ObjectHideFlags: 0
  m_CorrespondingSourceObject: {fileID: 0}
  m_PrefabInstance: {fileID: 0}
  m_PrefabAsset: {fileID: 0}
  m_GameObject: {fileID: 1046048059590413795}
  m_Enabled: 1
  m_EditorHideFlags: 0
  m_Script: {fileID: 11500000, guid: 3f86a506926186840bba62e8e4f9c3f3, type: 3}
  m_Name: 
  m_EditorClassIdentifier: 
  mainCollider: {fileID: 1046048060924890692}
--- !u!1 &4934780857121531376
GameObject:
  m_ObjectHideFlags: 0
  m_CorrespondingSourceObject: {fileID: 0}
  m_PrefabInstance: {fileID: 0}
  m_PrefabAsset: {fileID: 0}
  serializedVersion: 6
  m_Component:
  - component: {fileID: 8727815634954110195}
  - component: {fileID: 6954487101548047145}
  m_Layer: 0
  m_Name: Sprite
  m_TagString: Untagged
  m_Icon: {fileID: 0}
  m_NavMeshLayer: 0
  m_StaticEditorFlags: 0
  m_IsActive: 1
--- !u!4 &8727815634954110195
Transform:
  m_ObjectHideFlags: 0
  m_CorrespondingSourceObject: {fileID: 0}
  m_PrefabInstance: {fileID: 0}
  m_PrefabAsset: {fileID: 0}
  m_GameObject: {fileID: 4934780857121531376}
  m_LocalRotation: {x: 0, y: 0, z: 0, w: 1}
  m_LocalPosition: {x: 0, y: 0, z: 0}
  m_LocalScale: {x: 1, y: 1, z: 1}
  m_Children: []
  m_Father: {fileID: 1046048059590413796}
  m_RootOrder: 1
  m_LocalEulerAnglesHint: {x: 0, y: 0, z: 0}
--- !u!212 &6954487101548047145
SpriteRenderer:
  m_ObjectHideFlags: 0
  m_CorrespondingSourceObject: {fileID: 0}
  m_PrefabInstance: {fileID: 0}
  m_PrefabAsset: {fileID: 0}
  m_GameObject: {fileID: 4934780857121531376}
  m_Enabled: 1
  m_CastShadows: 0
  m_ReceiveShadows: 0
  m_DynamicOccludee: 1
  m_MotionVectors: 1
  m_LightProbeUsage: 1
  m_ReflectionProbeUsage: 1
  m_RenderingLayerMask: 1
  m_RendererPriority: 0
  m_Materials:
  - {fileID: 10754, guid: 0000000000000000f000000000000000, type: 0}
  m_StaticBatchInfo:
    firstSubMesh: 0
    subMeshCount: 0
  m_StaticBatchRoot: {fileID: 0}
  m_ProbeAnchor: {fileID: 0}
  m_LightProbeVolumeOverride: {fileID: 0}
  m_ScaleInLightmap: 1
  m_PreserveUVs: 0
  m_IgnoreNormalsForChartDetection: 0
  m_ImportantGI: 0
  m_StitchLightmapSeams: 0
  m_SelectedEditorRenderState: 0
  m_MinimumChartSize: 4
  m_AutoUVMaxDistance: 0.5
  m_AutoUVMaxAngle: 89
  m_LightmapParameters: {fileID: 0}
  m_SortingLayerID: 0
  m_SortingLayer: 0
  m_SortingOrder: 0
  m_Sprite: {fileID: 21300000, guid: 331972784ad20354ea5bd91a2809f8cf, type: 3}
  m_Color: {r: 1, g: 1, b: 1, a: 1}
  m_FlipX: 0
  m_FlipY: 0
  m_DrawMode: 0
  m_Size: {x: 317, y: 279}
  m_AdaptiveModeThreshold: 0.5
  m_SpriteTileMode: 0
  m_WasSpriteAssigned: 1
  m_MaskInteraction: 0
  m_SpriteSortPoint: 0
--- !u!1001 &3300093152531454754
PrefabInstance:
  m_ObjectHideFlags: 0
  serializedVersion: 2
  m_Modification:
    m_TransformParent: {fileID: 0}
    m_Modifications:
    - target: {fileID: 2542288689053669057, guid: 26ab23e57397b44d6862cc04ea5e25ee,
        type: 3}
      propertyPath: m_Name
      value: EnemyController_03
      objectReference: {fileID: 0}
    - target: {fileID: 2542288689053669062, guid: 26ab23e57397b44d6862cc04ea5e25ee,
        type: 3}
      propertyPath: m_LocalPosition.x
      value: 0
      objectReference: {fileID: 0}
    - target: {fileID: 2542288689053669062, guid: 26ab23e57397b44d6862cc04ea5e25ee,
        type: 3}
      propertyPath: m_LocalPosition.y
      value: 0
      objectReference: {fileID: 0}
    - target: {fileID: 2542288689053669062, guid: 26ab23e57397b44d6862cc04ea5e25ee,
        type: 3}
      propertyPath: m_LocalPosition.z
      value: 0
      objectReference: {fileID: 0}
    - target: {fileID: 2542288689053669062, guid: 26ab23e57397b44d6862cc04ea5e25ee,
        type: 3}
      propertyPath: m_LocalRotation.x
      value: 0
      objectReference: {fileID: 0}
    - target: {fileID: 2542288689053669062, guid: 26ab23e57397b44d6862cc04ea5e25ee,
        type: 3}
      propertyPath: m_LocalRotation.y
      value: 0
      objectReference: {fileID: 0}
    - target: {fileID: 2542288689053669062, guid: 26ab23e57397b44d6862cc04ea5e25ee,
        type: 3}
      propertyPath: m_LocalRotation.z
      value: 0
      objectReference: {fileID: 0}
    - target: {fileID: 2542288689053669062, guid: 26ab23e57397b44d6862cc04ea5e25ee,
        type: 3}
      propertyPath: m_LocalRotation.w
      value: 1
      objectReference: {fileID: 0}
    - target: {fileID: 2542288689053669062, guid: 26ab23e57397b44d6862cc04ea5e25ee,
        type: 3}
      propertyPath: m_RootOrder
      value: 0
      objectReference: {fileID: 0}
    - target: {fileID: 2542288689053669062, guid: 26ab23e57397b44d6862cc04ea5e25ee,
        type: 3}
      propertyPath: m_LocalEulerAnglesHint.x
      value: 0
      objectReference: {fileID: 0}
    - target: {fileID: 2542288689053669062, guid: 26ab23e57397b44d6862cc04ea5e25ee,
        type: 3}
      propertyPath: m_LocalEulerAnglesHint.y
      value: 0
      objectReference: {fileID: 0}
    - target: {fileID: 2542288689053669062, guid: 26ab23e57397b44d6862cc04ea5e25ee,
        type: 3}
      propertyPath: m_LocalEulerAnglesHint.z
      value: 0
      objectReference: {fileID: 0}
    m_RemovedComponents: []
  m_SourcePrefab: {fileID: 100100000, guid: 26ab23e57397b44d6862cc04ea5e25ee, type: 3}
--- !u!1 &1046048059590413795 stripped
GameObject:
  m_CorrespondingSourceObject: {fileID: 2542288689053669057, guid: 26ab23e57397b44d6862cc04ea5e25ee,
    type: 3}
  m_PrefabInstance: {fileID: 3300093152531454754}
  m_PrefabAsset: {fileID: 0}
--- !u!4 &1046048059590413796 stripped
Transform:
  m_CorrespondingSourceObject: {fileID: 2542288689053669062, guid: 26ab23e57397b44d6862cc04ea5e25ee,
    type: 3}
  m_PrefabInstance: {fileID: 3300093152531454754}
  m_PrefabAsset: {fileID: 0}
--- !u!58 &1046048060924890692 stripped
CircleCollider2D:
  m_CorrespondingSourceObject: {fileID: 2542288687706412390, guid: 26ab23e57397b44d6862cc04ea5e25ee,
    type: 3}
  m_PrefabInstance: {fileID: 3300093152531454754}
  m_PrefabAsset: {fileID: 0}
