date,position,title,artist,spotify_id,is_new,last_pos,peak_pos,weeks,danceability,energy,key,loudness,mode,speechiness,acousticness,instrumentalness,liveness,valence,tempo,duration_ms,time_signature
2012-11-10,1,One More Night,Maroon 5,5xvUgoVED1F4mBu8FL0HaW,False,1,1,19,0.718,0.82,5,-3.453,0,0.0323,0.0444,0,0.0846,0.613,92.998,219467,4
2012-11-10,2,Gangnam Style,PSY,5xvUgoVED1F4mBu8FL0HaW,False,2,2,8,0.727,0.937,11,-2.871,0,0.286,0.00417,0,0.091,0.749,132.067,219493,4
2012-11-10,3,Some Nights,fun.,5xvUgoVED1F4mBu8FL0HaW,False,3,3,36,0.672,0.738,0,-7.045,1,0.0506,0.0178,6.75e-05,0.0927,0.392,107.938,277040,4
2012-11-10,4,Die Young,Ke$ha,5xvUgoVED1F4mBu8FL0HaW,False,5,4,5,0.711,0.7,1,-4.805,0,0.046,0.00498,0.000125,0.215,0.801,128.001,211920,4
2012-11-10,5,Diamonds,Rihanna,5xvUgoVED1F4mBu8FL0HaW,False,8,5,5,0.564,0.71,11,-4.92,0,0.0461,0.00125,0,0.109,0.393,91.972,225147,4
2012-11-10,6,As Long As You Love Me,Justin Bieber Featuring Big Sean,5xvUgoVED1F4mBu8FL0HaW,False,6,6,19,0.571,0.873,0,-3.382,0,0.1,0.0811,0,0.361,0.613,139.691,229467,4
2012-11-10,7,Locked Out Of Heaven,Bruno Mars,5xvUgoVED1F4mBu8FL0HaW,False,15,7,4,0.726,0.698,5,-4.165,1,0.0431,0.049,0,0.309,0.867,143.994,233478,4
2012-11-10,8,Too Close,Alex Clare,5xvUgoVED1F4mBu8FL0HaW,False,7,7,31,0.584,0.712,11,-4.311,0,0.0395,0.0112,1.05e-06,0.114,0.286,126.043,256560,4
2012-11-10,9,Let Me Love You (Until You Learn To Love Yourself),Ne-Yo,5xvUgoVED1F4mBu8FL0HaW,False,9,9,13,0.669,0.723,5,-5.2,1,0.0346,0.213,0,0.523,0.269,124.925,252227,4
2012-11-10,10,Don't Wake Me Up,Chris Brown,5xvUgoVED1F4mBu8FL0HaW,False,11,10,18,0.602,0.691,7,-5.197,0,0.051,0.0548,0,0.144,0.206,127.967,222307,4
2012-11-10,11,We Are Never Ever Getting Back Together,Taylor Swift,5xvUgoVED1F4mBu8FL0HaW,False,4,1,12,0.628,0.676,7,-5.911,1,0.0916,0.00957,2.65e-05,0.121,0.75,85.984,193147,4
2012-11-10,12,Blow Me (One Last Kiss),P!nk,5xvUgoVED1F4mBu8FL0HaW,False,10,5,17,0.597,0.919,7,-2.954,1,0.044,0.000145,0,0.282,0.73,113.987,255587,4
2012-11-10,13,Good Time,Owl City & Carly Rae Jepsen,5xvUgoVED1F4mBu8FL0HaW,False,12,8,18,0.56,0.872,3,-4.269,1,0.14,0.0239,6.98e-06,0.371,0.682,126.05,205933,4
2012-11-10,14,Home,Phillip Phillips,5xvUgoVED1F4mBu8FL0HaW,False,17,9,18,0.606,0.826,0,-6.04,1,0.0307,0.0256,1.56e-05,0.117,0.322,121.04,210173,4
2012-11-10,15,I Cry,Flo Rida,5xvUgoVED1F4mBu8FL0HaW,False,24,15,5,0.693,0.822,4,-5.441,0,0.0439,0.00616,1.79e-06,0.315,0.763,126.035,223800,4
2012-11-10,16,Clique,"Kanye West, Jay-Z, Big Sean",5xvUgoVED1F4mBu8FL0HaW,False,18,12,8,0.704,0.569,7,-4.998,0,0.247,0.0488,0,0.191,0.313,109.314,293533,5
2012-11-10,17,Lights,Ellie Goulding,5xvUgoVED1F4mBu8FL0HaW,False,14,2,45,0.681,0.802,8,-5.836,0,0.0347,0.0271,0.0496,0.127,0.791,120.053,212707,4
2012-11-10,18,Adorn,Miguel,5xvUgoVED1F4mBu8FL0HaW,False,22,18,13,0.625,0.576,11,-5.693,0,0.175,0.0543,4.07e-05,0.187,0.235,179.063,193147,4
2012-11-10,19,Ho Hey,The Lumineers,5xvUgoVED1F4mBu8FL0HaW,False,27,19,21,0.685,0.466,0,-9.074,1,0.0304,0.794,2.06e-06,0.0915,0.353,79.936,163133,4
2012-11-10,20,Everybody Talks,Neon Trees,5xvUgoVED1F4mBu8FL0HaW,False,16,6,33,0.471,0.924,8,-3.906,1,0.0586,0.00301,0,0.313,0.725,154.961,177280,4
2012-11-10,21,50 Ways To Say Goodbye,Train,5xvUgoVED1F4mBu8FL0HaW,False,20,20,16,0.591,0.935,6,-2.664,1,0.0478,0.000284,0.000278,0.142,0.736,140.043,247947,4
2012-11-10,22,Whistle,Flo Rida,5xvUgoVED1F4mBu8FL0HaW,False,19,1,24,0.747,0.937,0,-5.746,1,0.0453,0.0208,0,0.29,0.739,103.976,224653,4
2012-11-10,23,Blown Away,Carrie Underwood,5xvUgoVED1F4mBu8FL0HaW,False,21,20,17,0.531,0.843,9,-2.569,0,0.0429,0.0909,0,0.0283,0.392,136.991,240133,4
2012-11-10,24,Cruise,Florida Georgia Line Featuring Nelly,5xvUgoVED1F4mBu8FL0HaW,False,29,24,11,0.457,0.948,10,-3.364,1,0.0354,0.0191,0,0.0536,0.878,148.0,208960,4
2012-11-10,25,Call Me Maybe,Carly Rae Jepsen,5xvUgoVED1F4mBu8FL0HaW,False,25,1,36,0.783,0.58,7,-6.548,1,0.0408,0.0114,2.28e-06,0.108,0.66,120.021,193400,4
2012-11-10,26,Somebody That I Used To Know,Gotye Featuring Kimbra,5xvUgoVED1F4mBu8FL0HaW,False,26,1,43,0.864,0.495,0,-7.036,1,0.037,0.591,0.000133,0.0992,0.72,129.062,244973,4
2012-11-10,27,Wide Awake,Katy Perry,5xvUgoVED1F4mBu8FL0HaW,False,28,2,23,0.514,0.683,5,-5.099,1,0.0367,0.0749,2.64e-06,0.392,0.575,159.814,220947,4
2012-11-10,28,Girl On Fire,Alicia Keys Featuring Nicki Minaj,5xvUgoVED1F4mBu8FL0HaW,False,47,28,8,0.482,0.706,9,-5.762,1,0.0609,0.135,0.00106,0.105,0.144,92.494,224920,4
2012-11-10,29,Titanium,David Guetta Featuring Sia,5xvUgoVED1F4mBu8FL0HaW,False,30,7,29,0.604,0.788,0,-3.673,0,0.103,0.0678,0.153,0.127,0.301,126.06,245040,4
2012-11-10,30,It's Time,Imagine Dragons,5xvUgoVED1F4mBu8FL0HaW,False,35,30,21,0.656,0.884,2,-4.748,1,0.0372,0.0162,0,0.145,0.86,105.009,237987,4
2012-11-10,31,Finally Found You,Enrique Iglesias Featuring Sammy Adams,5xvUgoVED1F4mBu8FL0HaW,False,36,24,7,0.622,0.881,6,-4.871,0,0.0956,0.0109,0,0.348,0.664,127.958,220813,4
2012-11-10,32,Swimming Pools (Drank),Kendrick Lamar,5xvUgoVED1F4mBu8FL0HaW,False,55,32,11,0.577,0.447,8,-5.892,1,0.277,0.00627,0.00022,0.0899,0.189,74.236,247800,4
2012-11-10,33,Payphone,Maroon 5 Featuring Wiz Khalifa,5xvUgoVED1F4mBu8FL0HaW,False,32,2,28,0.739,0.756,4,-4.828,1,0.0394,0.0136,0,0.37,0.523,110.028,231387,4
2012-11-10,34,The A Team,Ed Sheeran,5xvUgoVED1F4mBu8FL0HaW,False,41,34,16,0.642,0.289,9,-9.918,1,0.0367,0.669,0,0.18,0.407,84.996,258373,4
2012-11-10,35,Hard To Love,Lee Brice,5xvUgoVED1F4mBu8FL0HaW,False,40,35,20,0.638,0.722,9,-6.177,1,0.0332,0.0119,0.00808,0.189,0.469,103.017,224293,4
2012-11-10,36,Pop That,"French Montana Featuring Rick Ross, Drake, Lil Wayne",5xvUgoVED1F4mBu8FL0HaW,False,37,36,16,0.734,0.892,2,-1.856,1,0.125,0.0648,0,0.58,0.605,138.031,303533,4
2012-11-10,37,I Will Wait,Mumford & Sons,5xvUgoVED1F4mBu8FL0HaW,False,34,23,12,0.48,0.756,1,-5.399,1,0.0333,0.00993,0.00704,0.312,0.447,131.127,276720,4
2012-11-10,38,Mercy,"Kanye West, Big Sean, Pusha T, 2 Chainz",5xvUgoVED1F4mBu8FL0HaW,False,33,13,30,0.563,0.496,6,-9.381,0,0.406,0.0685,5.8e-05,0.173,0.426,139.993,329320,4
2012-11-10,39,Live While We're Young,One Direction,5xvUgoVED1F4mBu8FL0HaW,False,31,3,4,0.663,0.857,2,-2.16,1,0.0544,0.0542,0,0.144,0.931,126.039,200213,4
2012-11-10,40,Kiss Tomorrow Goodbye,Luke Bryan,5xvUgoVED1F4mBu8FL0HaW,False,42,40,10,0.571,0.937,5,-3.467,0,0.0365,0.0064,0,0.316,0.584,115.013,203133,4
2012-11-10,41,Wanted,Hunter Hayes,5xvUgoVED1F4mBu8FL0HaW,False,38,16,27,0.421,0.476,0,-7.692,1,0.0298,0.268,0,0.0816,0.3,169.784,228840,4
2012-11-10,42,Give Your Heart A Break,Demi Lovato,5xvUgoVED1F4mBu8FL0HaW,False,39,16,30,0.651,0.695,6,-3.218,1,0.0487,0.23,0,0.144,0.569,123.008,205347,4
2012-11-10,43,Bandz A Make Her Dance,Juicy J Featuring Lil Wayne & 2 Chainz,5xvUgoVED1F4mBu8FL0HaW,False,46,43,7,0.871,0.743,2,-5.442,1,0.277,0.00212,0,0.141,0.576,130.977,278827,4
2012-11-10,44,22,Taylor Swift,3bIxTsfeNMO7Nt2J3EUKrA,True,0,44,1,0.658,0.729,7,-6.561,1,0.0378,0.00215,0.0013,0.0752,0.668,104.007,230133,4
2012-11-10,45,Thinkin Bout You,Frank Ocean,3bIxTsfeNMO7Nt2J3EUKrA,False,52,39,16,0.721,0.339,0,-11.195,1,0.0532,0.409,0.00153,0.0973,0.2,129.83,200747,4
2012-11-10,46,No Lie,2 Chainz Featuring Drake,3bIxTsfeNMO7Nt2J3EUKrA,False,43,24,25,0.634,0.665,6,-5.984,0,0.176,0.0172,0,0.365,0.611,131.108,237827,4
2012-11-10,47,Birthday Song,2 Chainz Featuring Kanye West,3bIxTsfeNMO7Nt2J3EUKrA,False,49,47,12,0.753,0.59,1,-2.623,1,0.0485,0.0591,0,0.15,0.161,140.002,306600,4
2012-11-10,48,2 Reasons,Trey Songz Featuring T.I.,3bIxTsfeNMO7Nt2J3EUKrA,False,48,43,17,0.734,0.746,11,-5.088,1,0.0762,0.00135,0,0.178,0.539,94.033,197627,4
2012-11-10,49,I Won't Give Up,Jason Mraz,3bIxTsfeNMO7Nt2J3EUKrA,False,44,8,43,0.585,0.303,4,-10.058,1,0.0398,0.694,0,0.115,0.142,136.703,240166,3
2012-11-10,50,Feel Again,OneRepublic,3bIxTsfeNMO7Nt2J3EUKrA,False,56,50,9,0.467,0.815,7,-7.929,0,0.0524,0.0198,1.23e-06,0.118,0.335,140.047,185080,4
2012-11-10,51,The One That Got Away,Jake Owen,3bIxTsfeNMO7Nt2J3EUKrA,False,57,51,12,0.576,0.865,0,-3.288,1,0.0407,0.0343,5.32e-05,0.252,0.535,119.913,194173,4
2012-11-10,52,Skyfall,Adele,3bIxTsfeNMO7Nt2J3EUKrA,False,45,8,4,0.346,0.552,0,-6.864,0,0.0282,0.417,0,0.114,0.0789,75.881,286480,4
2012-11-10,53,Hall Of Fame,The Script Featuring will.i.am,3bIxTsfeNMO7Nt2J3EUKrA,False,70,53,5,0.421,0.873,10,-4.343,1,0.0565,0.0653,0,0.123,0.63,84.803,202533,4
2012-11-10,54,Turn On The Lights,Future,3bIxTsfeNMO7Nt2J3EUKrA,False,53,50,12,0.596,0.574,6,-9.373,0,0.212,0.0409,0,0.147,0.439,131.075,248360,4
2012-11-10,55,Don't You Worry Child,Swedish House Mafia Featuring John Martin,3bIxTsfeNMO7Nt2J3EUKrA,False,75,55,6,0.612,0.84,11,-3.145,0,0.0509,0.112,0,0.116,0.438,129.042,212862,4
2012-11-10,56,Fastest Girl In Town,Miranda Lambert,3bIxTsfeNMO7Nt2J3EUKrA,False,60,56,14,0.541,0.911,1,-3.6,0,0.0631,0.0205,0.00155,0.275,0.563,145.057,197600,4
2012-11-10,57,Lovin' You Is Fun,Easton Corbin,3bIxTsfeNMO7Nt2J3EUKrA,False,61,57,17,0.703,0.83,8,-3.028,1,0.0327,0.32,0,0.364,0.597,109.958,199013,4
2012-11-10,58,Take A Little Ride,Jason Aldean,3bIxTsfeNMO7Nt2J3EUKrA,False,63,12,15,0.472,0.866,2,-3.771,1,0.0413,0.044,0,0.213,0.775,163.867,187613,4
2012-11-10,59,Come Wake Me Up,Rascal Flatts,3bIxTsfeNMO7Nt2J3EUKrA,False,62,59,14,0.454,0.605,4,-6.816,1,0.0314,0.255,0,0.109,0.18,155.861,263253,3
2012-11-10,60,Your Body,Christina Aguilera,3bIxTsfeNMO7Nt2J3EUKrA,False,59,34,6,0.593,0.781,8,-5.291,0,0.0545,0.000724,0,0.225,0.565,103.025,239853,4
2012-11-10,61,Madness,Muse,3bIxTsfeNMO7Nt2J3EUKrA,False,66,60,10,0.502,0.417,10,-7.665,1,0.0718,0.127,0.00419,0.106,0.218,180.301,281040,4
2012-11-10,62,I Can Only Imagine,David Guetta Featuring Chris Brown & Lil Wayne,3bIxTsfeNMO7Nt2J3EUKrA,False,58,44,12,0.669,0.939,9,-2.06,1,0.0427,0.0463,1.12e-06,0.335,0.264,127.947,209533,4
2012-11-10,63,Beer Money,Kip Moore,3bIxTsfeNMO7Nt2J3EUKrA,False,67,63,6,0.745,0.805,2,-5.549,1,0.0307,0.0223,1.06e-06,0.13,0.765,126.065,218147,4
2012-11-10,64,Pound The Alarm,Nicki Minaj,3bIxTsfeNMO7Nt2J3EUKrA,False,51,15,14,0.728,0.858,9,-3.686,1,0.0609,0.0403,4.26e-06,0.0241,0.591,125.054,205640,4
2012-11-10,65,I Almost Do,Taylor Swift,31pEV5lPJi7btskZoUr2yu,True,0,65,1,0.567,0.481,4,-7.357,1,0.027,0.0173,4.13e-05,0.182,0.233,145.865,242573,4
2012-11-10,66,No Worries,Lil Wayne Featuring Detail,31pEV5lPJi7btskZoUr2yu,False,72,58,8,0.844,0.592,5,-5.486,1,0.199,0.085,0,0.0817,0.819,128.033,221000,4
2012-11-10,67,Everything Has Changed,Taylor Swift Featuring Ed Sheeran,4NAmRvqSITAAzKWnC8yRq3,True,0,67,1,0.624,0.458,6,-6.755,1,0.0287,0.36,3.89e-06,0.303,0.436,80.017,243933,4
2012-11-10,68,Til My Last Day,Justin Moore,4NAmRvqSITAAzKWnC8yRq3,False,76,68,7,0.577,0.761,9,-5.34,1,0.0358,0.0377,0,0.116,0.599,104.991,234027,4
2012-11-10,69,Anything Could Happen,Ellie Goulding,4NAmRvqSITAAzKWnC8yRq3,False,64,64,3,0.702,0.781,0,-4.081,1,0.03,0.433,0,0.135,0.382,102.997,286322,4
2012-11-10,70,Beauty And A Beat,Justin Bieber Featuring Nicki Minaj,4NAmRvqSITAAzKWnC8yRq3,False,71,70,3,0.602,0.843,0,-4.831,1,0.0593,0.000688,5.27e-05,0.0682,0.526,128.003,227987,4
2012-11-10,71,Put It Down,Brandy Featuring Chris Brown,4NAmRvqSITAAzKWnC8yRq3,False,65,65,11,0.761,0.413,0,-8.104,1,0.195,0.019,0,0.0829,0.595,141.056,246213,4
2012-11-10,72,Numb,Usher,4NAmRvqSITAAzKWnC8yRq3,False,69,69,6,0.577,0.687,8,-7.601,1,0.0471,0.0113,4.42e-06,0.112,0.291,124.956,225520,4
2012-11-10,73,Want U Back,Cher Lloyd,4NAmRvqSITAAzKWnC8yRq3,False,68,12,20,0.694,0.891,9,-2.94,1,0.0949,0.0562,0,0.561,0.563,97.939,214573,4
2012-11-10,74,Creepin',Eric Church,4NAmRvqSITAAzKWnC8yRq3,False,73,73,10,0.464,0.889,5,-5.042,1,0.0497,0.0389,0.0272,0.31,0.539,87.858,232720,4
2012-11-10,75,Ball,T.I. Featuring Lil Wayne,4NAmRvqSITAAzKWnC8yRq3,False,50,50,2,0.772,0.885,1,-4.736,1,0.0847,0.193,9.48e-06,0.0953,0.512,94.98,205360,4
2012-11-10,76,Poetic Justice,Kendrick Lamar Featuring Drake,2P3SLxeQHPqh8qKB6gtJY2,True,0,76,1,0.779,0.572,6,-9.985,0,0.378,0.157,0,0.246,0.647,135.956,300160,4
2012-11-10,77,Thrift Shop,Macklemore & Ryan Lewis Featuring Wanz,2P3SLxeQHPqh8qKB6gtJY2,False,82,77,4,0.781,0.526,6,-6.986,0,0.293,0.0633,0,0.0457,0.665,94.993,235613,4
2012-11-10,78,Ready Or Not,Bridgit Mendler,2P3SLxeQHPqh8qKB6gtJY2,False,98,78,2,0.715,0.872,2,-3.835,1,0.0509,0.00351,3.84e-05,0.107,0.748,93.043,200947,4
2012-11-10,79,Dance For You,Beyonce,2P3SLxeQHPqh8qKB6gtJY2,False,79,78,8,0.616,0.78,2,-6.062,1,0.0623,0.0322,0,0.173,0.471,110.005,377467,4
2012-11-10,80,All Too Well,Taylor Swift,1q3RiD1tIWUpGsNFADMlvl,True,0,80,1,0.602,0.609,0,-7.803,1,0.0243,0.0382,0.0002,0.127,0.337,93.06,327893,4
2012-11-10,81,Every Storm (Runs Out Of Rain),Gary Allan,1q3RiD1tIWUpGsNFADMlvl,False,89,78,4,0.525,0.693,0,-6.972,1,0.0327,0.046,9.55e-06,0.247,0.363,107.012,225640,4
2012-11-10,82,Goodbye In Her Eyes,Zac Brown Band,1q3RiD1tIWUpGsNFADMlvl,False,91,82,3,0.4,0.558,3,-7.393,1,0.038,0.163,3.76e-06,0.0879,0.376,81.271,324267,4
2012-11-10,83,Dive In,Trey Songz,1q3RiD1tIWUpGsNFADMlvl,False,81,77,9,0.587,0.648,0,-6.954,1,0.089,0.0279,0,0.962,0.37,119.888,252453,4
2012-11-10,84,Diced Pineapples,Rick Ross Featuring Wale & Drake,1q3RiD1tIWUpGsNFADMlvl,False,87,84,4,0.511,0.735,2,-6.026,1,0.239,0.352,0,0.196,0.379,110.965,276160,5
2012-11-10,85,How Country Feels,Randy Houser,1q3RiD1tIWUpGsNFADMlvl,False,86,85,4,0.678,0.839,7,-3.617,1,0.0394,0.0379,0,0.0742,0.772,104.952,185907,4
2012-11-10,86,Did It For The Girl,Greg Bates,1q3RiD1tIWUpGsNFADMlvl,False,88,85,6,0.658,0.728,5,-4.916,1,0.0237,0.0183,6.26e-06,0.306,0.682,101.969,191293,4
2012-11-10,87,Southern Comfort Zone,Brad Paisley,1q3RiD1tIWUpGsNFADMlvl,False,84,73,4,0.431,0.876,4,-6.109,1,0.0658,0.0771,1.81e-05,0.0998,0.519,160.0,316987,4
2012-11-10,88,El Cerrito Place,Kenny Chesney,1q3RiD1tIWUpGsNFADMlvl,False,90,88,3,0.596,0.503,4,-7.606,1,0.0272,0.13,0,0.0754,0.262,134.032,351613,4
2012-11-10,89,Take A Walk,Passion Pit,1q3RiD1tIWUpGsNFADMlvl,False,85,85,9,0.566,0.755,11,-5.526,1,0.0368,0.0338,0,0.315,0.445,101.006,264493,4
2012-11-10,90,Radioactive,Imagine Dragons,1q3RiD1tIWUpGsNFADMlvl,False,93,90,9,0.448,0.784,9,-3.686,1,0.0627,0.106,0.000108,0.668,0.236,136.245,186813,4
2012-11-10,91,Stay Stay Stay,Taylor Swift,1x0J8LFX23d5h1zzuzZorc,True,0,91,1,0.729,0.748,0,-6.67,1,0.0245,0.307,1.29e-06,0.09,0.928,99.981,204827,4
2012-11-10,92,Fade Into You,Sam Palladio & Clare Bowen,0kcxKrUvHMOYIEqjJgnQHZ,True,0,92,1,0.683,0.201,6,-12.436,0,0.0322,0.886,0.00107,0.115,0.262,112.648,209227,3
2012-11-10,93,Catch My Breath,Kelly Clarkson,0kcxKrUvHMOYIEqjJgnQHZ,False,54,54,2,0.692,0.908,9,-5.364,1,0.0677,0.0251,0,0.0933,0.513,124.042,250387,4
2012-11-10,94,m.A.A.d City,Kendrick Lamar Featuring MC Eiht,439TlnnznSiBbQbgXiBqAd,True,0,94,1,0.487,0.729,2,-6.815,1,0.271,0.0538,4.07e-06,0.44,0.217,91.048,350120,4
2012-11-10,95,Young & Gettin' It,Meek Mill Featuring Kirko Bangz,6MVdz8I7oYm86MRzZiOZa8,True,0,95,1,0.624,0.752,4,-5.43,1,0.121,0.244,0,0.131,0.858,134.021,205973,4
2012-11-10,96,My Moment,"DJ Drama Featuring 2 Chainz, Meek Mill & Jeremih",6MVdz8I7oYm86MRzZiOZa8,False,95,89,4,0.456,0.76,1,-3.015,0,0.0988,0.0337,0,0.228,0.189,148.063,198920,4
2012-11-10,97,Babel,Mumford & Sons,6MVdz8I7oYm86MRzZiOZa8,False,83,60,5,0.373,0.813,2,-6.13,1,0.0543,0.0253,0.000227,0.0826,0.647,80.465,208933,4
2012-11-10,98,Va Va Voom,Nicki Minaj,6MVdz8I7oYm86MRzZiOZa8,False,0,79,2,0.648,0.836,8,-3.394,1,0.0316,0.0625,0.00995,0.202,0.705,126.889,183560,4
2012-11-10,99,Don't Stop The Party,Pitbull Featuring TJR,6MVdz8I7oYm86MRzZiOZa8,False,0,89,2,0.722,0.958,4,-3.617,1,0.0912,0.00726,0,0.375,0.952,127.008,206120,4
2012-11-10,100,Ice,Kelly Rowland Featuring Lil Wayne,6MVdz8I7oYm86MRzZiOZa8,False,0,100,2,0.621,0.511,11,-8.523,1,0.265,0.015,0,0.0963,0.317,158.896,248933,4
