date,position,title,artist,spotify_id,is_new,last_pos,peak_pos,weeks,danceability,energy,key,loudness,mode,speechiness,acousticness,instrumentalness,liveness,valence,tempo,duration_ms,time_signature
2010-05-22,1,Not Afraid,Eminem,7Ie9W94M7OjPoZVV216Xus,True,0,1,1,0.855,0.954,0,-1.19,0,0.264,0.529,0,0.205,0.668,114.635,248133,5
2010-05-22,2,OMG,Usher Featuring will.i.am,7Ie9W94M7OjPoZVV216Xus,False,1,1,6,0.781,0.745,4,-5.81,0,0.0332,0.198,1.14e-05,0.36,0.326,129.998,269493,4
2010-05-22,3,Nothin' On You,B.o.B Featuring Bruno Mars,7Ie9W94M7OjPoZVV216Xus,False,2,1,15,0.688,0.853,10,-5.814,1,0.0493,0.386,0,0.0862,0.743,103.993,268320,4
2010-05-22,4,Break Your Heart,Taio Cruz Featuring Ludacris,7Ie9W94M7OjPoZVV216Xus,False,4,1,11,0.666,0.899,8,-4.676,1,0.028,0.00155,0,0.0677,0.629,122.05,186267,4
2010-05-22,5,Airplanes,B.o.B Featuring Hayley Williams,7Ie9W94M7OjPoZVV216Xus,False,7,5,4,0.66,0.867,6,-4.285,0,0.116,0.11,0,0.0368,0.377,93.033,180480,4
2010-05-22,6,Rude Boy,Rihanna,7Ie9W94M7OjPoZVV216Xus,False,3,1,13,0.563,0.75,11,-4.496,1,0.127,0.113,0,0.0788,0.812,173.906,222920,4
2010-05-22,7,"Hey, Soul Sister",Train,7Ie9W94M7OjPoZVV216Xus,False,6,3,32,0.673,0.886,1,-4.44,0,0.0431,0.185,0,0.0826,0.795,97.012,216773,4
2010-05-22,8,Your Love Is My Drug,Ke$ha,7Ie9W94M7OjPoZVV216Xus,False,8,8,13,0.826,0.612,1,-3.891,1,0.0982,0.00681,0,0.0889,0.756,120.057,187133,4
2010-05-22,9,My First Kiss,3OH!3 Featuring Ke$ha,17tDv8WA8IhqE8qzuQn707,True,0,9,1,0.682,0.889,0,-4.166,1,0.0804,0.00564,0,0.36,0.827,138.021,192440,4
2010-05-22,10,Need You Now,Lady Antebellum,17tDv8WA8IhqE8qzuQn707,False,5,2,39,0.587,0.622,4,-5.535,1,0.0303,0.0927,0.000636,0.2,0.231,107.943,277573,4
2010-05-22,11,Alejandro,Lady Gaga,17tDv8WA8IhqE8qzuQn707,False,16,11,6,0.626,0.799,11,-6.612,0,0.046,0.000358,0.00155,0.36,0.369,98.992,274213,4
2010-05-22,12,Young Forever,Jay-Z + Mr. Hudson,17tDv8WA8IhqE8qzuQn707,False,10,10,17,0.637,0.69,9,-3.214,0,0.0693,0.417,0,0.211,0.103,140.329,253907,4
2010-05-22,13,In My Head,Jason Derulo,17tDv8WA8IhqE8qzuQn707,False,9,5,22,0.762,0.748,0,-4.15,0,0.033,0.0266,0,0.348,0.851,110.009,199027,4
2010-05-22,14,Telephone,Lady Gaga Featuring Beyonce,17tDv8WA8IhqE8qzuQn707,False,13,3,24,0.825,0.832,5,-5.853,0,0.0403,0.00587,0.000789,0.114,0.713,122.021,220627,4
2010-05-22,15,My Chick Bad,Ludacris Featuring Nicki Minaj,17tDv8WA8IhqE8qzuQn707,False,11,11,11,0.624,0.723,1,-6.782,1,0.378,0.172,0,0.483,0.757,84.789,216933,4
2010-05-22,16,Total Eclipse Of The Heart,Glee Cast Featuring Jonathan Groff,2k5A2k4Alou3htT0jmFRs8,True,0,16,1,0.513,0.663,8,-5.848,1,0.0296,0.194,0,0.096,0.276,134.155,265293,4
2010-05-22,17,Over,Drake,2k5A2k4Alou3htT0jmFRs8,False,14,14,9,0.35,0.845,7,-5.614,1,0.2,0.0107,0,0.123,0.45,99.643,233560,5
2010-05-22,18,Eenie Meenie,Sean Kingston & Justin Bieber,2k5A2k4Alou3htT0jmFRs8,False,15,15,7,0.734,0.639,1,-3.241,1,0.0316,0.0348,0,0.102,0.836,121.212,201653,4
2010-05-22,19,Breakeven,The Script,2k5A2k4Alou3htT0jmFRs8,False,12,12,23,0.63,0.698,10,-4.51,1,0.0244,0.173,0,0.0789,0.529,94.023,261427,4
2010-05-22,20,Imma Be,The Black Eyed Peas,2k5A2k4Alou3htT0jmFRs8,False,17,1,23,0.597,0.517,0,-6.963,1,0.365,0.179,0,0.307,0.412,92.035,257560,4
2010-05-22,21,TiK ToK,Ke$ha,2k5A2k4Alou3htT0jmFRs8,False,19,1,31,0.755,0.837,2,-2.718,0,0.142,0.0991,0,0.289,0.714,120.028,199693,4
2010-05-22,22,Billionaire,Travie McCoy Featuring Bruno Mars,2k5A2k4Alou3htT0jmFRs8,False,28,22,6,0.633,0.673,6,-6.403,0,0.258,0.297,0,0.206,0.659,86.776,211160,4
2010-05-22,23,Bulletproof,La Roux,2k5A2k4Alou3htT0jmFRs8,False,29,23,10,0.674,0.882,3,-2.771,0,0.0477,0.000441,6.47e-05,0.068,0.682,123.016,205733,4
2010-05-22,24,Whataya Want From Me,Adam Lambert,2k5A2k4Alou3htT0jmFRs8,False,18,10,21,0.44,0.683,11,-4.732,0,0.0489,0.00706,0,0.0593,0.445,185.948,227320,4
2010-05-22,25,I Made It (Cash Money Heroes),"Kevin Rudolf Featuring Birdman, Jay Sean, & Lil Wayne",2k5A2k4Alou3htT0jmFRs8,False,21,21,14,0.592,0.944,7,-2.94,1,0.111,0.043,0,0.365,0.574,124.42,249547,5
2010-05-22,26,Say Aah,Trey Songz Featuring Fabolous,2k5A2k4Alou3htT0jmFRs8,False,20,9,26,0.724,0.87,1,-3.614,0,0.113,0.00453,0,0.833,0.81,93.01,207547,4
2010-05-22,27,Carry Out,Timbaland Featuring Justin Timberlake,2k5A2k4Alou3htT0jmFRs8,False,22,11,23,0.531,0.574,10,-6.693,0,0.113,0.114,0.0308,0.256,0.272,115.68,232467,5
2010-05-22,28,Haven't Met You Yet,Michael Buble,2k5A2k4Alou3htT0jmFRs8,False,30,25,32,0.615,0.733,8,-4.808,1,0.0335,0.152,0,0.109,0.796,122.58,244587,4
2010-05-22,29,All The Right Moves,OneRepublic,2k5A2k4Alou3htT0jmFRs8,False,23,18,31,0.529,0.948,0,-3.522,1,0.0475,0.259,1.01e-05,0.283,0.651,146.02,238000,4
2010-05-22,30,Winner,Jamie Foxx Featuring Justin Timberlake & T .I.,2k5A2k4Alou3htT0jmFRs8,False,32,28,5,0.788,0.613,1,-8.539,0,0.25,0.00914,0,0.137,0.648,89.985,244347,4
2010-05-22,31,Bad Romance,Lady Gaga,2k5A2k4Alou3htT0jmFRs8,False,25,2,28,0.696,0.921,0,-3.755,1,0.0363,0.00314,5.24e-05,0.0842,0.714,119.001,294573,4
2010-05-22,32,Hey Daddy (Daddy's Home),Usher Featuring Plies,2k5A2k4Alou3htT0jmFRs8,False,24,24,17,0.59,0.698,11,-4.262,1,0.0286,0.000176,0,0.107,0.352,95.975,224093,4
2010-05-22,33,The House That Built Me,Miranda Lambert,2k5A2k4Alou3htT0jmFRs8,False,36,30,7,0.515,0.3,5,-8.005,1,0.0289,0.575,8.46e-06,0.115,0.206,81.12,236627,4
2010-05-22,34,Find Your Love,Drake,4BycRneKmOs6MhYG9THsuX,True,0,34,1,0.627,0.614,6,-6.006,0,0.17,0.0211,0,0.0286,0.758,96.038,208947,4
2010-05-22,35,Lose My Mind,Young Jeezy Featuring Plies,0Ft6hwGWdCdujdK6TOfBV7,True,0,35,1,0.705,0.75,1,-4.558,1,0.0524,0.0632,0,0.146,0.392,77.748,241947,4
2010-05-22,36,Rock That Body,The Black Eyed Peas,0Ft6hwGWdCdujdK6TOfBV7,False,62,36,2,0.715,0.907,7,-6.025,0,0.0993,0.0172,8.39e-05,0.426,0.841,124.992,268840,4
2010-05-22,37,American Honey,Lady Antebellum,0Ft6hwGWdCdujdK6TOfBV7,False,27,25,17,0.588,0.684,1,-5.154,1,0.0288,0.508,0,0.141,0.121,85.997,224867,4
2010-05-22,38,Baby,Justin Bieber Featuring Ludacris,0Ft6hwGWdCdujdK6TOfBV7,False,26,5,16,0.813,0.708,2,-6.34,1,0.0504,0.117,0,0.0796,0.756,130.039,215453,4
2010-05-22,39,Solo,Iyaz,0Ft6hwGWdCdujdK6TOfBV7,False,33,32,13,0.73,0.728,11,-3.113,1,0.0291,0.197,0,0.197,0.68,130.061,194267,4
2010-05-22,40,Naturally,Selena Gomez & The Scene,0Ft6hwGWdCdujdK6TOfBV7,False,35,29,20,0.605,0.902,10,-5.406,0,0.0511,0.0185,1.01e-06,0.0534,0.875,132.612,202587,4
2010-05-22,41,Gimmie That Girl,Joe Nichols,0Ft6hwGWdCdujdK6TOfBV7,False,34,34,11,0.5,0.9,2,-3.577,1,0.117,0.205,0.000251,0.694,0.675,162.249,185453,4
2010-05-22,42,BedRock,Young Money Featuring Lloyd,0Ft6hwGWdCdujdK6TOfBV7,False,31,2,24,0.733,0.664,8,-6.163,1,0.295,0.102,0,0.191,0.557,148.005,288133,4
2010-05-22,43,All I Do Is Win,"DJ Khaled Featuring T-Pain, Ludacris, Snoop Dogg & Rick Ross",0Ft6hwGWdCdujdK6TOfBV7,False,39,39,12,0.545,0.781,10,-3.616,1,0.185,0.0139,0,0.161,0.277,150.097,232507,4
2010-05-22,44,If We Ever Meet Again,Timbaland Featuring Katy Perry,0Ft6hwGWdCdujdK6TOfBV7,False,37,37,8,0.652,0.605,8,-7.371,1,0.0393,0.00481,0,0.0605,0.394,126.091,292707,4
2010-05-22,45,I Gotta Feeling,The Black Eyed Peas,0Ft6hwGWdCdujdK6TOfBV7,False,38,1,48,0.744,0.774,0,-6.399,1,0.0268,0.0751,0,0.512,0.649,127.958,289187,4
2010-05-22,46,Un-Thinkable (I'm Ready),Alicia Keys,0Ft6hwGWdCdujdK6TOfBV7,False,44,44,5,0.595,0.507,7,-7.892,1,0.0618,0.732,1.97e-05,0.106,0.337,86.099,249240,4
2010-05-22,47,Not Myself Tonight,Christina Aguilera,0Ft6hwGWdCdujdK6TOfBV7,False,46,23,4,0.757,0.812,7,-5.178,1,0.0395,0.00137,0.018,0.563,0.542,120.015,186493,4
2010-05-22,48,Live Like We're Dying,Kris Allen,0Ft6hwGWdCdujdK6TOfBV7,False,41,18,28,0.589,0.893,0,-2.948,1,0.0397,0.0273,0,0.343,0.94,92.011,212507,4
2010-05-22,49,Lil Freak,Usher Featuring Nicki Minaj,0Ft6hwGWdCdujdK6TOfBV7,False,40,40,10,0.834,0.628,7,-6.616,1,0.0626,0.000879,0.000192,0.292,0.766,139.958,234253,4
2010-05-22,50,Sexy Chick,David Guetta Featuring Akon,0Ft6hwGWdCdujdK6TOfBV7,False,45,5,40,0.809,0.562,11,-7.694,0,0.0534,0.0816,0.000418,0.105,0.798,130.003,194347,4
2010-05-22,51,The Man I Want To Be,Chris Young,0Ft6hwGWdCdujdK6TOfBV7,False,48,48,10,0.639,0.678,7,-5.02,1,0.0278,0.44,1.45e-06,0.221,0.531,106.966,212133,4
2010-05-22,52,Neighbors Know My Name,Trey Songz,0Ft6hwGWdCdujdK6TOfBV7,False,43,43,11,0.663,0.693,7,-5.776,0,0.0635,0.0379,0,0.162,0.391,120.026,186307,4
2010-05-22,53,This Afternoon,Nickelback,0Ft6hwGWdCdujdK6TOfBV7,False,55,53,5,0.507,0.875,7,-7.697,1,0.0389,0.00257,0,0.346,0.647,160.079,273493,4
2010-05-22,54,Pray For You,Jaron And The Long Road To Love,0Ft6hwGWdCdujdK6TOfBV7,False,51,51,7,0.4,0.635,10,-5.787,1,0.0436,0.612,0,0.149,0.395,139.649,190240,4
2010-05-22,55,Ain't Back Yet,Kenny Chesney,0Ft6hwGWdCdujdK6TOfBV7,False,52,50,10,0.602,0.944,10,-4.238,1,0.0427,0.0308,0.00256,0.436,0.797,106.958,239813,4
2010-05-22,56,Everything To Me,Monica,0Ft6hwGWdCdujdK6TOfBV7,False,50,44,13,0.308,0.529,7,-5.319,0,0.0874,0.479,0,0.441,0.485,80.794,196960,4
2010-05-22,57,Impossible,Shontelle,0Ft6hwGWdCdujdK6TOfBV7,False,71,57,3,0.599,0.624,8,-3.631,1,0.0343,0.385,0,0.125,0.539,90.034,226533,4
2010-05-22,58,"Beamer, Benz, Or Bentley",Lloyd Banks Featuring Juelz Santana,0Ft6hwGWdCdujdK6TOfBV7,False,49,49,11,0.652,0.671,4,-5.376,0,0.315,0.00402,2.89e-05,0.598,0.518,159.963,208387,4
2010-05-22,59,Rain Is A Good Thing,Luke Bryan,0Ft6hwGWdCdujdK6TOfBV7,False,58,54,7,0.622,0.932,11,-4.66,0,0.0498,0.105,2.37e-06,0.328,0.519,108.051,176160,4
2010-05-22,60,Say Something,Timbaland Featuring Drake,0Ft6hwGWdCdujdK6TOfBV7,False,42,23,18,0.555,0.713,11,-4.549,1,0.0911,0.0845,0,0.712,0.725,79.934,240920,4
2010-05-22,61,Run Joey Run,Glee Cast Featuring Jonathan Groff,3CBSZ4j53i5Zg3iF10fU5o,True,0,61,1,0.331,0.714,7,-5.634,0,0.0834,0.129,0,0.318,0.268,151.097,171667,4
2010-05-22,62,I'm Back,T.I.,3CBSZ4j53i5Zg3iF10fU5o,False,59,44,8,0.526,0.885,1,-3.807,1,0.248,0.0403,0,0.085,0.502,184.055,194467,4
2010-05-22,63,Roger That,Young Money,3CBSZ4j53i5Zg3iF10fU5o,False,56,56,7,0.482,0.627,2,-7.561,1,0.116,0.00827,0,0.701,0.293,157.58,209827,4
2010-05-22,64,Cooler Than Me,Mike Posner,3CBSZ4j53i5Zg3iF10fU5o,False,85,64,2,0.768,0.82,7,-4.63,0,0.0475,0.179,0,0.704,0.625,129.969,213293,4
2010-05-22,65,I Never Told You,Colbie Caillat,3CBSZ4j53i5Zg3iF10fU5o,False,68,65,7,0.506,0.639,3,-5.222,1,0.0285,0.171,0,0.315,0.385,144.073,233200,4
2010-05-22,66,Unstoppable,Rascal Flatts,3CBSZ4j53i5Zg3iF10fU5o,False,60,52,14,0.473,0.799,3,-4.798,1,0.0483,0.0738,0,0.121,0.506,155.892,227720,4
2010-05-22,67,There Goes My Baby,Usher,3CBSZ4j53i5Zg3iF10fU5o,False,66,66,8,0.626,0.52,9,-8.077,0,0.0892,0.175,0,0.13,0.257,77.468,281293,4
2010-05-22,68,Highway 20 Ride,Zac Brown Band,3CBSZ4j53i5Zg3iF10fU5o,False,57,40,17,0.55,0.402,3,-7.195,1,0.0339,0.551,1.38e-05,0.105,0.428,76.105,229280,4
2010-05-22,69,She Won't Be Lonely Long,Clay Walker,3CBSZ4j53i5Zg3iF10fU5o,False,75,69,6,0.635,0.758,7,-5.772,1,0.0243,0.00643,0,0.229,0.322,113.002,209253,4
2010-05-22,70,Hell On The Heart,Eric Church,3CBSZ4j53i5Zg3iF10fU5o,False,67,67,10,0.637,0.89,0,-3.877,1,0.0312,0.0832,1.9e-06,0.0892,0.928,123.002,164733,4
2010-05-22,71,Keep On Lovin' You,Steel Magnolia,3CBSZ4j53i5Zg3iF10fU5o,False,72,71,10,0.511,0.781,9,-4.681,1,0.0479,0.0719,0,0.265,0.512,159.953,182587,4
2010-05-22,72,Backwoods,Justin Moore,3CBSZ4j53i5Zg3iF10fU5o,False,69,69,11,0.497,0.932,8,-5.029,1,0.0527,0.0678,2.5e-06,0.116,0.774,157.884,155893,4
2010-05-22,73,Water,Brad Paisley,3CBSZ4j53i5Zg3iF10fU5o,False,78,73,4,0.562,0.825,5,-5.794,1,0.0269,0.00493,0.000629,0.57,0.694,97.54,261920,4
2010-05-22,74,Ice Ice Baby,Glee Cast,222xITHDi1QPjFC1I83dPm,True,0,74,1,0.98,0.816,7,-8.087,1,0.0831,0.0192,0.00298,0.0554,0.787,120.019,205120,4
2010-05-22,75,"Lover, Lover",Jerrod Niemann,222xITHDi1QPjFC1I83dPm,False,89,75,2,0.879,0.567,7,-6.509,1,0.0586,0.184,0,0.622,0.948,112.472,193733,4
2010-05-22,76,Crazy Town,Jason Aldean,222xITHDi1QPjFC1I83dPm,False,76,76,4,0.43,0.841,6,-2.99,1,0.037,0.13,0,0.0517,0.489,180.977,183440,4
2010-05-22,77,I Gotta Get To You,George Strait,222xITHDi1QPjFC1I83dPm,False,77,77,8,0.723,0.62,9,-6.371,1,0.0284,0.0172,0.0815,0.26,0.683,116.282,187822,4
2010-05-22,78,Drop The World,Lil Wayne Featuring Eminem,222xITHDi1QPjFC1I83dPm,False,74,18,19,0.663,0.91,1,-1.629,1,0.317,0.0719,0,0.244,0.342,144.993,229227,4
2010-05-22,79,I'm Awesome,Spose,222xITHDi1QPjFC1I83dPm,False,63,37,8,0.636,0.774,0,-5.474,1,0.344,0.145,0,0.633,0.774,92.429,249160,4
2010-05-22,80,Blah Blah Blah,Ke$ha Featuring 3OH!3,222xITHDi1QPjFC1I83dPm,False,73,7,18,0.752,0.836,10,-3.173,1,0.115,0.0843,0.000425,0.424,0.519,120.003,172053,4
2010-05-22,81,Steady Mobbin',Young Money Featuring Gucci Mane,222xITHDi1QPjFC1I83dPm,False,80,48,18,0.488,0.691,0,-8.09,0,0.279,0.0219,0,0.501,0.697,156.141,310733,4
2010-05-22,82,Wrong Baby Wrong,Martina McBride,222xITHDi1QPjFC1I83dPm,False,88,82,7,0.572,0.673,6,-5.565,1,0.042,0.0596,0,0.0887,0.573,106.024,221667,4
2010-05-22,83,A Little More Country Than That,Easton Corbin,222xITHDi1QPjFC1I83dPm,False,86,42,18,0.64,0.6,11,-8.534,1,0.0318,0.0795,1.5e-06,0.106,0.593,84.969,172227,4
2010-05-22,84,Gypsy,Shakira,222xITHDi1QPjFC1I83dPm,False,65,65,2,0.763,0.758,6,-5.106,1,0.0576,0.64,0,0.0706,0.515,92.727,198827,4
2010-05-22,85,Today Was A Fairytale,Taylor Swift,222xITHDi1QPjFC1I83dPm,False,81,2,16,0.491,0.703,7,-4.5,1,0.0319,0.0307,5.72e-06,0.167,0.344,157.988,242480,4
2010-05-22,86,Hillbilly Bone,Blake Shelton Featuring Trace Adkins,222xITHDi1QPjFC1I83dPm,False,87,40,20,0.611,0.964,7,-3.076,1,0.0464,0.0441,7.37e-05,0.109,0.9,144.014,225280,4
2010-05-22,87,Hello Good Morning,Diddy - Dirty Money Featuring T.I.,222xITHDi1QPjFC1I83dPm,False,82,34,6,0.75,0.874,2,-4.831,1,0.242,0.0915,0,0.295,0.552,104.016,217267,4
2010-05-22,88,Gettin' Over You,David Guetta & Chris Willis Featuring Fergie & LMFAO,222xITHDi1QPjFC1I83dPm,False,95,88,2,0.615,0.913,10,-5.077,0,0.0816,0.178,0,0.0773,0.45,129.944,188000,4
2010-05-22,89,Physical,Glee Cast Featuring Olivia Newton-John,3hJQ0Bzblzx7JY5rKPvap0,True,0,89,1,0.789,0.698,0,-5.837,1,0.0467,0.0236,0,0.0959,0.416,123.849,198907,4
2010-05-22,90,I Keep On Loving You,Reba,3hJQ0Bzblzx7JY5rKPvap0,False,92,90,3,0.538,0.461,10,-5.676,1,0.0279,0.353,0,0.118,0.299,127.107,193893,4
2010-05-22,91,Kissin U,Miranda Cosgrove,3hJQ0Bzblzx7JY5rKPvap0,False,54,54,4,0.624,0.86,0,-3.129,0,0.043,0.0119,0,0.0598,0.521,110.018,199693,4
2010-05-22,92,U Can't Touch This,Glee Cast,5E10OlQFbgG8FjNw0bBHw3,True,0,92,1,0.801,0.947,7,-4.515,1,0.0954,0.00866,8.87e-06,0.122,0.92,133.381,247160,4
2010-05-22,93,Temporary Home,Carrie Underwood,5E10OlQFbgG8FjNw0bBHw3,False,84,41,20,0.416,0.354,0,-6.357,1,0.0263,0.731,1e-06,0.0925,0.181,80.767,268560,4
2010-05-22,94,When I Look At You,Miley Cyrus,5E10OlQFbgG8FjNw0bBHw3,False,91,16,13,0.459,0.545,6,-4.874,1,0.0282,0.142,0,0.105,0.194,137.946,248587,3
2010-05-22,95,Undo It,Carrie Underwood,5E10OlQFbgG8FjNw0bBHw3,False,0,87,2,0.476,0.84,2,-2.259,1,0.058,0.11,0,0.046,0.648,156.254,177253,4
2010-05-22,96,Ride,Ciara Featuring Ludacris,5E10OlQFbgG8FjNw0bBHw3,False,79,79,3,0.694,0.719,7,-4.538,1,0.0484,0.00131,1.47e-05,0.0714,0.352,129.961,274147,4
2010-05-22,97,Love Like Crazy,Lee Brice,6Ozp6ac86CSHMik8lbvJuM,True,0,97,1,0.535,0.725,10,-5.108,1,0.0275,0.0203,1.45e-05,0.176,0.292,78.489,217387,4
2010-05-22,98,All I Ever Wanted,Kelly Clarkson,6Ozp6ac86CSHMik8lbvJuM,False,97,96,5,0.633,0.866,11,-3.633,1,0.0443,0.0103,0,0.227,0.696,100.007,239107,4
2010-05-22,99,All Or Nothing,Theory Of A Deadman,2ejt6exJRE2bXPfp37Xi8w,True,0,99,1,0.419,0.785,10,-4.483,0,0.0313,0.0289,0,0.0799,0.332,152.053,210560,4
2010-05-22,100,Give Me A Sign (Forever And Ever),Breaking Benjamin,2ejt6exJRE2bXPfp37Xi8w,False,99,97,5,0.196,0.85,6,-3.644,1,0.0531,0.00034,1.03e-06,0.0799,0.4,156.725,257693,4
