date,position,title,artist,spotify_id,is_new,last_pos,peak_pos,weeks,danceability,energy,key,loudness,mode,speechiness,acousticness,instrumentalness,liveness,valence,tempo,duration_ms,time_signature
2020-09-26,1,WAP,Cardi B Featuring Megan Thee Stallion,46hDiH4YvAWXE04GskkIHS,False,1,1,6,0.935,0.454,1,-7.509,1,0.375,0.0194,0,0.0824,0.357,133.073,187541,4
2020-09-26,2,Dynamite,BTS,46hDiH4YvAWXE04GskkIHS,False,2,1,4,0.746,0.765,6,-4.41,0,0.0993,0.0112,0,0.0936,0.737,114.044,199054,4
2020-09-26,3,Laugh Now Cry Later,Drake Featuring Lil Durk,46hDiH4YvAWXE04GskkIHS,False,3,2,5,0.761,0.518,0,-8.871,1,0.134,0.244,3.47e-05,0.107,0.522,133.976,261493,4
2020-09-26,4,Rockstar,DaBaby Featuring Roddy Ricch,46hDiH4YvAWXE04GskkIHS,False,4,1,22,0.746,0.69,11,-7.956,1,0.164,0.247,0,0.101,0.497,89.977,181733,4
2020-09-26,5,Blinding Lights,The Weeknd,46hDiH4YvAWXE04GskkIHS,False,5,1,42,0.514,0.73,1,-5.934,1,0.0598,0.00146,9.54e-05,0.0897,0.334,171.005,200040,4
2020-09-26,6,Mood,24kGoldn Featuring iann dior,46hDiH4YvAWXE04GskkIHS,False,6,6,6,0.7,0.722,7,-3.558,0,0.0369,0.221,0,0.272,0.756,90.989,140526,4
2020-09-26,7,Watermelon Sugar,Harry Styles,46hDiH4YvAWXE04GskkIHS,False,7,1,26,0.548,0.816,0,-4.209,1,0.0465,0.122,0,0.335,0.557,95.39,174000,4
2020-09-26,8,Savage Love (Laxed - Siren Beat),Jawsh 685 x Jason Derulo,46hDiH4YvAWXE04GskkIHS,False,9,7,14,0.767,0.481,0,-8.52,0,0.0803,0.234,0,0.269,0.761,150.076,171375,4
2020-09-26,9,Before You Go,Lewis Capaldi,46hDiH4YvAWXE04GskkIHS,False,11,9,33,0.459,0.575,3,-4.858,1,0.0573,0.604,0,0.0885,0.183,111.881,215107,4
2020-09-26,10,Whats Poppin,"Jack Harlow Featuring DaBaby, Tory Lanez & Lil Wayne",46hDiH4YvAWXE04GskkIHS,False,8,2,32,0.904,0.723,11,-5.224,0,0.26,0.0631,0,0.185,0.835,145.013,227478,4
2020-09-26,11,I Hope,Gabby Barrett Featuring Charlie Puth,46hDiH4YvAWXE04GskkIHS,False,12,10,38,0.466,0.536,6,-6.227,1,0.0429,0.0951,0,0.114,0.377,75.998,210773,4
2020-09-26,12,Popstar,DJ Khaled Featuring Drake,46hDiH4YvAWXE04GskkIHS,False,10,3,9,0.8,0.56,5,-4.818,0,0.261,0.057,0,0.134,0.45,163.071,200221,4
2020-09-26,13,Go Crazy,Chris Brown & Young Thug,46hDiH4YvAWXE04GskkIHS,False,14,9,19,0.755,0.578,0,-8.932,0,0.145,0.316,0,0.25,0.581,94.148,176960,4
2020-09-26,14,Roses,SAINt JHN,46hDiH4YvAWXE04GskkIHS,False,13,4,26,0.769,0.719,8,-5.472,1,0.0474,0.0143,0.00777,0.359,0.863,121.955,176867,4
2020-09-26,15,For The Night,Pop Smoke Featuring Lil Baby & DaBaby,46hDiH4YvAWXE04GskkIHS,False,15,6,11,0.823,0.586,6,-6.606,0,0.2,0.114,0,0.193,0.347,125.971,190476,4
2020-09-26,16,Circles,Post Malone,46hDiH4YvAWXE04GskkIHS,False,16,1,55,0.695,0.762,0,-3.497,1,0.0395,0.192,0.00244,0.0863,0.553,120.042,215280,4
2020-09-26,17,Come & Go,Juice WRLD x Marshmello,46hDiH4YvAWXE04GskkIHS,False,19,2,10,0.625,0.814,0,-5.181,1,0.0657,0.0172,0,0.158,0.535,144.991,205485,4
2020-09-26,18,Adore You,Harry Styles,46hDiH4YvAWXE04GskkIHS,False,18,6,41,0.676,0.771,8,-3.675,1,0.0483,0.0237,7e-06,0.102,0.569,99.048,207133,4
2020-09-26,19,One Of Them Girls,Lee Brice,46hDiH4YvAWXE04GskkIHS,False,22,19,16,0.643,0.79,4,-6.079,1,0.0462,0.294,0,0.107,0.8,95.987,188893,4
2020-09-26,20,Break My Heart,Dua Lipa,46hDiH4YvAWXE04GskkIHS,False,17,13,25,0.73,0.729,4,-3.434,0,0.0883,0.167,1.39e-06,0.349,0.467,113.013,221820,4
2020-09-26,21,Got What I Got,Jason Aldean,46hDiH4YvAWXE04GskkIHS,False,26,21,16,0.512,0.58,3,-6.658,0,0.029,0.621,1.72e-05,0.513,0.303,159.847,178147,3
2020-09-26,22,Lemonade,Internet Money & Gunna Featuring Don Toliver & NAV,46hDiH4YvAWXE04GskkIHS,False,38,22,5,0.799,0.66,1,-6.153,0,0.079,0.256,0,0.111,0.471,140.04,195429,4
2020-09-26,23,Lovin' On You,Luke Combs,46hDiH4YvAWXE04GskkIHS,False,23,23,12,0.572,0.949,4,-4.865,1,0.06,0.00165,0.000195,0.163,0.53,118.974,194867,4
2020-09-26,24,Tap In,Saweetie,46hDiH4YvAWXE04GskkIHS,False,20,20,10,0.954,0.696,10,-7.117,0,0.204,0.00576,0.000498,0.0754,0.432,100.036,139413,4
2020-09-26,26,Mood Swings,Pop Smoke Featuring Lil Tjay,,False,21,17,11,0.48,0.602,10,-6.335,0,0.368,0.487,0,0.0848,0.269,179.798,213333,4
2020-09-26,27,The Woo,Pop Smoke Featuring 50 Cent & Roddy Ricch,,False,27,11,11,0.49,0.618,1,-5.655,1,0.104,0.0221,3.77e-06,0.259,0.286,99.7,201600,4
2020-09-26,28,Don't Start Now,Dua Lipa,,False,25,2,46,0.794,0.793,11,-4.521,0,0.0842,0.0125,0,0.0952,0.677,123.941,183290,4
2020-09-26,29,The Bones,Maren Morris,,False,28,12,52,0.612,0.57,11,-6.642,0,0.0347,0.278,0,0.0963,0.334,77.002,197293,4
2020-09-26,30,If The World Was Ending,JP Saxe Featuring Julia Michaels,,False,30,27,25,0.464,0.473,1,-10.086,1,0.129,0.866,0,0.109,0.604,75.801,208687,4
2020-09-26,31,Cool Again,Kane Brown,,False,36,31,16,0.608,0.735,4,-5.497,1,0.0371,0.0156,1.69e-06,0.361,0.773,90.007,164668,4
2020-09-26,32,Rags2Riches,Rod Wave Featuring ATR Son Son,,False,35,12,12,0.874,0.443,5,-9.628,0,0.241,0.147,0,0.124,0.298,118.004,235988,4
2020-09-26,33,Life Is Good,Future Featuring Drake,,False,33,2,36,0.676,0.609,2,-5.831,0,0.481,0.0706,0,0.152,0.508,142.037,237735,4
2020-09-26,34,Midnight Sky,Miley Cyrus,,False,34,14,5,0.705,0.814,4,-5.466,0,0.0346,0.00115,0.00312,0.203,0.259,110.0,223279,4
2020-09-26,35,My Window,YoungBoy Never Broke Again Featuring Lil Wayne,7IECs9d4Rrlpa7tiHOCE1w,True,0,35,1,0.778,0.662,8,-6.081,0,0.308,0.187,0,0.116,0.571,149.935,192000,4
2020-09-26,36,OK Not To Be OK,Marshmello & Demi Lovato,0zzVTGyRrWpQu8Fr28NRAv,True,0,36,1,0.743,0.837,1,-5.025,0,0.0649,0.0172,0,0.0743,0.263,103.072,159863,4
2020-09-26,37,Rain On Me,Lady Gaga & Ariana Grande,0zzVTGyRrWpQu8Fr28NRAv,False,37,1,17,0.672,0.855,9,-3.764,1,0.0397,0.021,0,0.323,0.646,123.056,182200,4
2020-09-26,38,Die From A Broken Heart,Maddie & Tae,0zzVTGyRrWpQu8Fr28NRAv,False,31,22,23,0.596,0.522,9,-6.633,1,0.0358,0.373,0,0.291,0.443,76.042,188320,4
2020-09-26,39,More Than My Hometown,Morgan Wallen,0zzVTGyRrWpQu8Fr28NRAv,False,53,39,14,0.62,0.869,6,-5.479,1,0.0462,0.615,0,0.131,0.597,126.019,216573,4
2020-09-26,40,Savage,Megan Thee Stallion,0zzVTGyRrWpQu8Fr28NRAv,False,32,1,27,0.822,0.743,10,-4.772,0,0.28,0.016,0,0.127,0.636,84.459,242001,4
2020-09-26,41,Bang!,AJR,0zzVTGyRrWpQu8Fr28NRAv,False,51,41,11,0.74,0.516,1,-6.233,0,0.0507,0.0183,0,0.0558,0.698,139.918,170858,4
2020-09-26,42,Wishing Well,Juice WRLD,0zzVTGyRrWpQu8Fr28NRAv,False,43,5,10,0.65,0.613,9,-6.13,0,0.128,0.00336,0,0.267,0.0804,149.972,194621,4
2020-09-26,43,Chasin' You,Morgan Wallen,0zzVTGyRrWpQu8Fr28NRAv,False,42,16,34,0.631,0.591,7,-5.785,1,0.0277,0.657,0,0.11,0.489,97.074,205453,4
2020-09-26,44,Drug Addiction,YoungBoy Never Broke Again,1jWHtG4UXwH7JkEGY559Pa,True,0,44,1,0.819,0.738,1,-5.159,0,0.186,0.47,0,0.117,0.676,139.957,164650,4
2020-09-26,45,I Should Probably Go To Bed,Dan + Shay,1jWHtG4UXwH7JkEGY559Pa,False,54,43,7,0.721,0.277,1,-7.128,1,0.0365,0.634,0,0.112,0.309,131.935,171827,4
2020-09-26,46,We Paid,Lil Baby & 42 Dugg,1jWHtG4UXwH7JkEGY559Pa,False,47,10,20,0.926,0.542,1,-5.064,1,0.293,0.135,0,0.0877,0.564,135.14,181929,4
2020-09-26,47,Blueberry Faygo,Lil Mosey,1jWHtG4UXwH7JkEGY559Pa,False,41,8,32,0.774,0.554,0,-7.909,1,0.0383,0.207,0,0.132,0.349,99.034,162547,4
2020-09-26,48,Say So,Doja Cat Featuring Nicki Minaj,1jWHtG4UXwH7JkEGY559Pa,False,40,1,37,0.787,0.673,11,-4.577,0,0.158,0.256,3.57e-06,0.0904,0.786,110.962,237893,4
2020-09-26,49,ily,surf mesa Featuring Emilee,1jWHtG4UXwH7JkEGY559Pa,False,59,49,17,0.674,0.774,11,-7.567,0,0.0892,0.0686,0.00188,0.393,0.33,112.05,176547,4
2020-09-26,50,Kacey Talk,YoungBoy Never Broke Again,1jWHtG4UXwH7JkEGY559Pa,False,87,50,5,0.877,0.607,10,-7.818,0,0.15,0.535,0,0.138,0.773,127.055,151249,4
2020-09-26,51,Heather,Conan Gray,1jWHtG4UXwH7JkEGY559Pa,False,46,46,5,0.357,0.425,5,-7.301,1,0.0333,0.584,0,0.322,0.27,102.078,198040,3
2020-09-26,52,Cardigan,Taylor Swift,1jWHtG4UXwH7JkEGY559Pa,False,52,1,8,0.613,0.581,0,-8.588,0,0.0424,0.537,0.000345,0.25,0.551,130.033,239560,4
2020-09-26,53,Girls In The Hood,Megan Thee Stallion,1jWHtG4UXwH7JkEGY559Pa,False,45,28,12,0.821,0.863,6,-3.159,1,0.353,0.00824,0,0.0377,0.874,180.013,154324,4
2020-09-26,54,Like That,Doja Cat Featuring Gucci Mane,1jWHtG4UXwH7JkEGY559Pa,False,50,50,16,0.879,0.499,4,-6.027,0,0.18,0.24,0,0.0967,0.405,106.043,163173,4
2020-09-26,55,Breaking Me,Topic & A7S,1jWHtG4UXwH7JkEGY559Pa,False,60,55,8,0.789,0.72,8,-5.652,0,0.218,0.223,0,0.129,0.664,122.031,166794,4
2020-09-26,56,One Beer,HARDY Featuring Lauren Alaina & Devin Dawson,1jWHtG4UXwH7JkEGY559Pa,False,57,56,15,0.516,0.745,2,-8.352,1,0.0774,0.563,0,0.275,0.825,186.004,173173,3
2020-09-26,57,Kings & Queens,Ava Max,1jWHtG4UXwH7JkEGY559Pa,False,66,57,6,0.637,0.69,1,-4.057,0,0.0405,0.00786,0,0.124,0.457,129.857,162399,4
2020-09-26,58,Hawai,Maluma & The Weeknd,1jWHtG4UXwH7JkEGY559Pa,False,55,55,4,0.766,0.788,6,-3.128,0,0.312,0.105,5.81e-06,0.142,0.609,179.984,200482,4
2020-09-26,59,One Margarita,Luke Bryan,1jWHtG4UXwH7JkEGY559Pa,False,56,19,20,0.641,0.842,9,-4.872,1,0.0464,0.0969,0,0.169,0.738,89.997,193427,4
2020-09-26,60,Said Sum,Moneybagg Yo,1jWHtG4UXwH7JkEGY559Pa,False,71,44,11,0.929,0.667,8,-6.789,0,0.353,0.0185,0,0.1,0.274,126.998,155168,4
2020-09-26,61,Ice Cream,BLACKPINK X Selena Gomez,1jWHtG4UXwH7JkEGY559Pa,False,49,13,3,0.79,0.701,9,-4.81,1,0.365,0.0317,8.06e-05,0.0311,0.91,159.972,177813,4
2020-09-26,62,Some Girls,Jameson Rodgers,1jWHtG4UXwH7JkEGY559Pa,False,70,62,6,0.431,0.831,8,-5.108,1,0.0474,0.0791,0,0.312,0.352,167.96,184893,4
2020-09-26,63,Nobody's Love,Maroon 5,1jWHtG4UXwH7JkEGY559Pa,False,44,41,8,0.486,0.567,1,-6.456,1,0.0379,0.31,0,0.0949,0.154,93.68,211254,4
2020-09-26,64,7 Summers,Morgan Wallen,1jWHtG4UXwH7JkEGY559Pa,False,72,6,5,0.466,0.786,0,-5.13,1,0.0328,0.417,6.1e-05,0.125,0.571,203.903,210507,4
2020-09-26,65,Gone Too Soon,Andrew Jannakos,07mnxqYqssab1EEBynCuQ4,True,0,65,1,0.529,0.723,4,-6.022,0,0.035,0.0175,0,0.364,0.459,119.942,169255,4
2020-09-26,66,Happy Anywhere,Blake Shelton Featuring Gwen Stefani,07mnxqYqssab1EEBynCuQ4,False,77,56,8,0.538,0.745,8,-5.774,1,0.0387,0.1,0,0.063,0.669,165.755,170173,4
2020-09-26,67,All In,YoungBoy Never Broke Again,07mnxqYqssab1EEBynCuQ4,False,0,67,3,0.511,0.654,8,-6.133,1,0.314,0.053,0,0.316,0.279,154.868,156663,4
2020-09-26,68,24,Money Man Featuring Lil Baby,07mnxqYqssab1EEBynCuQ4,False,73,63,5,0.868,0.638,2,-7.746,1,0.0736,0.146,0.0565,0.0931,0.459,126.03,182857,4
2020-09-26,69,You Broke Me First.,Tate McRae,07mnxqYqssab1EEBynCuQ4,False,85,69,4,0.642,0.374,4,-9.386,1,0.0545,0.786,0,0.0906,0.0799,124.099,169266,4
2020-09-26,70,My Ex's Best Friend,Machine Gun Kelly X blackbear,07mnxqYqssab1EEBynCuQ4,False,68,68,5,0.731,0.675,5,-5.134,0,0.0434,0.00473,0,0.141,0.298,124.939,139461,4
2020-09-26,71,The Bigger Picture,Lil Baby,07mnxqYqssab1EEBynCuQ4,False,58,3,14,0.59,0.618,1,-5.756,1,0.334,0.0127,0,0.244,0.153,96.459,252729,3
2020-09-26,72,Dead Trollz,YoungBoy Never Broke Again,6sk8haR99TFmwp9S5U7fac,True,0,72,1,0.524,0.832,6,-4.351,1,0.471,0.0508,0,0.632,0.761,111.142,209528,5
2020-09-26,73,Pretty Heart,Parker McCollum,6sk8haR99TFmwp9S5U7fac,False,79,73,10,0.562,0.683,7,-4.427,1,0.0296,0.00531,0,0.107,0.385,132.003,244798,4
2020-09-26,74,Greece,DJ Khaled Featuring Drake,6sk8haR99TFmwp9S5U7fac,False,67,8,9,0.695,0.343,5,-10.798,1,0.0432,0.0743,1.04e-06,0.107,0.229,85.84,218902,4
2020-09-26,75,Relacion,"Sech, Daddy Yankee & J Balvin Featuring ROSALIA & Farruko",6sk8haR99TFmwp9S5U7fac,False,64,64,2,0.793,0.771,5,-3.417,1,0.0959,0.0337,1.51e-06,0.284,0.835,171.943,247308,4
2020-09-26,76,Cross Roads,YoungBoy Never Broke Again,16oNc3gAxjqO7ifVoEYqCR,True,0,76,1,0.714,0.722,0,-5.685,1,0.0538,0.0735,0,0.114,0.439,143.019,168046,4
2020-09-26,77,Hit Different,SZA Featuring Ty Dolla $ign,16oNc3gAxjqO7ifVoEYqCR,False,29,29,2,0.679,0.516,0,-6.371,0,0.0452,0.199,0,0.0965,0.716,120.074,202008,4
2020-09-26,78,I Called Mama,Tim McGraw,16oNc3gAxjqO7ifVoEYqCR,False,80,61,7,0.499,0.619,2,-7.054,1,0.0339,0.571,4.82e-06,0.148,0.514,86.185,212147,4
2020-09-26,79,Smile,Juice WRLD & The Weeknd,16oNc3gAxjqO7ifVoEYqCR,False,74,8,6,0.694,0.685,6,-6.535,0,0.133,0.224,0,0.124,0.306,158.831,196180,4
2020-09-26,80,Un Dia (One Day),"J Balvin, Dua Lipa, Bad Bunny & Tainy",16oNc3gAxjqO7ifVoEYqCR,False,75,63,8,0.579,0.687,6,-8.23,0,0.0618,0.00491,0,0.181,0.392,168.157,232253,4
2020-09-26,81,The Last Backyard...,YoungBoy Never Broke Again,17BBRv0iYOVlcbMjJUSfBO,True,0,81,1,0.592,0.691,6,-6.325,1,0.204,0.355,0,0.217,0.815,159.708,156130,4
2020-09-26,82,Over Now,Calvin Harris X The Weeknd,17BBRv0iYOVlcbMjJUSfBO,False,78,38,3,0.612,0.884,4,-4.113,0,0.0454,0.0759,0.00132,0.247,0.679,178.043,210795,4
2020-09-26,83,What You Know Bout Love,Pop Smoke,17BBRv0iYOVlcbMjJUSfBO,False,0,52,2,0.709,0.548,10,-8.493,1,0.353,0.65,1.59e-06,0.133,0.543,83.995,160000,4
2020-09-26,84,Martin & Gina,Polo G,17BBRv0iYOVlcbMjJUSfBO,False,81,61,7,0.832,0.534,1,-7.813,0,0.253,0.345,0,0.165,0.116,93.924,132833,4
2020-09-26,85,Caramelo,Ozuna x Karol G x Myke Towers,17BBRv0iYOVlcbMjJUSfBO,False,76,76,5,0.728,0.806,6,-3.766,1,0.0623,0.0531,0.000301,0.153,0.698,168.084,217547,4
2020-09-26,86,Do It,Chloe X Halle,17BBRv0iYOVlcbMjJUSfBO,False,63,63,5,0.725,0.668,5,-7.286,0,0.055,0.0932,2.33e-06,0.112,0.566,82.966,176787,4
2020-09-26,87,Love You Like I Used To,Russell Dickerson,17BBRv0iYOVlcbMjJUSfBO,False,91,87,2,0.501,0.788,10,-4.624,1,0.0415,0.12,0,0.137,0.61,152.047,186613,4
2020-09-26,88,Right Foot Creep,YoungBoy Never Broke Again,6FiySur7YZL0Kff2YVGsEB,True,0,88,1,0.725,0.79,3,-4.773,0,0.327,0.346,0,0.195,0.815,157.99,159086,4
2020-09-26,89,Starting Over,Chris Stapleton,6FiySur7YZL0Kff2YVGsEB,False,83,57,3,0.638,0.538,10,-8.445,1,0.0315,0.452,0.000415,0.0695,0.318,89.124,240413,4
2020-09-26,90,One Night Standards,Ashley McBryde,6FiySur7YZL0Kff2YVGsEB,False,84,76,15,0.537,0.686,5,-5.022,1,0.0293,0.0287,0.00709,0.0988,0.611,78.052,190973,4
2020-09-26,91,Lonely If You Are,Chase Rice,6FiySur7YZL0Kff2YVGsEB,False,92,91,5,0.681,0.726,7,-5.1,1,0.0453,0.162,0,0.119,0.819,84.98,176729,4
2020-09-26,92,Dollaz On My Head,Gunna Featuring Young Thug,6FiySur7YZL0Kff2YVGsEB,False,88,38,15,0.825,0.458,0,-7.47,1,0.0577,0.114,0,0.102,0.161,145.115,197760,4
2020-09-26,93,Ain't Always The Cowboy,Jon Pardi,6FiySur7YZL0Kff2YVGsEB,False,89,89,3,0.539,0.837,9,-3.458,1,0.0385,0.0094,0,0.262,0.551,151.913,220881,4
2020-09-26,94,Everywhere But On,Matt Stell,6FiySur7YZL0Kff2YVGsEB,False,96,94,2,0.563,0.722,6,-3.972,1,0.0279,0.0345,0,0.0795,0.309,149.903,192587,4
2020-09-26,95,You Got It,VEDO,4lsHZ92XCFOQfzJFBTluk8,True,0,95,1,0.774,0.376,5,-9.372,1,0.208,0.297,0,0.165,0.391,122.089,201587,4
2020-09-26,96,Lets Link,WhoHeem,4lsHZ92XCFOQfzJFBTluk8,False,86,86,3,0.839,0.683,10,-9.232,0,0.165,0.00667,0,0.241,0.522,120.003,159955,4
2020-09-26,97,3 Headed Goat,Lil Durk Featuring Lil Baby & Polo G,4lsHZ92XCFOQfzJFBTluk8,False,0,43,12,0.837,0.482,8,-8.608,0,0.365,0.268,0,0.0991,0.444,143.01,169532,4
2020-09-26,98,Dirty Stick,YoungBoy Never Broke Again,0nEWVyeYLtIi3JUHpASGiU,True,0,98,1,0.614,0.789,0,-4.859,1,0.541,0.178,0,0.396,0.349,106.704,169953,5
2020-09-26,99,La Jeepeta,Nio Garcia x Anuel AA x Myke Towers x Brray x Juanka,0nEWVyeYLtIi3JUHpASGiU,False,98,93,6,0.815,0.715,4,-4.65,0,0.207,0.3,4.83e-06,0.091,0.786,176.007,345241,4
2020-09-26,100,Got It On Me,Pop Smoke,0nEWVyeYLtIi3JUHpASGiU,False,0,31,10,0.688,0.647,2,-7.258,1,0.19,0.00815,1.65e-05,0.095,0.195,88.834,164580,4
