date,position,title,artist,spotify_id,is_new,last_pos,peak_pos,weeks,danceability,energy,key,loudness,mode,speechiness,acousticness,instrumentalness,liveness,valence,tempo,duration_ms,time_signature
2020-10-24,1,Mood,24kGoldn Featuring iann dior,11XegnWeJHBDtj9IsNwngu,False,4,1,10,0.7,0.722,7,-3.558,0,0.0369,0.221,0,0.272,0.756,90.989,140526,4
2020-10-24,2,WAP,Cardi B Featuring Megan Thee Stallion,11XegnWeJHBDtj9IsNwngu,False,3,1,10,0.935,0.454,1,-7.509,1,0.375,0.0194,0,0.0824,0.357,133.073,187541,4
2020-10-24,3,Laugh Now Cry Later,Drake Featuring Lil Durk,11XegnWeJHBDtj9IsNwngu,False,5,2,9,0.761,0.518,0,-8.871,1,0.134,0.244,3.47e-05,0.107,0.522,133.976,261493,4
2020-10-24,4,Blinding Lights,The Weeknd,11XegnWeJHBDtj9IsNwngu,False,6,1,46,0.514,0.73,1,-5.934,1,0.0598,0.00146,9.54e-05,0.0897,0.334,171.005,200040,4
2020-10-24,5,Dynamite,BTS,11XegnWeJHBDtj9IsNwngu,False,2,1,8,0.746,0.765,6,-4.41,0,0.0993,0.0112,0,0.0936,0.737,114.044,199054,4
2020-10-24,6,Savage Love (Laxed - Siren Beat),Jawsh 685 x Jason Derulo,11XegnWeJHBDtj9IsNwngu,False,1,1,18,0.767,0.481,0,-8.52,0,0.0803,0.234,0,0.269,0.761,150.076,171375,4
2020-10-24,7,Rockstar,DaBaby Featuring Roddy Ricch,11XegnWeJHBDtj9IsNwngu,False,7,1,26,0.746,0.69,11,-7.956,1,0.164,0.247,0,0.101,0.497,89.977,181733,4
2020-10-24,8,I Hope,Gabby Barrett Featuring Charlie Puth,11XegnWeJHBDtj9IsNwngu,False,8,8,42,0.466,0.536,6,-6.227,1,0.0429,0.0951,0,0.114,0.377,75.998,210773,4
2020-10-24,9,Watermelon Sugar,Harry Styles,11XegnWeJHBDtj9IsNwngu,False,11,1,30,0.548,0.816,0,-4.209,1,0.0465,0.122,0,0.335,0.557,95.39,174000,4
2020-10-24,10,Lemonade,Internet Money & Gunna Featuring Don Toliver & NAV,11XegnWeJHBDtj9IsNwngu,False,12,10,9,0.799,0.66,1,-6.153,0,0.079,0.256,0,0.111,0.471,140.04,195429,4
2020-10-24,11,Before You Go,Lewis Capaldi,11XegnWeJHBDtj9IsNwngu,False,13,9,37,0.459,0.575,3,-4.858,1,0.0573,0.604,0,0.0885,0.183,111.881,215107,4
2020-10-24,12,Dreams,Fleetwood Mac,11XegnWeJHBDtj9IsNwngu,False,21,1,21,0.828,0.492,0,-9.744,1,0.0276,0.0644,0.00428,0.128,0.789,120.151,257800,4
2020-10-24,13,For The Night,Pop Smoke Featuring Lil Baby & DaBaby,11XegnWeJHBDtj9IsNwngu,False,15,6,15,0.823,0.586,6,-6.606,0,0.2,0.114,0,0.193,0.347,125.971,190476,4
2020-10-24,14,Holy,Justin Bieber Featuring Chance The Rapper,11XegnWeJHBDtj9IsNwngu,False,14,3,4,0.673,0.704,6,-8.056,1,0.36,0.196,0,0.0898,0.372,86.919,212093,4
2020-10-24,15,Go Crazy,Chris Brown & Young Thug,11XegnWeJHBDtj9IsNwngu,False,17,9,23,0.755,0.578,0,-8.932,0,0.145,0.316,0,0.25,0.581,94.148,176960,4
2020-10-24,16,Got What I Got,Jason Aldean,11XegnWeJHBDtj9IsNwngu,False,23,16,20,0.512,0.58,3,-6.658,0,0.029,0.621,1.72e-05,0.513,0.303,159.847,178147,3
2020-10-24,17,One Of Them Girls,Lee Brice,11XegnWeJHBDtj9IsNwngu,False,20,17,20,0.643,0.79,4,-6.079,1,0.0462,0.294,0,0.107,0.8,95.987,188893,4
2020-10-24,18,Whats Poppin,"Jack Harlow Featuring DaBaby, Tory Lanez & Lil Wayne",11XegnWeJHBDtj9IsNwngu,False,16,2,36,0.904,0.723,11,-5.224,0,0.26,0.0631,0,0.185,0.835,145.013,227478,4
2020-10-24,19,Circles,Post Malone,11XegnWeJHBDtj9IsNwngu,False,22,1,59,0.695,0.762,0,-3.497,1,0.0395,0.192,0.00244,0.0863,0.553,120.042,215280,4
2020-10-24,21,Come & Go,Juice WRLD x Marshmello,,False,24,2,14,0.625,0.814,0,-5.181,1,0.0657,0.0172,0,0.158,0.535,144.991,205485,4
2020-10-24,22,Wonder,Shawn Mendes,,False,18,18,2,0.333,0.637,1,-4.904,0,0.0581,0.131,1.8e-05,0.149,0.132,139.898,172693,4
2020-10-24,23,Franchise,Travis Scott Featuring Young Thug & M.I.A.,,False,25,1,3,0.835,0.699,8,-5.405,0,0.277,0.00671,0,0.195,0.547,154.981,202795,4
2020-10-24,24,Mr. Right Now,21 Savage & Metro Boomin Featuring Drake,,False,10,10,2,0.647,0.667,5,-5.563,1,0.304,0.231,0,0.133,0.704,172.08,193839,4
2020-10-24,25,Adore You,Harry Styles,,False,28,6,45,0.676,0.771,8,-3.675,1,0.0483,0.0237,7e-06,0.102,0.569,99.048,207133,4
2020-10-24,26,Bang!,AJR,,False,35,26,15,0.74,0.516,1,-6.233,0,0.0507,0.0183,0,0.0558,0.698,139.918,170858,4
2020-10-24,27,Break My Heart,Dua Lipa,,False,29,13,29,0.73,0.729,4,-3.434,0,0.0883,0.167,1.39e-06,0.349,0.467,113.013,221820,4
2020-10-24,28,ily,surf mesa Featuring Emilee,,False,41,28,21,0.674,0.774,11,-7.567,0,0.0892,0.0686,0.00188,0.393,0.33,112.05,176547,4
2020-10-24,29,What You Know Bout Love,Pop Smoke,,False,44,29,6,0.709,0.548,10,-8.493,1,0.353,0.65,1.59e-06,0.133,0.543,83.995,160000,4
2020-10-24,30,More Than My Hometown,Morgan Wallen,,False,38,30,18,0.62,0.869,6,-5.479,1,0.0462,0.615,0,0.131,0.597,126.019,216573,4
2020-10-24,31,Roses,SAINt JHN,,False,31,4,30,0.769,0.719,8,-5.472,1,0.0474,0.0143,0.00777,0.359,0.863,121.955,176867,4
2020-10-24,32,Kings & Queens,Ava Max,,False,46,32,10,0.637,0.69,1,-4.057,0,0.0405,0.00786,0,0.124,0.457,129.857,162399,4
2020-10-24,33,Said Sum,Moneybagg Yo,,False,51,24,15,0.929,0.667,8,-6.789,0,0.353,0.0185,0,0.1,0.274,126.998,155168,4
2020-10-24,34,Some Girls,Jameson Rodgers,,False,45,34,10,0.431,0.831,8,-5.108,1,0.0474,0.0791,0,0.312,0.352,167.96,184893,4
2020-10-24,35,Don't Start Now,Dua Lipa,,False,39,2,50,0.794,0.793,11,-4.521,0,0.0842,0.0125,0,0.0952,0.677,123.941,183290,4
2020-10-24,36,Runnin,21 Savage & Metro Boomin,,False,9,9,2,0.819,0.626,10,-4.574,0,0.202,0.00748,0.101,0.167,0.415,143.01,195906,4
2020-10-24,37,Mood Swings,Pop Smoke Featuring Lil Tjay,,False,36,17,15,0.48,0.602,10,-6.335,0,0.368,0.487,0,0.0848,0.269,179.798,213333,4
2020-10-24,38,The Woo,Pop Smoke Featuring 50 Cent & Roddy Ricch,,False,42,11,15,0.49,0.618,1,-5.655,1,0.104,0.0221,3.77e-06,0.259,0.286,99.7,201600,4
2020-10-24,39,Rags2Riches,Rod Wave Featuring ATR Son Son,,False,49,12,16,0.874,0.443,5,-9.628,0,0.241,0.147,0,0.124,0.298,118.004,235988,4
2020-10-24,40,Popstar,DJ Khaled Featuring Drake,,False,34,3,13,0.8,0.56,5,-4.818,0,0.261,0.057,0,0.134,0.45,163.071,200221,4
2020-10-24,41,One Beer,HARDY Featuring Lauren Alaina & Devin Dawson,,False,52,41,19,0.516,0.745,2,-8.352,1,0.0774,0.563,0,0.275,0.825,186.004,173173,3
2020-10-24,42,Lovin' On You,Luke Combs,,False,40,23,16,0.572,0.949,4,-4.865,1,0.06,0.00165,0.000195,0.163,0.53,118.974,194867,4
2020-10-24,43,If The World Was Ending,JP Saxe Featuring Julia Michaels,,False,43,27,29,0.464,0.473,1,-10.086,1,0.129,0.866,0,0.109,0.604,75.801,208687,4
2020-10-24,44,I Should Probably Go To Bed,Dan + Shay,,False,54,42,11,0.721,0.277,1,-7.128,1,0.0365,0.634,0,0.112,0.309,131.935,171827,4
2020-10-24,45,Happy Anywhere,Blake Shelton Featuring Gwen Stefani,,False,58,45,12,0.538,0.745,8,-5.774,1,0.0387,0.1,0,0.063,0.669,165.755,170173,4
2020-10-24,46,Tap In,Saweetie,,False,47,20,14,0.954,0.696,10,-7.117,0,0.204,0.00576,0.000498,0.0754,0.432,100.036,139413,4
2020-10-24,47,Pretty Heart,Parker McCollum,,False,63,47,14,0.562,0.683,7,-4.427,1,0.0296,0.00531,0,0.107,0.385,132.003,244798,4
2020-10-24,48,My Ex's Best Friend,Machine Gun Kelly X blackbear,,False,50,28,9,0.731,0.675,5,-5.134,0,0.0434,0.00473,0,0.141,0.298,124.939,139461,4
2020-10-24,49,24,Money Man Featuring Lil Baby,,False,60,49,9,0.868,0.638,2,-7.746,1,0.0736,0.146,0.0565,0.0931,0.459,126.03,182857,4
2020-10-24,50,Midnight Sky,Miley Cyrus,,False,55,14,9,0.705,0.814,4,-5.466,0,0.0346,0.00115,0.00312,0.203,0.259,110.0,223279,4
2020-10-24,51,Love You Like I Used To,Russell Dickerson,,False,68,51,6,0.501,0.788,10,-4.624,1,0.0415,0.12,0,0.137,0.61,152.047,186613,4
2020-10-24,52,Wishing Well,Juice WRLD,,False,62,5,14,0.65,0.613,9,-6.13,0,0.128,0.00336,0,0.267,0.0804,149.972,194621,4
2020-10-24,53,Don't Stop,Megan Thee Stallion Featuring Young Thug,,False,30,30,2,0.933,0.757,2,-3.212,1,0.117,0.00184,0,0.135,0.544,137.993,187941,4
2020-10-24,54,Levitating,Dua Lipa Featuring DaBaby,,False,73,54,2,0.702,0.825,6,-3.787,0,0.0601,0.00883,0,0.0674,0.915,102.977,203064,4
2020-10-24,55,Hawai,Maluma & The Weeknd,,False,66,55,8,0.766,0.788,6,-3.128,0,0.312,0.105,5.81e-06,0.142,0.609,179.984,200482,4
2020-10-24,56,7 Summers,Morgan Wallen,,False,67,6,9,0.466,0.786,0,-5.13,1,0.0328,0.417,6.1e-05,0.125,0.571,203.903,210507,4
2020-10-24,57,You Broke Me First.,Tate McRae,,False,72,57,8,0.642,0.374,4,-9.386,1,0.0545,0.786,0,0.0906,0.0799,124.099,169266,4
2020-10-24,58,"Baby, I'm Jealous",Bebe Rexha Featuring Doja Cat,2fTdRdN73RgIgcUZN33dvt,True,0,58,1,0.737,0.867,11,-2.259,0,0.0458,0.0398,0,0.32,0.506,98.05,175873,4
2020-10-24,59,Diamonds,Sam Smith,2fTdRdN73RgIgcUZN33dvt,False,80,51,4,0.653,0.667,10,-6.764,0,0.0423,0.154,0,0.107,0.556,104.181,213869,4
2020-10-24,60,Heather,Conan Gray,2fTdRdN73RgIgcUZN33dvt,False,69,46,9,0.357,0.425,5,-7.301,1,0.0333,0.584,0,0.322,0.27,102.078,198040,3
2020-10-24,61,Ain't Always The Cowboy,Jon Pardi,2fTdRdN73RgIgcUZN33dvt,False,75,61,7,0.539,0.837,9,-3.458,1,0.0385,0.0094,0,0.262,0.551,151.913,220881,4
2020-10-24,62,Everywhere But On,Matt Stell,2fTdRdN73RgIgcUZN33dvt,False,79,62,6,0.563,0.722,6,-3.972,1,0.0279,0.0345,0,0.0795,0.309,149.903,192587,4
2020-10-24,63,Glock In My Lap,21 Savage & Metro Boomin,2fTdRdN73RgIgcUZN33dvt,False,19,19,2,0.847,0.733,10,-6.439,0,0.16,0.00574,1.04e-05,0.151,0.202,130.029,193591,4
2020-10-24,64,Starting Over,Chris Stapleton,2fTdRdN73RgIgcUZN33dvt,False,81,57,7,0.638,0.538,10,-8.445,1,0.0315,0.452,0.000415,0.0695,0.318,89.124,240413,4
2020-10-24,65,Cool Again,Kane Brown,2fTdRdN73RgIgcUZN33dvt,False,70,29,20,0.608,0.735,4,-5.497,1,0.0371,0.0156,1.69e-06,0.361,0.773,90.007,164668,4
2020-10-24,66,Hit Different,SZA Featuring Ty Dolla $ign,2fTdRdN73RgIgcUZN33dvt,False,87,29,6,0.679,0.516,0,-6.371,0,0.0452,0.199,0,0.0965,0.716,120.074,202008,4
2020-10-24,67,Martin & Gina,Polo G,2fTdRdN73RgIgcUZN33dvt,False,86,61,11,0.832,0.534,1,-7.813,0,0.253,0.345,0,0.165,0.116,93.924,132833,4
2020-10-24,68,The Bigger Picture,Lil Baby,2fTdRdN73RgIgcUZN33dvt,False,89,3,18,0.59,0.618,1,-5.756,1,0.334,0.0127,0,0.244,0.153,96.459,252729,3
2020-10-24,69,Better Together,Luke Combs,2fTdRdN73RgIgcUZN33dvt,False,0,69,2,0.552,0.225,0,-11.501,1,0.0477,0.827,0,0.111,0.67,138.002,219573,4
2020-10-24,70,OK Not To Be OK,Marshmello & Demi Lovato,2fTdRdN73RgIgcUZN33dvt,False,82,36,5,0.743,0.837,1,-5.025,0,0.0649,0.0172,0,0.0743,0.263,103.072,159863,4
2020-10-24,71,Greece,DJ Khaled Featuring Drake,2fTdRdN73RgIgcUZN33dvt,False,88,8,13,0.695,0.343,5,-10.798,1,0.0432,0.0743,1.04e-06,0.107,0.229,85.84,218902,4
2020-10-24,72,Ice Cream,BLACKPINK X Selena Gomez,2fTdRdN73RgIgcUZN33dvt,False,64,13,7,0.79,0.701,9,-4.81,1,0.365,0.0317,8.06e-05,0.0311,0.91,159.972,177813,4
2020-10-24,73,Un Dia (One Day),"J Balvin, Dua Lipa, Bad Bunny & Tainy",2fTdRdN73RgIgcUZN33dvt,False,85,63,12,0.579,0.687,6,-8.23,0,0.0618,0.00491,0,0.181,0.392,168.157,232253,4
2020-10-24,74,Rich N*gga Sh*t,21 Savage & Metro Boomin Featuring Young Thug,2fTdRdN73RgIgcUZN33dvt,False,26,26,2,0.82,0.718,1,-5.417,0,0.0962,0.438,0,0.11,0.599,97.994,190331,4
2020-10-24,75,Relacion,"Sech, Daddy Yankee & J Balvin Featuring ROSALIA & Farruko",2fTdRdN73RgIgcUZN33dvt,False,92,64,6,0.793,0.771,5,-3.417,1,0.0959,0.0337,1.51e-06,0.284,0.835,171.943,247308,4
2020-10-24,76,B.S.,Jhene Aiko Featuring H.E.R.,2fTdRdN73RgIgcUZN33dvt,False,97,24,11,0.617,0.525,8,-10.426,0,0.12,0.554,1.1e-06,0.135,0.377,135.781,212867,4
2020-10-24,77,Do It,Chloe X Halle,2fTdRdN73RgIgcUZN33dvt,False,94,63,9,0.725,0.668,5,-7.286,0,0.055,0.0932,2.33e-06,0.112,0.566,82.966,176787,4
2020-10-24,78,"Big, Big Plans",Chris Lane,2fTdRdN73RgIgcUZN33dvt,False,0,78,2,0.574,0.58,7,-6.091,1,0.0278,0.076,0,0.12,0.4,149.974,187307,4
2020-10-24,79,Breaking Me,Topic & A7S,2fTdRdN73RgIgcUZN33dvt,False,78,53,12,0.789,0.72,8,-5.652,0,0.218,0.223,0,0.129,0.664,122.031,166794,4
2020-10-24,80,U 2 Luv,Ne-Yo & Jeremih,2fTdRdN73RgIgcUZN33dvt,False,0,80,2,0.628,0.597,6,-7.083,1,0.15,0.131,0.000335,0.0961,0.667,177.742,208216,4
2020-10-24,81,I Called Mama,Tim McGraw,2fTdRdN73RgIgcUZN33dvt,False,53,53,11,0.499,0.619,2,-7.054,1,0.0339,0.571,4.82e-06,0.148,0.514,86.185,212147,4
2020-10-24,82,Kacey Talk,YoungBoy Never Broke Again,2fTdRdN73RgIgcUZN33dvt,False,98,50,9,0.877,0.607,10,-7.818,0,0.15,0.535,0,0.138,0.773,127.055,151249,4
2020-10-24,83,Blind,DaBaby Featuring Young Thug,2fTdRdN73RgIgcUZN33dvt,False,99,83,4,0.709,0.679,11,-6.503,0,0.346,0.0115,0,0.0971,0.754,162.973,153467,4
2020-10-24,84,Good Time,Niko Moon,2fTdRdN73RgIgcUZN33dvt,False,0,84,2,0.79,0.646,5,-5.878,1,0.0447,0.132,0,0.295,0.641,138.047,214707,4
2020-10-24,85,Cardigan,Taylor Swift,2fTdRdN73RgIgcUZN33dvt,False,77,1,12,0.613,0.581,0,-8.588,0,0.0424,0.537,0.000345,0.25,0.551,130.033,239560,4
2020-10-24,86,Bloody Valentine,Machine Gun Kelly,2fTdRdN73RgIgcUZN33dvt,False,90,50,3,0.533,0.858,2,-4.212,1,0.0766,0.00021,0,0.148,0.506,160.057,205159,4
2020-10-24,87,Girls In The Hood,Megan Thee Stallion,2fTdRdN73RgIgcUZN33dvt,False,95,28,16,0.821,0.863,6,-3.159,1,0.353,0.00824,0,0.0377,0.874,180.013,154324,4
2020-10-24,88,Slidin,21 Savage & Metro Boomin,2fTdRdN73RgIgcUZN33dvt,False,32,32,2,0.774,0.706,2,-6.494,1,0.355,0.00163,1.28e-06,0.104,0.382,152.891,185037,4
2020-10-24,89,Smile,Juice WRLD & The Weeknd,2fTdRdN73RgIgcUZN33dvt,False,0,8,9,0.694,0.685,6,-6.535,0,0.133,0.224,0,0.124,0.306,158.831,196180,4
2020-10-24,90,Caramelo,Ozuna x Karol G x Myke Towers,2fTdRdN73RgIgcUZN33dvt,False,100,76,9,0.728,0.806,6,-3.766,1,0.0623,0.0531,0.000301,0.153,0.698,168.084,217547,4
2020-10-24,91,Dollaz On My Head,Gunna Featuring Young Thug,2fTdRdN73RgIgcUZN33dvt,False,0,38,18,0.825,0.458,0,-7.47,1,0.0577,0.114,0,0.102,0.161,145.115,197760,4
2020-10-24,92,Epidemic,Polo G,2fTdRdN73RgIgcUZN33dvt,False,93,47,3,0.616,0.617,1,-8.431,1,0.52,0.128,0,0.177,0.476,175.929,177273,4
2020-10-24,93,Put Your Records On,Ritt Momney,2fTdRdN73RgIgcUZN33dvt,False,0,93,2,0.399,0.491,6,-10.778,0,0.0538,0.0563,0.00089,0.11,0.151,91.066,210463,4
2020-10-24,94,Many Men,21 Savage & Metro Boomin,2fTdRdN73RgIgcUZN33dvt,False,33,33,2,0.635,0.793,10,-4.333,0,0.0322,0.000647,0.747,0.113,0.281,77.594,201856,4
2020-10-24,95,Hole In The Bottle,Kelsea Ballerini,2bV4NwncWMnVvcWyU2yxwB,True,0,95,1,0.598,0.839,4,-4.605,1,0.111,0.106,0,0.372,0.783,105.084,156276,4
2020-10-24,96,3 Headed Goat,Lil Durk Featuring Lil Baby & Polo G,2bV4NwncWMnVvcWyU2yxwB,False,0,43,15,0.837,0.482,8,-8.608,0,0.365,0.268,0,0.0991,0.444,143.01,169532,4
2020-10-24,97,La Jeepeta,Nio Garcia x Anuel AA x Myke Towers x Brray x Juanka,2bV4NwncWMnVvcWyU2yxwB,False,0,93,9,0.815,0.715,4,-4.65,0,0.207,0.3,4.83e-06,0.091,0.786,176.007,345241,4
2020-10-24,98,Sofia,Clairo,7B3z0ySL9Rr0XvZEAjWZzM,True,0,98,1,0.744,0.619,0,-9.805,1,0.039,0.598,0.00372,0.231,0.641,112.997,188387,4
2020-10-24,100,You Got It,VEDO,,False,0,87,4,0.774,0.376,5,-9.372,1,0.208,0.297,0,0.165,0.391,122.089,201587,4
