date,position,title,artist,spotify_id,is_new,last_pos,peak_pos,weeks,danceability,energy,key,loudness,mode,speechiness,acousticness,instrumentalness,liveness,valence,tempo,duration_ms,time_signature
2016-05-21,1,One Dance,Drake Featuring WizKid & Kyla,5yuShbu70mtHXY0yLzCQLQ,False,2,1,5,0.792,0.625,1,-5.609,1,0.0536,0.00776,0.0018,0.329,0.37,103.967,173987,4
2016-05-21,2,Panda,Desiigner,5yuShbu70mtHXY0yLzCQLQ,False,1,1,11,0.685,0.731,10,-5.503,0,0.414,0.0292,0,0.369,0.266,145.245,247867,4
2016-05-21,3,7 Years,Lukas Graham,5yuShbu70mtHXY0yLzCQLQ,False,3,2,16,0.765,0.473,10,-5.829,1,0.0514,0.287,0,0.391,0.34,119.992,237300,4
2016-05-21,4,I Took A Pill In Ibiza,Mike Posner,5yuShbu70mtHXY0yLzCQLQ,False,5,4,16,0.664,0.714,7,-6.645,0,0.111,0.0353,8.42e-06,0.0843,0.71,101.969,197933,4
2016-05-21,5,Work From Home,Fifth Harmony Featuring Ty Dolla $ign,5yuShbu70mtHXY0yLzCQLQ,False,7,5,10,0.803,0.585,8,-5.861,1,0.0432,0.103,3.94e-06,0.0644,0.593,105.017,214480,4
2016-05-21,6,Work,Rihanna Featuring Drake,5yuShbu70mtHXY0yLzCQLQ,False,6,1,15,0.725,0.534,11,-6.238,1,0.0946,0.0752,0,0.0919,0.558,91.974,219320,4
2016-05-21,7,Don't Let Me Down,The Chainsmokers Featuring Daya,5yuShbu70mtHXY0yLzCQLQ,False,14,7,12,0.532,0.869,11,-5.094,1,0.172,0.157,0.00508,0.136,0.422,159.803,208373,4
2016-05-21,8,Pillowtalk,Zayn,5yuShbu70mtHXY0yLzCQLQ,False,9,1,14,0.584,0.7,11,-4.275,1,0.0456,0.117,0,0.0939,0.438,124.944,202747,4
2016-05-21,9,This Is What You Came For,Calvin Harris Featuring Rihanna,0azC730Exh71aQlOt9Zj3y,True,0,9,1,0.63,0.928,9,-2.787,0,0.0331,0.199,0.124,0.148,0.465,123.963,222160,4
2016-05-21,10,Love Yourself,Justin Bieber,0azC730Exh71aQlOt9Zj3y,False,15,1,25,0.759,0.401,4,-8.999,1,0.259,0.86,0,0.299,0.576,100.126,232627,4
2016-05-21,11,Sorry,Beyonce,0azC730Exh71aQlOt9Zj3y,False,11,11,2,0.775,0.598,2,-7.274,1,0.0535,0.00175,4.44e-06,0.253,0.356,129.988,232560,4
2016-05-21,12,No,Meghan Trainor,0azC730Exh71aQlOt9Zj3y,False,12,3,9,0.557,0.803,1,-3.599,0,0.213,0.0124,1.61e-06,0.737,0.657,92.134,213507,4
2016-05-21,13,Needed Me,Rihanna,0azC730Exh71aQlOt9Zj3y,False,22,13,14,0.671,0.314,5,-8.091,0,0.244,0.11,0,0.0825,0.296,110.898,191600,4
2016-05-21,14,My House,Flo Rida,0azC730Exh71aQlOt9Zj3y,False,19,4,26,0.688,0.702,7,-4.792,0,0.0499,0.0215,0,0.128,0.74,94.006,192191,4
2016-05-21,15,Stressed Out,twenty one pilots,0azC730Exh71aQlOt9Zj3y,False,16,2,33,0.734,0.637,4,-5.677,0,0.141,0.0462,2.29e-05,0.0602,0.648,169.977,202333,4
2016-05-21,16,Hold Up,Beyonce,0azC730Exh71aQlOt9Zj3y,False,13,13,2,0.524,0.397,0,-11.936,1,0.405,0.745,0,0.521,0.552,80.744,221093,4
2016-05-21,17,"Me, Myself & I",G-Eazy x Bebe Rexha,0azC730Exh71aQlOt9Zj3y,False,17,7,27,0.756,0.674,0,-6.518,0,0.0959,0.0184,0,0.158,0.389,111.995,251467,4
2016-05-21,18,Dangerous Woman,Ariana Grande,0azC730Exh71aQlOt9Zj3y,False,21,10,8,0.664,0.602,4,-5.369,0,0.0412,0.0529,0,0.356,0.289,134.049,235947,3
2016-05-21,19,Formation,Beyonce,0azC730Exh71aQlOt9Zj3y,False,10,10,2,0.896,0.621,5,-6.857,0,0.237,0.00532,0,0.196,0.818,121.966,206080,4
2016-05-21,20,H.O.L.Y.,Florida Georgia Line,0BCy325UZyR9z0t0uxwn2N,True,0,20,1,0.523,0.666,7,-4.081,0,0.0327,0.401,0,0.0728,0.564,78.077,194187,4
2016-05-21,21,Pop Style,Drake Featuring The Throne,0BCy325UZyR9z0t0uxwn2N,False,40,16,5,0.713,0.462,7,-10.027,1,0.123,0.192,2.16e-06,0.105,0.0594,133.053,212947,4
2016-05-21,22,Cake By The Ocean,DNCE,0BCy325UZyR9z0t0uxwn2N,False,24,9,29,0.774,0.753,4,-5.446,0,0.0517,0.152,0,0.0371,0.896,119.002,219147,4
2016-05-21,23,Never Forget You,Zara Larsson & MNEK,0BCy325UZyR9z0t0uxwn2N,False,26,15,12,0.583,0.732,11,-5.728,0,0.0457,0.00312,9.86e-06,0.269,0.276,145.992,213428,4
2016-05-21,24,Low Life,Future Featuring The Weeknd,0BCy325UZyR9z0t0uxwn2N,False,29,18,13,0.722,0.331,8,-7.789,1,0.0725,0.337,0.283,0.146,0.102,143.974,313547,4
2016-05-21,25,Oui,Jeremih,0BCy325UZyR9z0t0uxwn2N,False,30,19,18,0.418,0.724,5,-3.724,1,0.0964,0.213,0,0.112,0.604,78.521,238320,5
2016-05-21,26,2 Phones,Kevin Gates,0BCy325UZyR9z0t0uxwn2N,False,32,17,18,0.895,0.681,7,-5.267,0,0.358,0.157,0,0.189,0.554,121.918,240000,4
2016-05-21,27,Sorry,Justin Bieber,0BCy325UZyR9z0t0uxwn2N,False,31,1,28,0.679,0.748,0,-3.624,0,0.0385,0.0878,0,0.299,0.438,100.035,200787,4
2016-05-21,28,6 Inch,Beyonce Featuring The Weeknd,0BCy325UZyR9z0t0uxwn2N,False,18,18,2,0.516,0.637,6,-8.832,1,0.0632,0.0433,3.89e-06,0.11,0.324,138.011,260440,4
2016-05-21,29,My Boo,Ghost Town DJ's,0BCy325UZyR9z0t0uxwn2N,False,0,29,32,0.885,0.477,6,-9.196,0,0.0664,0.000131,0.000664,0.336,0.691,130.078,346840,4
2016-05-21,30,Middle,DJ Snake Featuring Bipolar Sunshine,0BCy325UZyR9z0t0uxwn2N,False,34,20,16,0.583,0.695,9,-5.336,1,0.0423,0.0141,0,0.0527,0.224,104.879,220573,4
2016-05-21,31,Close,Nick Jonas Featuring Tove Lo,0BCy325UZyR9z0t0uxwn2N,False,36,26,6,0.654,0.623,6,-5.273,0,0.082,0.253,0,0.144,0.401,123.996,234213,4
2016-05-21,32,Let It Go,James Bay,0BCy325UZyR9z0t0uxwn2N,False,42,30,20,0.546,0.311,1,-10.396,1,0.0288,0.818,1.65e-05,0.107,0.246,147.464,260533,4
2016-05-21,33,Hype,Drake,5NFYuqu8V6QXc6mzcLImd6,True,0,33,1,0.787,0.635,4,-8.271,0,0.155,0.0253,0,0.357,0.237,130.018,209413,4
2016-05-21,34,Controlla,Drake,3O8NlPh2LByMU9lSRSHedm,True,0,34,1,0.59,0.468,10,-11.083,0,0.185,0.0789,0,0.101,0.349,92.287,245227,4
2016-05-21,35,Exchange,Bryson Tiller,3O8NlPh2LByMU9lSRSHedm,False,44,26,28,0.525,0.433,6,-10.598,1,0.185,0.107,0,0.135,0.276,160.108,194613,4
2016-05-21,36,Stitches,Shawn Mendes,3O8NlPh2LByMU9lSRSHedm,False,45,4,50,0.736,0.74,10,-6.662,0,0.0912,0.0174,0,0.0481,0.737,74.99,206879,4
2016-05-21,37,Don't Hurt Yourself,Beyonce Featuring Jack White,3O8NlPh2LByMU9lSRSHedm,False,28,28,2,0.614,0.686,9,-6.483,0,0.21,0.0105,1.36e-06,0.184,0.645,136.537,233667,4
2016-05-21,38,Grammys,Drake Featuring Future,5e574bhjycX1eH2l4Auage,True,0,38,1,0.676,0.432,1,-9.51,1,0.502,0.00163,3.84e-06,0.0799,0.12,145.869,220427,4
2016-05-21,39,One Call Away,Charlie Puth,5e574bhjycX1eH2l4Auage,False,46,12,23,0.667,0.613,1,-5.353,1,0.0344,0.403,0,0.115,0.47,91.024,194453,4
2016-05-21,40,Still Here,Drake,4YJmZfvlheSziXem8HBWrj,True,0,40,1,0.833,0.431,0,-9.604,1,0.194,0.0267,0,0.633,0.224,133.938,189853,3
2016-05-21,41,Somewhere On A Beach,Dierks Bentley,4YJmZfvlheSziXem8HBWrj,False,51,35,14,0.569,0.638,7,-6.557,1,0.0291,0.000547,0,0.0848,0.438,144.042,197120,4
2016-05-21,42,Lost Boy,Ruth B,4YJmZfvlheSziXem8HBWrj,False,55,41,11,0.71,0.0565,7,-15.099,1,0.0534,0.965,0,0.0889,0.348,123.994,275280,4
2016-05-21,43,Roses,The Chainsmokers Featuring Rozes,4YJmZfvlheSziXem8HBWrj,False,48,6,29,0.713,0.802,4,-7.055,1,0.0561,0.0435,0.00377,0.309,0.343,100.001,226739,4
2016-05-21,44,U With Me?,Drake,03L2AoiRbWhvt7BDMx1jUB,True,0,44,1,0.429,0.43,2,-11.373,1,0.165,0.338,1.18e-05,0.138,0.125,174.983,297373,4
2016-05-21,45,9,Drake,1C7KSXR2GVxknex6I4ANco,True,0,45,1,0.68,0.712,10,-7.184,1,0.0453,0.000803,0.000612,0.237,0.0379,100.009,255787,4
2016-05-21,46,Don't,Bryson Tiller,1C7KSXR2GVxknex6I4ANco,False,50,13,32,0.765,0.356,11,-5.556,0,0.195,0.223,0,0.0963,0.189,96.991,198293,4
2016-05-21,47,With You,Drake Featuring PARTYNEXTDOOR,3aJkV6DUTSCqOwVwaBDG9B,True,0,47,1,0.878,0.406,1,-9.961,1,0.248,0.134,0.000234,0.112,0.784,128.014,195053,4
2016-05-21,48,Cheap Thrills,Sia Featuring Sean Paul,3aJkV6DUTSCqOwVwaBDG9B,False,54,39,12,0.628,0.698,6,-5.608,0,0.105,0.0472,0.00143,0.0907,0.732,89.976,211667,4
2016-05-21,49,Childs Play,Drake,3NxAG2ni1lLa8RKL6a0INc,True,0,49,1,0.746,0.475,10,-11.243,0,0.113,0.0175,1.1e-05,0.197,0.292,80.006,241400,4
2016-05-21,50,Think Of You,Chris Young Duet With Cassadee Pope,3NxAG2ni1lLa8RKL6a0INc,False,52,40,12,0.632,0.323,10,-14.042,0,0.951,0.811,0,0.102,0.769,171.053,46253,4
2016-05-21,51,Humble And Kind,Tim McGraw,3NxAG2ni1lLa8RKL6a0INc,False,53,30,13,0.355,0.48,11,-7.31,1,0.0282,0.679,2.28e-06,0.12,0.137,100.956,259267,3
2016-05-21,52,Too Good,Drake Featuring Rihanna,3BtuIIrQlkujKPuWF2B85z,True,0,52,1,0.794,0.653,7,-7.839,1,0.104,0.0489,4.88e-05,0.1,0.397,117.996,263373,4
2016-05-21,53,Feel No Ways,Drake,3cjF2OFRmip8spwZYQRKxP,True,0,53,1,0.582,0.677,7,-7.081,1,0.172,0.0312,6.6e-06,0.122,0.205,193.818,240653,4
2016-05-21,54,Weston Road Flows,Drake,4PA16FAl8LPmFmOhARawdV,True,0,54,1,0.623,0.74,1,-6.942,1,0.307,0.0635,0,0.366,0.35,82.877,253533,4
2016-05-21,55,Just Like Fire,P!nk,4PA16FAl8LPmFmOhARawdV,False,75,42,3,0.632,0.701,7,-5.921,1,0.146,0.0114,0,0.108,0.497,162.958,215414,4
2016-05-21,56,Wild Things,Alessia Cara,4PA16FAl8LPmFmOhARawdV,False,57,52,11,0.534,0.391,1,-5.18,0,0.068,0.769,0,0.297,0.764,101.867,191480,4
2016-05-21,57,Cut It,O.T. Genasis Featuring Young Dolph,4PA16FAl8LPmFmOhARawdV,False,56,43,11,0.875,0.673,7,-4.184,1,0.0932,0.135,0,0.292,0.231,130.0,222600,4
2016-05-21,58,Ride,twenty one pilots,4PA16FAl8LPmFmOhARawdV,False,66,58,8,0.645,0.713,6,-5.355,1,0.0393,0.00835,0,0.113,0.566,74.989,214507,4
2016-05-21,59,"Huntin', Fishin' & Lovin' Every Day",Luke Bryan,4PA16FAl8LPmFmOhARawdV,False,65,59,6,0.543,0.81,0,-4.275,1,0.0368,0.14,1.23e-05,0.145,0.395,76.978,278613,4
2016-05-21,60,Snapback,Old Dominion,4PA16FAl8LPmFmOhARawdV,False,60,50,15,0.687,0.793,5,-3.577,1,0.0333,0.302,3.46e-06,0.1,0.673,100.993,206507,4
2016-05-21,61,Redemption,Drake,4cRBqWBjuccCowYVHFlXK6,True,0,61,1,0.694,0.314,0,-7.82,1,0.116,0.611,2.07e-06,0.117,0.341,119.905,333947,4
2016-05-21,62,T-Shirt,Thomas Rhett,4cRBqWBjuccCowYVHFlXK6,False,62,56,10,0.634,0.862,2,-5.337,1,0.0376,0.0287,0,0.0217,0.767,95.989,227693,4
2016-05-21,63,Don't Mind,Kent Jones,27PmvZoffODNFW2p7ehZTQ,True,0,63,1,0.464,0.771,8,-4.503,1,0.336,0.0235,0,0.063,0.69,158.777,198237,4
2016-05-21,64,All Night,Beyonce,27PmvZoffODNFW2p7ehZTQ,False,38,38,2,0.574,0.573,11,-7.079,1,0.085,0.392,2.16e-05,0.0933,0.626,136.304,322000,4
2016-05-21,65,Freedom,Beyonce Featuring Kendrick Lamar,27PmvZoffODNFW2p7ehZTQ,False,35,35,2,0.437,0.803,2,-6.412,1,0.305,0.0376,0,0.683,0.406,84.378,289760,4
2016-05-21,66,Daddy Lessons,Beyonce,27PmvZoffODNFW2p7ehZTQ,False,41,41,2,0.643,0.503,7,-8.37,1,0.216,0.273,0,0.349,0.598,90.886,287987,4
2016-05-21,67,The Sound Of Silence,Disturbed,27PmvZoffODNFW2p7ehZTQ,False,59,42,11,0.322,0.28,6,-9.367,0,0.0281,0.468,1.1e-06,0.102,0.175,85.794,248467,4
2016-05-21,68,Keep The Family Close,Drake,7sBwAWyXfiIgrYQ8BaJESH,True,0,68,1,0.378,0.566,9,-7.685,0,0.0482,0.149,0,0.382,0.196,87.691,328907,3
2016-05-21,69,Came Here To Forget,Blake Shelton,7sBwAWyXfiIgrYQ8BaJESH,False,61,40,9,0.613,0.667,1,-6.874,0,0.029,0.356,1.29e-05,0.111,0.481,130.023,220413,4
2016-05-21,70,Pray You Catch Me,Beyonce,7sBwAWyXfiIgrYQ8BaJESH,False,37,37,2,0.25,0.215,8,-13.676,0,0.037,0.632,0.0717,0.401,0.0746,174.824,195987,3
2016-05-21,71,Sandcastles,Beyonce,7sBwAWyXfiIgrYQ8BaJESH,False,43,43,2,0.33,0.357,10,-10.171,1,0.0348,0.866,1.76e-05,0.19,0.101,84.119,182720,3
2016-05-21,72,Faithful,Drake Featuring Pimp C & dvsn,2qLcJOLrh6Djda4uLbldSA,True,0,72,1,0.536,0.449,1,-10.499,1,0.103,0.11,1.49e-05,0.284,0.171,99.889,290133,4
2016-05-21,73,Love Drought,Beyonce,2qLcJOLrh6Djda4uLbldSA,False,47,47,2,0.455,0.535,9,-10.602,0,0.0426,0.0209,0.64,0.126,0.216,157.01,237440,4
2016-05-21,74,True Colors,Zedd & Kesha,71qR03VPn762lG8esdRmkR,True,0,74,1,0.568,0.794,2,-3.317,0,0.0371,0.398,3.95e-05,0.104,0.489,126.023,224867,4
2016-05-21,75,Fire & Desire,Drake,4BhGTc3Cgay2U1QcTS7vQe,True,0,75,1,0.722,0.252,1,-14.411,0,0.0761,0.0671,0,0.0852,0.275,79.923,238120,4
2016-05-21,76,Kiss It Better,Rihanna,4BhGTc3Cgay2U1QcTS7vQe,False,67,67,5,0.619,0.806,3,-4.8,0,0.0483,0.272,0,0.0671,0.877,95.0,253080,4
2016-05-21,77,All The Way Up,"Fat Joe, Remy Ma & Jay Z Featuring French Montana & Infared",4BhGTc3Cgay2U1QcTS7vQe,False,68,65,6,0.536,0.721,10,-6.44,0,0.386,0.062,0,0.824,0.393,117.139,191942,5
2016-05-21,78,Mind Reader,Dustin Lynch,4BhGTc3Cgay2U1QcTS7vQe,False,69,67,11,0.394,0.8,4,-4.17,0,0.0413,0.0266,0,0.184,0.525,162.053,185413,4
2016-05-21,79,Never Be Like You,Flume Featuring Kai,4BhGTc3Cgay2U1QcTS7vQe,False,71,71,5,0.444,0.557,0,-5.476,1,0.0602,0.453,0,0.152,0.296,115.058,234910,4
2016-05-21,80,My Church,Maren Morris,4BhGTc3Cgay2U1QcTS7vQe,False,64,50,15,0.517,0.743,9,-4.336,1,0.0363,0.243,3.36e-06,0.107,0.664,76.979,197931,4
2016-05-21,81,Really Really,Kevin Gates,4BhGTc3Cgay2U1QcTS7vQe,False,76,54,20,0.762,0.666,0,-6.055,1,0.0916,0.00427,0,0.127,0.278,118.97,232093,4
2016-05-21,82,Wicked,Future,4BhGTc3Cgay2U1QcTS7vQe,False,80,73,3,0.718,0.679,11,-5.899,0,0.0706,0.00191,0.0104,0.385,0.205,157.97,173347,4
2016-05-21,83,Youth,Troye Sivan,4BhGTc3Cgay2U1QcTS7vQe,False,58,23,14,0.628,0.737,7,-4.437,1,0.041,0.0625,0,0.0777,0.592,91.507,185194,4
2016-05-21,84,Uber Everywhere,MadeinTYO,4BhGTc3Cgay2U1QcTS7vQe,False,85,80,5,0.779,0.455,1,-15.025,1,0.28,0.0542,0,0.177,0.197,140.181,153429,4
2016-05-21,85,Might Not,Belly Featuring The Weeknd,4BhGTc3Cgay2U1QcTS7vQe,False,79,68,11,0.792,0.563,1,-4.836,1,0.0787,0.318,0,0.13,0.321,134.022,224213,4
2016-05-21,86,Views,Drake,7MjSipTto9QljYzZnloXOn,True,0,86,1,0.395,0.852,5,-5.896,1,0.37,0.0657,0,0.262,0.112,76.428,311960,4
2016-05-21,87,If It Ain't Love,Jason Derulo,7MjSipTto9QljYzZnloXOn,False,87,84,4,0.503,0.843,10,-4.991,0,0.316,0.0487,0,0.344,0.778,128.63,203105,4
2016-05-21,88,Team,Iggy Azalea,7MjSipTto9QljYzZnloXOn,False,74,42,7,0.891,0.692,4,-4.989,1,0.0673,0.0545,0,0.608,0.218,100.023,209467,4
2016-05-21,89,Summer Sixteen,Drake,7MjSipTto9QljYzZnloXOn,False,73,6,14,0.594,0.46,1,-7.607,1,0.382,0.00354,2.71e-05,0.147,0.0541,146.274,202451,4
2016-05-21,90,Light It Up,Major Lazer Featuring Nyla & Fuse ODG,7MjSipTto9QljYzZnloXOn,False,88,75,8,0.747,0.877,9,-3.782,0,0.0668,0.0385,0.00089,0.233,0.751,107.989,166138,4
2016-05-21,91,Promise,Kid Ink Featuring Fetty Wap,7MjSipTto9QljYzZnloXOn,False,77,57,12,0.797,0.469,8,-8.112,1,0.0646,0.0599,0,0.0753,0.481,103.057,224240,4
2016-05-21,92,Body,Dreezy Featuring Jeremih,7MjSipTto9QljYzZnloXOn,False,86,77,7,0.735,0.567,0,-5.962,1,0.0635,0.554,0,0.0659,0.574,149.968,232707,4
2016-05-21,93,Piece By Piece,Kelly Clarkson,7MjSipTto9QljYzZnloXOn,False,93,8,10,0.561,0.245,1,-6.372,1,0.0344,0.904,0,0.0933,0.402,109.558,212280,4
2016-05-21,94,Head Over Boots,Jon Pardi,7MjSipTto9QljYzZnloXOn,False,89,79,10,0.563,0.688,7,-4.474,1,0.0262,0.0763,0,0.0863,0.622,108.008,202347,4
2016-05-21,95,Famous,Kanye West,7MjSipTto9QljYzZnloXOn,False,83,34,5,0.465,0.735,6,-3.715,1,0.117,0.0711,0,0.0975,0.409,173.935,196040,4
2016-05-21,96,Confession,Florida Georgia Line,7MjSipTto9QljYzZnloXOn,False,81,53,19,0.549,0.878,1,-5.066,1,0.0358,0.106,6.07e-05,0.176,0.44,104.98,190640,4
2016-05-21,97,I Like The Sound Of That,Rascal Flatts,7MjSipTto9QljYzZnloXOn,False,78,52,15,0.611,0.8,0,-5.61,1,0.0377,0.257,0,0.194,0.527,89.974,209280,4
2016-05-21,98,Father Stretch My Hands Pt. 1,Kanye West,7MjSipTto9QljYzZnloXOn,False,82,37,5,0.724,0.573,7,-4.113,1,0.0549,0.118,0,0.538,0.438,113.088,135920,4
2016-05-21,99,I Hate U I Love U,gnash Featuring Olivia O'Brien,7MjSipTto9QljYzZnloXOn,False,96,93,3,0.492,0.275,6,-13.4,0,0.3,0.687,0,0.101,0.18,92.6,251034,4
2016-05-21,100,Law,Yo Gotti Featuring E-40,7MjSipTto9QljYzZnloXOn,False,95,85,4,0.882,0.699,2,-5.572,1,0.249,0.0196,0,0.0469,0.42,145.008,257267,4
