date,position,title,artist,spotify_id,is_new,last_pos,peak_pos,weeks,danceability,energy,key,loudness,mode,speechiness,acousticness,instrumentalness,liveness,valence,tempo,duration_ms,time_signature
2019-09-14,1,Truth Hurts,Lizzo,,False,1,1,18,0.715,0.624,4,-3.046,0,0.114,0.11,0,0.123,0.412,158.087,173325,4
2019-09-14,2,Senorita,Shawn Mendes & Camila Cabello,,False,2,1,11,0.759,0.54,9,-6.039,0,0.0287,0.037,0,0.0945,0.75,116.947,190960,4
2019-09-14,3,Bad Guy,Billie Eilish,,False,3,1,23,0.701,0.425,7,-10.965,1,0.375,0.328,0.13,0.1,0.562,135.128,194088,4
2019-09-14,4,Ran$om,Lil Tecca,,False,6,4,14,0.536,0.715,7,-6.577,1,0.287,0.571,0.000418,0.471,0.391,179.631,60070,4
2019-09-14,5,Old Town Road,Lil Nas X Featuring Billy Ray Cyrus,,False,5,1,27,0.878,0.619,6,-5.56,1,0.102,0.0533,0,0.113,0.639,136.041,157067,4
2019-09-14,6,No Guidance,Chris Brown Featuring Drake,,False,7,6,13,0.696,0.454,1,-6.756,0,0.153,0.123,0,0.155,0.136,92.928,260640,4
2019-09-14,7,Circles,Post Malone,21jGcNKet2qwijlDFuPiPb,True,0,7,1,0.695,0.762,0,-3.497,1,0.0395,0.192,0.00244,0.0863,0.553,120.042,215280,4
2019-09-14,8,I Don't Care,Ed Sheeran & Justin Bieber,21jGcNKet2qwijlDFuPiPb,False,9,2,17,0.798,0.675,6,-5.041,1,0.0442,0.0912,0,0.0894,0.842,101.956,219947,4
2019-09-14,9,Talk,Khalid,21jGcNKet2qwijlDFuPiPb,False,8,3,30,0.901,0.4,0,-8.575,1,0.126,0.051,0,0.0599,0.346,135.984,197573,4
2019-09-14,10,Goodbyes,Post Malone Featuring Young Thug,21jGcNKet2qwijlDFuPiPb,False,12,3,9,0.548,0.653,5,-3.875,1,0.081,0.456,0,0.103,0.163,150.068,174853,4
2019-09-14,11,Someone You Loved,Lewis Capaldi,21jGcNKet2qwijlDFuPiPb,False,13,11,17,0.501,0.405,1,-5.679,1,0.0319,0.751,0,0.105,0.446,109.891,182161,4
2019-09-14,12,You Need To Calm Down,Taylor Swift,21jGcNKet2qwijlDFuPiPb,False,4,2,12,0.771,0.671,2,-5.617,1,0.0553,0.00929,0,0.0637,0.714,85.026,171360,4
2019-09-14,13,Sucker,Jonas Brothers,21jGcNKet2qwijlDFuPiPb,False,15,1,27,0.842,0.734,1,-5.065,0,0.0588,0.0427,0,0.106,0.952,137.958,181027,4
2019-09-14,14,Sunflower (Spider-Man: Into The Spider-Verse),Post Malone & Swae Lee,21jGcNKet2qwijlDFuPiPb,False,17,1,46,0.76,0.479,2,-5.574,1,0.0466,0.556,0,0.0703,0.913,89.911,158040,4
2019-09-14,15,Money In The Grave,Drake Featuring Rick Ross,21jGcNKet2qwijlDFuPiPb,False,14,7,12,0.831,0.502,10,-4.045,0,0.046,0.101,0,0.122,0.101,100.541,205427,4
2019-09-14,16,If I Can't Have You,Shawn Mendes,21jGcNKet2qwijlDFuPiPb,False,16,2,18,0.69,0.809,2,-4.198,1,0.0603,0.524,0,0.147,0.864,123.912,190800,4
2019-09-14,17,Beautiful People,Ed Sheeran Featuring Khalid,21jGcNKet2qwijlDFuPiPb,False,20,17,10,0.64,0.648,5,-8.113,0,0.187,0.124,0,0.0802,0.548,92.977,197867,4
2019-09-14,18,Suge,DaBaby,21jGcNKet2qwijlDFuPiPb,False,18,7,23,0.876,0.662,2,-6.482,0,0.426,0.0608,0,0.127,0.844,75.445,163320,4
2019-09-14,19,Boyfriend,Ariana Grande & Social House,21jGcNKet2qwijlDFuPiPb,False,22,8,5,0.4,0.795,10,-3.731,0,0.461,0.119,0,0.159,0.702,190.097,186107,4
2019-09-14,20,The Git Up,Blanco Brown,21jGcNKet2qwijlDFuPiPb,False,19,14,13,0.847,0.678,9,-8.635,1,0.109,0.0669,0,0.274,0.811,97.984,200594,4
2019-09-14,21,Hot Girl Summer,"Megan Thee Stallion, Nicki Minaj & Ty Dolla $ign",21jGcNKet2qwijlDFuPiPb,False,31,11,4,0.872,0.814,0,-4.568,1,0.155,0.00485,1.96e-06,0.214,0.57,98.985,199427,4
2019-09-14,22,My Type,Saweetie,21jGcNKet2qwijlDFuPiPb,False,21,21,10,0.899,0.811,2,-6.294,1,0.258,0.000677,0,0.0672,0.587,105.038,126446,4
2019-09-14,23,Lover,Taylor Swift,21jGcNKet2qwijlDFuPiPb,False,10,10,3,0.359,0.543,7,-7.582,1,0.0919,0.492,1.58e-05,0.118,0.453,68.534,221307,4
2019-09-14,24,The London,"Young Thug, J. Cole & Travis Scott",21jGcNKet2qwijlDFuPiPb,False,25,12,15,0.796,0.586,4,-6.946,0,0.147,0.0247,0,0.132,0.179,97.981,200107,4
2019-09-14,25,Dancing With A Stranger,Sam Smith & Normani,21jGcNKet2qwijlDFuPiPb,False,26,7,34,0.741,0.52,8,-7.513,1,0.0656,0.45,1.97e-06,0.222,0.347,102.998,171030,4
2019-09-14,26,Baby,Lil Baby & DaBaby,21jGcNKet2qwijlDFuPiPb,False,24,24,7,0.97,0.463,10,-7.259,1,0.366,0.0957,0,0.151,0.46,108.003,142417,4
2019-09-14,27,Wow.,Post Malone,21jGcNKet2qwijlDFuPiPb,False,35,2,37,0.829,0.539,11,-7.359,0,0.208,0.136,1.78e-06,0.103,0.388,99.96,149547,4
2019-09-14,28,Pop Out,Polo G Featuring Lil Tjay,21jGcNKet2qwijlDFuPiPb,False,30,11,24,0.772,0.639,1,-7.119,1,0.467,0.15,0,0.0698,0.261,168.112,166560,4
2019-09-14,29,Panini,Lil Nas X,21jGcNKet2qwijlDFuPiPb,False,40,16,11,0.717,0.598,5,-5.613,0,0.0809,0.22,0,0.122,0.496,153.905,151040,4
2019-09-14,30,Without Me,Halsey,21jGcNKet2qwijlDFuPiPb,False,32,1,48,0.752,0.488,6,-7.05,1,0.0705,0.297,9.11e-06,0.0936,0.533,136.041,201661,4
2019-09-14,31,Knockin' Boots,Luke Bryan,21jGcNKet2qwijlDFuPiPb,False,34,31,19,0.739,0.682,2,-3.728,1,0.205,0.129,0,0.328,0.634,131.983,199382,4
2019-09-14,32,How Do You Sleep?,Sam Smith,21jGcNKet2qwijlDFuPiPb,False,36,29,7,0.477,0.682,1,-4.931,0,0.0925,0.153,0,0.0763,0.345,110.567,202205,5
2019-09-14,33,Beer Never Broke My Heart,Luke Combs,21jGcNKet2qwijlDFuPiPb,False,27,21,18,0.538,0.863,1,-4.483,1,0.0481,0.0139,0,0.0874,0.637,77.001,186733,4
2019-09-14,34,Speechless,Dan + Shay,21jGcNKet2qwijlDFuPiPb,False,33,24,37,0.616,0.438,1,-5.968,1,0.0298,0.356,0,0.24,0.386,135.929,213387,4
2019-09-14,35,Only Human,Jonas Brothers,21jGcNKet2qwijlDFuPiPb,False,44,35,12,0.795,0.496,0,-5.883,1,0.0722,0.108,0,0.0645,0.874,94.01,183000,4
2019-09-14,36,Cash Shit,Megan Thee Stallion Featuring DaBaby,21jGcNKet2qwijlDFuPiPb,False,42,36,11,0.921,0.635,1,-4.904,1,0.416,0.0218,0,0.0946,0.549,130.028,192540,4
2019-09-14,37,Trampoline,SHAED,21jGcNKet2qwijlDFuPiPb,False,41,37,14,0.689,0.412,7,-7.523,0,0.0301,0.488,0.00016,0.0659,0.537,126.754,184060,4
2019-09-14,38,Hot,Young Thug Featuring Gunna,21jGcNKet2qwijlDFuPiPb,False,39,26,3,0.855,0.651,0,-8.044,0,0.235,0.063,0,0.0772,0.559,111.997,193027,4
2019-09-14,39,"Hey Look Ma, I Made It",Panic! At The Disco,21jGcNKet2qwijlDFuPiPb,False,37,16,21,0.577,0.833,5,-3.337,1,0.0695,0.0137,0,0.121,0.58,107.936,169667,4
2019-09-14,40,7 Rings,Ariana Grande,21jGcNKet2qwijlDFuPiPb,False,43,1,33,0.778,0.317,1,-10.732,0,0.334,0.592,0,0.0881,0.327,140.048,178627,4
2019-09-14,41,Good As Hell,Lizzo,21jGcNKet2qwijlDFuPiPb,False,52,41,2,0.682,0.919,0,-3.18,0,0.0875,0.256,0,0.442,0.535,95.982,159736,4
2019-09-14,42,One Thing Right,Marshmello & Kane Brown,21jGcNKet2qwijlDFuPiPb,False,59,42,11,0.659,0.623,4,-2.253,1,0.0451,0.0667,0,0.582,0.439,88.042,181824,4
2019-09-14,43,Whiskey Glasses,Morgan Wallen,21jGcNKet2qwijlDFuPiPb,False,47,17,27,0.614,0.68,6,-4.58,1,0.0289,0.369,1.84e-06,0.115,0.707,149.959,234347,4
2019-09-14,44,God's Country,Blake Shelton,21jGcNKet2qwijlDFuPiPb,False,46,17,23,0.538,0.752,10,-5.106,1,0.0396,0.0608,5.39e-06,0.118,0.217,139.984,205107,4
2019-09-14,45,On Chill,Wale Featuring Jeremih,21jGcNKet2qwijlDFuPiPb,False,55,45,4,0.597,0.733,1,-6.017,1,0.41,0.134,0,0.159,0.639,171.016,214035,4
2019-09-14,46,Shotta Flow,NLE Choppa,21jGcNKet2qwijlDFuPiPb,False,50,36,20,0.894,0.511,2,-4.768,1,0.42,0.0251,0,0.14,0.568,120.08,176632,4
2019-09-14,47,All To Myself,Dan + Shay,21jGcNKet2qwijlDFuPiPb,False,48,31,18,0.646,0.781,1,-4.616,1,0.0313,0.208,0,0.125,0.565,94.975,169920,4
2019-09-14,48,The Ones That Didn't Make It Back Home,Justin Moore,21jGcNKet2qwijlDFuPiPb,False,53,46,12,0.537,0.784,3,-4.869,1,0.034,0.0979,0,0.224,0.468,137.995,191018,4
2019-09-14,49,China,"Anuel AA, Daddy Yankee, Karol G, Ozuna & J Balvin",21jGcNKet2qwijlDFuPiPb,False,58,43,7,0.786,0.808,7,-3.702,1,0.0882,0.0846,0.000289,0.0822,0.609,105.027,301714,4
2019-09-14,50,I Don't Know About You,Chris Lane,21jGcNKet2qwijlDFuPiPb,False,68,50,9,0.593,0.81,1,-5.733,1,0.0625,0.602,0,0.119,0.712,144.011,207933,4
2019-09-14,51,Motivation,Normani,21jGcNKet2qwijlDFuPiPb,False,66,33,3,0.599,0.887,4,-3.967,1,0.0984,0.0192,1.21e-06,0.3,0.881,170.918,193837,4
2019-09-14,52,Bad Bad Bad,Young Thug Featuring Lil Baby,21jGcNKet2qwijlDFuPiPb,False,54,32,3,0.974,0.596,6,-8.888,1,0.184,0.0976,0,0.151,0.892,111.959,149040,4
2019-09-14,53,Otro Trago,"Sech, Darell, Nicky Jam, Ozuna & Anuel AA",21jGcNKet2qwijlDFuPiPb,False,60,34,13,0.725,0.79,0,-2.331,1,0.197,0.0711,1.14e-06,0.0602,0.763,175.988,287773,4
2019-09-14,54,ME!,Taylor Swift Featuring Brendon Urie,21jGcNKet2qwijlDFuPiPb,False,11,2,20,0.61,0.83,0,-4.105,1,0.0571,0.033,0,0.118,0.728,182.162,193000,4
2019-09-14,55,Lalala,Y2K & bbno$,21jGcNKet2qwijlDFuPiPb,False,71,55,10,0.843,0.391,2,-7.899,1,0.0845,0.181,0,0.137,0.496,129.972,160627,4
2019-09-14,56,Rearview Town,Jason Aldean,21jGcNKet2qwijlDFuPiPb,False,56,40,15,0.526,0.85,10,-4.47,0,0.0313,0.023,0,0.0948,0.338,141.973,184173,4
2019-09-14,57,Living,Dierks Bentley,21jGcNKet2qwijlDFuPiPb,False,73,57,6,0.517,0.813,1,-6.325,1,0.0558,0.0153,0,0.106,0.444,83.005,222147,4
2019-09-14,58,Queen Of Mean,Sarah Jeffery,21jGcNKet2qwijlDFuPiPb,False,61,49,5,0.543,0.787,8,-6.52,1,0.241,0.248,0,0.0778,0.343,173.702,189397,4
2019-09-14,59,Doin' Time,Lana Del Rey,0Oqc0kKFsQ6MhFOLBNZIGX,True,0,59,1,0.649,0.538,7,-11.196,0,0.0519,0.372,0.00632,0.0951,0.496,144.979,202193,4
2019-09-14,60,Time,NF,0Oqc0kKFsQ6MhFOLBNZIGX,False,72,60,7,0.677,0.688,0,-4.058,0,0.0633,0.138,0,0.114,0.198,98.049,240429,4
2019-09-14,61,The Man,Taylor Swift,0Oqc0kKFsQ6MhFOLBNZIGX,False,23,23,2,0.777,0.658,0,-5.191,1,0.054,0.0767,0,0.0901,0.633,110.048,190360,4
2019-09-14,62,Easier,5 Seconds Of Summer,0Oqc0kKFsQ6MhFOLBNZIGX,False,65,48,15,0.562,0.46,5,-4.173,1,0.259,0.476,0,0.107,0.623,176.055,158099,4
2019-09-14,63,Callaita,Bad Bunny & Tainy,0Oqc0kKFsQ6MhFOLBNZIGX,False,69,52,13,0.61,0.624,2,-4.773,1,0.309,0.6,2.12e-06,0.243,0.244,176.169,250534,4
2019-09-14,64,Did It Again,Lil Tecca,0Oqc0kKFsQ6MhFOLBNZIGX,False,99,64,3,0.686,0.561,10,-9.929,0,0.191,0.185,0,0.114,0.186,148.775,116240,4
2019-09-14,65,Prayed For You,Matt Stell,0Oqc0kKFsQ6MhFOLBNZIGX,False,74,65,5,0.6,0.698,9,-5.86,1,0.0355,0.0724,1.64e-06,0.113,0.57,140.032,210373,4
2019-09-14,66,Southbound,Carrie Underwood,0Oqc0kKFsQ6MhFOLBNZIGX,False,76,66,8,0.614,0.884,0,-4.019,1,0.0402,0.00122,0,0.077,0.721,100.531,202853,4
2019-09-14,67,Slide Away,Miley Cyrus,0Oqc0kKFsQ6MhFOLBNZIGX,False,64,47,3,0.53,0.538,5,-6.672,1,0.0335,0.17,2.83e-06,0.248,0.288,148.051,233654,4
2019-09-14,68,F.N,Lil Tjay,0Oqc0kKFsQ6MhFOLBNZIGX,False,70,68,4,0.567,0.515,6,-10.265,0,0.247,0.354,0,0.078,0.321,120.1,224000,1
2019-09-14,69,Babushka Boi,A$AP Rocky,643PW82aBMUa1FiWi5VQY7,True,0,69,1,0.897,0.743,10,-5.446,0,0.222,0.304,4.44e-05,0.137,0.905,134.979,187105,4
2019-09-14,70,Ballin',Mustard & Roddy Ricch,643PW82aBMUa1FiWi5VQY7,False,83,70,7,0.809,0.545,7,-6.678,1,0.0735,0.392,0,0.151,0.244,97.008,180435,4
2019-09-14,71,Cruel Summer,Taylor Swift,643PW82aBMUa1FiWi5VQY7,False,29,29,2,0.552,0.702,9,-5.707,1,0.157,0.117,2.06e-05,0.105,0.564,169.994,178427,4
2019-09-14,72,Hate Me,Ellie Goulding & Juice WRLD,643PW82aBMUa1FiWi5VQY7,False,80,72,7,0.657,0.768,8,-4.628,1,0.0507,0.108,0,0.144,0.759,75.025,186223,4
2019-09-14,73,Right Back,Khalid Featuring A Boogie Wit da Hoodie,643PW82aBMUa1FiWi5VQY7,False,93,73,6,0.786,0.428,5,-10.011,0,0.31,0.0933,1.1e-06,0.156,0.556,97.001,255000,4
2019-09-14,74,I Forgot That You Existed,Taylor Swift,643PW82aBMUa1FiWi5VQY7,False,28,28,2,0.664,0.316,5,-10.345,1,0.519,0.298,2.03e-06,0.0812,0.541,92.875,170640,4
2019-09-14,75,Love You Too Late,Cole Swindell,643PW82aBMUa1FiWi5VQY7,False,81,74,5,0.542,0.797,9,-4.45,0,0.0379,0.00111,0,0.0906,0.593,113.95,204720,4
2019-09-14,76,Call You Mine,The Chainsmokers & Bebe Rexha,643PW82aBMUa1FiWi5VQY7,False,79,56,14,0.585,0.696,4,-5.6,0,0.0307,0.204,0,0.344,0.522,104.01,217640,4
2019-09-14,77,Heat,Chris Brown Featuring Gunna,1GIYmwtBbPSHrqcSaukZck,True,0,77,1,0.619,0.613,0,-5.83,1,0.0796,0.0614,0,0.117,0.483,82.419,232733,4
2019-09-14,78,Press,Cardi B,1GIYmwtBbPSHrqcSaukZck,False,85,16,14,0.888,0.525,1,-5.665,1,0.305,0.029,5.68e-06,0.137,0.243,133.983,143792,4
2019-09-14,79,No Me Conoce,"Jhay Cortez, J Balvin & Bad Bunny",1GIYmwtBbPSHrqcSaukZck,False,86,71,9,0.804,0.786,10,-3.837,0,0.0735,0.144,0,0.0928,0.575,91.992,309120,4
2019-09-14,80,Out Of Luck,Lil Tecca,1ipyiYqvds0wcaFDTW6N4X,True,0,80,1,0.563,0.624,8,-8.271,1,0.287,0.0439,0,0.111,0.337,152.068,163267,4
2019-09-14,82,One Man Band,Old Dominion,,False,91,82,2,0.706,0.358,6,-8.331,1,0.0347,0.677,0,0.107,0.478,75.991,186240,4
2019-09-14,83,It's You,Ali Gatie,,False,78,70,12,0.732,0.463,11,-6.972,0,0.0287,0.374,0,0.194,0.397,95.971,212607,4
2019-09-14,84,Shots,Lil Tecca,6eSU1exzDvBEXmBRxspeh5,True,0,84,1,0.829,0.582,7,-5.721,0,0.0415,0.525,0,0.0759,0.51,108.028,109373,4
2019-09-14,85,Tip Of My Tongue,Kenny Chesney,6eSU1exzDvBEXmBRxspeh5,False,88,77,8,0.669,0.56,5,-5.003,1,0.0251,0.0821,0,0.0703,0.49,95.0,199413,4
2019-09-14,86,Juice,Lizzo,6eSU1exzDvBEXmBRxspeh5,False,82,82,4,0.767,0.889,7,-2.988,1,0.0963,0.00611,0,0.402,0.843,119.93,195145,4
2019-09-14,87,Go Loko,"YG, Tyga & Jon Z",6eSU1exzDvBEXmBRxspeh5,False,84,49,18,0.88,0.67,2,-5.177,1,0.0468,0.325,4.17e-06,0.0662,0.131,101.008,299227,4
2019-09-14,88,Baby Sitter,DaBaby Featuring Offset,6eSU1exzDvBEXmBRxspeh5,False,98,88,4,0.852,0.73,1,-5.803,1,0.0579,0.0219,0,0.336,0.394,92.506,157693,4
2019-09-14,89,Bezerk,Big Sean Featuring A$AP Ferg & Hit-Boy,2B9wgj9XzbJZLty03PRbVo,True,0,89,1,0.684,0.687,2,-4.673,1,0.2,0.0164,0,0.253,0.265,184.026,151067,4
2019-09-14,90,Good Vibes,Chris Janson,1XVqh0dC0PIl72f2mQhsVt,True,0,90,1,0.582,0.846,0,-2.771,1,0.0451,0.022,0,0.133,0.736,92.004,165587,4
2019-09-14,91,What Happens In A Small Town,Brantley Gilbert + Lindsay Ell,1XVqh0dC0PIl72f2mQhsVt,False,0,85,4,0.496,0.775,11,-5.304,1,0.0411,0.000927,0,0.14,0.478,138.165,202587,4
2019-09-14,92,Buy My Own Drinks,Runaway June,1XVqh0dC0PIl72f2mQhsVt,False,100,88,4,0.686,0.9,5,-4.406,1,0.0614,0.068,0,0.0985,0.962,155.963,206293,4
2019-09-14,93,Higher Love,Kygo X Whitney Houston,1XVqh0dC0PIl72f2mQhsVt,False,0,63,2,0.693,0.678,8,-7.159,1,0.0324,0.0154,6.05e-06,0.101,0.404,103.952,228267,4
2019-09-14,94,God Only Knows,for KING & COUNTRY,4ElNxglBjcrASiGn58t9Jm,True,0,94,1,0.597,0.417,2,-7.952,1,0.0502,0.395,8.35e-06,0.128,0.263,143.839,229760,4
2019-09-14,95,Wish Wish,DJ Khaled Featuring Cardi B & 21 Savage,4ElNxglBjcrASiGn58t9Jm,False,0,19,9,0.861,0.666,8,-5.18,0,0.343,0.00218,0,0.272,0.853,145.041,202625,4
2019-09-14,96,The Bones,Maren Morris,7yFhA2fUsL2oIMWlw5DaHQ,True,0,96,1,0.612,0.57,11,-6.642,0,0.0347,0.278,0,0.0963,0.334,77.002,197293,4
2019-09-14,97,Love Me,Lil Tecca,4e0FYxSROat25pH16zMTZI,True,0,97,1,0.719,0.538,11,-6.897,0,0.28,0.632,0,0.135,0.803,204.132,117013,4
2019-09-14,98,La Cancion,J Balvin & Bad Bunny,4LNDwYuspWaC3Row4kUdAk,True,0,98,1,0.756,0.646,7,-5.795,1,0.319,0.152,1.81e-05,0.108,0.429,176.088,242573,4
2019-09-14,99,We Were,Keith Urban,4LNDwYuspWaC3Row4kUdAk,False,0,80,4,0.44,0.803,5,-6.162,1,0.0512,0.127,0,0.128,0.633,79.312,189104,4
2019-09-14,100,Soltera,"Lunay, Daddy Yankee & Bad Bunny",4LNDwYuspWaC3Row4kUdAk,False,97,66,17,0.795,0.783,5,-4.271,1,0.0432,0.361,0,0.437,0.799,92.01,266087,4
