date,position,title,artist,spotify_id,is_new,last_pos,peak_pos,weeks,danceability,energy,key,loudness,mode,speechiness,acousticness,instrumentalness,liveness,valence,tempo,duration_ms,time_signature
2011-12-24,1,We Found Love,Rihanna Featuring Calvin Harris,6hVgzcyMmjNKaJn5VRZX3H,False,1,1,12,0.734,0.766,1,-4.485,1,0.0383,0.025,0.00138,0.108,0.6,127.986,215227,4
2011-12-24,2,Sexy And I Know It,LMFAO,6hVgzcyMmjNKaJn5VRZX3H,False,2,2,15,0.707,0.861,7,-4.225,1,0.316,0.1,0,0.191,0.795,130.021,199480,4
2011-12-24,3,It Will Rain,Bruno Mars,6hVgzcyMmjNKaJn5VRZX3H,False,3,3,11,0.576,0.835,2,-6.826,1,0.0486,0.337,0,0.082,0.476,150.017,257720,4
2011-12-24,4,The One That Got Away,Katy Perry,6hVgzcyMmjNKaJn5VRZX3H,False,9,4,9,0.687,0.792,1,-4.023,0,0.0353,0.000802,0,0.2,0.864,133.962,227333,4
2011-12-24,5,Good Feeling,Flo Rida,6hVgzcyMmjNKaJn5VRZX3H,False,5,5,11,0.706,0.89,1,-4.444,0,0.0688,0.0588,0.00286,0.306,0.684,128.011,248133,4
2011-12-24,6,Ni**as in Paris,Jay Z Kanye West,6hVgzcyMmjNKaJn5VRZX3H,False,8,6,18,0.789,0.858,1,-5.542,1,0.311,0.127,0,0.349,0.775,140.022,219333,4
2011-12-24,7,Someone Like You,Adele,6hVgzcyMmjNKaJn5VRZX3H,False,6,1,23,0.556,0.319,9,-8.251,1,0.0281,0.893,0,0.0996,0.294,135.187,285240,4
2011-12-24,8,Moves Like Jagger,Maroon 5 Featuring Christina Aguilera,6hVgzcyMmjNKaJn5VRZX3H,False,4,1,25,0.708,0.784,11,-3.742,0,0.049,0.012,0,0.368,0.697,128.015,202859,4
2011-12-24,9,Without You,David Guetta Featuring Usher,6hVgzcyMmjNKaJn5VRZX3H,False,7,4,15,0.608,0.614,2,-3.727,1,0.0285,0.227,3.82e-06,0.157,0.402,127.885,208133,4
2011-12-24,10,5 O'Clock,T-Pain Featuring Wiz Khalifa & Lily Allen,6hVgzcyMmjNKaJn5VRZX3H,False,11,10,11,0.4,0.882,7,-1.958,0,0.334,0.168,0,0.124,0.385,167.114,281533,4
2011-12-24,11,Stereo Hearts,Gym Class Heroes Featuring Adam Levine,6hVgzcyMmjNKaJn5VRZX3H,False,10,4,26,0.646,0.795,9,-3.293,1,0.0976,0.0319,0,0.267,0.796,89.99,210960,4
2011-12-24,12,We Are Young,Glee Cast,1zugfOhn6BebboqGcpUlba,True,0,12,1,0.378,0.555,7,-6.086,1,0.0498,0.0504,0,0.199,0.524,91.966,249773,4
2011-12-24,13,Party Rock Anthem,LMFAO Featuring Lauren Bennett & GoonRock,1zugfOhn6BebboqGcpUlba,False,12,1,38,0.75,0.727,5,-4.21,0,0.142,0.0189,0,0.266,0.359,129.993,262173,4
2011-12-24,14,Dance (A$$),Big Sean Featuring Nicki Minaj,1zugfOhn6BebboqGcpUlba,False,16,14,10,0.765,0.695,2,-6.57,1,0.342,0.02,0.0437,0.13,0.7,159.865,197760,4
2011-12-24,15,Work Out,J. Cole,1zugfOhn6BebboqGcpUlba,False,14,14,15,0.831,0.427,2,-6.903,1,0.106,0.0531,0,0.307,0.216,93.004,235320,4
2011-12-24,16,Headlines,Drake,1zugfOhn6BebboqGcpUlba,False,13,13,18,0.636,0.566,6,-7.16,0,0.106,0.365,0.000353,0.0917,0.425,151.894,235987,4
2011-12-24,17,Red Solo Cup,Toby Keith,1zugfOhn6BebboqGcpUlba,False,35,17,7,0.535,0.56,4,-6.586,1,0.0901,0.287,0,0.209,0.785,164.17,223387,4
2011-12-24,18,Pumped Up Kicks,Foster The People,1zugfOhn6BebboqGcpUlba,False,17,3,33,0.733,0.71,5,-5.849,0,0.0292,0.145,0.115,0.0956,0.965,127.975,239600,4
2011-12-24,19,You Make Me Feel...,Cobra Starship Featuring Sabi,1zugfOhn6BebboqGcpUlba,False,15,7,22,0.668,0.857,7,-2.944,0,0.0535,0.0191,6.71e-06,0.0385,0.748,131.959,215693,4
2011-12-24,20,Mr. Know It All,Kelly Clarkson,1zugfOhn6BebboqGcpUlba,False,18,10,14,0.676,0.807,5,-5.131,1,0.029,0.0284,0,0.0701,0.443,95.956,232520,4
2011-12-24,21,Set Fire To The Rain,Adele,1zugfOhn6BebboqGcpUlba,False,37,21,15,0.603,0.67,2,-3.882,0,0.0249,0.00408,1.68e-06,0.112,0.446,107.993,242974,4
2011-12-24,22,"Young, Wild & Free",Snoop Dogg & Wiz Khalifa Featuring Bruno Mars,1zugfOhn6BebboqGcpUlba,False,29,10,9,0.715,0.655,0,-6.425,1,0.137,0.0525,0,0.115,0.531,95.078,207333,4
2011-12-24,23,You Da One,Rihanna,1zugfOhn6BebboqGcpUlba,False,19,14,5,0.702,0.715,5,-5.377,0,0.0425,0.503,2.44e-05,0.126,0.863,127.05,200013,4
2011-12-24,24,Not Over You,Gavin DeGraw,1zugfOhn6BebboqGcpUlba,False,23,23,18,0.63,0.894,10,-4.592,1,0.0544,0.255,0,0.181,0.364,142.051,218520,4
2011-12-24,25,I Don't Want This Night To End,Luke Bryan,1zugfOhn6BebboqGcpUlba,False,22,22,11,0.616,0.728,9,-4.02,0,0.0278,0.0275,0,0.228,0.375,111.934,219973,4
2011-12-24,26,Give Me Everything,"Pitbull Featuring Ne-Yo, Afrojack & Nayer",1zugfOhn6BebboqGcpUlba,False,20,1,37,0.671,0.939,8,-3.206,1,0.161,0.191,0,0.298,0.53,129.024,252307,4
2011-12-24,27,Make Me Proud,Drake Featuring Nicki Minaj,1zugfOhn6BebboqGcpUlba,False,28,9,9,0.684,0.486,1,-10.155,1,0.132,0.00268,0.000148,0.157,0.355,131.913,219893,4
2011-12-24,28,Just A Kiss,Lady Antebellum,1zugfOhn6BebboqGcpUlba,False,26,7,32,0.593,0.639,1,-5.826,1,0.0307,0.446,0,0.0998,0.332,142.881,218840,4
2011-12-24,29,Marry The Night,Lady Gaga,1zugfOhn6BebboqGcpUlba,False,32,29,5,0.614,0.879,0,-4.422,1,0.056,0.00104,0.00438,0.41,0.407,131.092,264520,4
2011-12-24,30,The Motto,Drake Featuring Lil Wayne,1zugfOhn6BebboqGcpUlba,False,27,18,4,0.766,0.442,1,-8.558,1,0.356,0.000107,6.12e-05,0.111,0.39,201.8,181573,4
2011-12-24,31,Love You Like A Love Song,Selena Gomez & The Scene,1zugfOhn6BebboqGcpUlba,False,34,31,25,0.779,0.614,1,-6.294,0,0.0406,0.0499,0,0.139,0.932,117.025,187611,4
2011-12-24,32,In The Dark,Dev,1zugfOhn6BebboqGcpUlba,False,24,11,19,0.736,0.823,8,-4.231,1,0.0675,0.00358,0.000914,0.33,0.442,124.954,226227,4
2011-12-24,33,Super Bass,Nicki Minaj,1zugfOhn6BebboqGcpUlba,False,21,3,33,0.723,0.86,11,-4.357,1,0.203,0.271,4.56e-06,0.598,0.667,126.979,200013,4
2011-12-24,34,Mistletoe,Justin Bieber,1zugfOhn6BebboqGcpUlba,False,44,11,7,0.657,0.56,6,-9.049,0,0.0467,0.498,0,0.0794,0.854,161.993,182947,4
2011-12-24,35,Keep Me In Mind,Zac Brown Band,1zugfOhn6BebboqGcpUlba,False,41,35,11,0.684,0.715,6,-6.132,1,0.0336,0.159,0,0.181,0.564,96.018,214107,4
2011-12-24,36,She Will,Lil Wayne Featuring Drake,1zugfOhn6BebboqGcpUlba,False,30,3,17,0.364,0.841,8,-4.831,1,0.119,0.000402,0,0.242,0.0837,100.14,305840,5
2011-12-24,37,Fly,Nicki Minaj Featuring Rihanna,1zugfOhn6BebboqGcpUlba,False,25,19,16,0.665,0.848,10,-4.926,1,0.0386,0.0148,0.000118,0.1,0.196,119.897,212920,4
2011-12-24,38,Domino,Jessie J,1zugfOhn6BebboqGcpUlba,False,48,38,9,0.757,0.547,7,-4.573,1,0.0355,0.0115,0,0.0445,0.793,126.977,231693,4
2011-12-24,39,Tattoos On This Town,Jason Aldean,1zugfOhn6BebboqGcpUlba,False,38,38,12,0.359,0.784,7,-4.404,1,0.0438,0.0181,2.72e-05,0.0989,0.444,78.494,202467,4
2011-12-24,40,Rolling In The Deep,Adele,1zugfOhn6BebboqGcpUlba,False,36,1,49,0.73,0.769,8,-5.114,1,0.0298,0.138,0,0.0473,0.507,104.948,228093,4
2011-12-24,41,God Gave Me You,Blake Shelton,1zugfOhn6BebboqGcpUlba,False,42,22,22,0.483,0.844,2,-5.043,1,0.0314,0.00481,7.29e-05,0.405,0.543,151.977,229533,4
2011-12-24,42,Paradise,Coldplay,1zugfOhn6BebboqGcpUlba,False,33,15,13,0.449,0.585,5,-6.761,1,0.0268,0.0509,8.75e-05,0.0833,0.212,139.631,278719,4
2011-12-24,43,Easy,Rascal Flatts Featuring Natasha Bedingfield,1zugfOhn6BebboqGcpUlba,False,45,43,20,0.343,0.594,2,-4.876,1,0.0344,0.128,0,0.128,0.425,120.998,218480,3
2011-12-24,44,Lotus Flower Bomb,Wale Featuring Miguel,1zugfOhn6BebboqGcpUlba,False,46,44,7,0.512,0.598,9,-4.959,0,0.115,0.611,0,0.0881,0.345,70.189,213253,4
2011-12-24,45,We Owned The Night,Lady Antebellum,1zugfOhn6BebboqGcpUlba,False,31,31,17,0.657,0.714,1,-6.965,1,0.0273,0.281,0.000145,0.0838,0.488,99.991,197800,4
2011-12-24,46,International Love,Pitbull Featuring Chris Brown,1zugfOhn6BebboqGcpUlba,False,56,46,6,0.67,0.855,0,-3.035,0,0.0499,0.0124,0,0.335,0.648,120.05,227280,4
2011-12-24,47,All Your Life,The Band Perry,1zugfOhn6BebboqGcpUlba,False,51,37,14,0.536,0.521,9,-5.373,1,0.0261,0.227,0,0.165,0.455,131.937,231933,4
2011-12-24,48,Bang Bang Pow Pow,T-Pain Featuring Lil Wayne,5974upRH7uHuhRkstgEhHu,True,0,48,1,0.436,0.61,9,-5.685,1,0.134,0.00171,0,0.217,0.0972,141.951,219773,4
2011-12-24,49,I Like It Like That,Hot Chelle Rae Featuring New Boyz,5974upRH7uHuhRkstgEhHu,False,43,43,10,0.742,0.784,1,-5.458,1,0.0552,0.0308,0,0.354,0.65,101.002,188200,4
2011-12-24,50,Drink In My Hand,Eric Church,5974upRH7uHuhRkstgEhHu,False,47,40,12,0.626,0.913,0,-4.452,1,0.0318,0.00635,0,0.293,0.946,113.044,191307,4
2011-12-24,51,Survivor / I Will Survive,Glee Cast,6m2qba8pt0oa13nBLA2Nt2,True,0,51,1,0.563,0.913,9,-4.384,0,0.225,0.00773,0,0.127,0.311,128.083,208573,4
2011-12-24,52,It Girl,Jason Derulo,6m2qba8pt0oa13nBLA2Nt2,False,40,17,18,0.668,0.718,1,-4.736,0,0.0605,0.0165,0,0.104,0.345,91.993,192200,4
2011-12-24,53,We Are Young,fun. Featuring Janelle Monae,7a86XRg84qjasly9f6bPSD,True,0,53,1,0.378,0.638,10,-5.576,1,0.075,0.02,7.66e-05,0.0849,0.735,184.086,250627,4
2011-12-24,54,Let It Rain,David Nail Featuring Sarah Buxton,7a86XRg84qjasly9f6bPSD,False,54,54,13,0.56,0.619,4,-3.013,1,0.0405,0.385,1.03e-06,0.247,0.561,77.881,222253,4
2011-12-24,55,Party,Beyonce Featuring Andre 3000,7a86XRg84qjasly9f6bPSD,False,50,50,10,0.648,0.593,10,-6.267,1,0.0506,0.0188,0,0.169,0.712,160.979,245480,4
2011-12-24,56,You,Chris Young,7a86XRg84qjasly9f6bPSD,False,58,56,8,0.708,0.708,6,-5.12,0,0.0266,0.316,0,0.361,0.667,95.031,164520,4
2011-12-24,57,Rack City,Tyga,7a86XRg84qjasly9f6bPSD,False,73,57,3,0.929,0.339,1,-10.881,1,0.371,0.0373,1.96e-05,0.187,0.273,98.986,203200,4
2011-12-24,58,Blackout,Breathe Carolina,7a86XRg84qjasly9f6bPSD,False,61,58,6,0.662,0.819,6,-4.609,1,0.124,0.00537,0,0.0498,0.801,122.951,210200,4
2011-12-24,59,You And I,Lady Gaga,7a86XRg84qjasly9f6bPSD,False,39,6,19,0.516,0.709,2,-5.234,1,0.0478,0.0745,0,0.0935,0.515,127.073,307347,4
2011-12-24,60,Strange Clouds,B.o.B Featuring Lil Wayne,7a86XRg84qjasly9f6bPSD,False,62,7,11,0.531,0.665,8,-6.672,0,0.286,0.0607,0,0.131,0.8,73.726,226293,4
2011-12-24,61,Take Care,Drake Featuring Rihanna,7a86XRg84qjasly9f6bPSD,False,49,9,4,0.629,0.515,0,-10.358,0,0.265,0.0267,1.22e-05,0.0888,0.299,121.845,277387,4
2011-12-24,62,A Thousand Years,Christina Perri,7a86XRg84qjasly9f6bPSD,False,55,43,8,0.421,0.407,10,-7.445,1,0.0267,0.309,0.000961,0.11,0.161,139.028,285120,3
2011-12-24,63,Brighter Than The Sun,Colbie Caillat,7a86XRg84qjasly9f6bPSD,False,60,60,17,0.629,0.793,9,-5.942,1,0.0346,0.00952,1.15e-06,0.218,0.588,95.981,231213,4
2011-12-24,64,Lonely Boy,The Black Keys,7a86XRg84qjasly9f6bPSD,False,69,64,5,0.356,0.872,2,-7.837,1,0.068,0.00417,0.00975,0.0997,0.607,166.3,193653,4
2011-12-24,65,Ours,Taylor Swift,7a86XRg84qjasly9f6bPSD,False,83,13,5,0.608,0.569,0,-7.227,1,0.0284,0.537,0,0.097,0.238,159.845,237920,4
2011-12-24,66,Baggage Claim,Miranda Lambert,7a86XRg84qjasly9f6bPSD,False,53,44,18,0.701,0.934,8,-2.777,1,0.0403,0.0657,1.53e-06,0.0671,0.964,81.0,197547,4
2011-12-24,67,Heartbeat,The Fray,7a86XRg84qjasly9f6bPSD,False,63,43,8,0.458,0.821,9,-5.076,1,0.0334,0.000594,9.46e-05,0.161,0.323,144.46,220693,4
2011-12-24,68,Tonight Is The Night,Outasight,7a86XRg84qjasly9f6bPSD,False,70,68,3,0.625,0.786,7,-3.814,1,0.0465,0.0343,1.05e-06,0.202,0.537,119.982,190000,4
2011-12-24,69,Tongue Tied,Grouplove,7a86XRg84qjasly9f6bPSD,False,78,69,2,0.56,0.936,3,-5.835,1,0.0439,0.00847,0,0.161,0.371,112.96,218013,4
2011-12-24,70,When We Stand Together,Nickelback,7a86XRg84qjasly9f6bPSD,False,52,44,11,0.446,0.9,10,-3.541,0,0.0489,0.000102,1.89e-05,0.0404,0.88,187.961,190787,4
2011-12-24,71,Can't Get Enough,J. Cole Featuring Trey Songz,7a86XRg84qjasly9f6bPSD,False,82,71,2,0.768,0.62,2,-7.399,1,0.0658,0.139,0,0.521,0.589,132.035,225960,4
2011-12-24,72,You The Boss,Rick Ross Featuring Nicki Minaj,7a86XRg84qjasly9f6bPSD,False,72,72,8,0.715,0.68,11,-6.57,1,0.14,0.00704,0,0.139,0.473,140.991,280667,4
2011-12-24,73,That Way,Wale Featuring Jeremih & Rick Ross,7a86XRg84qjasly9f6bPSD,False,67,49,15,0.683,0.691,6,-6.435,0,0.23,0.0379,0,0.0578,0.295,73.469,269267,4
2011-12-24,74,I'm Gonna Love You Through It,Martina McBride,7a86XRg84qjasly9f6bPSD,False,75,61,10,0.431,0.657,5,-5.12,1,0.0304,0.317,0,0.0893,0.259,142.527,227613,4
2011-12-24,75,The Trouble With Girls,Scotty McCreery,7a86XRg84qjasly9f6bPSD,False,95,75,5,0.554,0.496,10,-7.266,1,0.0281,0.391,0,0.109,0.351,132.078,229573,4
2011-12-24,76,Man In The Mirror,Glee Cast,4PcrxYt1pnxf3KApGx9BGA,True,0,76,1,0.755,0.717,8,-5.702,1,0.038,0.305,0,0.148,0.41,100.327,246853,4
2011-12-24,77,Home,Dierks Bentley,4PcrxYt1pnxf3KApGx9BGA,False,79,70,5,0.61,0.69,11,-7.157,1,0.0378,0.463,0.0409,0.0842,0.462,118.038,238413,4
2011-12-24,78,I Got You,Thompson Square,4PcrxYt1pnxf3KApGx9BGA,False,68,68,17,0.533,0.799,2,-2.594,1,0.0531,0.0123,0.000879,0.106,0.521,127.04,183867,4
2011-12-24,79,Reality,Kenny Chesney,4PcrxYt1pnxf3KApGx9BGA,False,80,79,6,0.315,0.925,0,-4.507,1,0.117,0.00296,0.0642,0.114,0.415,185.305,210640,4
2011-12-24,80,Levels,Avicii,4PcrxYt1pnxf3KApGx9BGA,False,71,66,4,0.584,0.889,1,-5.941,0,0.0343,0.0462,0.828,0.309,0.464,126.04,199907,4
2011-12-24,81,Shake It Out,Florence + The Machine,4PcrxYt1pnxf3KApGx9BGA,False,88,79,7,0.527,0.804,10,-4.168,1,0.0358,0.0104,0,0.105,0.221,107.486,277720,4
2011-12-24,82,Nothing,The Script,4PcrxYt1pnxf3KApGx9BGA,False,74,32,18,0.473,0.833,2,-5.013,1,0.039,0.00369,0,0.118,0.503,157.012,272213,4
2011-12-24,83,Roman In Moscow,Nicki Minaj,4PcrxYt1pnxf3KApGx9BGA,False,64,64,2,0.632,0.923,1,-3.184,0,0.0879,0.0601,0,0.302,0.134,120.016,157547,5
2011-12-24,84,Wish You Were Here,Avril Lavigne,4PcrxYt1pnxf3KApGx9BGA,False,0,84,2,0.454,0.865,4,-3.841,1,0.0561,0.0323,0,0.186,0.34,166.018,225760,4
2011-12-24,85,Sparks Fly,Taylor Swift,4PcrxYt1pnxf3KApGx9BGA,False,65,17,20,0.605,0.787,5,-3.002,1,0.0308,0.0396,1.42e-06,0.163,0.374,114.987,260933,4
2011-12-24,86,Storm Warning,Hunter Hayes,4PcrxYt1pnxf3KApGx9BGA,False,92,86,4,0.483,0.843,2,-5.62,1,0.0835,0.0331,0,0.134,0.772,185.998,239907,4
2011-12-24,87,Bait A Hook,Justin Moore,4PcrxYt1pnxf3KApGx9BGA,False,0,87,2,0.668,0.781,1,-6.151,1,0.0267,0.0191,0,0.113,0.695,105.945,208493,4
2011-12-24,88,ABC,Glee Cast,73o83gUyd4hdmGdYNYcTJp,True,0,88,1,0.753,0.948,1,-2.901,0,0.0781,0.16,0,0.353,0.771,99.009,174000,4
2011-12-24,89,Promise,Romeo Santos Featuring Usher,73o83gUyd4hdmGdYNYcTJp,False,97,83,8,0.764,0.739,1,-6.422,1,0.0574,0.403,0,0.0821,0.77,132.995,252253,4
2011-12-24,90,Alone With You,Jake Owen,2Xdatbm43IXEVi0wmKeJve,True,0,90,1,0.646,0.761,7,-3.991,1,0.0267,0.221,0,0.109,0.336,108.999,210973,4
2011-12-24,91,You Gonna Fly,Keith Urban,5B25Jpgu62IX8w1YtLibuA,True,0,91,1,0.457,0.846,4,-8.547,1,0.0477,0.0598,0,0.34,0.851,177.353,216867,4
2011-12-24,92,Red Solo Cup,Glee Cast,2jY8KalpIwv0qDh6SSRfVo,True,0,92,1,0.507,0.601,1,-5.702,0,0.117,0.583,0,0.22,0.631,165.434,221253,4
2011-12-24,93,I'll Be Home For Christmas,Kelly Clarkson,6OYMdu2HEKjwfh8jwijxbL,True,0,93,1,0.392,0.172,5,-11.229,1,0.0319,0.943,0.000232,0.0882,0.224,83.389,173093,3
2011-12-24,94,Crawling Back To You,Daughtry,6OYMdu2HEKjwfh8jwijxbL,False,81,41,9,0.426,0.908,0,-3.437,0,0.0504,0.00686,0,0.167,0.16,150.979,225440,4
2011-12-24,95,Camouflage,Brad Paisley,6OYMdu2HEKjwfh8jwijxbL,False,100,95,2,0.56,0.965,4,-3.67,1,0.0472,0.0325,0.000984,0.43,0.771,113.633,266147,4
2011-12-24,96,Body 2 Body,Ace Hood Featuring Chris Brown,6OYMdu2HEKjwfh8jwijxbL,False,84,65,13,0.603,0.82,1,-4.587,0,0.0566,0.00252,0,0.178,0.561,152.057,235307,4
2011-12-24,97,Round Of Applause,Waka Flocka Flame Featuring Drake,5ORf8BZMbq4xN9kiumrPcQ,True,0,97,1,0.712,0.758,9,-4.835,1,0.26,0.343,0,0.141,0.903,140.02,266000,4
2011-12-24,98,Love On Top,Beyonce,5ORf8BZMbq4xN9kiumrPcQ,False,0,20,4,0.652,0.748,0,-5.242,1,0.0887,0.0849,0,0.604,0.652,94.1,267413,4
2011-12-24,99,Amen,Edens Edge,0cunAi5FhuVTMMIE9XfqfP,True,0,99,1,0.509,0.688,5,-3.892,1,0.0313,0.345,0,0.151,0.434,179.047,228560,4
2011-12-24,100,Sail,AWOLNATION,0cunAi5FhuVTMMIE9XfqfP,False,94,82,17,0.825,0.435,1,-9.582,1,0.0568,0.452,0.609,0.0953,0.243,119.038,259102,4
