date,position,title,artist,spotify_id,is_new,last_pos,peak_pos,weeks,danceability,energy,key,loudness,mode,speechiness,acousticness,instrumentalness,liveness,valence,tempo,duration_ms,time_signature
2008-11-29,1,Live Your Life,T.I. Featuring Rihanna,0sp00HSXkQyqTa6QqM0O8V,False,1,1,8,0.375,0.862,11,-3.363,0,0.255,0.071,0,0.211,0.478,159.841,338853,4
2008-11-29,2,Whatever You Like,T.I.,0sp00HSXkQyqTa6QqM0O8V,False,2,1,15,0.68,0.687,9,-6.162,0,0.0709,0.0161,0,0.261,0.467,150.053,249533,4
2008-11-29,3,If I Were A Boy,Beyonce,0sp00HSXkQyqTa6QqM0O8V,False,5,3,6,0.632,0.518,6,-6.126,1,0.0313,0.107,0,0.354,0.427,90.007,249147,4
2008-11-29,4,Hot N Cold,Katy Perry,0sp00HSXkQyqTa6QqM0O8V,False,3,3,16,0.706,0.841,7,-3.956,1,0.0418,7.95e-05,0,0.0688,0.861,132.032,220227,4
2008-11-29,5,So What,P!nk,0sp00HSXkQyqTa6QqM0O8V,False,6,1,13,0.534,0.87,11,-3.078,0,0.0425,0.000329,0,0.241,0.462,126.019,215160,4
2008-11-29,6,Let It Rock,Kevin Rudolf Featuring Lil Wayne,0sp00HSXkQyqTa6QqM0O8V,False,8,5,12,0.607,0.783,7,-4.41,1,0.0397,0.000683,0,0.0678,0.434,113.172,231173,4
2008-11-29,7,Womanizer,Britney Spears,0sp00HSXkQyqTa6QqM0O8V,False,7,1,7,0.724,0.695,11,-5.226,1,0.0622,0.073,0,0.0889,0.235,139.0,224400,4
2008-11-29,8,Right Now (Na Na Na),Akon,0sp00HSXkQyqTa6QqM0O8V,False,10,8,8,0.826,0.853,8,-4.219,0,0.172,0.289,0,0.35,0.567,137.996,244680,4
2008-11-29,9,Love Lockdown,Kanye West,0sp00HSXkQyqTa6QqM0O8V,False,13,3,9,0.76,0.524,1,-7.67,0,0.0323,0.0542,0.5,0.112,0.112,119.603,270307,4
2008-11-29,10,I'm Yours,Jason Mraz,0sp00HSXkQyqTa6QqM0O8V,False,9,6,31,0.686,0.457,11,-8.322,1,0.0468,0.595,0,0.105,0.718,150.953,242187,4
2008-11-29,11,Miss Independent,Ne-Yo,0sp00HSXkQyqTa6QqM0O8V,False,11,8,13,0.673,0.683,1,-5.693,1,0.115,0.522,0,0.235,0.713,171.86,232000,4
2008-11-29,12,Heartless,Kanye West,0sp00HSXkQyqTa6QqM0O8V,False,4,4,2,0.79,0.647,10,-5.983,0,0.136,0.0515,0,0.248,0.654,87.999,211000,4
2008-11-29,13,White Horse,Taylor Swift,6wn61Fzx9XMxQmieLpoIhW,True,0,13,1,0.578,0.34,0,-8.027,1,0.0264,0.305,0,0.104,0.223,92.702,234427,4
2008-11-29,14,Can't Believe It,T-Pain Featuring Lil Wayne,6wn61Fzx9XMxQmieLpoIhW,False,16,7,16,0.648,0.516,10,-8.869,0,0.049,0.00179,0,0.0772,0.0756,89.828,273827,4
2008-11-29,15,Disturbia,Rihanna,6wn61Fzx9XMxQmieLpoIhW,False,15,1,22,0.707,0.813,11,-4.515,0,0.0571,0.0863,0,0.168,0.722,124.921,238627,4
2008-11-29,16,Just Dance,Lady Gaga Featuring Colby O'Donis,6wn61Fzx9XMxQmieLpoIhW,False,21,16,15,0.813,0.74,1,-4.668,0,0.0327,0.0318,1.43e-05,0.166,0.699,118.976,244055,4
2008-11-29,17,Better In Time,Leona Lewis,6wn61Fzx9XMxQmieLpoIhW,False,18,11,19,0.584,0.7,6,-4.251,1,0.0506,0.512,2.43e-05,0.13,0.549,163.953,234173,4
2008-11-29,18,Love Story,Taylor Swift,6wn61Fzx9XMxQmieLpoIhW,False,14,5,10,0.626,0.79,2,-4.302,1,0.0311,0.135,3.97e-06,0.0989,0.416,119.082,235767,4
2008-11-29,19,Mrs. Officer,Lil Wayne Featuring Bobby Valentino & Kidd Kidd,6wn61Fzx9XMxQmieLpoIhW,False,17,16,13,0.92,0.553,6,-5.068,1,0.191,0.236,0,0.0767,0.947,112.022,286907,5
2008-11-29,20,Gotta Be Somebody,Nickelback,6wn61Fzx9XMxQmieLpoIhW,False,19,10,7,0.536,0.89,0,-5.222,1,0.0601,0.000354,0.00165,0.133,0.205,115.998,252653,4
2008-11-29,21,Crush,David Archuleta,6wn61Fzx9XMxQmieLpoIhW,False,22,2,14,0.57,0.664,0,-4.718,0,0.0322,0.00836,1.2e-05,0.0719,0.487,162.084,213520,4
2008-11-29,22,Chicken Fried,Zac Brown Band,6wn61Fzx9XMxQmieLpoIhW,False,23,22,9,0.566,0.713,6,-4.25,1,0.0417,0.645,0,0.114,0.807,169.864,238147,4
2008-11-29,23,Addicted,Saving Abel,6wn61Fzx9XMxQmieLpoIhW,False,20,20,23,0.512,0.864,7,-4.146,1,0.0338,0.000821,0,0.0982,0.527,138.018,222827,4
2008-11-29,24,Keeps Gettin' Better,Christina Aguilera,6wn61Fzx9XMxQmieLpoIhW,False,29,7,7,0.645,0.697,5,-4.733,0,0.0285,0.0739,0.000842,0.575,0.25,130.001,181947,4
2008-11-29,25,Viva La Vida,Coldplay,6wn61Fzx9XMxQmieLpoIhW,False,24,1,28,0.486,0.617,5,-7.115,0,0.0287,0.0954,3.23e-06,0.109,0.417,138.015,242373,4
2008-11-29,26,Closer,Ne-Yo,6wn61Fzx9XMxQmieLpoIhW,False,25,7,31,0.711,0.753,4,-6.461,0,0.0766,0.028,2.96e-05,0.152,0.588,126.051,234360,4
2008-11-29,27,Spotlight,Jennifer Hudson,6wn61Fzx9XMxQmieLpoIhW,False,26,24,17,0.707,0.724,11,-3.887,0,0.051,0.0448,0,0.072,0.659,108.984,250107,4
2008-11-29,28,Single Ladies (Put A Ring On It),Beyonce,6wn61Fzx9XMxQmieLpoIhW,False,39,28,5,0.426,0.584,1,-5.293,1,0.296,0.0383,0,0.188,0.272,193.437,193213,4
2008-11-29,29,Just A Dream,Carrie Underwood,6wn61Fzx9XMxQmieLpoIhW,False,43,29,15,0.526,0.781,7,-3.673,1,0.0369,0.0613,0,0.121,0.358,142.06,284707,4
2008-11-29,30,Swagga Like Us,Jay-Z & T.I. Featuring Kanye West & Lil Wayne,6wn61Fzx9XMxQmieLpoIhW,False,28,5,10,0.579,0.809,4,-5.031,1,0.206,0.00154,0,0.564,0.258,88.99,329680,4
2008-11-29,31,Green Light,John Legend Featuring Andre 3000,6wn61Fzx9XMxQmieLpoIhW,False,32,31,11,0.622,0.882,9,-5.59,0,0.119,0.0912,0,0.216,0.762,77.506,284187,4
2008-11-29,32,Fall For You,Secondhand Serenade,6wn61Fzx9XMxQmieLpoIhW,False,30,21,23,0.387,0.442,0,-7.086,1,0.0352,0.19,0,0.0788,0.382,169.481,185600,4
2008-11-29,33,Paper Planes,M.I.A.,6wn61Fzx9XMxQmieLpoIhW,False,27,4,18,0.447,0.848,2,-6.175,1,0.222,0.033,7.46e-05,0.65,0.485,172.253,205200,4
2008-11-29,34,Chinese Democracy,Guns N' Roses,0zoK1L5JxJbyk7T2nw367B,True,0,34,1,0.474,0.8,2,-10.472,1,0.0775,0.000769,0.0309,0.131,0.156,133.94,283213,4
2008-11-29,35,If Today Was Your Last Day,Nickelback,4QJLKU75Rg4558f4LbDBRi,True,0,35,1,0.485,0.911,3,-5.749,1,0.0355,8.67e-05,0,0.092,0.568,89.956,249067,4
2008-11-29,36,Got Money,Lil Wayne Featuring T-Pain,4QJLKU75Rg4558f4LbDBRi,False,31,10,25,0.694,0.661,7,-4.847,1,0.118,0.00188,0,0.676,0.702,82.48,244627,4
2008-11-29,37,Forever,Chris Brown,4QJLKU75Rg4558f4LbDBRi,False,36,2,30,0.672,0.82,11,-4.456,1,0.0459,0.0368,0.000188,0.184,0.438,120.005,278573,4
2008-11-29,38,Bust Your Windows,Jazmine Sullivan,4QJLKU75Rg4558f4LbDBRi,False,45,38,6,0.683,0.664,5,-4.233,0,0.0332,0.538,0,0.0671,0.866,106.991,266307,4
2008-11-29,39,Chopped 'N' Skrewed,T-Pain Featuring Ludacris,4QJLKU75Rg4558f4LbDBRi,False,62,39,5,0.558,0.604,7,-7.892,0,0.0529,0.0181,0,0.503,0.323,120.159,261227,4
2008-11-29,40,My Life,The Game Featuring Lil Wayne,4QJLKU75Rg4558f4LbDBRi,False,33,21,15,0.673,0.766,11,-5.018,1,0.349,0.0724,0,0.0563,0.382,148.113,320893,4
2008-11-29,41,Love Remains The Same,Gavin Rossdale,4QJLKU75Rg4558f4LbDBRi,False,42,27,24,0.406,0.632,4,-5.115,1,0.0344,0.236,0,0.18,0.109,149.258,249440,4
2008-11-29,42,Shattered (Turn The Car Around),O.A.R.,4QJLKU75Rg4558f4LbDBRi,False,40,40,15,0.571,0.784,11,-6.396,1,0.0352,0.0175,0,0.19,0.462,105.973,255493,4
2008-11-29,43,Sweet Thing,Keith Urban,21zOTXChnP7ghgn3fVKuSF,True,0,43,1,0.621,0.888,8,-6.199,1,0.0443,0.19,1.7e-05,0.151,0.651,102.986,228187,4
2008-11-29,44,T-Shirt,Shontelle,21zOTXChnP7ghgn3fVKuSF,False,37,36,11,0.679,0.657,6,-6.222,1,0.0423,0.0219,0,0.295,0.363,86.984,234760,4
2008-11-29,45,Roll With Me,Montgomery Gentry,21zOTXChnP7ghgn3fVKuSF,False,44,44,10,0.552,0.648,2,-6.71,1,0.0273,0.0533,0.00015,0.144,0.407,142.159,233933,4
2008-11-29,46,One Step At A Time,Jordin Sparks,21zOTXChnP7ghgn3fVKuSF,False,41,17,21,0.766,0.692,1,-4.672,1,0.0289,0.0825,0,0.0384,0.691,102.028,205160,4
2008-11-29,47,Krazy,Pitbull Featuring Lil Jon,21zOTXChnP7ghgn3fVKuSF,False,38,30,8,0.871,0.883,11,-5.075,0,0.105,0.0155,0,0.14,0.581,125.037,231507,4
2008-11-29,48,Don't Think I Don't Think About It,Darius Rucker,21zOTXChnP7ghgn3fVKuSF,False,53,35,19,0.577,0.752,9,-5.264,1,0.0332,0.0275,0,0.125,0.404,149.686,183307,4
2008-11-29,49,Forever & Always,Taylor Swift,47HtKpfzpAt8rQjjXWotFj,True,0,49,1,0.608,0.821,10,-4.985,1,0.0576,0.0752,0,0.11,0.544,128.042,225320,4
2008-11-29,50,Pop Champagne,Jim Jones & Ron Browz Featuring Juelz Santana,47HtKpfzpAt8rQjjXWotFj,False,59,50,5,0.61,0.431,0,-6.73,1,0.294,0.03,0,0.099,0.463,136.878,215973,3
2008-11-29,51,Already Gone,Sugarland,47HtKpfzpAt8rQjjXWotFj,False,51,51,8,0.48,0.596,1,-5.844,1,0.03,0.214,1.06e-05,0.151,0.332,154.769,275867,3
2008-11-29,52,Swing,Savage Featuring Soulja Boy Tell'em,47HtKpfzpAt8rQjjXWotFj,False,49,45,16,0.885,0.474,1,-8.133,0,0.25,0.0209,0,0.0895,0.794,150.072,217893,4
2008-11-29,53,Decode,Paramore,47HtKpfzpAt8rQjjXWotFj,False,34,34,2,0.277,0.949,10,-4.072,0,0.0919,0.00155,0.000112,0.765,0.232,164.102,264205,4
2008-11-29,55,Start A Band,Brad Paisley Duet With Keith Urban,,False,58,55,5,0.719,0.629,5,-11.132,1,0.0297,0.00919,0,0.13,0.766,123.006,214709,4
2008-11-29,56,Sex On Fire,Kings Of Leon,,False,82,56,4,0.542,0.905,9,-5.653,1,0.054,0.00172,0.0104,0.136,0.374,153.398,203347,4
2008-11-29,57,Right Here (Departed),Brandy,,False,52,52,10,0.568,0.682,8,-5.781,1,0.0439,0.256,0,0.231,0.366,92.99,217947,4
2008-11-29,58,Let It Go,Tim McGraw,,False,57,56,10,0.477,0.86,1,-4.16,1,0.032,0.322,0,0.313,0.473,159.27,225027,4
2008-11-29,59,Everybody Wants To Go To Heaven,Kenny Chesney With The Wailers,,False,65,41,14,0.705,0.693,11,-7.153,1,0.155,0.374,1.21e-05,0.65,0.555,137.741,252987,4
2008-11-29,60,Need U Bad,Jazmine Sullivan,,False,61,37,18,0.529,0.659,7,-5.318,1,0.0629,0.0232,0,0.114,0.36,138.196,257427,4
2008-11-29,61,Rehab,Rihanna,,False,91,61,2,0.583,0.792,1,-5.894,1,0.0533,0.00321,4.92e-05,0.315,0.397,80.055,294720,4
2008-11-29,62,Here,Rascal Flatts,,False,69,62,7,0.458,0.585,2,-5.574,1,0.0342,0.324,0,0.231,0.196,145.977,245373,4
2008-11-29,63,Come On Get Higher,Matt Nathanson,,False,73,63,12,0.672,0.623,9,-5.699,1,0.0297,0.241,0,0.0848,0.617,92.018,215173,4
2008-11-29,64,So Fly,Slim Featuring Yung Joc,,False,55,49,12,0.784,0.559,2,-4.862,1,0.0846,0.0021,0,0.412,0.698,90.994,212453,4
2008-11-29,65,All Summer Long,Kid Rock,,False,64,23,20,0.7,0.864,7,-3.629,1,0.0283,0.0212,0,0.0956,0.887,102.997,297587,4
2008-11-29,66,Waitin' On A Woman,Brad Paisley,,False,72,44,19,0.548,0.617,0,-7.093,1,0.0283,0.0846,5.09e-05,0.113,0.339,76.371,272587,4
2008-11-29,67,All Summer Long,The Rock Heroes,,False,83,29,9,0.606,0.885,7,-4.377,1,0.0336,0.00825,0,0.0634,0.855,102.992,296347,4
2008-11-29,68,Lookin' For A Good Time,Lady Antebellum,,False,81,68,6,0.665,0.936,7,-2.97,1,0.0544,0.0146,0,0.125,0.848,122.003,187320,4
2008-11-29,69,Gives You Hell,The All-American Rejects,6ihL9TjfRjadfEePzXXyVF,True,0,69,1,0.718,0.691,4,-6.44,1,0.0387,0.0159,0,0.0627,0.552,100.008,213107,4
2008-11-29,70,Human,The Killers,6ihL9TjfRjadfEePzXXyVF,False,70,32,7,0.557,0.8,10,-8.477,1,0.0601,0.00132,0.0012,0.0906,0.582,135.47,245373,4
2008-11-29,71,Get Up,50 Cent,6ihL9TjfRjadfEePzXXyVF,False,68,44,5,0.707,0.885,11,-2.635,0,0.174,0.0303,0,0.311,0.405,92.435,195680,4
2008-11-29,72,The Way I Loved You,Taylor Swift,5P4wWhUYWM0IaVYLuZxdar,True,0,72,1,0.433,0.7,5,-3.709,1,0.0336,0.0408,0,0.115,0.398,160.927,244227,4
2008-11-29,73,I Don't Care,Fall Out Boy,5P4wWhUYWM0IaVYLuZxdar,False,56,21,10,0.55,0.938,11,-3.556,0,0.0522,0.00171,2.18e-05,0.555,0.433,133.99,214493,4
2008-11-29,74,In Color,Jamey Johnson,5P4wWhUYWM0IaVYLuZxdar,False,76,74,7,0.544,0.404,3,-8.751,1,0.0354,0.391,3.98e-06,0.157,0.251,129.518,290680,4
2008-11-29,75,Lovebug,Jonas Brothers,5P4wWhUYWM0IaVYLuZxdar,False,60,57,10,0.597,0.499,4,-6.216,1,0.0581,0.126,0,0.214,0.521,79.071,220693,4
2008-11-29,76,What About Now,Daughtry,5P4wWhUYWM0IaVYLuZxdar,False,71,18,15,0.387,0.862,9,-2.219,0,0.0457,0.107,0,0.103,0.337,161.984,251627,4
2008-11-29,77,She Never Cried In Front Of Me,Toby Keith,5P4wWhUYWM0IaVYLuZxdar,False,63,42,19,0.458,0.621,7,-4.553,1,0.0306,0.374,0,0.0999,0.34,145.904,239507,4
2008-11-29,78,"You're Gonna Go Far, Kid",The Offspring,5P4wWhUYWM0IaVYLuZxdar,False,74,71,6,0.55,0.917,0,-3.159,1,0.0638,0.00428,0,0.197,0.601,126.115,177827,4
2008-11-29,79,Fifteen,Taylor Swift,4t0OI7XrODjSkAu3bTPmWj,True,0,79,1,0.556,0.651,7,-4.396,1,0.0266,0.067,0,0.145,0.203,95.485,294333,4
2008-11-29,80,Trading Places,Usher,4t0OI7XrODjSkAu3bTPmWj,False,90,80,3,0.696,0.643,0,-5.218,1,0.0447,0.000153,1.03e-05,0.156,0.332,146.005,268240,4
2008-11-29,81,Another Way to Die,Jack White & Alicia Keys,3ODl8J0TZAykdMCtCIO28n,True,0,81,1,0.42,0.766,4,-4.231,0,0.179,0.0239,3.08e-05,0.11,0.41,68.393,262240,4
2008-11-29,82,Light On,David Cook,3ODl8J0TZAykdMCtCIO28n,False,89,17,6,0.446,0.834,9,-4.014,0,0.0341,0.0794,0,0.114,0.363,132.034,228827,4
2008-11-29,83,I'll Walk,Bucky Covington,3ODl8J0TZAykdMCtCIO28n,False,77,70,7,0.509,0.389,7,-7.433,1,0.0272,0.8,0,0.113,0.302,77.098,210213,4
2008-11-29,84,Love Remembers,Craig Morgan,3ODl8J0TZAykdMCtCIO28n,False,79,73,5,0.39,0.715,0,-3.448,1,0.0342,0.311,0,0.212,0.379,153.655,235773,4
2008-11-29,85,Cowgirls Don't Cry,Brooks & Dunn Featuring Reba McEntire,76fUOrKOcUnAceODDPBidy,True,0,85,1,0.655,0.668,9,-5.251,1,0.0302,0.0626,2.78e-06,0.179,0.619,114.881,219813,4
2008-11-29,86,Feel That Fire,Dierks Bentley,76fUOrKOcUnAceODDPBidy,False,80,80,6,0.412,0.833,1,-3.865,1,0.0352,0.371,1.28e-05,0.208,0.669,179.846,201507,4
2008-11-29,87,Breathe,Taylor Swift Featuring Colbie Caillat,6S9G7J3EB1ZY0rrZPwsBg5,True,0,87,1,0.498,0.486,1,-7.384,1,0.0273,0.373,0,0.113,0.17,147.952,263987,4
2008-11-29,88,Don't,Billy Currington,6S9G7J3EB1ZY0rrZPwsBg5,False,86,86,4,0.571,0.826,1,-4.475,1,0.0362,0.0446,0,0.343,0.713,90.966,189000,4
2008-11-29,89,Country Boy,Alan Jackson,6S9G7J3EB1ZY0rrZPwsBg5,False,85,84,3,0.73,0.684,9,-10.803,1,0.0351,0.259,1.53e-06,0.111,0.564,139.037,246080,4
2008-11-29,90,She's Country,Jason Aldean,0PspNrE4MSjr1JeB4OW0jn,True,0,90,1,0.553,0.872,1,-2.832,0,0.0782,0.198,0,0.0659,0.638,172.138,220573,4
2008-11-29,91,She Wouldn't Be Gone,Blake Shelton,0PspNrE4MSjr1JeB4OW0jn,False,87,87,4,0.51,0.683,0,-4.338,1,0.0302,0.166,0,0.0795,0.211,159.918,215613,4
2008-11-29,93,I'm So Paid,Akon Featuring Lil Wayne & Young Jeezy,,False,100,40,5,0.471,0.865,6,-4.179,1,0.325,0.118,0,0.0994,0.516,92.037,263640,4
2008-11-29,94,Hey Stephen,Taylor Swift,4WXzzCof26KJLTK5kK53dS,True,0,94,1,0.841,0.544,6,-7.347,1,0.0309,0.194,2.48e-06,0.108,0.831,115.994,254307,4
2008-11-29,95,Lost!,Coldplay With Jay-Z,4WXzzCof26KJLTK5kK53dS,False,0,94,2,0.257,0.805,7,-7.025,1,0.0559,0.0081,0.494,0.357,0.39,175.251,256909,4
2008-11-29,96,Do You Believe Me Now,Jimmy Wayne,4WXzzCof26KJLTK5kK53dS,False,84,36,18,0.503,0.827,4,-4.046,1,0.0553,0.0723,1.15e-06,0.126,0.376,161.834,204387,4
2008-11-29,97,Troublemaker,Akon Featuring Sweet Rush,1sBiJZixyXiVBkZCXYvTdf,True,0,97,1,0.856,0.78,7,-4.256,0,0.105,0.131,0,0.401,0.835,122.067,237173,4
2008-11-29,98,I Don't Care,Apocalyptica Featuring Adam Gontier,1sBiJZixyXiVBkZCXYvTdf,False,93,92,5,0.274,0.792,2,-4.388,0,0.0413,0.00833,0,0.131,0.092,179.067,237347,4
2008-11-29,99,Playa Cardz Right,Keyshia Cole Featuring 2Pac,0nJZDtAaqO7o9mb6YoBfqO,True,0,99,1,0.626,0.59,0,-5.547,0,0.0366,0.0392,0,0.254,0.192,86.078,291240,4
2008-11-29,100,Broken,Lifehouse,0nJZDtAaqO7o9mb6YoBfqO,False,95,92,4,0.534,0.708,11,-5.732,1,0.0402,0.089,0,0.192,0.488,130.639,286480,4
