date,position,title,artist,spotify_id,is_new,last_pos,peak_pos,weeks,danceability,energy,key,loudness,mode,speechiness,acousticness,instrumentalness,liveness,valence,tempo,duration_ms,time_signature
1991-09-14,1,The Promise Of A New Day,Paula Abdul,04jNbL6I5ZPLYKKlL08Z8Z,False,2,1,9,0.754,0.82,1,-8.622,1,0.062,0.0911,1.62e-06,0.0805,0.896,119.835,272893,4
1991-09-14,2,I Adore Mi Amor,Color Me Badd,04jNbL6I5ZPLYKKlL08Z8Z,False,6,2,8,0.683,0.476,3,-9.995,0,0.027,0.243,0,0.0787,0.725,91.99,289200,4
1991-09-14,3,(Everything I Do) I Do It For You,Bryan Adams,04jNbL6I5ZPLYKKlL08Z8Z,False,1,1,12,0.508,0.834,2,-6.205,1,0.0386,0.0183,0,0.0732,0.774,139.131,216053,4
1991-09-14,4,Motownphilly,Boyz II Men,04jNbL6I5ZPLYKKlL08Z8Z,False,3,3,14,0.754,0.857,2,-9.699,1,0.0605,0.0143,2.14e-05,0.278,0.785,114.144,235227,4
1991-09-14,6,Good Vibrations,Marky Mark & The Funky Bunch Featuring Loleatta Holloway,,False,11,6,9,0.711,0.951,1,-8.406,1,0.0537,0.00189,0.366,0.0229,0.903,121.656,269307,4
1991-09-14,7,"Time, Love And Tenderness",Michael Bolton,,False,9,7,10,0.51,0.808,6,-8.649,0,0.0475,0.0281,0,0.295,0.738,170.037,330307,4
1991-09-14,8,Crazy,Seal,,False,7,7,13,0.643,0.699,4,-11.102,0,0.039,0.436,0.109,0.166,0.89,102.877,269427,4
1991-09-14,9,Too Many Walls,Cathy Dennis,,False,12,9,11,0.729,0.578,10,-11.04,1,0.0267,0.377,2.44e-05,0.0886,0.649,97.146,264680,4
1991-09-14,10,3 A.M. Eternal,The KLF,,False,5,5,13,0.732,0.577,0,-11.716,1,0.0506,0.000826,0.925,0.363,0.332,120.013,200073,4
1991-09-14,11,The Motown Song,Rod Stewart,,False,16,11,11,0.654,0.837,9,-6.121,1,0.0455,0.155,0,0.113,0.778,116.0,238013,4
1991-09-14,12,Love Of A Lifetime,Firehouse,,False,18,12,12,0.472,0.48,1,-11.893,1,0.0308,0.000204,0.00275,0.0914,0.126,123.023,286573,4
1991-09-14,13,I Can't Wait Another Minute,Hi-Five,,False,10,8,13,0.625,0.644,8,-8.801,1,0.0287,0.357,0,0.102,0.638,147.435,301640,4
1991-09-14,14,Now That We Found Love,Heavy D & The Boyz,,False,17,14,12,0.744,0.697,8,-14.753,1,0.0631,0.039,0,0.171,0.683,119.955,258200,4
1991-09-14,15,Wind Of Change,Scorpions,,False,8,4,16,0.452,0.524,0,-10.108,1,0.0351,0.315,0,0.103,0.246,151.505,312360,4
1991-09-14,16,Shiny Happy People,R.E.M.,,False,22,16,8,0.452,0.909,9,-3.977,1,0.0366,0.0313,0.0603,0.23,0.805,124.623,225787,4
1991-09-14,17,Emotions,Mariah Carey,,False,26,17,3,0.74,0.752,9,-7.008,0,0.0359,0.0409,0.00125,0.0233,0.939,114.851,248093,4
1991-09-14,18,Every Heartbeat,Amy Grant,,False,13,2,14,0.648,0.89,2,-3.834,1,0.0429,0.288,0,0.119,0.808,126.956,213733,4
1991-09-14,19,Something To Talk About,Bonnie Raitt,,False,24,19,9,0.795,0.64,1,-13.478,1,0.0294,0.0631,2.13e-06,0.0692,0.954,102.633,227573,4
1991-09-14,20,Unforgettable,Natalie Cole,,False,14,14,10,0.307,0.289,5,-13.369,1,0.0281,0.851,0.000126,0.0798,0.145,85.948,210907,4
1991-09-14,21,It Hit Me Like A Hammer,Huey Lewis & The News,,False,23,21,9,0.607,0.742,8,-11.151,1,0.0316,0.0772,0,0.126,0.736,145.3,241893,3
1991-09-14,22,Do Anything,Natural Selection,,False,28,22,6,0.654,0.749,11,-9.221,0,0.0537,0.0746,0,0.114,0.663,93.847,237373,4
1991-09-14,23,Romantic,Karyn White,,False,27,23,5,0.68,0.941,1,-7.509,0,0.0374,0.484,7.43e-05,0.0656,0.823,110.264,247160,4
1991-09-14,24,Fading Like A Flower (Every Time You Leave),Roxette,,False,15,2,14,0.609,0.668,0,-5.738,1,0.026,0.195,0,0.219,0.319,105.419,230680,4
1991-09-14,25,Hole Hearted,Extreme,,False,29,25,7,0.4,0.747,6,-9.438,1,0.045,0.163,0,0.0774,0.674,203.396,219289,4
1991-09-14,26,Everybody Plays The Fool,Aaron Neville,,False,30,26,9,0.789,0.352,10,-14.022,1,0.143,0.224,0.00147,0.0536,0.431,87.894,266107,4
1991-09-14,27,Summertime,D.J. Jazzy Jeff & The Fresh Prince,,False,21,4,14,0.677,0.54,7,-14.439,1,0.0627,0.0455,1.84e-06,0.845,0.469,95.116,270973,4
1991-09-14,28,It Ain't Over 'til It's Over,Lenny Kravitz,,False,19,2,15,0.679,0.568,6,-10.74,1,0.0423,0.422,0.00928,0.322,0.93,159.69,242640,4
1991-09-14,29,Enter Sandman,Metallica,,False,35,29,4,0.579,0.824,6,-8.71,0,0.03,0.00206,0.00903,0.059,0.635,123.331,331573,4
1991-09-14,30,My Name Is Not Susan,Whitney Houston,,False,20,20,8,0.787,0.899,7,-7.896,1,0.0562,0.178,0,0.358,0.536,101.098,279840,4
1991-09-14,31,I'll Be There,The Escape Club,,False,32,8,17,0.57,0.385,1,-12.027,0,0.0251,0.383,0.0012,0.0924,0.188,99.86,347867,4
1991-09-14,32,Love. . .Thy Will Be Done,Martika,,False,34,32,6,0.663,0.34,2,-10.995,1,0.0286,0.4,0.00363,0.163,0.269,91.38,302773,4
1991-09-14,33,The Sound Of Your Voice,38 Special,,False,36,33,10,0.616,0.786,4,-9.973,1,0.0281,0.0148,0,0.224,0.79,136.043,299600,4
1991-09-14,35,Temptation,Corina,,False,25,6,18,0.609,0.771,7,-10.663,1,0.0428,0.000274,0.05,0.038,0.565,118.352,241533,4
1991-09-14,36,Pop Goes The Weasel,3rd Bass,,False,33,29,10,0.663,0.599,2,-13.299,1,0.378,0.0145,0,0.15,0.259,200.312,235627,4
1991-09-14,37,The One And Only,Chesney Hawkes,,False,40,37,7,0.681,0.697,4,-11.063,1,0.0327,0.357,0,0.388,0.775,119.956,223667,4
1991-09-14,38,The Real Love,Bob Seger & The Silver Bullet Band,,False,44,38,4,0.721,0.546,5,-6.845,1,0.0269,0.0362,0.00487,0.114,0.612,115.387,279867,4
1991-09-14,39,Real Real Real,Jesus Jones,,False,45,39,4,0.596,0.547,0,-13.136,1,0.0331,0.0478,4.92e-05,0.157,0.697,110.209,188760,4
1991-09-14,40,Don't Want To Be A Fool,Luther Vandross,,False,42,40,7,0.632,0.576,7,-8.345,1,0.0234,0.482,0,0.151,0.323,95.321,275133,4
1991-09-14,41,Running Back To You,Vanessa Williams,,False,43,41,6,0.723,0.865,5,-10.517,1,0.0451,0.0358,0.51,0.335,0.875,115.303,280000,4
1991-09-14,42,Just Like You,Robbie Nevil,,False,31,25,11,0.697,0.716,2,-11.987,1,0.0408,0.113,0,0.345,0.847,98.243,246600,4
1991-09-14,43,Kiss Them For Me,Siouxsie & The Banshees,,False,51,43,5,0.6,0.949,7,-5.473,0,0.0556,0.187,0.00539,0.105,0.752,99.387,277147,4
1991-09-14,44,You Could Be Mine,Guns N' Roses,,False,37,29,10,0.35,0.985,10,-5.676,0,0.122,0.00876,0.551,0.36,0.323,151.007,343640,4
1991-09-14,45,Walk Through Fire,Bad Company,,False,50,45,4,0.626,0.698,7,-10.311,1,0.0325,0.00316,0.0211,0.331,0.72,122.965,288560,4
1991-09-14,46,With You,Tony Terry,,False,46,46,12,0.619,0.492,8,-9.532,1,0.0328,0.455,0,0.106,0.553,131.888,305827,4
1991-09-14,47,Gett Off,Prince And The N.P.G.,,False,55,47,5,0.655,0.628,10,-11.407,0,0.0947,0.00448,0.000751,0.29,0.602,99.842,271667,4
1991-09-14,48,Got A Love For You,Jomanda,,False,41,40,11,0.708,0.604,6,-13.591,0,0.0437,4.18e-05,0.639,0.0489,0.632,119.9,454960,4
1991-09-14,50,Can't Stop This Thing We Started,Bryan Adams,753VOnELPOptUFMm7H10Vc,True,0,50,1,0.497,0.93,9,-3.902,1,0.0444,0.0112,0,0.354,0.47,113.086,195933,4
1991-09-14,52,Face The Music,RTZ,,False,57,52,5,0.666,0.909,4,-11.076,1,0.0955,0.341,0,0.246,0.535,118.137,245907,4
1991-09-14,53,Power Windows,Billy Falcon,,False,60,53,5,0.716,0.568,9,-10.478,1,0.0293,0.0743,0,0.0536,0.393,103.027,244373,4
1991-09-14,54,Just Want To Hold You,Jasmine Guy,,False,56,54,7,0.611,0.368,8,-13.701,1,0.0362,0.3,4.05e-05,0.0567,0.451,161.986,251867,4
1991-09-14,56,Tonite,DJ Quik,,False,65,56,4,0.965,0.449,0,-15.225,1,0.237,0.0502,1.17e-06,0.267,0.722,105.392,323267,4
1991-09-14,57,Straight To Your Heart,Bad English,,False,66,57,3,0.564,0.825,8,-7.081,1,0.0365,0.0877,7.47e-06,0.246,0.585,127.112,249027,4
1991-09-14,58,P.A.S.S.I.O.N.,Rhythm Syndicate,,False,38,2,16,0.737,0.753,2,-8.416,0,0.0399,0.0135,0.0562,0.0738,0.562,110.89,217993,4
1991-09-14,60,Let's Talk About Sex,Salt-N-Pepa,,False,71,60,4,0.863,0.543,6,-13.497,1,0.13,0.0507,0,0.241,0.799,106.929,213267,4
1991-09-14,61,O.P.P.,Naughty By Nature,,False,85,61,2,0.848,0.838,4,-11.949,0,0.0723,0.0326,4.63e-06,0.124,0.774,97.735,271067,4
1991-09-14,62,"Right Here, Right Now",Jesus Jones,,False,48,2,23,0.657,0.608,2,-13.565,1,0.0287,0.0088,3.45e-06,0.103,0.723,106.862,189293,4
1991-09-14,63,Silver Thunderbird,Marc Cohn,,False,64,63,6,0.475,0.267,7,-15.35,1,0.034,0.721,0,0.0815,0.56,138.942,278720,4
1991-09-14,64,There She Goes,The La's,,False,49,49,9,0.536,0.854,7,-6.907,1,0.0298,0.0129,0.743,0.156,0.905,122.733,162160,4
1991-09-14,65,The Devil Came Up To Michigan,K.M.C. KRU,,False,74,65,3,0.86,0.636,2,-15.511,1,0.145,0.172,4.9e-05,0.368,0.842,128.012,226933,4
1991-09-14,66,I'm Not Your Puppet,Hi-C,,False,70,66,5,0.718,0.729,0,-5.389,0,0.267,0.0403,0,0.171,0.651,188.51,360480,4
1991-09-14,68,Learning To Fly,Tom Petty And The Heartbreakers,,False,47,28,12,0.651,0.766,0,-9.935,1,0.0299,0.206,0.00103,0.362,0.949,116.74,242107,4
1991-09-14,69,Hard To Handle,The Black Crowes,,False,53,26,13,0.599,0.79,4,-3.58,1,0.043,0.00257,0.00181,0.312,0.961,103.783,188067,4
1991-09-14,71,My Fallen Angel,Coro,,False,61,54,10,0.76,0.733,10,-9.312,0,0.0675,0.00621,0.0105,0.0401,0.797,124.058,340773,4
1991-09-14,72,Latin Active,Lighter Shade Of Brown Featuring Teardrop & Shiro,,False,67,59,9,0.938,0.628,4,-7.587,0,0.158,0.0364,0,0.33,0.758,119.996,211733,4
1991-09-14,73,Let The Beat Hit 'Em,Lisa Lisa And Cult Jam,,False,68,37,13,0.792,0.731,1,-9.659,1,0.0502,0.00263,0.0126,0.303,0.838,113.007,278267,4
1991-09-14,74,Sometimes (It's A Bitch),Stevie Nicks,,False,86,74,2,0.674,0.651,9,-7.305,1,0.0413,0.0987,4.02e-05,0.15,0.341,119.926,278373,4
1991-09-14,75,This Beat Is Hot,B.G. The Prince Of Rap,,False,75,75,5,0.777,0.829,9,-14.003,1,0.0558,0.027,0.00306,0.0417,0.598,111.998,248000,4
1991-09-14,76,She's Gone (Lady),Steelheart,,False,80,76,3,0.416,0.559,0,-10.751,0,0.0349,0.00346,0.085,0.148,0.152,137.17,392400,4
1991-09-14,77,Only Time Will Tell,Nelson,,False,59,28,13,0.455,0.417,0,-16.817,0,0.0303,0.316,1.44e-06,0.0608,0.464,142.25,233718,4
1991-09-14,78,Louder Than Love,TKA,,False,76,76,6,0.686,0.652,6,-10.505,0,0.0387,0.0941,0.109,0.1,0.523,122.063,318893,4
1991-09-14,79,Place In This World,Michael W. Smith,,False,62,6,20,0.446,0.559,4,-8.319,1,0.0285,0.388,1.78e-05,0.153,0.372,145.419,240173,4
1991-09-14,80,Can You Stop The Rain,Peabo Bryson,,False,72,52,13,0.684,0.359,3,-12.867,0,0.0368,0.353,0,0.233,0.144,119.942,334933,4
1991-09-14,81,I Wonder Why,Curtis Stigers,,False,97,81,2,0.549,0.62,0,-8.971,1,0.0306,0.0573,0,0.591,0.288,135.112,267240,3
1991-09-14,82,"Gonna Catch You (From ""Cool As Ice"")",Lonnie Gordon,,False,84,82,3,0.84,0.668,7,-9.071,1,0.0461,0.000825,1.05e-05,0.223,0.953,121.649,231040,4
1991-09-14,83,Love And Understanding,Cher,,False,69,17,14,0.668,0.75,0,-9.717,1,0.0267,0.0332,3.5e-06,0.0383,0.646,116.07,282040,4
1991-09-14,85,Save Me,Lisa Fischer,,False,88,85,2,0.655,0.902,5,-8.038,1,0.0357,0.0401,0.00045,0.0722,0.787,116.255,284960,4
1991-09-14,86,Chorus,Erasure,,False,83,83,6,0.613,0.655,5,-12.989,1,0.0302,0.209,0.000754,0.171,0.69,129.906,266267,4
1991-09-14,87,For You,Michael W. Smith,2OiTtw4qqCMKn8dikc6zrn,True,0,87,1,0.576,0.627,4,-9.273,0,0.0292,0.388,4.25e-06,0.142,0.858,169.563,248093,4
1991-09-14,88,Never Stop,The Brand New Heavies Featuring N'Dea Davenport,2OiTtw4qqCMKn8dikc6zrn,False,91,88,2,0.717,0.81,4,-10.259,1,0.0692,0.00312,0.000449,0.0654,0.735,101.421,253333,4
1991-09-14,89,Why Can't You Come Home,Ex-Girlfriend,2OiTtw4qqCMKn8dikc6zrn,False,90,89,2,0.777,0.47,7,-13.376,1,0.0412,0.00754,7.29e-05,0.0648,0.712,103.452,348600,4
1991-09-14,90,That's The Way Love Goes,Young M.C.,2OiTtw4qqCMKn8dikc6zrn,False,79,54,7,0.849,0.694,6,-14.43,0,0.0642,0.0232,0.00252,0.0524,0.932,118.309,229307,4
1991-09-14,91,My Heart Belongs To You,Russ Irwin,1s0VBhLgxZJpC6M9uncj4e,True,0,91,1,0.491,0.34,3,-12.18,1,0.0293,0.645,1.46e-06,0.112,0.226,133.305,240933,4
1991-09-14,92,Heaven In The Back Seat,Eddie Money,0ZUAwAOJJKtNnkWkKSWcJc,True,0,92,1,0.696,0.945,0,-5.31,1,0.0364,0.115,0,0.694,0.708,120.074,243227,4
1991-09-14,93,When Love Cries,Donna Summer,0ZUAwAOJJKtNnkWkKSWcJc,False,77,77,5,0.67,0.766,4,-11.024,0,0.0672,0.0976,0.00495,0.0472,0.456,95.754,319107,4
1991-09-14,94,Unbelievable,EMF,0ZUAwAOJJKtNnkWkKSWcJc,False,81,1,23,0.637,0.849,1,-6.855,1,0.0362,0.000341,0.0386,0.141,0.936,104.074,209813,4
1991-09-14,95,6 Minutes Of Pleasure,LL Cool J,0rDGGor6D1IHggV8UiUfEp,True,0,95,1,0.596,0.671,10,-10.859,0,0.15,0.0148,0.221,0.109,0.89,200.121,274053,4
1991-09-14,96,If You're Serious,Riff,1moqVeiFEOxtXaPNEtS3md,True,0,96,1,0.618,0.277,8,-14.381,1,0.0289,0.692,0,0.101,0.214,92.985,220707,4
1991-09-14,97,Keep Warm,Jinny,3Ox6RleCID5x2Eh8RoxfkJ,True,0,97,1,0.653,0.854,0,-10.072,1,0.0391,0.00607,0.00456,0.106,0.736,123.855,222778,4
1991-09-14,98,I'll Never Let You Go,Steelheart,3Ox6RleCID5x2Eh8RoxfkJ,False,89,23,27,0.341,0.651,1,-9.829,1,0.0423,0.0119,0.148,0.0875,0.31,143.934,306560,4
1991-09-14,99,Do You Want Me,Salt-N-Pepa,3Ox6RleCID5x2Eh8RoxfkJ,False,87,21,26,0.899,0.451,11,-14.009,0,0.0511,0.0756,3.22e-05,0.044,0.973,121.575,232267,4
1991-09-14,100,Rush Rush,Paula Abdul,3Ox6RleCID5x2Eh8RoxfkJ,False,82,1,19,0.706,0.44,4,-11.577,1,0.0493,0.763,0,0.0958,0.395,90.012,292933,4
