date,position,title,artist,spotify_id,is_new,last_pos,peak_pos,weeks,danceability,energy,key,loudness,mode,speechiness,acousticness,instrumentalness,liveness,valence,tempo,duration_ms,time_signature
2005-12-24,1,Run It!,Chris Brown,79t5idiRhbDB1oLaVcTVsD,False,1,1,18,0.846,0.482,1,-6.721,0,0.129,0.0246,0,0.393,0.212,100.969,229867,4
2005-12-24,2,Don't Forget About Us,Mariah Carey,79t5idiRhbDB1oLaVcTVsD,False,7,2,10,0.699,0.543,10,-6.859,0,0.0383,0.0457,0,0.1,0.431,143.635,233867,4
2005-12-24,3,Laffy Taffy,D4L,79t5idiRhbDB1oLaVcTVsD,False,2,2,13,0.891,0.439,7,-7.994,0,0.428,0.0351,0,0.0932,0.622,77.499,224253,4
2005-12-24,4,Grillz,"Nelly Featuring Paul Wall, Ali & Gipp",79t5idiRhbDB1oLaVcTVsD,False,11,4,6,0.865,0.514,4,-7.251,0,0.241,0.0399,0,0.255,0.822,82.987,271240,4
2005-12-24,5,Photograph,Nickelback,79t5idiRhbDB1oLaVcTVsD,False,4,2,16,0.515,0.876,8,-3.756,1,0.0292,0.000932,0.000166,0.136,0.385,145.916,258920,4
2005-12-24,6,Gold Digger,Kanye West Featuring Jamie Foxx,79t5idiRhbDB1oLaVcTVsD,False,3,1,22,0.629,0.696,1,-5.572,0,0.348,0.0195,0,0.0554,0.623,93.034,207627,4
2005-12-24,7,Stickwitu,The Pussycat Dolls,79t5idiRhbDB1oLaVcTVsD,False,9,7,10,0.655,0.54,9,-6.482,1,0.0516,0.268,0,0.068,0.43,79.983,207507,4
2005-12-24,8,When I'm Gone,Eminem,79t5idiRhbDB1oLaVcTVsD,False,8,8,5,0.608,0.745,10,-5.496,0,0.365,0.0551,0,0.27,0.725,150.068,281120,4
2005-12-24,9,My Humps,The Black Eyed Peas,79t5idiRhbDB1oLaVcTVsD,False,6,3,19,0.743,0.751,0,-5.216,1,0.0326,0.305,0.00082,0.0893,0.361,118.083,158653,4
2005-12-24,10,Because Of You,Kelly Clarkson,79t5idiRhbDB1oLaVcTVsD,False,12,7,17,0.583,0.584,5,-5.362,0,0.0314,0.254,0,0.123,0.136,140.039,219493,4
2005-12-24,11,Soul Survivor,Young Jeezy Featuring Akon,79t5idiRhbDB1oLaVcTVsD,False,5,4,17,0.682,0.483,10,-7.718,1,0.0451,0.00103,0,0.159,0.108,84.012,280013,4
2005-12-24,12,There It Go! (The Whistle Song),Juelz Santana,79t5idiRhbDB1oLaVcTVsD,False,15,11,11,0.942,0.892,6,-6.363,0,0.196,0.023,0.000897,0.264,0.595,100.007,180493,4
2005-12-24,13,Stay Fly,Three 6 Mafia Featuring Young Buck & Eightball & MJG,79t5idiRhbDB1oLaVcTVsD,False,17,13,14,0.789,0.881,11,-5.758,1,0.0331,0.108,0,0.355,0.647,133.301,236600,4
2005-12-24,14,I'm Sprung,T-Pain,79t5idiRhbDB1oLaVcTVsD,False,13,8,18,0.722,0.329,0,-11.617,0,0.108,0.088,0,0.081,0.166,99.991,230713,4
2005-12-24,15,We Be Burnin',Sean Paul,79t5idiRhbDB1oLaVcTVsD,False,10,6,15,0.95,0.803,1,-4.195,1,0.151,0.145,0,0.0748,0.86,117.0,213066,4
2005-12-24,16,One Wish,Ray J,79t5idiRhbDB1oLaVcTVsD,False,18,16,12,0.525,0.652,5,-7.042,0,0.28,0.278,0,0.339,0.602,127.673,337640,4
2005-12-24,17,I Think They Like Me,"Dem Franchize Boyz Featuring Jermaine Dupri, Da Brat & Bow Wow",79t5idiRhbDB1oLaVcTVsD,False,16,15,14,0.781,0.625,7,-9.139,1,0.373,0.00447,0,0.185,0.679,83.024,282093,4
2005-12-24,18,Check On It,Beyonce Featuring Slim Thug,79t5idiRhbDB1oLaVcTVsD,False,21,18,6,0.705,0.796,7,-6.845,1,0.267,0.0708,0,0.388,0.864,166.042,210453,4
2005-12-24,19,Hung Up,Madonna,79t5idiRhbDB1oLaVcTVsD,False,14,7,8,0.649,0.647,9,-7.695,0,0.0452,0.0039,0.161,0.0686,0.405,125.02,337733,4
2005-12-24,20,Here We Go,Trina Featuring Kelly Rowland,79t5idiRhbDB1oLaVcTVsD,False,19,17,12,0.814,0.494,8,-7.167,1,0.0846,0.624,0,0.0888,0.607,128.083,230973,4
2005-12-24,21,"Sugar, We're Goin' Down",Fall Out Boy,79t5idiRhbDB1oLaVcTVsD,False,20,8,26,0.494,0.842,7,-4.784,1,0.0843,0.00579,0,0.122,0.574,162.011,229093,4
2005-12-24,22,You're Beautiful,James Blunt,79t5idiRhbDB1oLaVcTVsD,False,46,22,7,0.675,0.479,0,-9.87,0,0.0278,0.633,1.76e-05,0.088,0.454,81.998,209493,4
2005-12-24,23,Luxurious,Gwen Stefani,79t5idiRhbDB1oLaVcTVsD,False,22,21,8,0.811,0.726,0,-3.995,1,0.0813,0.154,0,0.116,0.666,131.027,264920,4
2005-12-24,24,"Dance, Dance",Fall Out Boy,79t5idiRhbDB1oLaVcTVsD,False,27,22,8,0.622,0.961,11,-3.198,0,0.154,0.00523,0,0.0854,0.449,114.452,180267,4
2005-12-24,25,Be Without You,Mary J. Blige,79t5idiRhbDB1oLaVcTVsD,False,32,25,5,0.724,0.705,2,-5.859,0,0.112,0.067,0,0.262,0.662,146.589,246333,4
2005-12-24,26,Heard 'Em Say,Kanye West Featuring Adam Levine,79t5idiRhbDB1oLaVcTVsD,False,26,26,9,0.744,0.696,7,-8.313,0,0.162,0.0535,0.0454,0.128,0.563,95.07,203733,4
2005-12-24,27,Window Shopper,50 Cent,79t5idiRhbDB1oLaVcTVsD,False,23,20,7,0.539,0.672,5,-4.972,0,0.195,0.0626,0,0.388,0.384,174.148,191813,4
2005-12-24,28,Dirty Little Secret,The All-American Rejects,79t5idiRhbDB1oLaVcTVsD,False,31,28,20,0.465,0.954,10,-4.251,1,0.044,0.000346,5.38e-06,0.573,0.458,143.85,193653,4
2005-12-24,29,You And Me,Lifehouse,79t5idiRhbDB1oLaVcTVsD,False,28,5,45,0.459,0.427,7,-7.734,1,0.0267,0.114,0,0.168,0.354,139.902,195493,3
2005-12-24,30,Wake Me Up When September Ends,Green Day,79t5idiRhbDB1oLaVcTVsD,False,29,6,21,0.546,0.814,7,-5.146,1,0.0314,0.023,0,0.0972,0.146,104.98,285653,4
2005-12-24,31,I Should Have Cheated,Keyshia Cole,79t5idiRhbDB1oLaVcTVsD,False,30,30,12,0.436,0.533,2,-4.266,0,0.0472,0.265,0,0.332,0.366,130.768,327693,4
2005-12-24,32,Shake It Off,Mariah Carey,79t5idiRhbDB1oLaVcTVsD,False,24,2,22,0.777,0.493,2,-6.516,1,0.126,0.181,0,0.108,0.82,134.086,232840,4
2005-12-24,33,Feel Good Inc,Gorillaz,79t5idiRhbDB1oLaVcTVsD,False,35,14,31,0.818,0.705,6,-6.679,1,0.177,0.00836,0.00233,0.613,0.772,138.559,222640,4
2005-12-24,34,Girl Tonite,Twista Featuring Trey Songz,79t5idiRhbDB1oLaVcTVsD,False,25,14,16,0.668,0.724,7,-5.953,1,0.0536,0.00551,0,0.218,0.318,148.522,221373,4
2005-12-24,35,So Sick,Ne-Yo,79t5idiRhbDB1oLaVcTVsD,False,54,35,3,0.452,0.574,6,-8.336,1,0.31,0.246,0,0.189,0.58,92.791,207187,4
2005-12-24,36,Fireman,Lil Wayne,79t5idiRhbDB1oLaVcTVsD,False,50,36,6,0.682,0.723,1,-4.628,1,0.211,0.0109,0,0.406,0.364,80.634,263547,4
2005-12-24,37,Beverly Hills,Weezer,79t5idiRhbDB1oLaVcTVsD,False,38,10,37,0.693,0.823,5,-3.761,1,0.0726,0.0932,0,0.328,0.741,87.904,196093,4
2005-12-24,38,If It's Lovin' That You Want,Rihanna,79t5idiRhbDB1oLaVcTVsD,False,43,38,10,0.745,0.694,8,-7.519,1,0.128,0.0962,0,0.0454,0.74,95.924,208107,4
2005-12-24,39,Come A Little Closer,Dierks Bentley,79t5idiRhbDB1oLaVcTVsD,False,36,31,14,0.579,0.57,5,-5.869,1,0.0227,0.0644,0.00636,0.105,0.368,80.028,281973,4
2005-12-24,40,Unbreakable,Alicia Keys,79t5idiRhbDB1oLaVcTVsD,False,37,34,13,0.504,0.429,8,-12.735,0,0.232,0.0145,0.00149,0.628,0.33,83.711,274000,4
2005-12-24,41,Tequila Makes Her Clothes Fall Off,Joe Nichols,79t5idiRhbDB1oLaVcTVsD,False,34,32,11,0.664,0.706,2,-7.045,1,0.027,0.129,1.06e-06,0.0857,0.681,93.968,187053,4
2005-12-24,42,"Jesus, Take The Wheel",Carrie Underwood,79t5idiRhbDB1oLaVcTVsD,False,40,40,6,0.359,0.518,2,-3.537,1,0.0302,0.665,0,0.106,0.135,76.572,226493,4
2005-12-24,43,Kryptonite (I'm On It),Purple Ribbon All-Stars,79t5idiRhbDB1oLaVcTVsD,False,51,43,5,0.755,0.705,2,-7.105,1,0.216,0.00512,0.807,0.872,0.135,145.062,268267,4
2005-12-24,44,Must Be Doin' Somethin' Right,Billy Currington,79t5idiRhbDB1oLaVcTVsD,False,47,44,10,0.489,0.647,9,-3.424,1,0.027,0.205,0,0.0504,0.436,167.792,269587,4
2005-12-24,45,Don't Cha,The Pussycat Dolls Featuring Busta Rhymes,79t5idiRhbDB1oLaVcTVsD,False,41,2,34,0.877,0.637,1,-3.493,0,0.101,0.00516,2.5e-06,0.0959,0.569,119.988,272080,4
2005-12-24,46,Honky Tonk Badonkadonk,Trace Adkins,79t5idiRhbDB1oLaVcTVsD,False,45,45,8,0.536,0.943,11,-5.317,0,0.108,0.399,2.27e-05,0.225,0.622,123.759,240093,4
2005-12-24,47,Who You'd Be Today,Kenny Chesney,79t5idiRhbDB1oLaVcTVsD,False,44,37,12,0.646,0.431,2,-9.287,1,0.029,0.149,0.000428,0.108,0.248,145.855,254573,4
2005-12-24,48,Turn It Up,Chamillionaire Featuring Lil' Flip,79t5idiRhbDB1oLaVcTVsD,False,53,48,8,0.859,0.773,7,-4.549,1,0.266,0.00382,0,0.129,0.691,166.824,274227,4
2005-12-24,49,We Belong Together,Mariah Carey,79t5idiRhbDB1oLaVcTVsD,False,49,1,37,0.837,0.462,0,-7.89,1,0.0601,0.0339,0,0.09,0.762,139.986,201400,4
2005-12-24,50,Like You,Bow Wow Featuring Ciara,79t5idiRhbDB1oLaVcTVsD,False,39,3,21,0.714,0.6,6,-8.365,1,0.0876,0.0465,0,0.0646,0.504,82.017,205840,4
2005-12-24,51,Like We Never Loved At All,Faith Hill,79t5idiRhbDB1oLaVcTVsD,False,52,45,12,0.497,0.468,2,-8.182,1,0.0286,0.0817,0,0.112,0.285,133.789,257693,4
2005-12-24,52,Don't Bother,Shakira,79t5idiRhbDB1oLaVcTVsD,False,42,42,6,0.617,0.741,7,-4.094,1,0.0438,0.00632,0.00324,0.166,0.222,129.976,257027,4
2005-12-24,53,Seasons Of Love,Cast Of Rent,79t5idiRhbDB1oLaVcTVsD,False,33,33,8,0.44,0.573,10,-5.42,1,0.0365,0.581,0,0.0777,0.442,178.192,183547,4
2005-12-24,54,She Let Herself Go,George Strait,79t5idiRhbDB1oLaVcTVsD,False,56,54,8,0.659,0.572,6,-7.817,0,0.0252,0.0888,1.08e-05,0.0813,0.386,113.987,198213,4
2005-12-24,55,Big Blue Note,Toby Keith,79t5idiRhbDB1oLaVcTVsD,False,55,55,11,0.739,0.709,0,-7.106,1,0.0312,0.426,5.85e-05,0.226,0.758,115.301,177107,4
2005-12-24,56,Boondocks,Little Big Town,79t5idiRhbDB1oLaVcTVsD,False,59,56,9,0.41,0.78,9,-5.391,1,0.0332,0.211,0,0.48,0.695,88.016,272347,4
2005-12-24,57,Confessions Of A Broken Heart (Daughter To Father),Lindsay Lohan,79t5idiRhbDB1oLaVcTVsD,False,91,57,5,0.574,0.721,8,-4.312,0,0.0335,0.0254,0,0.0952,0.159,120.033,220800,4
2005-12-24,58,Unpredictable,Jamie Foxx Featuring Ludacris,79t5idiRhbDB1oLaVcTVsD,False,66,58,4,0.734,0.599,9,-8.462,1,0.197,0.206,0,0.0555,0.772,145.185,219867,4
2005-12-24,59,Better Days,Goo Goo Dolls,79t5idiRhbDB1oLaVcTVsD,False,57,36,12,0.486,0.595,7,-5.009,1,0.0302,0.00212,0.000264,0.0953,0.331,113.276,213267,4
2005-12-24,60,Unwritten,Natasha Bedingfield,79t5idiRhbDB1oLaVcTVsD,False,65,60,3,0.706,0.8,5,-6.333,1,0.0399,0.00584,0,0.0822,0.629,100.011,259333,4
2005-12-24,61,Good Ride Cowboy,Garth Brooks,79t5idiRhbDB1oLaVcTVsD,False,61,61,10,0.55,0.852,9,-2.211,1,0.0629,0.571,0,0.104,0.589,132.255,205589,4
2005-12-24,62,Everytime We Touch,Cascada,79t5idiRhbDB1oLaVcTVsD,False,86,62,2,0.633,0.976,8,-5.362,1,0.0519,0.00281,1.29e-05,0.382,0.493,142.027,197124,4
2005-12-24,63,Shake,Ying Yang Twins Featuring Pitbull,79t5idiRhbDB1oLaVcTVsD,False,58,41,17,0.918,0.681,1,-7.399,1,0.309,0.337,0,0.644,0.843,117.994,241587,4
2005-12-24,64,Twisted Transistor,Korn,79t5idiRhbDB1oLaVcTVsD,False,83,64,5,0.58,0.983,5,-3.291,0,0.0636,0.00043,0.00694,0.0801,0.416,110.053,188933,4
2005-12-24,65,Hypnotize,System Of A Down,79t5idiRhbDB1oLaVcTVsD,False,64,61,7,0.274,0.92,6,-4.096,1,0.0489,0.0303,0.000412,0.115,0.0397,153.986,189440,4
2005-12-24,66,Better Life,Keith Urban,79t5idiRhbDB1oLaVcTVsD,False,62,44,16,0.618,0.832,2,-3.535,1,0.0374,0.0402,1.58e-05,0.033,0.8,104.942,283160,4
2005-12-24,67,Gotta Go,Trey Songz,79t5idiRhbDB1oLaVcTVsD,False,85,67,4,0.675,0.635,5,-5.356,0,0.0632,0.161,0,0.48,0.562,82.21,247053,4
2005-12-24,68,DOA,Foo Fighters,79t5idiRhbDB1oLaVcTVsD,False,68,68,7,0.462,0.913,2,-4.298,1,0.074,0.000189,0.00142,0.0671,0.72,145.522,252107,4
2005-12-24,69,More Than Words,Frankie J,79t5idiRhbDB1oLaVcTVsD,False,63,25,15,0.733,0.405,7,-8.74,1,0.0278,0.291,0,0.365,0.467,100.02,240884,4
2005-12-24,70,Rompe,Daddy Yankee,79t5idiRhbDB1oLaVcTVsD,False,70,70,4,0.687,0.806,1,-6.019,0,0.0549,0.0358,5.83e-06,0.0569,0.534,176.064,189040,4
2005-12-24,71,Miss Me Baby,Chris Cagle,79t5idiRhbDB1oLaVcTVsD,False,67,67,8,0.526,0.569,1,-5.786,1,0.0259,0.185,0,0.0812,0.357,147.87,234653,4
2005-12-24,72,When I Get Where I'm Going,Brad Paisley Featuring Dolly Parton,79t5idiRhbDB1oLaVcTVsD,False,71,71,4,0.52,0.379,0,-9.906,1,0.0279,0.619,1.85e-06,0.108,0.208,85.934,247053,4
2005-12-24,73,Save Me,Shinedown,79t5idiRhbDB1oLaVcTVsD,False,72,72,6,0.524,0.816,11,-3.49,0,0.0308,0.00044,0,0.0777,0.252,116.026,213933,4
2005-12-24,74,Best I Ever Had,Gary Allan,79t5idiRhbDB1oLaVcTVsD,False,60,51,17,0.273,0.59,6,-4.997,1,0.0295,0.00254,1.07e-06,0.108,0.214,174.863,251480,4
2005-12-24,75,Just Might (Make Me Believe),Sugarland,79t5idiRhbDB1oLaVcTVsD,False,78,75,4,0.487,0.504,1,-5.207,1,0.0261,0.123,0,0.109,0.331,139.717,247800,4
2005-12-24,76,Shake That,Eminem Featuring Nate Dogg,0fGh0trRN1xz3s41r7V5ce,True,0,76,1,0.963,0.643,1,-5.785,0,0.117,0.0507,4.94e-05,0.157,0.534,107.005,274440,4
2005-12-24,77,Looking For You,Kirk Franklin,0fGh0trRN1xz3s41r7V5ce,False,74,74,3,0.81,0.72,1,-4.793,1,0.0503,0.0138,0,0.221,0.805,121.984,246560,4
2005-12-24,78,Amor Eterno,Cristian Castro,1vS2gWMJU5gLm9z0x8DpNG,True,0,78,1,0.553,0.789,0,-4.355,1,0.0256,0.0122,5.68e-06,0.0918,0.491,104.979,193240,4
2005-12-24,79,Bat Country,Avenged Sevenfold,1vS2gWMJU5gLm9z0x8DpNG,False,76,76,7,0.541,0.968,0,-4.129,1,0.0396,0.000248,8.28e-06,0.423,0.505,125.04,311813,4
2005-12-24,80,Rodeo,Juvenile,1vS2gWMJU5gLm9z0x8DpNG,False,84,80,3,0.7,0.547,1,-7.907,1,0.156,0.0532,0,0.068,0.67,157.137,237947,3
2005-12-24,81,Soul Meets Body,Death Cab For Cutie,1vS2gWMJU5gLm9z0x8DpNG,False,79,76,12,0.621,0.853,2,-5.735,0,0.0253,0.0767,3.26e-06,0.0893,0.714,128.142,229413,4
2005-12-24,82,Pretty Vegas,INXS,1vS2gWMJU5gLm9z0x8DpNG,False,77,37,5,0.624,0.922,5,-4.536,0,0.0604,0.00121,2.46e-05,0.0785,0.676,141.968,205413,4
2005-12-24,83,Nasty Girl,"The Notorious B.I.G. Featuring Diddy, Nelly, Jagged Edge & Avery Storm",1vS2gWMJU5gLm9z0x8DpNG,False,92,83,2,0.833,0.628,2,-7.041,1,0.141,0.0949,1.6e-06,0.282,0.645,106.328,286187,4
2005-12-24,84,Fresh Azimiz,Bow Wow Featuring J-Kwon & Jermaine Dupri,5ZOfHnTDRa9NHCdscBILvn,True,0,84,1,0.768,0.602,10,-5.656,0,0.312,0.0701,0,0.232,0.506,160.133,271133,4
2005-12-24,85,Can I Have It Like That,Pharrell Featuring Gwen Stefani,5ZOfHnTDRa9NHCdscBILvn,False,82,49,8,0.745,0.525,7,-7.532,1,0.239,0.129,0,0.0811,0.376,100.99,235360,4
2005-12-24,86,Boyfriend,Ashlee Simpson,5ZOfHnTDRa9NHCdscBILvn,False,80,19,14,0.705,0.753,1,-3.114,0,0.0384,0.0321,6.69e-06,0.0655,0.906,128.047,179427,4
2005-12-24,87,Belly Dancer (Bananza),Akon,5ZOfHnTDRa9NHCdscBILvn,False,69,30,20,0.855,0.721,10,-5.408,0,0.198,0.079,0,0.416,0.657,104.81,193520,4
2005-12-24,88,Touch It,Busta Rhymes,3HVJbdz0V402U5YggQK4Ao,True,0,88,1,0.658,0.551,1,-6.62,1,0.37,0.0043,0.000108,0.197,0.442,138.335,214960,5
2005-12-24,89,My Old Friend,Tim McGraw,3HVJbdz0V402U5YggQK4Ao,False,87,87,4,0.463,0.819,4,-7.662,1,0.0357,0.212,0.000268,0.0599,0.591,183.998,217067,4
2005-12-24,90,Pump It,The Black Eyed Peas,3HVJbdz0V402U5YggQK4Ao,False,0,82,3,0.89,0.57,6,-10.966,1,0.333,0.396,1.13e-06,0.443,0.56,95.037,84193,4
2005-12-24,91,Only,Nine Inch Nails,3HVJbdz0V402U5YggQK4Ao,False,90,90,8,0.7,0.807,9,-5.711,0,0.029,0.000576,0.00488,0.0996,0.963,112.15,263093,4
2005-12-24,92,Perfect Situation,Weezer,1D7UBHqaPWDbBHs2S5YXge,True,0,92,1,0.47,0.806,6,-4.1,1,0.0328,0.0271,0.000142,0.2,0.403,93.853,254333,4
2005-12-24,93,Comin' To Your City,Big & Rich,1D7UBHqaPWDbBHs2S5YXge,False,88,72,4,0.559,0.944,9,-1.422,0,0.085,0.258,0,0.165,0.66,99.027,207133,4
2005-12-24,94,Don't Lie,The Black Eyed Peas,1D7UBHqaPWDbBHs2S5YXge,False,73,14,20,0.61,0.827,6,-3.709,0,0.0512,0.00429,0.154,0.108,0.756,89.901,219340,4
2005-12-24,95,Have A Nice Day,Bon Jovi,1D7UBHqaPWDbBHs2S5YXge,False,96,53,9,0.5,0.899,4,-4.066,1,0.0736,4.84e-05,0.000198,0.0794,0.566,130.06,229107,4
2005-12-24,96,Your Man,Josh Turner,1WzAeadSKJhqykZFbJNmQv,True,0,96,1,0.744,0.637,6,-4.483,1,0.0241,0.337,0.000222,0.0696,0.785,100.511,211893,4
2005-12-24,97,Believe,Brooks & Dunn,4RBL1O2KXydgUhZrslOsn5,True,0,97,1,0.598,0.223,9,-9.842,1,0.0365,0.782,9.76e-05,0.102,0.211,117.308,338520,4
2005-12-24,98,Skin (Sarabeth),Rascal Flatts,4RBL1O2KXydgUhZrslOsn5,False,81,42,14,0.484,0.299,2,-9.903,1,0.0286,0.483,0.000112,0.145,0.232,139.87,261267,3
2005-12-24,99,Rakata,Wisin & Yandel,4RBL1O2KXydgUhZrslOsn5,False,89,89,3,0.872,0.785,1,-5.463,1,0.153,0.0303,0,0.0798,0.723,95.991,172853,4
2005-12-24,100,Hit The Floor,Twista Featuring Pitbull,4RBL1O2KXydgUhZrslOsn5,False,95,95,2,0.921,0.876,11,-4.673,0,0.0954,0.00211,0.0268,0.364,0.696,117.986,217467,4
