date,position,title,artist,spotify_id,is_new,last_pos,peak_pos,weeks,danceability,energy,key,loudness,mode,speechiness,acousticness,instrumentalness,liveness,valence,tempo,duration_ms,time_signature
2012-11-03,1,One More Night,Maroon 5,5rIuVlKlLCfuQyt5eyzxOy,False,1,1,18,0.718,0.82,5,-3.453,0,0.0323,0.0444,0,0.0846,0.613,92.998,219467,4
2012-11-03,2,Gangnam Style,PSY,5rIuVlKlLCfuQyt5eyzxOy,False,2,2,7,0.727,0.937,11,-2.871,0,0.286,0.00417,0,0.091,0.749,132.067,219493,4
2012-11-03,3,Some Nights,fun.,5rIuVlKlLCfuQyt5eyzxOy,False,4,3,35,0.672,0.738,0,-7.045,1,0.0506,0.0178,6.75e-05,0.0927,0.392,107.938,277040,4
2012-11-03,4,We Are Never Ever Getting Back Together,Taylor Swift,5rIuVlKlLCfuQyt5eyzxOy,False,5,1,11,0.628,0.676,7,-5.911,1,0.0916,0.00957,2.65e-05,0.121,0.75,85.984,193147,4
2012-11-03,5,Die Young,Ke$ha,5rIuVlKlLCfuQyt5eyzxOy,False,8,5,4,0.711,0.7,1,-4.805,0,0.046,0.00498,0.000125,0.215,0.801,128.001,211920,4
2012-11-03,6,As Long As You Love Me,Justin Bieber Featuring Big Sean,5rIuVlKlLCfuQyt5eyzxOy,False,6,6,18,0.571,0.873,0,-3.382,0,0.1,0.0811,0,0.361,0.613,139.691,229467,4
2012-11-03,7,Too Close,Alex Clare,5rIuVlKlLCfuQyt5eyzxOy,False,7,7,30,0.584,0.712,11,-4.311,0,0.0395,0.0112,1.05e-06,0.114,0.286,126.043,256560,4
2012-11-03,8,Diamonds,Rihanna,5rIuVlKlLCfuQyt5eyzxOy,False,11,8,4,0.564,0.71,11,-4.92,0,0.0461,0.00125,0,0.109,0.393,91.972,225147,4
2012-11-03,9,Let Me Love You (Until You Learn To Love Yourself),Ne-Yo,5rIuVlKlLCfuQyt5eyzxOy,False,12,9,12,0.669,0.723,5,-5.2,1,0.0346,0.213,0,0.523,0.269,124.925,252227,4
2012-11-03,10,Blow Me (One Last Kiss),P!nk,5rIuVlKlLCfuQyt5eyzxOy,False,9,5,16,0.597,0.919,7,-2.954,1,0.044,0.000145,0,0.282,0.73,113.987,255587,4
2012-11-03,11,Don't Wake Me Up,Chris Brown,5rIuVlKlLCfuQyt5eyzxOy,False,14,11,17,0.602,0.691,7,-5.197,0,0.051,0.0548,0,0.144,0.206,127.967,222307,4
2012-11-03,12,Good Time,Owl City & Carly Rae Jepsen,5rIuVlKlLCfuQyt5eyzxOy,False,10,8,17,0.56,0.872,3,-4.269,1,0.14,0.0239,6.98e-06,0.371,0.682,126.05,205933,4
2012-11-03,13,State Of Grace,Taylor Swift,5zyCYmiaVE5y26EZuwZbsw,True,0,13,1,0.588,0.825,4,-5.882,1,0.0328,0.000197,0.00138,0.0885,0.397,129.968,295187,4
2012-11-03,14,Lights,Ellie Goulding,5zyCYmiaVE5y26EZuwZbsw,False,15,2,44,0.681,0.802,8,-5.836,0,0.0347,0.0271,0.0496,0.127,0.791,120.053,212707,4
2012-11-03,15,Locked Out Of Heaven,Bruno Mars,5zyCYmiaVE5y26EZuwZbsw,False,33,15,3,0.726,0.698,5,-4.165,1,0.0431,0.049,0,0.309,0.867,143.994,233478,4
2012-11-03,16,Everybody Talks,Neon Trees,5zyCYmiaVE5y26EZuwZbsw,False,16,6,32,0.471,0.924,8,-3.906,1,0.0586,0.00301,0,0.313,0.725,154.961,177280,4
2012-11-03,17,Home,Phillip Phillips,5zyCYmiaVE5y26EZuwZbsw,False,19,9,17,0.606,0.826,0,-6.04,1,0.0307,0.0256,1.56e-05,0.117,0.322,121.04,210173,4
2012-11-03,18,Clique,"Kanye West, Jay-Z, Big Sean",5zyCYmiaVE5y26EZuwZbsw,False,18,12,7,0.704,0.569,7,-4.998,0,0.247,0.0488,0,0.191,0.313,109.314,293533,5
2012-11-03,19,Whistle,Flo Rida,5zyCYmiaVE5y26EZuwZbsw,False,17,1,23,0.747,0.937,0,-5.746,1,0.0453,0.0208,0,0.29,0.739,103.976,224653,4
2012-11-03,20,50 Ways To Say Goodbye,Train,5zyCYmiaVE5y26EZuwZbsw,False,24,20,15,0.591,0.935,6,-2.664,1,0.0478,0.000284,0.000278,0.142,0.736,140.043,247947,4
2012-11-03,21,Blown Away,Carrie Underwood,5zyCYmiaVE5y26EZuwZbsw,False,20,20,16,0.531,0.843,9,-2.569,0,0.0429,0.0909,0,0.0283,0.392,136.991,240133,4
2012-11-03,22,Adorn,Miguel,5zyCYmiaVE5y26EZuwZbsw,False,26,22,12,0.625,0.576,11,-5.693,0,0.175,0.0543,4.07e-05,0.187,0.235,179.063,193147,4
2012-11-03,23,I Knew You Were Trouble.,Taylor Swift,5zyCYmiaVE5y26EZuwZbsw,False,3,3,2,0.622,0.469,3,-6.798,0,0.0363,0.00454,2.25e-06,0.0398,0.679,77.019,217973,4
2012-11-03,24,I Cry,Flo Rida,5zyCYmiaVE5y26EZuwZbsw,False,51,24,4,0.693,0.822,4,-5.441,0,0.0439,0.00616,1.79e-06,0.315,0.763,126.035,223800,4
2012-11-03,25,Call Me Maybe,Carly Rae Jepsen,5zyCYmiaVE5y26EZuwZbsw,False,23,1,35,0.783,0.58,7,-6.548,1,0.0408,0.0114,2.28e-06,0.108,0.66,120.021,193400,4
2012-11-03,26,Somebody That I Used To Know,Gotye Featuring Kimbra,5zyCYmiaVE5y26EZuwZbsw,False,22,1,42,0.864,0.495,0,-7.036,1,0.037,0.591,0.000133,0.0992,0.72,129.062,244973,4
2012-11-03,27,Ho Hey,The Lumineers,5zyCYmiaVE5y26EZuwZbsw,False,32,27,20,0.685,0.466,0,-9.074,1,0.0304,0.794,2.06e-06,0.0915,0.353,79.936,163133,4
2012-11-03,28,Wide Awake,Katy Perry,5zyCYmiaVE5y26EZuwZbsw,False,25,2,22,0.514,0.683,5,-5.099,1,0.0367,0.0749,2.64e-06,0.392,0.575,159.814,220947,4
2012-11-03,29,Cruise,Florida Georgia Line Featuring Nelly,5zyCYmiaVE5y26EZuwZbsw,False,34,29,10,0.457,0.948,10,-3.364,1,0.0354,0.0191,0,0.0536,0.878,148.0,208960,4
2012-11-03,30,Titanium,David Guetta Featuring Sia,5zyCYmiaVE5y26EZuwZbsw,False,28,7,28,0.604,0.788,0,-3.673,0,0.103,0.0678,0.153,0.127,0.301,126.06,245040,4
2012-11-03,31,Live While We're Young,One Direction,5zyCYmiaVE5y26EZuwZbsw,False,21,3,3,0.663,0.857,2,-2.16,1,0.0544,0.0542,0,0.144,0.931,126.039,200213,4
2012-11-03,32,Payphone,Maroon 5 Featuring Wiz Khalifa,5zyCYmiaVE5y26EZuwZbsw,False,29,2,27,0.739,0.756,4,-4.828,1,0.0394,0.0136,0,0.37,0.523,110.028,231387,4
2012-11-03,33,Mercy,"Kanye West, Big Sean, Pusha T, 2 Chainz",5zyCYmiaVE5y26EZuwZbsw,False,27,13,29,0.563,0.496,6,-9.381,0,0.406,0.0685,5.8e-05,0.173,0.426,139.993,329320,4
2012-11-03,34,I Will Wait,Mumford & Sons,5zyCYmiaVE5y26EZuwZbsw,False,30,23,11,0.48,0.756,1,-5.399,1,0.0333,0.00993,0.00704,0.312,0.447,131.127,276720,4
2012-11-03,35,It's Time,Imagine Dragons,5zyCYmiaVE5y26EZuwZbsw,False,39,33,20,0.656,0.884,2,-4.748,1,0.0372,0.0162,0,0.145,0.86,105.009,237987,4
2012-11-03,36,Finally Found You,Enrique Iglesias Featuring Sammy Adams,5zyCYmiaVE5y26EZuwZbsw,False,37,24,6,0.622,0.881,6,-4.871,0,0.0956,0.0109,0,0.348,0.664,127.958,220813,4
2012-11-03,37,Pop That,"French Montana Featuring Rick Ross, Drake, Lil Wayne",5zyCYmiaVE5y26EZuwZbsw,False,38,37,15,0.734,0.892,2,-1.856,1,0.125,0.0648,0,0.58,0.605,138.031,303533,4
2012-11-03,38,Wanted,Hunter Hayes,5zyCYmiaVE5y26EZuwZbsw,False,36,16,26,0.421,0.476,0,-7.692,1,0.0298,0.268,0,0.0816,0.3,169.784,228840,4
2012-11-03,39,Give Your Heart A Break,Demi Lovato,5zyCYmiaVE5y26EZuwZbsw,False,31,16,29,0.651,0.695,6,-3.218,1,0.0487,0.23,0,0.144,0.569,123.008,205347,4
2012-11-03,40,Hard To Love,Lee Brice,5zyCYmiaVE5y26EZuwZbsw,False,41,40,19,0.638,0.722,9,-6.177,1,0.0332,0.0119,0.00808,0.189,0.469,103.017,224293,4
2012-11-03,41,The A Team,Ed Sheeran,5zyCYmiaVE5y26EZuwZbsw,False,43,41,15,0.642,0.289,9,-9.918,1,0.0367,0.669,0,0.18,0.407,84.996,258373,4
2012-11-03,42,Kiss Tomorrow Goodbye,Luke Bryan,5zyCYmiaVE5y26EZuwZbsw,False,45,42,9,0.571,0.937,5,-3.467,0,0.0365,0.0064,0,0.316,0.584,115.013,203133,4
2012-11-03,43,No Lie,2 Chainz Featuring Drake,5zyCYmiaVE5y26EZuwZbsw,False,40,24,24,0.634,0.665,6,-5.984,0,0.176,0.0172,0,0.365,0.611,131.108,237827,4
2012-11-03,44,I Won't Give Up,Jason Mraz,5zyCYmiaVE5y26EZuwZbsw,False,42,8,42,0.585,0.303,4,-10.058,1,0.0398,0.694,0,0.115,0.142,136.703,240166,3
2012-11-03,45,Skyfall,Adele,5zyCYmiaVE5y26EZuwZbsw,False,13,8,3,0.346,0.552,0,-6.864,0,0.0282,0.417,0,0.114,0.0789,75.881,286480,4
2012-11-03,46,Bandz A Make Her Dance,Juicy J Featuring Lil Wayne & 2 Chainz,5zyCYmiaVE5y26EZuwZbsw,False,53,46,6,0.871,0.743,2,-5.442,1,0.277,0.00212,0,0.141,0.576,130.977,278827,4
2012-11-03,47,Girl On Fire,Alicia Keys Featuring Nicki Minaj,5zyCYmiaVE5y26EZuwZbsw,False,48,37,7,0.482,0.706,9,-5.762,1,0.0609,0.135,0.00106,0.105,0.144,92.494,224920,4
2012-11-03,48,2 Reasons,Trey Songz Featuring T.I.,5zyCYmiaVE5y26EZuwZbsw,False,46,43,16,0.734,0.746,11,-5.088,1,0.0762,0.00135,0,0.178,0.539,94.033,197627,4
2012-11-03,49,Birthday Song,2 Chainz Featuring Kanye West,5zyCYmiaVE5y26EZuwZbsw,False,52,49,11,0.753,0.59,1,-2.623,1,0.0485,0.0591,0,0.15,0.161,140.002,306600,4
2012-11-03,50,Ball,T.I. Featuring Lil Wayne,4XVfNwP88Hn9kSkXVnxj2S,True,0,50,1,0.772,0.885,1,-4.736,1,0.0847,0.193,9.48e-06,0.0953,0.512,94.98,205360,4
2012-11-03,51,Pound The Alarm,Nicki Minaj,4XVfNwP88Hn9kSkXVnxj2S,False,35,15,13,0.728,0.858,9,-3.686,1,0.0609,0.0403,4.26e-06,0.0241,0.591,125.054,205640,4
2012-11-03,52,Thinkin Bout You,Frank Ocean,4XVfNwP88Hn9kSkXVnxj2S,False,55,39,15,0.721,0.339,0,-11.195,1,0.0532,0.409,0.00153,0.0973,0.2,129.83,200747,4
2012-11-03,53,Turn On The Lights,Future,4XVfNwP88Hn9kSkXVnxj2S,False,50,50,11,0.596,0.574,6,-9.373,0,0.212,0.0409,0,0.147,0.439,131.075,248360,4
2012-11-03,54,Catch My Breath,Kelly Clarkson,5qxPabNDnJQ551Tf4v6k3j,True,0,54,1,0.692,0.908,9,-5.364,1,0.0677,0.0251,0,0.0933,0.513,124.042,250387,4
2012-11-03,55,Swimming Pools (Drank),Kendrick Lamar,5qxPabNDnJQ551Tf4v6k3j,False,61,55,10,0.577,0.447,8,-5.892,1,0.277,0.00627,0.00022,0.0899,0.189,74.236,247800,4
2012-11-03,56,Feel Again,OneRepublic,5qxPabNDnJQ551Tf4v6k3j,False,59,56,8,0.467,0.815,7,-7.929,0,0.0524,0.0198,1.23e-06,0.118,0.335,140.047,185080,4
2012-11-03,57,The One That Got Away,Jake Owen,5qxPabNDnJQ551Tf4v6k3j,False,57,57,11,0.576,0.865,0,-3.288,1,0.0407,0.0343,5.32e-05,0.252,0.535,119.913,194173,4
2012-11-03,58,I Can Only Imagine,David Guetta Featuring Chris Brown & Lil Wayne,5qxPabNDnJQ551Tf4v6k3j,False,56,44,11,0.669,0.939,9,-2.06,1,0.0427,0.0463,1.12e-06,0.335,0.264,127.947,209533,4
2012-11-03,59,Your Body,Christina Aguilera,5qxPabNDnJQ551Tf4v6k3j,False,58,34,5,0.593,0.781,8,-5.291,0,0.0545,0.000724,0,0.225,0.565,103.025,239853,4
2012-11-03,60,Fastest Girl In Town,Miranda Lambert,5qxPabNDnJQ551Tf4v6k3j,False,65,60,13,0.541,0.911,1,-3.6,0,0.0631,0.0205,0.00155,0.275,0.563,145.057,197600,4
2012-11-03,61,Lovin' You Is Fun,Easton Corbin,5qxPabNDnJQ551Tf4v6k3j,False,63,59,16,0.703,0.83,8,-3.028,1,0.0327,0.32,0,0.364,0.597,109.958,199013,4
2012-11-03,62,Come Wake Me Up,Rascal Flatts,5qxPabNDnJQ551Tf4v6k3j,False,64,59,13,0.454,0.605,4,-6.816,1,0.0314,0.255,0,0.109,0.18,155.861,263253,3
2012-11-03,63,Take A Little Ride,Jason Aldean,5qxPabNDnJQ551Tf4v6k3j,False,44,12,14,0.472,0.866,2,-3.771,1,0.0413,0.044,0,0.213,0.775,163.867,187613,4
2012-11-03,64,Anything Could Happen,Ellie Goulding,5qxPabNDnJQ551Tf4v6k3j,False,75,64,2,0.702,0.781,0,-4.081,1,0.03,0.433,0,0.135,0.382,102.997,286322,4
2012-11-03,65,Put It Down,Brandy Featuring Chris Brown,5qxPabNDnJQ551Tf4v6k3j,False,69,65,10,0.761,0.413,0,-8.104,1,0.195,0.019,0,0.0829,0.595,141.056,246213,4
2012-11-03,66,Madness,Muse,5qxPabNDnJQ551Tf4v6k3j,False,60,60,9,0.502,0.417,10,-7.665,1,0.0718,0.127,0.00419,0.106,0.218,180.301,281040,4
2012-11-03,67,Beer Money,Kip Moore,5qxPabNDnJQ551Tf4v6k3j,False,68,67,5,0.745,0.805,2,-5.549,1,0.0307,0.0223,1.06e-06,0.13,0.765,126.065,218147,4
2012-11-03,68,Want U Back,Cher Lloyd,5qxPabNDnJQ551Tf4v6k3j,False,62,12,19,0.694,0.891,9,-2.94,1,0.0949,0.0562,0,0.561,0.563,97.939,214573,4
2012-11-03,69,Numb,Usher,5qxPabNDnJQ551Tf4v6k3j,False,72,69,5,0.577,0.687,8,-7.601,1,0.0471,0.0113,4.42e-06,0.112,0.291,124.956,225520,4
2012-11-03,70,Hall Of Fame,The Script Featuring will.i.am,5qxPabNDnJQ551Tf4v6k3j,False,71,70,4,0.421,0.873,10,-4.343,1,0.0565,0.0653,0,0.123,0.63,84.803,202533,4
2012-11-03,71,Beauty And A Beat,Justin Bieber Featuring Nicki Minaj,5qxPabNDnJQ551Tf4v6k3j,False,0,71,2,0.602,0.843,0,-4.831,1,0.0593,0.000688,5.27e-05,0.0682,0.526,128.003,227987,4
2012-11-03,72,No Worries,Lil Wayne Featuring Detail,5qxPabNDnJQ551Tf4v6k3j,False,76,58,7,0.844,0.592,5,-5.486,1,0.199,0.085,0,0.0817,0.819,128.033,221000,4
2012-11-03,73,Creepin',Eric Church,5qxPabNDnJQ551Tf4v6k3j,False,73,73,9,0.464,0.889,5,-5.042,1,0.0497,0.0389,0.0272,0.31,0.539,87.858,232720,4
2012-11-03,74,Pontoon,Little Big Town,5qxPabNDnJQ551Tf4v6k3j,False,67,22,20,0.721,0.819,9,-5.715,1,0.0269,0.413,0,0.196,0.867,96.02,212320,4
2012-11-03,75,Don't You Worry Child,Swedish House Mafia Featuring John Martin,5qxPabNDnJQ551Tf4v6k3j,False,80,68,5,0.612,0.84,11,-3.145,0,0.0509,0.112,0,0.116,0.438,129.042,212862,4
2012-11-03,76,Til My Last Day,Justin Moore,5qxPabNDnJQ551Tf4v6k3j,False,78,76,6,0.577,0.761,9,-5.34,1,0.0358,0.0377,0,0.116,0.599,104.991,234027,4
2012-11-03,77,Red,Taylor Swift,5qxPabNDnJQ551Tf4v6k3j,False,54,6,3,0.602,0.896,1,-4.267,0,0.0437,0.0773,8.87e-05,0.091,0.641,124.978,220827,4
2012-11-03,78,Begin Again,Taylor Swift,5qxPabNDnJQ551Tf4v6k3j,False,70,7,4,0.53,0.526,7,-8.349,1,0.0263,0.199,3.52e-06,0.232,0.323,79.025,237613,4
2012-11-03,79,Dance For You,Beyonce,5qxPabNDnJQ551Tf4v6k3j,False,79,78,7,0.616,0.78,2,-6.062,1,0.0623,0.0322,0,0.173,0.471,110.005,377467,4
2012-11-03,80,Truck Yeah,Tim McGraw,5qxPabNDnJQ551Tf4v6k3j,False,66,57,16,0.615,0.92,7,-4.167,1,0.032,0.108,0,0.102,0.776,97.994,209013,4
2012-11-03,81,Dive In,Trey Songz,5qxPabNDnJQ551Tf4v6k3j,False,82,77,8,0.587,0.648,0,-6.954,1,0.089,0.0279,0,0.962,0.37,119.888,252453,4
2012-11-03,82,Thrift Shop,Macklemore & Ryan Lewis Featuring Wanz,5qxPabNDnJQ551Tf4v6k3j,False,96,82,3,0.781,0.526,6,-6.986,0,0.293,0.0633,0,0.0457,0.665,94.993,235613,4
2012-11-03,83,Babel,Mumford & Sons,5qxPabNDnJQ551Tf4v6k3j,False,74,60,4,0.373,0.813,2,-6.13,1,0.0543,0.0253,0.000227,0.0826,0.647,80.465,208933,4
2012-11-03,84,Southern Comfort Zone,Brad Paisley,5qxPabNDnJQ551Tf4v6k3j,False,81,73,3,0.431,0.876,4,-6.109,1,0.0658,0.0771,1.81e-05,0.0998,0.519,160.0,316987,4
2012-11-03,85,Take A Walk,Passion Pit,5qxPabNDnJQ551Tf4v6k3j,False,86,85,8,0.566,0.755,11,-5.526,1,0.0368,0.0338,0,0.315,0.445,101.006,264493,4
2012-11-03,86,How Country Feels,Randy Houser,5qxPabNDnJQ551Tf4v6k3j,False,87,86,3,0.678,0.839,7,-3.617,1,0.0394,0.0379,0,0.0742,0.772,104.952,185907,4
2012-11-03,87,Diced Pineapples,Rick Ross Featuring Wale & Drake,5qxPabNDnJQ551Tf4v6k3j,False,88,87,3,0.511,0.735,2,-6.026,1,0.239,0.352,0,0.196,0.379,110.965,276160,5
2012-11-03,88,Did It For The Girl,Greg Bates,5qxPabNDnJQ551Tf4v6k3j,False,85,85,5,0.658,0.728,5,-4.916,1,0.0237,0.0183,6.26e-06,0.306,0.682,101.969,191293,4
2012-11-03,89,Every Storm (Runs Out Of Rain),Gary Allan,5qxPabNDnJQ551Tf4v6k3j,False,84,78,3,0.525,0.693,0,-6.972,1,0.0327,0.046,9.55e-06,0.247,0.363,107.012,225640,4
2012-11-03,90,El Cerrito Place,Kenny Chesney,5qxPabNDnJQ551Tf4v6k3j,False,92,90,2,0.596,0.503,4,-7.606,1,0.0272,0.13,0,0.0754,0.262,134.032,351613,4
2012-11-03,91,Goodbye In Her Eyes,Zac Brown Band,5qxPabNDnJQ551Tf4v6k3j,False,97,91,2,0.4,0.558,3,-7.393,1,0.038,0.163,3.76e-06,0.0879,0.376,81.271,324267,4
2012-11-03,92,Night Train,Jason Aldean,5ytc87gcx6dZ4nWRNykinV,True,0,92,1,0.496,0.708,5,-5.175,1,0.0293,0.0512,1.06e-06,0.182,0.502,158.121,232307,4
2012-11-03,93,Radioactive,Imagine Dragons,5ytc87gcx6dZ4nWRNykinV,False,90,90,8,0.448,0.784,9,-3.686,1,0.0627,0.106,0.000108,0.668,0.236,136.245,186813,4
2012-11-03,94,She's So Mean,matchbox twenty,5ytc87gcx6dZ4nWRNykinV,False,83,40,17,0.672,0.875,0,-3.728,1,0.0378,0.0136,0,0.279,0.676,118.014,232320,4
2012-11-03,95,My Moment,"DJ Drama Featuring 2 Chainz, Meek Mill & Jeremih",5ytc87gcx6dZ4nWRNykinV,False,89,89,3,0.456,0.76,1,-3.015,0,0.0988,0.0337,0,0.228,0.189,148.063,198920,4
2012-11-03,96,Sweet Nothing,Calvin Harris Featuring Florence Welch,24LS4lQShWyixJ0ZrJXfJ5,True,0,96,1,0.573,0.929,8,-3.942,0,0.109,0.197,0.000112,0.0567,0.582,127.934,212560,4
2012-11-03,97,Hello,Karmin,24LS4lQShWyixJ0ZrJXfJ5,False,77,62,8,0.658,0.919,5,-2.455,1,0.171,0.166,0,0.123,0.516,127.916,237547,4
2012-11-03,98,Ready Or Not,Bridgit Mendler,5xvUgoVED1F4mBu8FL0HaW,True,0,98,1,0.715,0.872,2,-3.835,1,0.0509,0.00351,3.84e-05,0.107,0.748,93.043,200947,4
2012-11-03,99,Amen,Meek Mill Featuring Drake,5xvUgoVED1F4mBu8FL0HaW,False,93,57,18,0.503,0.795,10,-4.505,1,0.335,0.178,0,0.042,0.265,149.981,289707,4
2012-11-03,100,Whispers In The Dark,Mumford & Sons,5xvUgoVED1F4mBu8FL0HaW,False,91,81,4,0.385,0.73,2,-7.82,1,0.0409,0.00382,0.00278,0.123,0.36,134.659,195867,4
