date,position,title,artist,spotify_id,is_new,last_pos,peak_pos,weeks,danceability,energy,key,loudness,mode,speechiness,acousticness,instrumentalness,liveness,valence,tempo,duration_ms,time_signature
2000-12-30,1,Independent Women Part I,Destiny's Child,3tC8SJpOwJhDg8WGG1NKGR,False,1,1,15,0.747,0.638,6,-6.137,0,0.245,0.107,6.44e-06,0.126,0.947,97.99,217680,4
2000-12-30,2,He Loves U Not,Dream,3tC8SJpOwJhDg8WGG1NKGR,False,5,2,14,0.595,0.877,1,-11.787,1,0.0579,0.026,2.85e-06,0.419,0.394,156.972,225813,4
2000-12-30,3,It Wasn't Me,"Shaggy Feat. Ricardo ""RikRok"" Ducent",3tC8SJpOwJhDg8WGG1NKGR,False,2,2,9,0.853,0.606,0,-4.596,1,0.0713,0.0561,0,0.313,0.654,94.759,227600,4
2000-12-30,4,Case Of The Ex (Whatcha Gonna Do),Mya,3tC8SJpOwJhDg8WGG1NKGR,False,3,2,20,0.774,0.684,1,-4.721,0,0.0408,0.0687,9.34e-05,0.0765,0.354,98.001,236827,4
2000-12-30,5,With Arms Wide Open,Creed,3tC8SJpOwJhDg8WGG1NKGR,False,4,1,34,0.41,0.539,0,-8.412,1,0.0302,0.00425,0.00089,0.117,0.141,138.852,274800,4
2000-12-30,6,Ms. Jackson,OutKast,3tC8SJpOwJhDg8WGG1NKGR,False,6,6,8,0.843,0.806,4,-5.946,0,0.269,0.143,0,0.0771,0.613,94.948,270507,4
2000-12-30,7,The Way You Love Me,Faith Hill,3tC8SJpOwJhDg8WGG1NKGR,False,8,7,35,0.627,0.716,2,-7.175,1,0.0352,0.127,0,0.0344,0.734,101.99,186067,4
2000-12-30,8,If You're Gone,matchbox twenty,3tC8SJpOwJhDg8WGG1NKGR,False,11,8,11,0.544,0.659,9,-7.191,1,0.0298,0.427,1.33e-06,0.126,0.361,109.933,274933,4
2000-12-30,9,Kryptonite,3 Doors Down,3tC8SJpOwJhDg8WGG1NKGR,False,9,3,39,0.545,0.865,11,-5.708,0,0.0286,0.00664,1.1e-05,0.168,0.543,99.009,233933,4
2000-12-30,10,Dance With Me,Debelah Morgan,3tC8SJpOwJhDg8WGG1NKGR,False,12,10,23,0.85,0.674,7,-7.981,0,0.0373,0.309,0.000645,0.0356,0.74,115.005,220107,4
2000-12-30,11,I Just Wanna Love U (Give It 2 Me),JAY-Z,3tC8SJpOwJhDg8WGG1NKGR,False,13,11,10,0.8,0.922,4,-5.125,0,0.24,0.301,9.31e-06,0.0352,0.801,98.631,227867,4
2000-12-30,12,This I Promise You,'N Sync,3tC8SJpOwJhDg8WGG1NKGR,False,10,5,14,0.55,0.587,2,-6.279,1,0.0329,0.354,0,0.128,0.466,165.975,284760,4
2000-12-30,13,Gotta Tell You,Samantha Mumba,3tC8SJpOwJhDg8WGG1NKGR,False,7,4,17,0.729,0.752,0,-4.478,0,0.028,0.229,0,0.19,0.792,110.007,201067,4
2000-12-30,14,Most Girls,P!nk,3tC8SJpOwJhDg8WGG1NKGR,False,14,4,21,0.742,0.732,2,-6.046,0,0.0311,0.0424,0.00444,0.101,0.695,97.923,298960,4
2000-12-30,15,I Wish,R. Kelly,3tC8SJpOwJhDg8WGG1NKGR,False,15,15,14,0.42,0.463,6,-9.056,1,0.12,0.068,0,0.119,0.659,78.83,334000,4
2000-12-30,16,Again,Lenny Kravitz,3tC8SJpOwJhDg8WGG1NKGR,False,19,16,7,0.55,0.804,2,-5.218,1,0.0271,0.0148,4.33e-05,0.105,0.789,79.166,231667,4
2000-12-30,17,Liquid Dreams,O-Town,3tC8SJpOwJhDg8WGG1NKGR,False,21,17,2,0.823,0.7,0,-5.042,0,0.035,0.0264,0,0.0531,0.75,108.019,210400,4
2000-12-30,18,E.I.,Nelly,3tC8SJpOwJhDg8WGG1NKGR,False,16,16,13,0.834,0.481,2,-7.824,0,0.188,0.0732,0,0.0934,0.406,89.849,285907,4
2000-12-30,19,Shape Of My Heart,Backstreet Boys,3tC8SJpOwJhDg8WGG1NKGR,False,17,9,12,0.575,0.786,9,-4.353,1,0.0296,0.252,0,0.159,0.518,96.102,230093,4
2000-12-30,20,Love Don't Cost A Thing,Jennifer Lopez,3tC8SJpOwJhDg8WGG1NKGR,False,22,20,4,0.786,0.842,4,-5.115,0,0.0707,0.00305,3.54e-06,0.473,0.685,97.577,221227,4
2000-12-30,21,Between Me And You,Ja Rule Featuring Christina Milian,3tC8SJpOwJhDg8WGG1NKGR,False,18,11,16,0.818,0.883,0,-4.547,1,0.0695,0.0202,0.000767,0.243,0.405,93.67,250173,4
2000-12-30,22,Pinch Me,Barenaked Ladies,3tC8SJpOwJhDg8WGG1NKGR,False,20,15,17,0.68,0.857,7,-4.132,1,0.0373,0.0151,2.88e-05,0.056,0.794,95.349,285160,4
2000-12-30,23,Crazy For This Girl,Evan And Jaron,3tC8SJpOwJhDg8WGG1NKGR,False,23,23,9,0.457,0.926,0,-5.461,1,0.038,0.000487,5.69e-05,0.0949,0.41,93.964,202027,4
2000-12-30,24,What's Your Fantasy,Ludacris Featuring Shawnna,3tC8SJpOwJhDg8WGG1NKGR,False,24,21,14,0.915,0.79,6,-3.186,0,0.207,0.16,0,0.112,0.967,140.093,275907,4
2000-12-30,25,Beautiful Day,U2,3tC8SJpOwJhDg8WGG1NKGR,False,28,25,13,0.539,0.926,2,-6.495,1,0.0499,0.014,0.00136,0.36,0.454,136.279,246400,4
2000-12-30,26,My First Love,Avant Featuring KeKe Wyatt,3tC8SJpOwJhDg8WGG1NKGR,False,26,26,9,0.643,0.368,11,-8.379,0,0.033,0.0237,1.35e-06,0.157,0.414,125.95,268516,4
2000-12-30,27,Music,Madonna,3tC8SJpOwJhDg8WGG1NKGR,False,25,1,21,0.736,0.802,7,-8.527,1,0.0663,0.00149,0.0876,0.14,0.871,119.854,225973,4
2000-12-30,28,My Next Thirty Years,Tim McGraw,3tC8SJpOwJhDg8WGG1NKGR,False,27,27,11,0.605,0.804,5,-7.521,1,0.0363,0.265,4.93e-06,0.345,0.601,98.866,217733,4
2000-12-30,29,Stronger,Britney Spears,3tC8SJpOwJhDg8WGG1NKGR,False,53,29,5,0.707,0.923,11,-3.957,1,0.0521,0.128,0.000437,0.273,0.842,108.049,203000,4
2000-12-30,30,Don't Tell Me,Madonna,3tC8SJpOwJhDg8WGG1NKGR,False,35,30,4,0.699,0.618,7,-7.338,1,0.0594,0.0502,0.000925,0.0914,0.679,99.965,280973,4
2000-12-30,31,Just Friends (Sunny),Musiq,3tC8SJpOwJhDg8WGG1NKGR,False,32,31,12,0.754,0.376,0,-7.561,1,0.204,0.404,0,0.358,0.554,95.018,251427,4
2000-12-30,32,Danger (Been So Long),Mystikal Featuring Nivea,3tC8SJpOwJhDg8WGG1NKGR,False,55,32,3,0.92,0.861,7,-5.435,1,0.218,0.211,2.59e-05,0.0288,0.718,97.969,211400,4
2000-12-30,33,Without You,Dixie Chicks,3tC8SJpOwJhDg8WGG1NKGR,False,31,31,13,0.626,0.424,2,-8.952,1,0.0253,0.313,1.26e-05,0.134,0.173,91.812,210533,4
2000-12-30,34,Born To Fly,Sara Evans,3tC8SJpOwJhDg8WGG1NKGR,False,39,34,11,0.612,0.663,1,-9.314,1,0.035,0.00931,0.0152,0.0637,0.558,100.178,336360,4
2000-12-30,35,Hemorrhage (In My Hands),Fuel,3tC8SJpOwJhDg8WGG1NKGR,False,40,35,10,0.301,0.823,1,-4.072,1,0.0433,0.000144,0.000309,0.0833,0.372,152.017,236867,4
2000-12-30,36,I Lost It,Kenny Chesney,3tC8SJpOwJhDg8WGG1NKGR,False,34,34,11,0.584,0.429,3,-9.289,1,0.028,0.23,0,0.0708,0.355,138.884,234160,4
2000-12-30,37,Bent,matchbox twenty,3tC8SJpOwJhDg8WGG1NKGR,False,33,1,36,0.518,0.83,6,-6.814,0,0.0386,0.0404,3.85e-06,0.375,0.527,95.468,256133,4
2000-12-30,38,Crazy,K-Ci & JoJo,3tC8SJpOwJhDg8WGG1NKGR,False,42,38,4,0.677,0.648,0,-4.4,1,0.0259,0.0987,0,0.554,0.448,116.128,260267,4
2000-12-30,39,So In Love With Two,Mikaila,3tC8SJpOwJhDg8WGG1NKGR,False,47,39,6,0.779,0.788,2,-4.63,0,0.0362,0.278,2.5e-06,0.0708,0.791,119.999,206933,4
2000-12-30,40,Don't Think I'm Not,Kandi,3tC8SJpOwJhDg8WGG1NKGR,False,30,24,22,0.859,0.622,11,-8.196,1,0.0445,0.0661,0,0.0394,0.433,134.007,243533,4
2000-12-30,41,Bow Wow (That's My Name),Lil Bow Wow,3tC8SJpOwJhDg8WGG1NKGR,False,43,41,6,0.762,0.67,8,-6.2,0,0.257,0.0217,0,0.0786,0.591,93.066,213493,4
2000-12-30,42,We Danced,Brad Paisley,3tC8SJpOwJhDg8WGG1NKGR,False,36,29,12,0.596,0.465,9,-8.511,1,0.0253,0.385,0,0.106,0.141,73.013,225680,4
2000-12-30,43,She Bangs,Ricky Martin,3tC8SJpOwJhDg8WGG1NKGR,False,29,12,13,0.63,0.95,1,-4.012,1,0.0806,0.000915,6.51e-06,0.373,0.858,143.866,280627,4
2000-12-30,44,My Everything,98 Degrees,3tC8SJpOwJhDg8WGG1NKGR,False,50,44,4,0.637,0.523,4,-7.802,1,0.0326,0.296,0,0.101,0.238,125.979,231200,4
2000-12-30,45,Best Of Intentions,Travis Tritt,3tC8SJpOwJhDg8WGG1NKGR,False,37,27,20,0.659,0.468,8,-7.439,1,0.0232,0.363,0,0.0964,0.37,99.066,257400,4
2000-12-30,46,You're A God,Vertical Horizon,3tC8SJpOwJhDg8WGG1NKGR,False,41,23,19,0.65,0.851,5,-6.519,0,0.0303,0.00117,3.39e-05,0.0937,0.294,96.651,218760,4
2000-12-30,47,Emotional,Carl Thomas,3tC8SJpOwJhDg8WGG1NKGR,False,54,47,6,0.548,0.542,1,-8.435,0,0.0409,0.544,0,0.148,0.389,83.106,271868,4
2000-12-30,48,No More (Baby I'ma Do Right),3LW,3tC8SJpOwJhDg8WGG1NKGR,False,48,48,9,0.721,0.723,2,-7.08,0,0.0631,0.102,4.4e-06,0.0651,0.761,88.933,263440,4
2000-12-30,49,www.memory,Alan Jackson,3tC8SJpOwJhDg8WGG1NKGR,False,45,45,9,0.701,0.503,5,-7.535,1,0.026,0.572,0,0.333,0.726,94.073,154200,4
2000-12-30,50,Tell Her,Lonestar,3tC8SJpOwJhDg8WGG1NKGR,False,51,50,7,0.58,0.487,7,-9.809,1,0.0318,0.437,0,0.0968,0.317,126.972,207560,4
2000-12-30,51,Just Another Day In Paradise,Phil Vassar,3tC8SJpOwJhDg8WGG1NKGR,False,46,35,14,0.596,0.706,2,-5.562,1,0.0262,0.351,0,0.36,0.704,146.088,233880,4
2000-12-30,52,Mamacita,Public Announcement,3tC8SJpOwJhDg8WGG1NKGR,False,59,52,2,0.712,0.771,1,-4.069,0,0.351,0.0566,0,0.063,0.746,94.937,226267,4
2000-12-30,53,911,Wyclef Jean Featuring Mary J. Blige,3tC8SJpOwJhDg8WGG1NKGR,False,49,38,13,0.747,0.646,7,-9.185,1,0.191,0.273,3.7e-06,0.0931,0.73,87.011,259333,4
2000-12-30,54,One Woman Man,Dave Hollister,3tC8SJpOwJhDg8WGG1NKGR,False,64,54,4,0.627,0.647,11,-6.818,1,0.0294,0.0457,0,0.0655,0.521,91.015,272053,4
2000-12-30,55,Stan,Eminem Featuring Dido,3tC8SJpOwJhDg8WGG1NKGR,False,57,51,9,0.78,0.768,6,-4.325,0,0.238,0.0371,2.34e-06,0.518,0.507,80.063,404107,4
2000-12-30,56,Ashes By Now,Lee Ann Womack,3tC8SJpOwJhDg8WGG1NKGR,False,62,56,4,0.66,0.74,1,-7.175,1,0.0258,0.051,1.45e-05,0.0894,0.502,107.999,251173,4
2000-12-30,57,The Itch,Vitamin C,3tC8SJpOwJhDg8WGG1NKGR,False,52,45,5,0.694,0.947,11,-3.91,0,0.0546,0.00621,0.0395,0.133,0.518,105.019,208733,4
2000-12-30,58,Burn,Jo Dee Messina,3tC8SJpOwJhDg8WGG1NKGR,False,60,58,5,0.43,0.708,7,-6.804,1,0.0351,0.133,0,0.238,0.356,173.706,281427,4
2000-12-30,59,South Side,Moby Featuring Gwen Stefani,3tC8SJpOwJhDg8WGG1NKGR,False,78,59,5,0.61,0.723,4,-7.572,1,0.0422,0.0103,0.0447,0.0748,0.45,97.147,229733,4
2000-12-30,61,Loser,3 Doors Down,,False,61,55,11,0.493,0.88,6,-6.424,0,0.0693,0.0108,2.66e-05,0.226,0.389,147.913,264800,4
2000-12-30,62,The Little Girl,John Michael Montgomery,,False,63,35,17,0.658,0.434,1,-8.527,1,0.025,0.354,1.75e-05,0.112,0.218,83.921,232640,4
2000-12-30,63,Babylon,David Gray,,False,66,63,5,0.737,0.543,8,-10.403,1,0.0374,0.0598,0.01,0.103,0.256,112.016,265667,4
2000-12-30,64,Promise,Jagged Edge,,False,73,64,2,0.751,0.568,5,-5.431,0,0.0872,0.136,0,0.0288,0.646,128.002,246720,4
2000-12-30,65,It's Over Now,112,,False,68,65,4,0.66,0.71,1,-4.541,1,0.0409,0.0106,7.01e-06,0.0736,0.233,97.988,264933,4
2000-12-30,66,Bag Lady,Erykah Badu,,False,56,6,20,0.724,0.416,5,-8.964,0,0.0841,0.365,0,0.0969,0.578,151.181,348893,4
2000-12-30,67,There Is No Arizona,Jamie O'Neal,,False,72,67,2,0.467,0.619,8,-6.046,0,0.0345,0.216,0,0.0886,0.346,167.907,236107,4
2000-12-30,68,The Christmas Shoes,NewSong,2P950p6RQQxCROYYZGjcBr,True,0,68,1,0.438,0.386,4,-10.024,1,0.034,0.689,0,0.113,0.281,131.926,291200,4
2000-12-30,69,Still On Your Side,BBMak,5xHR6Eo11YoZjdkVtIwbb5,True,0,69,1,0.517,0.808,10,-4.519,1,0.0262,0.0769,0,0.298,0.52,85.052,230960,4
2000-12-30,70,Wild Horses,Garth Brooks,5xHR6Eo11YoZjdkVtIwbb5,False,79,70,2,0.711,0.565,4,-4.213,1,0.027,0.589,4.58e-05,0.116,0.447,120.048,196093,4
2000-12-30,71,Is That Your Chick,Memphis Bleek Featuring Jay-Z & Missy Elliott,5xHR6Eo11YoZjdkVtIwbb5,False,74,71,3,0.841,0.835,8,-6.191,0,0.308,0.263,0,0.108,0.702,133.024,294040,4
2000-12-30,72,But For The Grace Of God,Keith Urban,5xHR6Eo11YoZjdkVtIwbb5,False,81,72,2,0.666,0.7,0,-6.083,1,0.0267,0.131,0,0.254,0.644,104.021,224107,4
2000-12-30,73,Rollin',Limp Bizkit,5xHR6Eo11YoZjdkVtIwbb5,False,67,65,8,0.603,0.933,1,-3.358,1,0.171,0.00591,0,0.206,0.709,96.306,213760,4
2000-12-30,74,You Should've Told Me,Kelly Price,5xHR6Eo11YoZjdkVtIwbb5,False,70,64,15,0.732,0.467,1,-4.951,1,0.07,0.235,0,0.0528,0.553,120.136,195080,4
2000-12-30,75,Liar,Profyle,5xHR6Eo11YoZjdkVtIwbb5,False,69,14,16,0.694,0.617,10,-3.559,0,0.049,0.226,0,0.247,0.305,114.064,297893,4
2000-12-30,76,This Everyday Love,Rascal Flatts,5xHR6Eo11YoZjdkVtIwbb5,False,76,76,2,0.673,0.812,0,-3.436,1,0.0468,0.348,0,0.106,0.96,95.024,184107,4
2000-12-30,77,You Shouldn't Kiss Me Like This,Toby Keith,5ueUywJbmAZY2MF9hdJS2y,True,0,77,1,0.421,0.79,7,-4.457,1,0.0417,0.319,3.41e-06,0.257,0.303,168.643,221067,4
2000-12-30,78,Original Prankster,The Offspring,5ueUywJbmAZY2MF9hdJS2y,False,77,70,6,0.664,0.877,2,-4.251,1,0.0334,0.000542,2.95e-05,0.284,0.961,146.804,220947,4
2000-12-30,79,Open My Heart,Yolanda Adams,5ueUywJbmAZY2MF9hdJS2y,False,71,57,19,0.414,0.402,10,-8.911,0,0.0427,0.7,0,0.363,0.171,105.368,340040,4
2000-12-30,80,X,Xzibit,5stZnlPMYz3Ba8Hbo3ajlP,True,0,80,1,0.936,0.678,4,-3.012,0,0.21,0.0795,0,0.0838,0.822,96.911,255640,4
2000-12-30,81,Angel,Shaggy Featuring Rayvon,7FDV5ELOJHCGLe52AnttEd,True,0,81,1,0.74,0.766,6,-2.939,1,0.178,0.116,0,0.0406,0.807,170.531,235133,4
2000-12-30,82,Meanwhile Back At The Ranch,The Clark Family Experience,7FDV5ELOJHCGLe52AnttEd,False,80,80,7,0.585,0.84,7,-6.109,1,0.0324,0.0649,0,0.367,0.534,94.944,179467,4
2000-12-30,83,Oklahoma,Billy Gilman,7FDV5ELOJHCGLe52AnttEd,False,84,83,8,0.42,0.268,1,-10.217,1,0.0332,0.484,0,0.0892,0.27,138.595,244000,4
2000-12-30,84,Girls Dem Sugar,Beenie Man Featuring Mya,7FDV5ELOJHCGLe52AnttEd,False,75,54,11,0.603,0.782,2,-4.832,1,0.162,0.118,0,0.363,0.731,124.303,257893,5
2000-12-30,85,Put It On Me,Ja Rule Featuring Lil' Mo & Vita,7FDV5ELOJHCGLe52AnttEd,False,95,85,2,0.831,0.79,1,-4.714,0,0.165,0.0024,0,0.0515,0.791,93.14,262827,4
2000-12-30,86,Can't Fight The Moonlight,LeAnn Rimes,7FDV5ELOJHCGLe52AnttEd,False,85,71,17,0.628,0.834,6,-6.341,0,0.0497,0.403,0,0.051,0.626,97.865,215507,4
2000-12-30,87,Could It Be,Jaheim,7FDV5ELOJHCGLe52AnttEd,False,90,87,3,0.655,0.553,9,-6.854,0,0.0891,0.0636,1.73e-05,0.126,0.531,70.033,224667,4
2000-12-30,88,A Little Gasoline,Terri Clark,7FDV5ELOJHCGLe52AnttEd,False,82,75,3,0.629,0.655,2,-3.798,1,0.0302,0.103,0,0.12,0.764,76.7,188640,4
2000-12-30,89,How Many Licks?,Lil' Kim Featuring Sisqo,7FDV5ELOJHCGLe52AnttEd,False,86,75,6,0.777,0.846,10,-3.11,0,0.194,0.0508,0,0.309,0.646,105.45,232800,4
2000-12-30,90,Thank You In Advance,Boyz II Men,1qLDXxbJK1VLwS9jArwWnC,True,0,90,1,0.698,0.435,1,-6.876,1,0.0445,0.0897,0,0.275,0.208,119.988,251307,4
2000-12-30,91,My Love Goes On And On,Chris Cagle,1qLDXxbJK1VLwS9jArwWnC,False,83,76,11,0.577,0.932,6,-6.137,1,0.0593,0.352,0,0.0609,0.92,161.949,182867,4
2000-12-30,92,Oh No,Mos Def & Pharoahe Monch Featuring Nate Dogg,1qLDXxbJK1VLwS9jArwWnC,False,97,92,2,0.719,0.863,5,-4.148,0,0.435,0.414,5.19e-06,0.147,0.765,87.579,239933,1
2000-12-30,93,My Baby You,Marc Anthony,1qLDXxbJK1VLwS9jArwWnC,False,89,70,16,0.443,0.596,0,-5.366,0,0.0294,0.688,0,0.167,0.186,115.597,236960,4
2000-12-30,94,Give Me Just One Night (Una Noche),98 Degrees,1qLDXxbJK1VLwS9jArwWnC,False,93,2,20,0.543,0.79,0,-6.145,1,0.0491,0.0513,3.55e-06,0.0981,0.655,123.631,205160,4
2000-12-30,95,Go On,George Strait,1qLDXxbJK1VLwS9jArwWnC,False,88,40,19,0.705,0.555,8,-8.488,1,0.0238,0.449,0.0149,0.254,0.487,104.501,201760,4
2000-12-30,96,All Good?,De La Soul Featuring Chaka Khan,1qLDXxbJK1VLwS9jArwWnC,False,96,96,2,0.464,0.0242,7,-20.843,1,0.0538,0.994,0.943,0.0931,0.198,142.01,118938,3
2000-12-30,97,Kiss This,Aaron Tippin,1qLDXxbJK1VLwS9jArwWnC,False,92,42,19,0.765,0.706,6,-5.477,0,0.026,0.047,4.25e-06,0.36,0.669,116.02,173760,4
2000-12-30,98,I Know,Sunday,3m1OyPw3fzMPAwDMcYcM6Z,True,0,98,1,0.536,0.855,7,-5.269,1,0.144,0.00139,0,0.0815,0.522,157.942,251373,3
2000-12-30,99,Feels Like Love,Vince Gill,3m1OyPw3fzMPAwDMcYcM6Z,False,91,52,18,0.55,0.832,10,-7.773,1,0.0296,0.133,3.96e-05,0.189,0.627,99.917,255773,4
2000-12-30,100,If I Am,Nine Days,3m1OyPw3fzMPAwDMcYcM6Z,False,94,68,5,0.223,0.902,11,-5.955,1,0.0579,0.00587,1.63e-06,0.34,0.539,98.038,258113,4
