date,position,title,artist,spotify_id,is_new,last_pos,peak_pos,weeks,danceability,energy,key,loudness,mode,speechiness,acousticness,instrumentalness,liveness,valence,tempo,duration_ms,time_signature
1991-12-14,1,Black Or White,Michael Jackson,,False,1,1,4,0.741,0.894,4,-3.826,1,0.0496,0.0814,0.0527,0.089,0.96,114.879,202853,4
1991-12-14,2,It's So Hard To Say Goodbye To Yesterday,Boyz II Men,,False,4,2,13,0.3,0.225,4,-11.079,1,0.0264,0.915,0,0.159,0.294,87.698,168627,4
1991-12-14,3,Set Adrift On Memory Bliss,P.M. Dawn,,False,3,1,9,0.795,0.705,5,-8.552,0,0.0715,0.00118,0.00658,0.136,0.482,100.025,235800,4
1991-12-14,4,When A Man Loves A Woman,Michael Bolton,,False,2,1,10,0.476,0.363,1,-10.706,1,0.0296,0.2,0,0.055,0.243,164.555,231067,3
1991-12-14,5,All 4 Love,Color Me Badd,,False,5,5,6,0.807,0.75,2,-8.29,1,0.0315,0.0346,0.000179,0.149,0.797,106.389,211493,4
1991-12-14,6,Blowing Kisses In The Wind,Paula Abdul,,False,6,6,9,0.524,0.544,6,-9.059,0,0.0337,0.574,0,0.236,0.261,147.674,281840,4
1991-12-14,7,Can't Let Go,Mariah Carey,,False,8,7,5,0.478,0.533,10,-11.048,1,0.0404,0.591,0.00704,0.139,0.181,162.369,266560,4
1991-12-14,8,Finally,CeCe Peniston,,False,11,8,12,0.791,0.658,7,-11.128,1,0.0445,0.00653,0,0.0472,0.842,120.066,245000,4
1991-12-14,9,That's What Love Is For,Amy Grant,,False,9,7,12,0.544,0.699,9,-4.148,1,0.0341,0.258,0,0.144,0.293,141.844,257293,4
1991-12-14,10,Wildside,Marky Mark & The Funky Bunch,,False,15,10,6,0.767,0.356,8,-15.502,0,0.106,0.166,0.309,0.101,0.271,105.404,307267,4
1991-12-14,11,2 Legit 2 Quit,M.C. Hammer,,False,17,11,6,0.853,0.884,1,-6.771,1,0.0836,0.0394,6.83e-06,0.0313,0.668,124.542,333624,4
1991-12-14,12,Cream,Prince And The N.P.G.,,False,7,1,12,0.861,0.604,5,-8.44,0,0.0719,0.0974,0.366,0.0467,0.853,115.589,253067,4
1991-12-14,13,Keep Coming Back,Richard Marx,,False,13,13,7,0.72,0.478,9,-11.074,1,0.0239,0.115,2.27e-05,0.104,0.672,97.073,409360,4
1991-12-14,14,O.P.P.,Naughty By Nature,,False,10,6,15,0.848,0.838,4,-11.949,0,0.0723,0.0326,4.63e-06,0.124,0.774,97.735,271067,4
1991-12-14,15,Let's Talk About Sex,Salt-N-Pepa,,False,14,13,17,0.863,0.543,6,-13.497,1,0.13,0.0507,0,0.241,0.799,106.929,213267,4
1991-12-14,16,Don't Cry,Guns N' Roses,,False,16,10,13,0.456,0.59,11,-8.638,1,0.0327,0.00182,0.00379,0.104,0.243,124.635,283733,4
1991-12-14,17,No Son Of Mine,Genesis,,False,20,17,7,0.658,0.595,4,-8.704,0,0.0251,0.133,0.000358,0.0978,0.256,103.975,399107,4
1991-12-14,18,Can't Stop This Thing We Started,Bryan Adams,,False,12,2,14,0.497,0.93,9,-3.902,1,0.0444,0.0112,0,0.354,0.47,113.086,195933,4
1991-12-14,19,Do Anything,Natural Selection,,False,18,2,19,0.654,0.749,11,-9.221,0,0.0537,0.0746,0,0.114,0.663,93.847,237373,4
1991-12-14,20,Set The Night To Music,Roberta Flack With Maxi Priest,,False,19,6,13,0.678,0.37,5,-16.073,1,0.0301,0.38,3.5e-05,0.128,0.622,121.595,323880,4
1991-12-14,21,Street Of Dreams,Nia Peeples,,False,21,12,10,0.753,0.628,0,-10.54,0,0.0466,0.00747,0.000123,0.263,0.94,110.516,263533,4
1991-12-14,22,Live For Loving You,Gloria Estefan,,False,25,22,10,0.728,0.613,7,-12.704,1,0.0369,0.093,0.00419,0.0448,0.521,114.926,276893,4
1991-12-14,23,Smells Like Teen Spirit,Nirvana,,False,40,23,2,0.502,0.912,1,-4.556,1,0.0564,2.55e-05,0.000173,0.106,0.72,116.761,301920,4
1991-12-14,24,Romantic,Karyn White,,False,22,1,18,0.68,0.941,1,-7.509,0,0.0374,0.484,7.43e-05,0.0656,0.823,110.264,247160,4
1991-12-14,25,Forever My Lady,Jodeci,,False,27,25,8,0.707,0.5,9,-15.198,0,0.0387,0.136,0,0.237,0.77,117.997,320360,4
1991-12-14,26,Broken Arrow,Rod Stewart,,False,28,26,9,0.569,0.486,2,-10.64,1,0.0248,0.364,0.000326,0.267,0.509,83.213,261093,4
1991-12-14,27,Hole Hearted,Extreme,,False,24,4,20,0.4,0.747,6,-9.438,1,0.045,0.163,0,0.0774,0.674,203.396,219289,4
1991-12-14,28,Emotions,Mariah Carey,,False,23,1,16,0.74,0.752,9,-7.008,0,0.0359,0.0409,0.00125,0.0233,0.939,114.851,248093,4
1991-12-14,29,I Love Your Smile,Shanice,,False,42,29,4,0.713,0.827,10,-9.759,0,0.113,0.0108,5.74e-06,0.134,0.738,93.934,259627,4
1991-12-14,30,Angel Baby,Angelica,,False,31,30,9,0.866,0.391,0,-7.632,1,0.0453,0.197,0.000377,0.0822,0.462,126.434,240867,4
1991-12-14,31,Change,Lisa Stansfield,,False,36,31,7,0.677,0.845,2,-8.27,0,0.0379,0.0253,0.00102,0.325,0.639,105.893,274747,4
1991-12-14,32,Mind Playing Tricks On Me,Geto Boys,,False,30,30,11,0.886,0.512,10,-11.825,0,0.237,0.207,0,0.0991,0.454,93.997,308733,4
1991-12-14,33,Mysterious Ways,U2,,False,48,33,4,0.674,0.659,8,-8.049,1,0.0277,0.00156,0.00765,0.108,0.697,99.768,243587,4
1991-12-14,34,Don't Let The Sun Go Down On Me,George Michael/Elton John,,False,72,34,2,0.601,0.329,0,-11.636,1,0.0294,0.816,1.52e-05,0.129,0.28,139.917,322884,4
1991-12-14,35,Spending My Time,Roxette,,False,35,35,8,0.42,0.574,4,-5.149,1,0.0292,0.238,0.000115,0.127,0.218,170.549,275667,4
1991-12-14,36,Addams Groove,M.C. Hammer,,False,84,36,2,0.912,0.582,11,-9.408,0,0.271,0.0333,0,0.0572,0.842,119.996,239040,4
1991-12-14,37,Tell Me What You Want Me To Do,Tevin Campbell,,False,38,37,6,0.609,0.551,6,-7.93,1,0.0291,0.0233,0,0.234,0.512,127.956,256040,4
1991-12-14,38,I Wonder Why,Curtis Stigers,,False,26,9,15,0.549,0.62,0,-8.971,1,0.0306,0.0573,0,0.591,0.288,135.112,267240,3
1991-12-14,39,Running Back To You,Vanessa Williams,,False,32,18,19,0.723,0.865,5,-10.517,1,0.0451,0.0358,0.51,0.335,0.875,115.303,280000,4
1991-12-14,40,Enter Sandman,Metallica,,False,33,16,17,0.579,0.824,6,-8.71,0,0.03,0.00206,0.00903,0.059,0.635,123.331,331573,4
1991-12-14,41,Top Of The World,Van Halen,,False,34,27,10,0.546,0.785,9,-8.788,1,0.0297,0.0354,3.6e-06,0.0935,0.804,127.957,232867,4
1991-12-14,42,Love Me All Up,Stacy Earl,,False,43,42,5,0.702,0.859,11,-10.922,1,0.0467,0.0468,0.0928,0.245,0.657,122.879,297360,4
1991-12-14,43,The Way I Feel About You,Karyn White,,False,55,43,3,0.673,0.888,1,-7.056,1,0.0364,0.261,0.000134,0.234,0.801,110.772,275467,4
1991-12-14,45,Tender Kisses,Tracie Spencer,,False,45,44,9,0.594,0.521,0,-11.033,1,0.0417,0.161,0.00556,0.0382,0.789,167.569,328240,4
1991-12-14,46,Save Up All Your Tears,Cher,,False,46,46,9,0.609,0.773,5,-9.166,1,0.0389,0.075,0,0.188,0.352,113.443,238160,4
1991-12-14,47,Home Sweet Home,Motley Crue,,False,47,47,6,0.403,0.777,5,-6.416,1,0.0354,0.0999,3.28e-06,0.124,0.149,76.329,240933,4
1991-12-14,48,Ring My Bell,D.J. Jazzy Jeff & The Fresh Prince,,False,39,20,10,0.808,0.612,10,-12.453,0,0.0726,0.00548,0.00145,0.456,0.701,118.121,284867,4
1991-12-14,49,Diamonds And Pearls,Prince And The N.P.G.,,False,88,49,2,0.549,0.547,7,-10.119,1,0.0328,0.0532,0.321,0.0655,0.287,81.051,285267,4
1991-12-14,50,Is It Good To You,Heavy D & The Boyz,,False,51,50,4,0.711,0.595,1,-12.99,1,0.036,0.0484,0.0327,0.208,0.836,107.473,292227,4
1991-12-14,51,The One And Only,Chesney Hawkes,,False,29,10,20,0.681,0.697,4,-11.063,1,0.0327,0.357,0,0.388,0.775,119.956,223667,4
1991-12-14,52,Too Blind To See It,Kym Sims,,False,52,52,5,0.773,0.668,11,-8.678,0,0.117,0.00187,9.17e-06,0.308,0.698,95.27,227699,4
1991-12-14,53,Keep It Comin',Keith Sweat,,False,66,53,3,0.667,0.899,11,-7.084,0,0.0809,0.0371,4.12e-06,0.541,0.738,101.477,246373,4
1991-12-14,54,Can't Truss It,Public Enemy,,False,54,50,9,0.802,0.872,11,-7.651,1,0.139,0.00196,0,0.132,0.607,101.664,321573,4
1991-12-14,55,I've Got A Lot To Learn About Love,The Storm,,False,58,54,8,0.583,0.742,9,-8.621,0,0.0255,0.00532,1.08e-06,0.0752,0.57,110.671,265467,4
1991-12-14,56,The Unforgiven,Metallica,,False,65,56,2,0.539,0.597,7,-9.581,1,0.0258,0.0108,0.00552,0.134,0.251,139.444,387133,4
1991-12-14,57,Shot Of Poison,Lita Ford,,False,57,45,7,0.578,0.855,5,-8.057,1,0.0414,0.0388,5.56e-06,0.345,0.732,126.264,210733,4
1991-12-14,58,Don't Want To Be A Fool,Luther Vandross,,False,44,9,20,0.632,0.576,7,-8.345,1,0.0234,0.482,0,0.151,0.323,95.321,275133,4
1991-12-14,59,Groovy Train,The Farm,,False,49,41,12,0.663,0.663,7,-16.943,1,0.0351,0.00286,1.78e-05,0.0233,0.782,115.858,244467,4
1991-12-14,60,Send Me An Angel,Scorpions,,False,62,60,6,0.153,0.417,1,-11.587,1,0.0318,0.434,0.000622,0.211,0.166,80.87,273333,3
1991-12-14,61,Ain't Gonna Hurt Nobody,Kid 'N Play,,False,61,61,5,0.776,0.735,6,-14.78,0,0.183,0.0532,0.00687,0.286,0.619,110.105,298814,4
1991-12-14,62,In My Dreams,The Party,,False,64,62,5,0.615,0.955,1,-8.336,0,0.0587,0.0355,0.00273,0.427,0.58,121.883,217038,4
1991-12-14,63,Kiss You Back,Digital Underground,,False,63,61,5,0.844,0.648,9,-10.685,0,0.113,0.0386,0,0.223,0.794,113.074,221467,4
1991-12-14,65,On A Sunday Afternoon,Lighter Shade Of Brown,,False,71,65,3,0.784,0.765,1,-3.545,1,0.212,0.095,0,0.182,0.845,94.812,212880,4
1991-12-14,67,I Can't Make You Love Me,Bonnie Raitt,,False,68,67,4,0.588,0.149,7,-16.728,0,0.0319,0.846,9.65e-05,0.236,0.113,124.689,332960,4
1991-12-14,68,All She Wrote,Firehouse,,False,69,68,5,0.603,0.759,8,-10.393,1,0.0322,3.85e-05,0.0162,0.148,0.376,121.214,267427,4
1991-12-14,69,Just Want To Hold You,Jasmine Guy,,False,60,34,20,0.611,0.368,8,-13.701,1,0.0362,0.3,4.05e-05,0.0567,0.451,161.986,251867,4
1991-12-14,70,A Day In My Life (Without You),Lisette Melendez,,False,59,49,12,0.606,0.947,6,-4.446,0,0.0371,0.000874,0.314,0.0514,0.789,119.104,235040,4
1991-12-14,72,Hearts Don't Think (They Feel),Natural Selection,,False,92,72,2,0.511,0.73,7,-9.266,0,0.0496,0.0911,0.000295,0.0559,0.895,196.112,256667,4
1991-12-14,73,I Want You,Jody Watley,,False,79,73,3,0.76,0.611,9,-8.862,0,0.0661,0.000178,0.0157,0.0685,0.646,110.006,260533,4
1991-12-14,74,Pop That Coochie,The 2 Live Crew,,False,73,58,7,0.904,0.89,7,-6.708,1,0.176,0.000246,0.00174,0.113,0.647,127.811,257800,4
1991-12-14,75,Get A Leg Up,John Mellencamp,,False,53,14,11,0.6,0.914,2,-4.748,1,0.0468,0.00518,1.84e-06,0.0649,0.736,138.586,227200,4
1991-12-14,76,No More Tears,Ozzy Osbourne,,False,77,76,3,0.346,0.749,6,-6.506,1,0.035,0.00167,8.86e-05,0.648,0.315,102.591,443240,4
1991-12-14,77,The Comfort Zone,Vanessa Williams,,False,86,77,2,0.861,0.716,6,-13.518,1,0.104,0.0564,4.59e-05,0.388,0.59,105.049,240200,4
1991-12-14,78,Love Crazy,Atlantic Starr,,False,75,75,4,0.59,0.681,10,-9.642,0,0.11,0.00217,0.0197,0.064,0.846,188.186,286760,4
1991-12-14,79,Something Got Me Started,Simply Red,,False,56,23,12,0.698,0.91,2,-6.563,1,0.0459,0.019,7.73e-05,0.11,0.715,112.112,240706,4
1991-12-14,80,Rush,Big Audio,,False,76,32,13,0.791,0.768,9,-9.348,1,0.0957,0.137,3.85e-06,0.307,0.722,124.077,257133,4
1991-12-14,81,Conviction Of The Heart,Kenny Loggins,,False,82,65,8,0.491,0.5,7,-12.097,0,0.0377,0.439,5.63e-06,0.114,0.406,96.7,411267,4
1991-12-14,82,Within My Heart,Voyce,,False,87,82,3,0.69,0.942,1,-5.798,0,0.0729,0.00231,3.38e-05,0.199,0.575,120.533,240824,4
1991-12-14,83,All Through The Night,Tone-Loc,5XlgIjaIwqD5q5dVjdVo9V,True,0,83,1,0.699,0.577,6,-12.375,1,0.172,0.00243,0.0268,0.0581,0.802,177.213,295067,4
1991-12-14,84,Whispers,Corina,5XlgIjaIwqD5q5dVjdVo9V,False,83,51,12,0.652,0.803,4,-12.688,0,0.0546,0.00942,0.00183,0.349,0.441,122.699,287893,4
1991-12-14,85,What Time Is Love?,The KLF,5XlgIjaIwqD5q5dVjdVo9V,False,85,57,8,0.642,0.88,6,-5.216,1,0.134,0.00233,3.07e-05,0.916,0.576,120.099,235852,4
1991-12-14,86,Real Real Real,Jesus Jones,5XlgIjaIwqD5q5dVjdVo9V,False,70,4,17,0.596,0.547,0,-13.136,1,0.0331,0.0478,4.92e-05,0.157,0.697,110.209,188760,4
1991-12-14,87,In Paradise,Laissez Faire,5XlgIjaIwqD5q5dVjdVo9V,False,97,87,2,0.71,0.846,7,-6.677,1,0.0835,0.00881,0.0274,0.347,0.78,122.718,349893,4
1991-12-14,88,Uhh Ahh,Boyz II Men,0MrD47wtvAu6igsy8vqUzN,True,0,88,1,0.722,0.661,2,-8.236,1,0.0844,0.151,0,0.233,0.643,126.007,228867,4
1991-12-14,89,The Fly,U2,0MrD47wtvAu6igsy8vqUzN,False,80,61,6,0.507,0.934,11,-8.888,0,0.0553,3.52e-05,0.0253,0.161,0.417,108.345,269053,4
1991-12-14,90,Everybody Move,Cathy Dennis,1PTQfm3F27SV4SIe5MP9tT,True,0,90,1,0.722,0.922,9,-8.934,0,0.0476,0.0395,0.00142,0.139,0.604,115.537,207373,4
1991-12-14,92,Insatiable,Prince And The N.P.G.,3q4SUOc4upvsrFItSrELsX,True,0,92,1,0.736,0.339,9,-11.956,0,0.0453,0.441,0.00553,0.0778,0.374,121.782,399667,3
1991-12-14,93,Right Down To It,Damian Dame,31tcr4OcLi2TXE5u4Iwhjc,True,0,93,1,0.743,0.584,1,-11.274,0,0.0281,0.104,0,0.0755,0.818,91.914,294267,4
1991-12-14,95,Groovin',UB40,,False,90,90,4,0.817,0.561,2,-13.311,1,0.0539,0.00204,0.00879,0.0421,0.904,99.02,229973,4
1991-12-14,96,Lies,EMF,,False,78,18,12,0.543,0.864,8,-9.874,1,0.0381,0.000611,0.00223,0.207,0.759,113.952,259667,4
1991-12-14,97,Monsters And Angels,Voice Of The Beehive,,False,94,74,7,0.573,0.557,9,-9.778,1,0.0283,0.000247,2.26e-05,0.271,0.519,81.536,218146,4
1991-12-14,98,Into The Great Wide Open,Tom Petty And The Heartbreakers,,False,95,92,5,0.651,0.766,0,-9.935,1,0.0299,0.206,0.00103,0.362,0.949,116.74,242107,4
1991-12-14,99,Walk Through Fire,Bad Company,,False,89,28,17,0.626,0.698,7,-10.311,1,0.0325,0.00316,0.0211,0.331,0.72,122.965,288560,4
1991-12-14,100,Move Any Mountain,The Shamen,6l26mQLF7A4lu9djfIez7O,True,0,100,1,0.66,0.991,7,-5.288,1,0.055,0.0031,0.000122,0.061,0.796,121.467,208560,4
