date,position,title,artist,spotify_id,is_new,last_pos,peak_pos,weeks,danceability,energy,key,loudness,mode,speechiness,acousticness,instrumentalness,liveness,valence,tempo,duration_ms,time_signature
2020-12-26,1,Willow,Taylor Swift,0lx2cLdOt3piJbcaXIV74f,True,0,1,1,0.392,0.574,7,-9.195,1,0.17,0.833,0.00179,0.145,0.529,81.112,214707,4
2020-12-26,2,All I Want For Christmas Is You,Mariah Carey,0lx2cLdOt3piJbcaXIV74f,False,1,1,42,0.695,0.652,11,-7.828,0,0.0751,0.000441,5.66e-06,0.0667,0.744,128.024,401680,4
2020-12-26,3,Rockin' Around The Christmas Tree,Brenda Lee,0lx2cLdOt3piJbcaXIV74f,False,3,2,37,0.589,0.472,8,-8.749,1,0.0502,0.614,0,0.505,0.898,67.196,126267,4
2020-12-26,4,Jingle Bell Rock,Bobby Helms,0lx2cLdOt3piJbcaXIV74f,False,5,3,34,0.754,0.424,2,-8.463,1,0.0363,0.643,0,0.0652,0.806,119.705,130973,4
2020-12-26,5,Mood,24kGoldn Featuring iann dior,0lx2cLdOt3piJbcaXIV74f,False,2,1,19,0.7,0.722,7,-3.558,0,0.0369,0.221,0,0.272,0.756,90.989,140526,4
2020-12-26,6,A Holly Jolly Christmas,Burl Ives,0lx2cLdOt3piJbcaXIV74f,False,14,4,18,0.683,0.375,0,-13.056,1,0.0303,0.579,0,0.076,0.888,140.467,135533,4
2020-12-26,7,It's The Most Wonderful Time Of The Year,Andy Williams,0lx2cLdOt3piJbcaXIV74f,False,6,6,19,0.24,0.598,7,-8.435,1,0.0369,0.766,0,0.117,0.776,201.629,151933,3
2020-12-26,8,Positions,Ariana Grande,0lx2cLdOt3piJbcaXIV74f,False,4,1,8,0.737,0.802,0,-4.771,1,0.0878,0.468,0,0.0931,0.682,144.015,172325,4
2020-12-26,9,Dynamite,BTS,0lx2cLdOt3piJbcaXIV74f,False,24,1,17,0.746,0.765,6,-4.41,0,0.0993,0.0112,0,0.0936,0.737,114.044,199054,4
2020-12-26,10,Feliz Navidad,Jose Feliciano,0lx2cLdOt3piJbcaXIV74f,False,10,10,13,0.513,0.831,2,-9.004,1,0.0383,0.55,0,0.336,0.963,148.837,182067,4
2020-12-26,11,"Let It Snow, Let It Snow, Let It Snow",Dean Martin,0lx2cLdOt3piJbcaXIV74f,False,15,11,12,0.451,0.24,1,-14.014,1,0.0351,0.912,2.45e-06,0.175,0.701,134.009,117147,4
2020-12-26,12,It's Beginning To Look A Lot Like Christmas,Perry Como And The Fontane Sisters With Mitchell Ayres And His Orchestra,0lx2cLdOt3piJbcaXIV74f,False,35,12,7,0.724,0.276,7,-12.25,1,0.0599,0.76,0,0.116,0.718,112.874,155933,4
2020-12-26,13,Holy,Justin Bieber Featuring Chance The Rapper,0lx2cLdOt3piJbcaXIV74f,False,9,3,13,0.673,0.704,6,-8.056,1,0.36,0.196,0,0.0898,0.372,86.919,212093,4
2020-12-26,14,Last Christmas,Wham!,0lx2cLdOt3piJbcaXIV74f,False,11,11,18,0.735,0.478,2,-12.472,1,0.0293,0.189,2.48e-06,0.355,0.947,107.682,262960,4
2020-12-26,15,The Christmas Song (Merry Christmas To You),Nat King Cole,0lx2cLdOt3piJbcaXIV74f,False,16,11,25,0.319,0.21,1,-15.231,1,0.0341,0.92,8.06e-05,0.138,0.209,78.696,192160,4
2020-12-26,16,Go Crazy,Chris Brown & Young Thug,0lx2cLdOt3piJbcaXIV74f,False,13,9,32,0.755,0.578,0,-8.932,0,0.145,0.316,0,0.25,0.581,94.148,176960,4
2020-12-26,17,Laugh Now Cry Later,Drake Featuring Lil Durk,0lx2cLdOt3piJbcaXIV74f,False,8,2,18,0.761,0.518,0,-8.871,1,0.134,0.244,3.47e-05,0.107,0.522,133.976,261493,4
2020-12-26,18,Blinding Lights,The Weeknd,0lx2cLdOt3piJbcaXIV74f,False,7,1,55,0.514,0.73,1,-5.934,1,0.0598,0.00146,9.54e-05,0.0897,0.334,171.005,200040,4
2020-12-26,19,Sleigh Ride,The Ronettes,0lx2cLdOt3piJbcaXIV74f,False,20,19,10,0.529,0.772,2,-7.013,1,0.0287,0.403,2.21e-06,0.316,0.853,91.751,181267,4
2020-12-26,20,I Hope,Gabby Barrett Featuring Charlie Puth,0lx2cLdOt3piJbcaXIV74f,False,12,3,51,0.466,0.536,6,-6.227,1,0.0429,0.0951,0,0.114,0.377,75.998,210773,4
2020-12-26,21,Champagne Problems,Taylor Swift,0sY6ZUTh4yoctD8VIXz339,True,0,21,1,0.462,0.24,0,-12.077,1,0.0377,0.92,0,0.113,0.32,171.319,244000,4
2020-12-26,22,Body,Megan Thee Stallion,0sY6ZUTh4yoctD8VIXz339,False,18,12,4,0.914,0.732,8,-6.1,0,0.241,0.0166,0,0.107,0.469,94.066,171067,4
2020-12-26,23,Dakiti,Bad Bunny & Jhay Cortez,0sY6ZUTh4yoctD8VIXz339,False,17,5,7,0.731,0.573,4,-10.059,0,0.0544,0.401,5.22e-05,0.113,0.145,109.928,205090,4
2020-12-26,24,Lemonade,Internet Money & Gunna Featuring Don Toliver & NAV,0sY6ZUTh4yoctD8VIXz339,False,19,6,18,0.799,0.66,1,-6.153,0,0.079,0.256,0,0.111,0.471,140.04,195429,4
2020-12-26,25,For The Night,Pop Smoke Featuring Lil Baby & DaBaby,0sY6ZUTh4yoctD8VIXz339,False,21,6,24,0.823,0.586,6,-6.606,0,0.2,0.114,0,0.193,0.347,125.971,190476,4
2020-12-26,26,Happy Holiday / The Holiday Season,Andy Williams,0sY6ZUTh4yoctD8VIXz339,False,29,24,7,0.505,0.451,9,-10.193,0,0.0329,0.727,0,0.233,0.744,74.347,156867,4
2020-12-26,27,Levitating,Dua Lipa Featuring DaBaby,0sY6ZUTh4yoctD8VIXz339,False,27,20,11,0.702,0.825,6,-3.787,0,0.0601,0.00883,0,0.0674,0.915,102.977,203064,4
2020-12-26,28,Underneath The Tree,Kelly Clarkson,0sY6ZUTh4yoctD8VIXz339,False,25,25,8,0.509,0.812,8,-5.439,1,0.0537,0.00128,1.99e-05,0.214,0.689,159.878,229640,4
2020-12-26,29,Run Rudolph Run,Chuck Berry,0sY6ZUTh4yoctD8VIXz339,False,40,29,7,0.681,0.715,7,-10.609,0,0.0912,0.812,9.43e-06,0.0777,0.957,152.132,165733,4
2020-12-26,30,Kings & Queens,Ava Max,0sY6ZUTh4yoctD8VIXz339,False,22,13,19,0.637,0.69,1,-4.057,0,0.0405,0.00786,0,0.124,0.457,129.857,162399,4
2020-12-26,31,Rudolph The Red-Nosed Reindeer,Gene Autry,0sY6ZUTh4yoctD8VIXz339,False,34,16,11,0.834,0.371,1,-11.99,1,0.0358,0.799,0,0.275,0.976,96.628,150267,4
2020-12-26,32,Santa Tell Me,Ariana Grande,0sY6ZUTh4yoctD8VIXz339,False,39,32,7,0.525,0.621,7,-7.364,1,0.116,0.0489,0,0.294,0.591,191.9,204093,4
2020-12-26,33,Bang!,AJR,0sY6ZUTh4yoctD8VIXz339,False,28,24,24,0.74,0.516,1,-6.233,0,0.0507,0.0183,0,0.0558,0.698,139.918,170858,4
2020-12-26,34,"No Body, No Crime",Taylor Swift Featuring HAIM,1WVtja0Mr9SeouWG393jQ8,True,0,34,1,0.532,0.612,7,-7.576,0,0.0272,0.421,0,0.102,0.529,79.026,215627,4
2020-12-26,35,34+35,Ariana Grande,1WVtja0Mr9SeouWG393jQ8,False,26,8,7,0.83,0.585,0,-6.476,1,0.094,0.237,0,0.248,0.485,109.978,173711,4
2020-12-26,36,Therefore I Am,Billie Eilish,1WVtja0Mr9SeouWG393jQ8,False,23,2,6,0.889,0.34,11,-7.773,0,0.0697,0.218,0.13,0.055,0.716,94.009,174321,4
2020-12-26,37,Christmas (Baby Please Come Home),Darlene Love,1WVtja0Mr9SeouWG393jQ8,False,31,29,6,0.325,0.759,8,-7.146,1,0.053,0.395,0.000362,0.0773,0.36,126.627,166453,4
2020-12-26,38,White Christmas,Bing Crosby,1WVtja0Mr9SeouWG393jQ8,False,32,12,19,0.317,0.158,9,-16.485,1,0.0381,0.673,0.353,0.338,0.247,130.503,177480,3
2020-12-26,39,'Tis The Damn Season,Taylor Swift,7dW84mWkdWE5a6lFWxJCBG,True,0,39,1,0.575,0.434,5,-8.193,1,0.0312,0.735,6.59e-05,0.105,0.348,145.916,229840,4
2020-12-26,40,Gold Rush,Taylor Swift,5BK0uqwY9DNfZ630STAEaq,True,0,40,1,0.512,0.462,9,-10.491,1,0.0408,0.83,0.166,0.121,0.353,112.05,185320,4
2020-12-26,41,Tequila Shots,Kid Cudi,30KctD1WsHKTIYczXjip5a,True,0,41,1,0.712,0.556,5,-7.214,0,0.0531,0.084,5.04e-05,0.527,0.22,90.494,193293,4
2020-12-26,42,It's Beginning To Look A Lot Like Christmas,Michael Buble,30KctD1WsHKTIYczXjip5a,False,33,33,4,0.339,0.214,4,-11.714,1,0.0375,0.908,7.47e-06,0.341,0.363,94.775,206640,3
2020-12-26,43,(There's No Place Like) Home For The Holidays,Perry Como,30KctD1WsHKTIYczXjip5a,False,37,32,6,0.724,0.276,7,-12.25,1,0.0599,0.76,0,0.116,0.718,112.874,155933,4
2020-12-26,44,Whats Poppin,"Jack Harlow Featuring DaBaby, Tory Lanez & Lil Wayne",30KctD1WsHKTIYczXjip5a,False,47,2,45,0.904,0.723,11,-5.224,0,0.26,0.0631,0,0.185,0.835,145.013,227478,4
2020-12-26,45,Tolerate It,Taylor Swift,0PurA4JVJ8YQgSVopY8fn6,True,0,45,1,0.316,0.361,9,-10.381,1,0.0488,0.878,2.67e-05,0.0797,0.221,74.952,245440,5
2020-12-26,46,Wonderful Christmastime,Paul McCartney,0PurA4JVJ8YQgSVopY8fn6,False,45,45,3,0.774,0.511,11,-8.914,1,0.0319,0.322,0,0.0672,0.771,94.736,227653,4
2020-12-26,47,Deck The Halls,Nat King Cole,2I5xeRHcOIA20a6B9RJSS0,True,0,47,1,0.636,0.393,9,-10.889,1,0.0394,0.652,0,0.0845,0.97,107.175,69000,4
2020-12-26,48,What You Know Bout Love,Pop Smoke,2I5xeRHcOIA20a6B9RJSS0,False,46,25,15,0.709,0.548,10,-8.493,1,0.353,0.65,1.59e-06,0.133,0.543,83.995,160000,4
2020-12-26,49,She Knows This,Kid Cudi,1xzUQMiCoY5pdego0pHMeV,True,0,49,1,0.39,0.724,6,-7.607,0,0.0889,0.162,0,0.393,0.312,165.945,216560,4
2020-12-26,50,Rockstar,DaBaby Featuring Roddy Ricch,1xzUQMiCoY5pdego0pHMeV,False,42,1,35,0.746,0.69,11,-7.956,1,0.164,0.247,0,0.101,0.497,89.977,181733,4
2020-12-26,51,Lonely,Justin Bieber & benny blanco,1xzUQMiCoY5pdego0pHMeV,False,50,14,9,0.631,0.239,11,-7.071,0,0.0398,0.864,0,0.116,0.0927,79.859,149297,4
2020-12-26,52,Happiness,Taylor Swift,73YUReisjb3A9ActdLLjJQ,True,0,52,1,0.559,0.334,11,-10.733,1,0.0376,0.87,0,0.114,0.211,122.079,315147,4
2020-12-26,53,Whoopty,CJ,73YUReisjb3A9ActdLLjJQ,False,51,51,6,0.719,0.648,3,-7.6,0,0.125,0.2,0,0.127,0.66,140.201,123263,4
2020-12-26,54,Show Out,"Kid Cudi, Skepta & Pop Smoke",5CFJRZRq6sdKKtRwNPWbYv,True,0,54,1,0.619,0.589,1,-6.531,1,0.124,0.43,0.000392,0.378,0.158,143.896,174960,4
2020-12-26,55,WAP,Cardi B Featuring Megan Thee Stallion,5CFJRZRq6sdKKtRwNPWbYv,False,43,1,19,0.935,0.454,1,-7.509,1,0.375,0.0194,0,0.0824,0.357,133.073,187541,4
2020-12-26,56,Holiday,Lil Nas X,5CFJRZRq6sdKKtRwNPWbYv,False,48,37,5,0.81,0.511,5,-6.924,0,0.164,0.12,0,0.0832,0.837,151.947,154998,4
2020-12-26,57,Evermore,Taylor Swift Featuring Bon Iver,3O5osWf1rSoKMwe6E9ZaXP,True,0,57,1,0.39,0.27,1,-10.673,1,0.0308,0.937,0.00227,0.111,0.32,125.177,304107,5
2020-12-26,58,Take Me Home For Christmas,Dan + Shay,3O5osWf1rSoKMwe6E9ZaXP,False,88,58,2,0.694,0.769,6,-4.665,1,0.0325,0.163,0,0.0976,0.663,93.033,203880,4
2020-12-26,59,Better Together,Luke Combs,3O5osWf1rSoKMwe6E9ZaXP,False,54,30,11,0.552,0.225,0,-11.501,1,0.0477,0.827,0,0.111,0.67,138.002,219573,4
2020-12-26,60,On Me,Lil Baby,3O5osWf1rSoKMwe6E9ZaXP,False,30,30,2,0.856,0.564,6,-6.295,0,0.392,0.00327,0,0.134,0.483,77.972,135960,4
2020-12-26,61,Ivy,Taylor Swift,19CSr8rwW05VJL2F91KFNK,True,0,61,1,0.515,0.545,2,-9.277,1,0.0353,0.855,1.97e-05,0.0921,0.535,88.856,260440,4
2020-12-26,62,Monster,Shawn Mendes & Justin Bieber,19CSr8rwW05VJL2F91KFNK,False,38,8,4,0.652,0.383,2,-7.076,0,0.0516,0.0676,0,0.0828,0.549,145.765,178994,4
2020-12-26,63,Coney Island,Taylor Swift Featuring The National,3k7ne7VmH43ZPWxPdvPUgR,True,0,63,1,0.537,0.537,8,-11.266,1,0.0617,0.819,0.000904,0.142,0.292,107.895,275320,4
2020-12-26,64,Another Day,Kid Cudi,6myUpr3GDR80Dg3zqNTmmG,True,0,64,1,0.646,0.758,4,-7.75,0,0.0708,0.556,0.00316,0.335,0.0642,172.995,199787,4
2020-12-26,65,Hawai,Maluma & The Weeknd,6myUpr3GDR80Dg3zqNTmmG,False,55,12,17,0.766,0.788,6,-3.128,0,0.312,0.105,5.81e-06,0.142,0.609,179.984,200482,4
2020-12-26,66,Diamonds,Sam Smith,6myUpr3GDR80Dg3zqNTmmG,False,53,40,13,0.653,0.667,10,-6.764,0,0.0423,0.154,0,0.107,0.556,104.181,213869,4
2020-12-26,67,Dorothea,Taylor Swift,1AqPh4lgiWPEkBAzvuasGJ,True,0,67,1,0.606,0.491,4,-8.357,1,0.0263,0.69,0,0.128,0.36,119.951,225880,4
2020-12-26,68,Long Story Short,Taylor Swift,2o2sgVJIgFXk8GQjWTgI6U,True,0,68,1,0.546,0.73,0,-7.704,1,0.0417,0.66,0.179,0.0972,0.573,157.895,215920,4
2020-12-26,69,Here Comes Santa Claus (Right Down Santa Claus Lane),Gene Autry,2o2sgVJIgFXk8GQjWTgI6U,False,36,28,9,0.834,0.371,1,-11.99,1,0.0358,0.799,0,0.275,0.976,96.628,150267,4
2020-12-26,70,I Should Probably Go To Bed,Dan + Shay,2o2sgVJIgFXk8GQjWTgI6U,False,60,42,20,0.721,0.277,1,-7.128,1,0.0365,0.634,0,0.112,0.309,131.935,171827,4
2020-12-26,71,Cowboy Like Me,Taylor Swift,1XjHRolIXL2M1EEOUsGGR4,True,0,71,1,0.604,0.517,0,-9.014,1,0.0347,0.768,0.000155,0.123,0.511,127.967,275040,4
2020-12-26,72,Starting Over,Chris Stapleton,1XjHRolIXL2M1EEOUsGGR4,False,58,25,16,0.638,0.538,10,-8.445,1,0.0315,0.452,0.000415,0.0695,0.318,89.124,240413,4
2020-12-26,73,"Big, Big Plans",Chris Lane,1XjHRolIXL2M1EEOUsGGR4,False,52,42,11,0.574,0.58,7,-6.091,1,0.0278,0.076,0,0.12,0.4,149.974,187307,4
2020-12-26,74,Way Out,Jack Harlow Featuring Big Sean,6rLi6PyWXu1rPlShuIZpj6,True,0,74,1,0.945,0.582,11,-8.357,0,0.0719,0.114,0,0.103,0.907,108.025,168906,4
2020-12-26,75,Marjorie,Taylor Swift,2VXxvZu6zlvV28lYbBvsv0,True,0,75,1,0.532,0.561,5,-11.609,1,0.0484,0.878,0.000143,0.115,0.288,96.123,257773,4
2020-12-26,76,B.S.,Jhene Aiko Featuring H.E.R.,2VXxvZu6zlvV28lYbBvsv0,False,62,24,20,0.617,0.525,8,-10.426,0,0.12,0.554,1.1e-06,0.135,0.377,135.781,212867,4
2020-12-26,77,Tyler Herro,Jack Harlow,2VXxvZu6zlvV28lYbBvsv0,False,77,34,8,0.794,0.756,5,-7.16,0,0.136,0.11,0,0.247,0.775,123.066,156498,4
2020-12-26,79,You Broke Me First.,Tate McRae,,False,64,50,17,0.642,0.374,4,-9.386,1,0.0545,0.786,0,0.0906,0.0799,124.099,169266,4
2020-12-26,80,Dive,Kid Cudi,7Hc3YL8oDiAzbiAW32KXrw,True,0,80,1,0.64,0.621,9,-8.269,0,0.0679,0.67,0,0.36,0.332,123.105,148707,4
2020-12-26,81,Without You,The Kid LAROI,7Hc3YL8oDiAzbiAW32KXrw,False,63,63,2,0.662,0.413,0,-7.357,1,0.0299,0.213,0,0.134,0.467,93.005,161385,4
2020-12-26,82,Closure,Taylor Swift,35rdVq36LMHQX0Suw9a6tK,True,0,82,1,0.689,0.704,9,-10.813,1,0.245,0.835,4.83e-06,0.134,0.92,151.884,180653,5
2020-12-26,83,Love You Like I Used To,Russell Dickerson,35rdVq36LMHQX0Suw9a6tK,False,61,31,15,0.501,0.788,10,-4.624,1,0.0415,0.12,0,0.137,0.61,152.047,186613,4
2020-12-26,84,Hallelujah,Carrie Underwood & John Legend,35rdVq36LMHQX0Suw9a6tK,False,96,84,2,0.335,0.43,5,-5.364,1,0.0322,0.846,0,0.126,0.379,78.259,275099,5
2020-12-26,85,Heaven On Earth,Kid Cudi,2koUj1Fn5TKFEkChSmBPIb,True,0,85,1,0.786,0.61,0,-6.736,1,0.0558,0.379,0.00082,0.0765,0.228,130.036,201093,4
2020-12-26,86,My Ex's Best Friend,Machine Gun Kelly X blackbear,2koUj1Fn5TKFEkChSmBPIb,False,67,28,18,0.731,0.675,5,-5.134,0,0.0434,0.00473,0,0.141,0.298,124.939,139461,4
2020-12-26,87,Rockin' Around The Christmas Tree,Justin Bieber,2koUj1Fn5TKFEkChSmBPIb,False,71,71,3,0.623,0.668,6,-7.282,0,0.0531,0.475,0,0.0862,0.823,161.948,183067,4
2020-12-26,88,Mr. Right Now,21 Savage & Metro Boomin Featuring Drake,2koUj1Fn5TKFEkChSmBPIb,False,65,10,11,0.647,0.667,5,-5.563,1,0.304,0.231,0,0.133,0.704,172.08,193839,4
2020-12-26,89,Reminds Me Of You,The Kid LAROI & Juice WRLD,5YSHygGN9D0mID1NsVd5my,True,0,89,1,0.613,0.631,4,-6.965,1,0.12,0.0663,0,0.169,0.33,149.992,158033,4
2020-12-26,90,Sad People,Kid Cudi,4nuAslShoN77tq12fzwjUq,True,0,90,1,0.636,0.647,5,-6.971,0,0.0381,0.247,0.00123,0.113,0.416,158.073,176027,4
2020-12-26,91,Damaged,Kid Cudi,2n7Ao4nyESBa5ti8gcAbBt,True,0,91,1,0.625,0.581,8,-7.1,1,0.0316,0.553,0.00111,0.254,0.267,142.04,150853,4
2020-12-26,92,Forever After All,Luke Combs,2n7Ao4nyESBa5ti8gcAbBt,False,66,2,8,0.487,0.65,0,-5.195,1,0.0253,0.191,0,0.0933,0.456,151.964,232533,4
2020-12-26,93,Ain't Always The Cowboy,Jon Pardi,2n7Ao4nyESBa5ti8gcAbBt,False,56,55,16,0.539,0.837,9,-3.458,1,0.0385,0.0094,0,0.262,0.551,151.913,220881,4
2020-12-26,94,Prisoner,Miley Cyrus Featuring Dua Lipa,2n7Ao4nyESBa5ti8gcAbBt,False,68,54,4,0.781,0.67,3,-3.912,0,0.0452,0.0103,0,0.0761,0.595,127.99,169333,4
2020-12-26,95,Cry Baby,Megan Thee Stallion Featuring DaBaby,2n7Ao4nyESBa5ti8gcAbBt,False,0,71,2,0.957,0.437,11,-7.882,1,0.359,0.00402,0,0.219,0.616,130.058,137984,4
2020-12-26,96,Good Time,Niko Moon,2n7Ao4nyESBa5ti8gcAbBt,False,79,71,11,0.79,0.646,5,-5.878,1,0.0447,0.132,0,0.295,0.641,138.047,214707,4
2020-12-26,97,Throat Baby (Go Baby),BRS Kash,2n7Ao4nyESBa5ti8gcAbBt,False,81,69,9,0.878,0.475,1,-8.42,0,0.324,0.00984,0,0.167,0.397,131.988,211610,4
2020-12-26,98,Errbody,Lil Baby,2n7Ao4nyESBa5ti8gcAbBt,False,41,41,2,0.887,0.606,2,-6.572,1,0.324,0.000407,0,0.151,0.272,139.995,210699,4
2020-12-26,100,Beautiful Trip,Kid Cudi,4IIuCotvqijraSdnVLaFnM,True,0,100,1,0.331,0.513,11,-15.392,0,0.632,0.972,0.953,0.882,0.42,133.971,37013,4
