date,position,title,artist,spotify_id,is_new,last_pos,peak_pos,weeks,danceability,energy,key,loudness,mode,speechiness,acousticness,instrumentalness,liveness,valence,tempo,duration_ms,time_signature
2012-11-17,1,One More Night,Maroon 5,6MVdz8I7oYm86MRzZiOZa8,False,1,1,20,0.718,0.82,5,-3.453,0,0.0323,0.0444,0,0.0846,0.613,92.998,219467,4
2012-11-17,2,Gangnam Style,PSY,6MVdz8I7oYm86MRzZiOZa8,False,2,2,9,0.727,0.937,11,-2.871,0,0.286,0.00417,0,0.091,0.749,132.067,219493,4
2012-11-17,3,Some Nights,fun.,6MVdz8I7oYm86MRzZiOZa8,False,3,3,37,0.672,0.738,0,-7.045,1,0.0506,0.0178,6.75e-05,0.0927,0.392,107.938,277040,4
2012-11-17,4,Diamonds,Rihanna,6MVdz8I7oYm86MRzZiOZa8,False,5,4,6,0.564,0.71,11,-4.92,0,0.0461,0.00125,0,0.109,0.393,91.972,225147,4
2012-11-17,5,We Are Never Ever Getting Back Together,Taylor Swift,6MVdz8I7oYm86MRzZiOZa8,False,11,1,13,0.628,0.676,7,-5.911,1,0.0916,0.00957,2.65e-05,0.121,0.75,85.984,193147,4
2012-11-17,6,Die Young,Ke$ha,6MVdz8I7oYm86MRzZiOZa8,False,4,4,6,0.711,0.7,1,-4.805,0,0.046,0.00498,0.000125,0.215,0.801,128.001,211920,4
2012-11-17,7,Locked Out Of Heaven,Bruno Mars,6MVdz8I7oYm86MRzZiOZa8,False,7,7,5,0.726,0.698,5,-4.165,1,0.0431,0.049,0,0.309,0.867,143.994,233478,4
2012-11-17,8,As Long As You Love Me,Justin Bieber Featuring Big Sean,6MVdz8I7oYm86MRzZiOZa8,False,6,6,20,0.571,0.873,0,-3.382,0,0.1,0.0811,0,0.361,0.613,139.691,229467,4
2012-11-17,9,Too Close,Alex Clare,6MVdz8I7oYm86MRzZiOZa8,False,8,7,32,0.584,0.712,11,-4.311,0,0.0395,0.0112,1.05e-06,0.114,0.286,126.043,256560,4
2012-11-17,10,Let Me Love You (Until You Learn To Love Yourself),Ne-Yo,6MVdz8I7oYm86MRzZiOZa8,False,9,9,14,0.669,0.723,5,-5.2,1,0.0346,0.213,0,0.523,0.269,124.925,252227,4
2012-11-17,11,Don't Wake Me Up,Chris Brown,6MVdz8I7oYm86MRzZiOZa8,False,10,10,19,0.602,0.691,7,-5.197,0,0.051,0.0548,0,0.144,0.206,127.967,222307,4
2012-11-17,12,I Cry,Flo Rida,6MVdz8I7oYm86MRzZiOZa8,False,15,12,6,0.693,0.822,4,-5.441,0,0.0439,0.00616,1.79e-06,0.315,0.763,126.035,223800,4
2012-11-17,13,Home,Phillip Phillips,6MVdz8I7oYm86MRzZiOZa8,False,14,9,19,0.606,0.826,0,-6.04,1,0.0307,0.0256,1.56e-05,0.117,0.322,121.04,210173,4
2012-11-17,14,Good Time,Owl City & Carly Rae Jepsen,6MVdz8I7oYm86MRzZiOZa8,False,13,8,19,0.56,0.872,3,-4.269,1,0.14,0.0239,6.98e-06,0.371,0.682,126.05,205933,4
2012-11-17,15,Blow Me (One Last Kiss),P!nk,6MVdz8I7oYm86MRzZiOZa8,False,12,5,18,0.597,0.919,7,-2.954,1,0.044,0.000145,0,0.282,0.73,113.987,255587,4
2012-11-17,16,Clique,"Kanye West, Jay-Z, Big Sean",6MVdz8I7oYm86MRzZiOZa8,False,16,12,9,0.704,0.569,7,-4.998,0,0.247,0.0488,0,0.191,0.313,109.314,293533,5
2012-11-17,17,Ho Hey,The Lumineers,6MVdz8I7oYm86MRzZiOZa8,False,19,17,22,0.685,0.466,0,-9.074,1,0.0304,0.794,2.06e-06,0.0915,0.353,79.936,163133,4
2012-11-17,18,Adorn,Miguel,6MVdz8I7oYm86MRzZiOZa8,False,18,18,14,0.625,0.576,11,-5.693,0,0.175,0.0543,4.07e-05,0.187,0.235,179.063,193147,4
2012-11-17,19,Lights,Ellie Goulding,6MVdz8I7oYm86MRzZiOZa8,False,17,2,46,0.681,0.802,8,-5.836,0,0.0347,0.0271,0.0496,0.127,0.791,120.053,212707,4
2012-11-17,20,Cruise,Florida Georgia Line Featuring Nelly,6MVdz8I7oYm86MRzZiOZa8,False,24,20,12,0.457,0.948,10,-3.364,1,0.0354,0.0191,0,0.0536,0.878,148.0,208960,4
2012-11-17,21,Blown Away,Carrie Underwood,6MVdz8I7oYm86MRzZiOZa8,False,23,20,18,0.531,0.843,9,-2.569,0,0.0429,0.0909,0,0.0283,0.392,136.991,240133,4
2012-11-17,22,Girl On Fire,Alicia Keys Featuring Nicki Minaj,6MVdz8I7oYm86MRzZiOZa8,False,28,22,9,0.482,0.706,9,-5.762,1,0.0609,0.135,0.00106,0.105,0.144,92.494,224920,4
2012-11-17,23,Wanted,Hunter Hayes,6MVdz8I7oYm86MRzZiOZa8,False,41,16,28,0.421,0.476,0,-7.692,1,0.0298,0.268,0,0.0816,0.3,169.784,228840,4
2012-11-17,24,50 Ways To Say Goodbye,Train,6MVdz8I7oYm86MRzZiOZa8,False,21,20,17,0.591,0.935,6,-2.664,1,0.0478,0.000284,0.000278,0.142,0.736,140.043,247947,4
2012-11-17,25,Swimming Pools (Drank),Kendrick Lamar,6MVdz8I7oYm86MRzZiOZa8,False,32,25,12,0.577,0.447,8,-5.892,1,0.277,0.00627,0.00022,0.0899,0.189,74.236,247800,4
2012-11-17,26,Everybody Talks,Neon Trees,6MVdz8I7oYm86MRzZiOZa8,False,20,6,34,0.471,0.924,8,-3.906,1,0.0586,0.00301,0,0.313,0.725,154.961,177280,4
2012-11-17,27,Hard To Love,Lee Brice,6MVdz8I7oYm86MRzZiOZa8,False,35,27,21,0.638,0.722,9,-6.177,1,0.0332,0.0119,0.00808,0.189,0.469,103.017,224293,4
2012-11-17,28,Whistle,Flo Rida,6MVdz8I7oYm86MRzZiOZa8,False,22,1,25,0.747,0.937,0,-5.746,1,0.0453,0.0208,0,0.29,0.739,103.976,224653,4
2012-11-17,29,Kiss Tomorrow Goodbye,Luke Bryan,6MVdz8I7oYm86MRzZiOZa8,False,40,29,11,0.571,0.937,5,-3.467,0,0.0365,0.0064,0,0.316,0.584,115.013,203133,4
2012-11-17,30,Call Me Maybe,Carly Rae Jepsen,6MVdz8I7oYm86MRzZiOZa8,False,25,1,37,0.783,0.58,7,-6.548,1,0.0408,0.0114,2.28e-06,0.108,0.66,120.021,193400,4
2012-11-17,31,It's Time,Imagine Dragons,6MVdz8I7oYm86MRzZiOZa8,False,30,30,22,0.656,0.884,2,-4.748,1,0.0372,0.0162,0,0.145,0.86,105.009,237987,4
2012-11-17,32,Somebody That I Used To Know,Gotye Featuring Kimbra,6MVdz8I7oYm86MRzZiOZa8,False,26,1,44,0.864,0.495,0,-7.036,1,0.037,0.591,0.000133,0.0992,0.72,129.062,244973,4
2012-11-17,33,Wide Awake,Katy Perry,6MVdz8I7oYm86MRzZiOZa8,False,27,2,24,0.514,0.683,5,-5.099,1,0.0367,0.0749,2.64e-06,0.392,0.575,159.814,220947,4
2012-11-17,34,Payphone,Maroon 5 Featuring Wiz Khalifa,6MVdz8I7oYm86MRzZiOZa8,False,33,2,29,0.739,0.756,4,-4.828,1,0.0394,0.0136,0,0.37,0.523,110.028,231387,4
2012-11-17,35,The A Team,Ed Sheeran,6MVdz8I7oYm86MRzZiOZa8,False,34,34,17,0.642,0.289,9,-9.918,1,0.0367,0.669,0,0.18,0.407,84.996,258373,4
2012-11-17,36,Titanium,David Guetta Featuring Sia,6MVdz8I7oYm86MRzZiOZa8,False,29,7,30,0.604,0.788,0,-3.673,0,0.103,0.0678,0.153,0.127,0.301,126.06,245040,4
2012-11-17,37,Finally Found You,Enrique Iglesias Featuring Sammy Adams,6MVdz8I7oYm86MRzZiOZa8,False,31,24,8,0.622,0.881,6,-4.871,0,0.0956,0.0109,0,0.348,0.664,127.958,220813,4
2012-11-17,38,I Will Wait,Mumford & Sons,6MVdz8I7oYm86MRzZiOZa8,False,37,23,13,0.48,0.756,1,-5.399,1,0.0333,0.00993,0.00704,0.312,0.447,131.127,276720,4
2012-11-17,39,Live While We're Young,One Direction,6MVdz8I7oYm86MRzZiOZa8,False,39,3,5,0.663,0.857,2,-2.16,1,0.0544,0.0542,0,0.144,0.931,126.039,200213,4
2012-11-17,40,Pop That,"French Montana Featuring Rick Ross, Drake, Lil Wayne",6MVdz8I7oYm86MRzZiOZa8,False,36,36,17,0.734,0.892,2,-1.856,1,0.125,0.0648,0,0.58,0.605,138.031,303533,4
2012-11-17,41,Mercy,"Kanye West, Big Sean, Pusha T, 2 Chainz",6MVdz8I7oYm86MRzZiOZa8,False,38,13,31,0.563,0.496,6,-9.381,0,0.406,0.0685,5.8e-05,0.173,0.426,139.993,329320,4
2012-11-17,42,Bandz A Make Her Dance,Juicy J Featuring Lil Wayne & 2 Chainz,6MVdz8I7oYm86MRzZiOZa8,False,43,42,8,0.871,0.743,2,-5.442,1,0.277,0.00212,0,0.141,0.576,130.977,278827,4
2012-11-17,43,I Won't Give Up,Jason Mraz,6MVdz8I7oYm86MRzZiOZa8,False,49,8,44,0.585,0.303,4,-10.058,1,0.0398,0.694,0,0.115,0.142,136.703,240166,3
2012-11-17,44,Thinkin Bout You,Frank Ocean,6MVdz8I7oYm86MRzZiOZa8,False,45,39,17,0.721,0.339,0,-11.195,1,0.0532,0.409,0.00153,0.0973,0.2,129.83,200747,4
2012-11-17,45,Give Your Heart A Break,Demi Lovato,6MVdz8I7oYm86MRzZiOZa8,False,42,16,31,0.651,0.695,6,-3.218,1,0.0487,0.23,0,0.144,0.569,123.008,205347,4
2012-11-17,46,Hall Of Fame,The Script Featuring will.i.am,6MVdz8I7oYm86MRzZiOZa8,False,53,46,6,0.421,0.873,10,-4.343,1,0.0565,0.0653,0,0.123,0.63,84.803,202533,4
2012-11-17,47,Fastest Girl In Town,Miranda Lambert,6MVdz8I7oYm86MRzZiOZa8,False,56,47,15,0.541,0.911,1,-3.6,0,0.0631,0.0205,0.00155,0.275,0.563,145.057,197600,4
2012-11-17,48,Birthday Song,2 Chainz Featuring Kanye West,6MVdz8I7oYm86MRzZiOZa8,False,47,47,13,0.753,0.59,1,-2.623,1,0.0485,0.0591,0,0.15,0.161,140.002,306600,4
2012-11-17,49,No Lie,2 Chainz Featuring Drake,6MVdz8I7oYm86MRzZiOZa8,False,46,24,26,0.634,0.665,6,-5.984,0,0.176,0.0172,0,0.365,0.611,131.108,237827,4
2012-11-17,50,Feel Again,OneRepublic,6MVdz8I7oYm86MRzZiOZa8,False,50,50,10,0.467,0.815,7,-7.929,0,0.0524,0.0198,1.23e-06,0.118,0.335,140.047,185080,4
2012-11-17,51,The One That Got Away,Jake Owen,6MVdz8I7oYm86MRzZiOZa8,False,51,51,13,0.576,0.865,0,-3.288,1,0.0407,0.0343,5.32e-05,0.252,0.535,119.913,194173,4
2012-11-17,52,2 Reasons,Trey Songz Featuring T.I.,6MVdz8I7oYm86MRzZiOZa8,False,48,43,18,0.734,0.746,11,-5.088,1,0.0762,0.00135,0,0.178,0.539,94.033,197627,4
2012-11-17,53,Better Dig Two,The Band Perry,3z0a8G407NbxfjTRffvQiP,True,0,53,1,0.64,0.669,7,-5.17,1,0.0519,0.413,0,0.0779,0.646,155.844,194680,4
2012-11-17,54,Beauty And A Beat,Justin Bieber Featuring Nicki Minaj,3z0a8G407NbxfjTRffvQiP,False,70,54,4,0.602,0.843,0,-4.831,1,0.0593,0.000688,5.27e-05,0.0682,0.526,128.003,227987,4
2012-11-17,55,Turn On The Lights,Future,3z0a8G407NbxfjTRffvQiP,False,54,50,13,0.596,0.574,6,-9.373,0,0.212,0.0409,0,0.147,0.439,131.075,248360,4
2012-11-17,56,Skyfall,Adele,3z0a8G407NbxfjTRffvQiP,False,52,8,5,0.346,0.552,0,-6.864,0,0.0282,0.417,0,0.114,0.0789,75.881,286480,4
2012-11-17,57,Don't You Worry Child,Swedish House Mafia Featuring John Martin,3z0a8G407NbxfjTRffvQiP,False,55,55,7,0.612,0.84,11,-3.145,0,0.0509,0.112,0,0.116,0.438,129.042,212862,4
2012-11-17,58,Take A Little Ride,Jason Aldean,3z0a8G407NbxfjTRffvQiP,False,58,12,16,0.472,0.866,2,-3.771,1,0.0413,0.044,0,0.213,0.775,163.867,187613,4
2012-11-17,59,I Knew You Were Trouble.,Taylor Swift,3z0a8G407NbxfjTRffvQiP,False,0,3,3,0.622,0.469,3,-6.798,0,0.0363,0.00454,2.25e-06,0.0398,0.679,77.019,217973,4
2012-11-17,60,Come Wake Me Up,Rascal Flatts,3z0a8G407NbxfjTRffvQiP,False,59,59,15,0.454,0.605,4,-6.816,1,0.0314,0.255,0,0.109,0.18,155.861,263253,3
2012-11-17,61,No Worries,Lil Wayne Featuring Detail,3z0a8G407NbxfjTRffvQiP,False,66,58,9,0.844,0.592,5,-5.486,1,0.199,0.085,0,0.0817,0.819,128.033,221000,4
2012-11-17,62,Lovin' You Is Fun,Easton Corbin,3z0a8G407NbxfjTRffvQiP,False,57,57,18,0.703,0.83,8,-3.028,1,0.0327,0.32,0,0.364,0.597,109.958,199013,4
2012-11-17,63,Goodbye In Her Eyes,Zac Brown Band,3z0a8G407NbxfjTRffvQiP,False,82,63,4,0.4,0.558,3,-7.393,1,0.038,0.163,3.76e-06,0.0879,0.376,81.271,324267,4
2012-11-17,64,Beer Money,Kip Moore,3z0a8G407NbxfjTRffvQiP,False,63,63,7,0.745,0.805,2,-5.549,1,0.0307,0.0223,1.06e-06,0.13,0.765,126.065,218147,4
2012-11-17,65,Til My Last Day,Justin Moore,3z0a8G407NbxfjTRffvQiP,False,68,65,8,0.577,0.761,9,-5.34,1,0.0358,0.0377,0,0.116,0.599,104.991,234027,4
2012-11-17,66,Thrift Shop,Macklemore & Ryan Lewis Featuring Wanz,3z0a8G407NbxfjTRffvQiP,False,77,66,5,0.781,0.526,6,-6.986,0,0.293,0.0633,0,0.0457,0.665,94.993,235613,4
2012-11-17,67,Madness,Muse,3z0a8G407NbxfjTRffvQiP,False,61,60,11,0.502,0.417,10,-7.665,1,0.0718,0.127,0.00419,0.106,0.218,180.301,281040,4
2012-11-17,68,Begin Again,Taylor Swift,3z0a8G407NbxfjTRffvQiP,False,0,7,5,0.53,0.526,7,-8.349,1,0.0263,0.199,3.52e-06,0.232,0.323,79.025,237613,4
2012-11-17,69,Va Va Voom,Nicki Minaj,3z0a8G407NbxfjTRffvQiP,False,98,69,3,0.648,0.836,8,-3.394,1,0.0316,0.0625,0.00995,0.202,0.705,126.889,183560,4
2012-11-17,70,Anything Could Happen,Ellie Goulding,3z0a8G407NbxfjTRffvQiP,False,69,64,4,0.702,0.781,0,-4.081,1,0.03,0.433,0,0.135,0.382,102.997,286322,4
2012-11-17,71,Southern Comfort Zone,Brad Paisley,3z0a8G407NbxfjTRffvQiP,False,87,71,5,0.431,0.876,4,-6.109,1,0.0658,0.0771,1.81e-05,0.0998,0.519,160.0,316987,4
2012-11-17,72,Creepin',Eric Church,3z0a8G407NbxfjTRffvQiP,False,74,72,11,0.464,0.889,5,-5.042,1,0.0497,0.0389,0.0272,0.31,0.539,87.858,232720,4
2012-11-17,73,F**kin Problems,"A$AP Rocky Featuring Drake, 2 Chainz & Kendrick Lamar",4X5f3vT8MRuXF68pfjNte5,True,0,73,1,0.853,0.693,1,-6.87,1,0.275,0.0239,0,0.11,0.662,95.967,233787,4
2012-11-17,74,Put It Down,Brandy Featuring Chris Brown,4X5f3vT8MRuXF68pfjNte5,False,71,65,12,0.761,0.413,0,-8.104,1,0.195,0.019,0,0.0829,0.595,141.056,246213,4
2012-11-17,75,Your Body,Christina Aguilera,4X5f3vT8MRuXF68pfjNte5,False,60,34,7,0.593,0.781,8,-5.291,0,0.0545,0.000724,0,0.225,0.565,103.025,239853,4
2012-11-17,76,Pound The Alarm,Nicki Minaj,4X5f3vT8MRuXF68pfjNte5,False,64,15,15,0.728,0.858,9,-3.686,1,0.0609,0.0403,4.26e-06,0.0241,0.591,125.054,205640,4
2012-11-17,77,Every Storm (Runs Out Of Rain),Gary Allan,4X5f3vT8MRuXF68pfjNte5,False,81,77,5,0.525,0.693,0,-6.972,1,0.0327,0.046,9.55e-06,0.247,0.363,107.012,225640,4
2012-11-17,78,I Can Only Imagine,David Guetta Featuring Chris Brown & Lil Wayne,4X5f3vT8MRuXF68pfjNte5,False,62,44,13,0.669,0.939,9,-2.06,1,0.0427,0.0463,1.12e-06,0.335,0.264,127.947,209533,4
2012-11-17,79,Dance For You,Beyonce,4X5f3vT8MRuXF68pfjNte5,False,79,78,9,0.616,0.78,2,-6.062,1,0.0623,0.0322,0,0.173,0.471,110.005,377467,4
2012-11-17,80,Did It For The Girl,Greg Bates,4X5f3vT8MRuXF68pfjNte5,False,86,80,7,0.658,0.728,5,-4.916,1,0.0237,0.0183,6.26e-06,0.306,0.682,101.969,191293,4
2012-11-17,81,How Country Feels,Randy Houser,4X5f3vT8MRuXF68pfjNte5,False,85,81,5,0.678,0.839,7,-3.617,1,0.0394,0.0379,0,0.0742,0.772,104.952,185907,4
2012-11-17,82,Diced Pineapples,Rick Ross Featuring Wale & Drake,4X5f3vT8MRuXF68pfjNte5,False,84,82,5,0.511,0.735,2,-6.026,1,0.239,0.352,0,0.196,0.379,110.965,276160,5
2012-11-17,83,Dive In,Trey Songz,4X5f3vT8MRuXF68pfjNte5,False,83,77,10,0.587,0.648,0,-6.954,1,0.089,0.0279,0,0.962,0.37,119.888,252453,4
2012-11-17,84,Numb,Usher,4X5f3vT8MRuXF68pfjNte5,False,72,69,7,0.577,0.687,8,-7.601,1,0.0471,0.0113,4.42e-06,0.112,0.291,124.956,225520,4
2012-11-17,85,Ready Or Not,Bridgit Mendler,4X5f3vT8MRuXF68pfjNte5,False,78,78,3,0.715,0.872,2,-3.835,1,0.0509,0.00351,3.84e-05,0.107,0.748,93.043,200947,4
2012-11-17,86,El Cerrito Place,Kenny Chesney,4X5f3vT8MRuXF68pfjNte5,False,88,86,4,0.596,0.503,4,-7.606,1,0.0272,0.13,0,0.0754,0.262,134.032,351613,4
2012-11-17,87,Radioactive,Imagine Dragons,4X5f3vT8MRuXF68pfjNte5,False,90,87,10,0.448,0.784,9,-3.686,1,0.0627,0.106,0.000108,0.668,0.236,136.245,186813,4
2012-11-17,88,Ball,T.I. Featuring Lil Wayne,4X5f3vT8MRuXF68pfjNte5,False,75,50,3,0.772,0.885,1,-4.736,1,0.0847,0.193,9.48e-06,0.0953,0.512,94.98,205360,4
2012-11-17,89,Red,Taylor Swift,4X5f3vT8MRuXF68pfjNte5,False,0,6,4,0.602,0.896,1,-4.267,0,0.0437,0.0773,8.87e-05,0.091,0.641,124.978,220827,4
2012-11-17,90,Take A Walk,Passion Pit,4X5f3vT8MRuXF68pfjNte5,False,89,85,10,0.566,0.755,11,-5.526,1,0.0368,0.0338,0,0.315,0.445,101.006,264493,4
2012-11-17,91,Don't Stop The Party,Pitbull Featuring TJR,4X5f3vT8MRuXF68pfjNte5,False,99,89,3,0.722,0.958,4,-3.617,1,0.0912,0.00726,0,0.375,0.952,127.008,206120,4
2012-11-17,92,Poetic Justice,Kendrick Lamar Featuring Drake,4X5f3vT8MRuXF68pfjNte5,False,76,76,2,0.779,0.572,6,-9.985,0,0.378,0.157,0,0.246,0.647,135.956,300160,4
2012-11-17,93,Try,P!nk,4X5f3vT8MRuXF68pfjNte5,False,0,56,2,0.673,0.629,2,-7.072,1,0.0299,0.00141,0,0.0944,0.551,103.998,247907,4
2012-11-17,94,My Moment,"DJ Drama Featuring 2 Chainz, Meek Mill & Jeremih",4X5f3vT8MRuXF68pfjNte5,False,96,89,5,0.456,0.76,1,-3.015,0,0.0988,0.0337,0,0.228,0.189,148.063,198920,4
2012-11-17,95,Don't Judge Me,Chris Brown,0NG5gJzPHjYeQmqcmqfopN,True,0,95,1,0.328,0.498,4,-10.898,0,0.126,0.532,7.94e-05,0.117,0.36,175.918,240173,4
2012-11-17,96,Wicked Games,The Weeknd,2B88kyD8JVMOHXdja0mFvx,True,0,96,1,0.658,0.575,9,-6.062,1,0.0313,0.00963,5.29e-06,0.191,0.335,114.081,325234,4
2012-11-17,97,Don't Rush,Kelly Clarkson Featuring Vince Gill,5HuyeNQq0GTDMhr7QtE5yj,True,0,97,1,0.406,0.665,1,-6.02,1,0.0298,0.0264,0,0.0826,0.522,201.7,242013,4
2012-11-17,98,If I Didn't Have You,Thompson Square,6PQ0WLZnT479J7Q1TGIb3n,True,0,98,1,0.549,0.805,6,-3.431,1,0.0277,0.0628,5.26e-06,0.343,0.53,147.91,202907,4
2012-11-17,99,Tip It On Back,Dierks Bentley,2G634xynj7ev8r5c0sAL3T,True,0,99,1,0.503,0.78,3,-5.148,1,0.0323,0.522,0.16,0.138,0.737,137.936,206520,4
2012-11-17,100,Ice,Kelly Rowland Featuring Lil Wayne,2G634xynj7ev8r5c0sAL3T,False,100,100,3,0.621,0.511,11,-8.523,1,0.265,0.015,0,0.0963,0.317,158.896,248933,4
