date,position,title,artist,spotify_id,is_new,last_pos,peak_pos,weeks,danceability,energy,key,loudness,mode,speechiness,acousticness,instrumentalness,liveness,valence,tempo,duration_ms,time_signature
2011-03-12,1,Born This Way,Lady Gaga,3JA9Jsuxr4xgHXEawAdCp4,False,1,1,3,0.586,0.835,11,-5.117,1,0.146,0.00387,0,0.304,0.492,123.936,260413,4
2011-03-12,2,F**k You! (Forget You),CeeLo Green,3JA9Jsuxr4xgHXEawAdCp4,False,2,2,27,0.689,0.836,0,-6.058,1,0.0559,0.187,0,0.162,0.749,127.411,223067,4
2011-03-12,3,Grenade,Bruno Mars,3JA9Jsuxr4xgHXEawAdCp4,False,3,1,22,0.706,0.558,2,-7.237,0,0.0593,0.146,0,0.118,0.227,110.443,223253,4
2011-03-12,4,F**kin' Perfect,P!nk,3JA9Jsuxr4xgHXEawAdCp4,False,6,2,9,0.57,0.646,7,-4.748,1,0.0331,0.0412,0,0.362,0.485,91.954,213413,4
2011-03-12,5,S&M,Rihanna Featuring Britney Spears,3JA9Jsuxr4xgHXEawAdCp4,False,7,5,7,0.769,0.684,1,-5.019,1,0.0411,0.0105,0.000125,0.0887,0.835,127.972,243600,4
2011-03-12,6,Firework,Katy Perry,3JA9Jsuxr4xgHXEawAdCp4,False,5,1,19,0.638,0.826,8,-4.968,1,0.0479,0.139,0,0.0803,0.649,124.072,227880,4
2011-03-12,7,Tonight (I'm Lovin' You),Enrique Iglesias Featuring Ludacris & DJ Frank E,3JA9Jsuxr4xgHXEawAdCp4,False,9,4,14,0.666,0.877,0,-4.657,0,0.0446,0.0277,1.15e-05,0.142,0.272,125.989,231653,4
2011-03-12,8,E.T.,Katy Perry Featuring Kanye West,3JA9Jsuxr4xgHXEawAdCp4,False,28,8,3,0.62,0.869,1,-5.252,1,0.175,0.0181,0,0.369,0.76,151.684,229573,4
2011-03-12,9,On The Floor,Jennifer Lopez Featuring Pitbull,0Oe49j06Bjrxs8PltuVeaW,True,0,9,1,0.758,0.686,11,-6.346,1,0.0792,0.0848,0.00127,0.142,0.444,130.007,230907,4
2011-03-12,10,I Need A Doctor,Dr. Dre Featuring Eminem & Skylar Grey,0Oe49j06Bjrxs8PltuVeaW,False,4,4,4,0.594,0.946,3,-4.521,1,0.452,0.0869,0,0.306,0.397,155.826,283733,4
2011-03-12,11,Blow,Ke$ha,0Oe49j06Bjrxs8PltuVeaW,False,32,11,6,0.753,0.729,11,-3.862,0,0.0392,0.00334,5.66e-05,0.073,0.812,120.013,219973,4
2011-03-12,12,Hold It Against Me,Britney Spears,0Oe49j06Bjrxs8PltuVeaW,False,11,1,7,0.648,0.722,0,-4.813,0,0.0427,0.0103,0,0.24,0.389,132.973,228827,4
2011-03-12,13,Rolling In The Deep,Adele,0Oe49j06Bjrxs8PltuVeaW,False,26,13,8,0.73,0.769,8,-5.114,1,0.0298,0.138,0,0.0473,0.507,104.948,228093,4
2011-03-12,14,Hey Baby (Drop It To The Floor),Pitbull Featuring T-Pain,0Oe49j06Bjrxs8PltuVeaW,False,17,7,22,0.595,0.912,10,-3.428,0,0.0884,0.0434,0,0.259,0.762,128.024,234453,4
2011-03-12,15,Moment 4 Life,Nicki Minaj Featuring Drake,0Oe49j06Bjrxs8PltuVeaW,False,18,15,11,0.475,0.882,11,-3.883,1,0.351,0.406,0,0.241,0.369,98.001,279307,4
2011-03-12,16,Rocketeer,Far*East Movement Featuring Ryan Tedder,0Oe49j06Bjrxs8PltuVeaW,False,16,7,13,0.664,0.845,4,-6.115,0,0.0461,0.181,0,0.267,0.357,96.005,211253,4
2011-03-12,17,More,Usher,0Oe49j06Bjrxs8PltuVeaW,False,15,15,12,0.551,0.893,7,-2.628,1,0.0543,0.00166,0,0.348,0.794,125.083,219987,4
2011-03-12,18,Black And Yellow,Wiz Khalifa,0Oe49j06Bjrxs8PltuVeaW,False,10,1,21,0.684,0.834,2,-4.524,0,0.0675,0.0646,0,0.271,0.538,164.02,217667,4
2011-03-12,19,Coming Home,Diddy - Dirty Money Featuring Skylar Grey,0Oe49j06Bjrxs8PltuVeaW,False,22,12,14,0.392,0.839,7,-1.921,1,0.193,0.158,0,0.3,0.232,168.001,238693,4
2011-03-12,20,Down On Me,Jeremih Featuring 50 Cent,0Oe49j06Bjrxs8PltuVeaW,False,25,20,16,0.7,0.598,2,-7.783,1,0.114,0.0369,0,0.111,0.594,160.041,228453,4
2011-03-12,21,Jar Of Hearts,Christina Perri,0Oe49j06Bjrxs8PltuVeaW,False,21,21,22,0.349,0.348,3,-6.142,1,0.0316,0.726,0,0.12,0.0886,74.541,246587,4
2011-03-12,22,What The Hell,Avril Lavigne,0Oe49j06Bjrxs8PltuVeaW,False,13,11,7,0.578,0.926,6,-3.689,0,0.0548,0.00472,0.0127,0.14,0.877,149.976,220707,4
2011-03-12,23,Never Say Never,Justin Bieber Featuring Jaden Smith,0Oe49j06Bjrxs8PltuVeaW,False,8,8,11,0.739,0.807,0,-5.063,1,0.0652,0.0181,0,0.295,0.632,97.048,227853,4
2011-03-12,24,Look At Me Now,Chris Brown Featuring Lil Wayne & Busta Rhymes,0Oe49j06Bjrxs8PltuVeaW,False,31,11,4,0.767,0.677,11,-6.128,0,0.184,0.0339,5.51e-06,0.144,0.538,146.155,222587,4
2011-03-12,25,Just The Way You Are,Bruno Mars,0Oe49j06Bjrxs8PltuVeaW,False,14,1,32,0.641,0.188,5,-9.954,1,0.0339,0.918,0,0.0857,0.294,109.317,219178,4
2011-03-12,26,What's My Name?,Rihanna Featuring Drake,0Oe49j06Bjrxs8PltuVeaW,False,12,1,19,0.689,0.784,2,-2.972,1,0.074,0.182,0,0.0843,0.561,99.954,263173,4
2011-03-12,27,Yeah 3X,Chris Brown,0Oe49j06Bjrxs8PltuVeaW,False,19,15,18,0.705,0.882,11,-3.201,0,0.0445,0.000369,1.16e-06,0.0934,0.7,130.0,241667,4
2011-03-12,28,6 Foot 7 Foot,Lil Wayne Featuring Cory Gunz,0Oe49j06Bjrxs8PltuVeaW,False,20,9,11,0.365,0.751,2,-5.429,1,0.304,0.000707,0,0.318,0.604,79.119,248587,4
2011-03-12,29,Back To December,Taylor Swift,0Oe49j06Bjrxs8PltuVeaW,False,24,6,18,0.529,0.67,2,-4.663,1,0.0303,0.117,0,0.334,0.286,141.893,293027,4
2011-03-12,30,Raise Your Glass,P!nk,0Oe49j06Bjrxs8PltuVeaW,False,23,1,21,0.7,0.709,7,-5.006,1,0.0839,0.0048,0,0.0289,0.625,122.019,202960,4
2011-03-12,31,All Of The Lights,Kanye West,0Oe49j06Bjrxs8PltuVeaW,False,54,31,9,0.531,0.803,1,-3.284,1,0.0717,0.0796,1.71e-05,0.176,0.221,142.113,299613,4
2011-03-12,32,No Hands,Waka Flocka Flame Featuring Roscoe Dash & Wale,0Oe49j06Bjrxs8PltuVeaW,False,29,13,25,0.76,0.595,1,-6.366,1,0.0391,0.00544,0,0.241,0.361,131.497,263773,4
2011-03-12,33,Pretty Girl Rock,Keri Hilson,0Oe49j06Bjrxs8PltuVeaW,False,34,31,14,0.666,0.87,11,-5.004,0,0.246,0.203,0,0.0851,0.9,160.014,243920,4
2011-03-12,34,We R Who We R,Ke$ha,0Oe49j06Bjrxs8PltuVeaW,False,30,1,18,0.736,0.817,8,-4.9,1,0.0407,0.00987,0.00167,0.117,0.653,119.95,204760,4
2011-03-12,35,Don't You Wanna Stay,Jason Aldean With Kelly Clarkson,0Oe49j06Bjrxs8PltuVeaW,False,38,35,17,0.445,0.631,11,-4.798,1,0.0304,0.129,0,0.0911,0.152,143.846,256440,4
2011-03-12,36,Only Girl (In The World),Rihanna,0Oe49j06Bjrxs8PltuVeaW,False,35,1,25,0.789,0.706,11,-4.233,0,0.0429,0.112,1.71e-05,0.0586,0.638,125.911,235493,4
2011-03-12,37,Dynamite,Taio Cruz,0Oe49j06Bjrxs8PltuVeaW,False,40,2,39,0.754,0.804,4,-3.177,1,0.0853,0.00332,0,0.0329,0.818,119.968,203867,4
2011-03-12,38,Stereo Love,Edward Maya & Vika Jigulina,0Oe49j06Bjrxs8PltuVeaW,False,42,16,21,0.773,0.736,9,-5.589,1,0.0383,0.0335,0.0184,0.104,0.212,127.056,184000,4
2011-03-12,39,Backseat,New Boyz Featuring The Cataracs & Dev,0Oe49j06Bjrxs8PltuVeaW,False,37,37,2,0.595,0.923,7,-3.449,1,0.144,0.0693,0,0.505,0.782,125.029,224093,4
2011-03-12,40,Are You Gonna Kiss Me Or Not,Thompson Square,0Oe49j06Bjrxs8PltuVeaW,False,48,40,11,0.485,0.701,8,-3.807,1,0.0288,0.039,0,0.0977,0.613,151.948,184920,4
2011-03-12,41,The Show Goes On,Lupe Fiasco,0Oe49j06Bjrxs8PltuVeaW,False,44,41,9,0.591,0.889,7,-3.839,1,0.115,0.0189,0,0.155,0.65,143.067,239613,4
2011-03-12,42,Higher,Taio Cruz Featuring Travie McCoy,0Oe49j06Bjrxs8PltuVeaW,False,33,24,11,0.528,0.9,8,-4.301,0,0.0759,0.0349,0,0.144,0.558,127.986,188133,4
2011-03-12,43,DJ Got Us Fallin' In Love,Usher Featuring Pitbull,0Oe49j06Bjrxs8PltuVeaW,False,41,4,33,0.663,0.861,7,-3.398,0,0.109,0.0338,0,0.082,0.654,119.963,220800,4
2011-03-12,44,Teenage Dream,Katy Perry,0Oe49j06Bjrxs8PltuVeaW,False,39,1,32,0.719,0.798,10,-4.582,1,0.0361,0.0162,2.34e-06,0.134,0.591,120.011,227741,4
2011-03-12,45,Marry Me,Train,0Oe49j06Bjrxs8PltuVeaW,False,43,34,15,0.461,0.267,0,-8.514,1,0.0278,0.834,2.03e-05,0.107,0.481,87.918,205453,4
2011-03-12,46,Colder Weather,Zac Brown Band,0Oe49j06Bjrxs8PltuVeaW,False,52,46,6,0.667,0.381,3,-7.494,1,0.0294,0.455,0,0.116,0.199,135.975,273893,4
2011-03-12,47,Waiting For The End,Linkin Park,0Oe49j06Bjrxs8PltuVeaW,False,50,42,21,0.487,0.961,4,-4.139,1,0.132,0.0415,1.15e-06,0.553,0.323,170.005,231680,4
2011-03-12,48,The Time (Dirty Bit),The Black Eyed Peas,0Oe49j06Bjrxs8PltuVeaW,False,36,4,16,0.816,0.813,6,-7.798,0,0.0664,0.0662,2.77e-06,0.602,0.436,127.979,307640,4
2011-03-12,49,Don't You Want Me,Glee Cast,67lMr5SLliCy6erdyT2RG0,True,0,49,1,0.734,0.706,0,-4.99,1,0.0375,0.000597,0.000276,0.273,0.335,119.993,213573,4
2011-03-12,50,Just A Dream,Nelly,67lMr5SLliCy6erdyT2RG0,False,46,3,28,0.531,0.752,1,-6.161,1,0.0305,0.0421,0,0.12,0.103,89.917,237800,4
2011-03-12,51,Let Me Down Easy,Billy Currington,67lMr5SLliCy6erdyT2RG0,False,57,48,14,0.606,0.497,1,-5.005,1,0.0278,0.361,0,0.106,0.18,125.059,228493,4
2011-03-12,52,On My Level,Wiz Khalifa Featuring Too $hort,0osPX8TruIebOhKuG6GK8C,True,0,52,1,0.72,0.514,1,-7.108,1,0.132,0.146,0.00713,0.107,0.212,142.98,272160,4
2011-03-12,53,The Cave,Mumford & Sons,0osPX8TruIebOhKuG6GK8C,False,27,27,4,0.595,0.506,4,-9.682,1,0.0388,0.0464,0.000138,0.107,0.346,141.981,217987,4
2011-03-12,54,Who Are You When I'm Not Looking,Blake Shelton,0osPX8TruIebOhKuG6GK8C,False,56,46,17,0.412,0.457,4,-9.142,1,0.0288,0.409,0.0187,0.0978,0.202,74.824,187733,4
2011-03-12,55,Blame It (On The Alcohol),Glee Cast,3a7dqgzNJhO3I6lxZLjU5G,True,0,55,1,0.653,0.604,7,-4.922,1,0.0799,0.00838,0,0.111,0.7,176.0,199040,4
2011-03-12,56,Who Dat Girl,Flo Rida Featuring Akon,3a7dqgzNJhO3I6lxZLjU5G,False,53,29,13,0.719,0.616,1,-3.951,1,0.0395,0.00683,3.11e-05,0.0742,0.625,124.963,200880,4
2011-03-12,57,For The First Time,The Script,3a7dqgzNJhO3I6lxZLjU5G,False,60,45,9,0.396,0.629,9,-4.78,1,0.0287,0.0328,0,0.183,0.358,173.794,252853,4
2011-03-12,58,Somewhere With You,Kenny Chesney,3a7dqgzNJhO3I6lxZLjU5G,False,55,31,17,0.68,0.849,1,-6.475,0,0.0376,0.0862,0.00013,0.174,0.536,111.969,243520,4
2011-03-12,59,Fall For Your Type,Jamie Foxx Featuring Drake,3a7dqgzNJhO3I6lxZLjU5G,False,63,50,12,0.593,0.393,1,-11.736,1,0.0827,0.394,3.24e-06,0.11,0.193,136.866,269533,4
2011-03-12,60,Voices,Chris Young,3a7dqgzNJhO3I6lxZLjU5G,False,59,53,17,0.552,0.788,0,-4.112,1,0.0525,0.38,0,0.15,0.641,76.528,186107,4
2011-03-12,61,Tik Tok,Glee Cast,1ZZJmQTmZ1xqi3sL8n3PkR,True,0,61,1,0.753,0.747,2,-4.314,0,0.0423,0.145,0,0.319,0.915,120.115,199080,4
2011-03-12,62,This Is Country Music,Brad Paisley,1ZZJmQTmZ1xqi3sL8n3PkR,False,65,62,10,0.507,0.669,2,-5.104,1,0.0275,0.126,0.000263,0.111,0.484,88.525,311640,4
2011-03-12,63,Buzzin',Mann,1ZZJmQTmZ1xqi3sL8n3PkR,False,64,61,7,0.724,0.951,7,-4.294,0,0.226,0.127,0,0.307,0.593,103.988,196147,4
2011-03-12,64,What Do You Want,Jerrod Niemann,1ZZJmQTmZ1xqi3sL8n3PkR,False,67,64,10,0.555,0.496,4,-10.12,1,0.143,0.657,1.14e-06,0.106,0.543,153.301,214573,4
2011-03-12,65,Someone Like You,Adele,1zwMYTA5nlNjZxYrvBB2pV,True,0,65,1,0.556,0.319,9,-8.251,1,0.0281,0.893,0,0.0996,0.294,135.187,285240,4
2011-03-12,66,Just Can't Get Enough,The Black Eyed Peas,1zwMYTA5nlNjZxYrvBB2pV,False,92,66,2,0.659,0.628,0,-8.685,0,0.179,0.186,0,0.105,0.262,94.05,219427,4
2011-03-12,67,You Be Killin Em,Fabolous,1zwMYTA5nlNjZxYrvBB2pV,False,66,64,9,0.664,0.909,6,-3.552,0,0.22,0.444,0,0.525,0.557,93.977,209693,4
2011-03-12,68,Written In The Stars,Tinie Tempah Featuring Eric Turner,1zwMYTA5nlNjZxYrvBB2pV,False,91,68,2,0.644,0.945,7,-3.534,1,0.0717,0.0587,0,0.184,0.573,91.017,219560,4
2011-03-12,69,Love Faces,Trey Songz,1zwMYTA5nlNjZxYrvBB2pV,False,72,69,5,0.654,0.599,11,-6.699,1,0.0561,0.0599,0,0.161,0.333,119.782,243800,4
2011-03-12,70,This,Darius Rucker,1zwMYTA5nlNjZxYrvBB2pV,False,70,70,9,0.625,0.826,4,-5.037,1,0.0325,0.121,0,0.158,0.699,99.919,218867,4
2011-03-12,71,I Won't Let Go,Rascal Flatts,1zwMYTA5nlNjZxYrvBB2pV,False,80,71,5,0.557,0.406,4,-7.083,1,0.0278,0.742,0,0.113,0.222,131.96,227760,4
2011-03-12,72,A Little Bit Stronger,Sara Evans,1zwMYTA5nlNjZxYrvBB2pV,False,73,72,9,0.536,0.65,2,-5.603,1,0.0337,0.282,1.16e-06,0.0876,0.288,147.93,301987,4
2011-03-12,73,Hello World,Lady Antebellum,1zwMYTA5nlNjZxYrvBB2pV,False,69,58,16,0.427,0.531,8,-6.985,1,0.0297,0.0555,0.00106,0.0835,0.145,111.079,326107,4
2011-03-12,74,Someone Else Calling You Baby,Luke Bryan,1zwMYTA5nlNjZxYrvBB2pV,False,68,56,18,0.498,0.915,8,-3.729,1,0.0662,0.0509,1.36e-06,0.0734,0.353,115.044,229253,4
2011-03-12,75,Sing,My Chemical Romance,1zwMYTA5nlNjZxYrvBB2pV,False,58,58,3,0.606,0.942,2,-3.618,1,0.0357,0.000233,7.07e-06,0.106,0.373,110.98,270387,4
2011-03-12,76,Pray,Justin Bieber,1zwMYTA5nlNjZxYrvBB2pV,False,61,61,3,0.569,0.797,11,-7.674,1,0.0599,0.124,1.14e-06,0.105,0.664,163.972,212320,4
2011-03-12,77,From A Table Away,Sunny Sweeney,1zwMYTA5nlNjZxYrvBB2pV,False,79,77,8,0.547,0.805,8,-4.34,1,0.0293,0.0393,1.75e-05,0.332,0.557,110.027,215333,4
2011-03-12,78,Felt Good On My Lips,Tim McGraw,1zwMYTA5nlNjZxYrvBB2pV,False,71,26,17,0.56,0.869,3,-3.804,1,0.0387,0.024,2.94e-06,0.136,0.519,136.001,277400,4
2011-03-12,79,Boyfriend,Big Time Rush,1rKBOL9kJfX1Y4C3QaOvRH,True,0,79,1,0.614,0.857,1,-4.171,0,0.111,0.0987,0,0.177,0.677,164.146,201040,4
2011-03-12,80,Heart Like Mine,Miranda Lambert,1rKBOL9kJfX1Y4C3QaOvRH,False,85,80,3,0.437,0.844,8,-3.394,1,0.0381,0.0642,1.42e-06,0.124,0.493,155.066,177867,4
2011-03-12,81,Roll Up,Wiz Khalifa,1rKBOL9kJfX1Y4C3QaOvRH,False,76,48,3,0.523,0.805,3,-5.473,1,0.192,0.0524,0,0.0914,0.602,125.358,227773,5
2011-03-12,82,Bow Chicka Wow Wow,Mike Posner Featuring Lil Wayne,7neVcKsbivjMDIkdfoao5m,True,0,82,1,0.626,0.67,7,-5.381,1,0.0534,0.318,0,0.0429,0.523,73.422,223253,4
2011-03-12,83,Bass Down Low,Dev Featuring The Cataracs,7neVcKsbivjMDIkdfoao5m,False,77,61,11,0.798,0.627,0,-8.086,1,0.0602,0.0778,0,0.0472,0.84,113.029,210600,4
2011-03-12,84,Wildflower,The JaneDear Girls,7neVcKsbivjMDIkdfoao5m,False,81,60,7,0.692,0.858,6,-4.354,0,0.03,0.00217,4.85e-05,0.358,0.69,125.944,163453,4
2011-03-12,85,Maybe,Sick Puppies,7neVcKsbivjMDIkdfoao5m,False,82,56,14,0.437,0.913,7,-4.315,1,0.0972,0.0171,0,0.284,0.537,167.861,206120,4
2011-03-12,86,No BS,Chris Brown,7neVcKsbivjMDIkdfoao5m,False,83,62,12,0.426,0.612,1,-6.359,0,0.0567,0.12,0,0.119,0.106,172.171,247933,4
2011-03-12,87,Little Miss,Sugarland,7neVcKsbivjMDIkdfoao5m,False,88,80,7,0.351,0.797,11,-4.286,1,0.0379,0.0959,4.12e-05,0.157,0.243,129.14,271267,5
2011-03-12,88,Set Fire To The Rain,Adele,73CMRj62VK8nUS4ezD2wvi,True,0,88,1,0.603,0.67,2,-3.882,0,0.0249,0.00408,1.68e-06,0.112,0.446,107.993,242974,4
2011-03-12,89,Lay It Down,Lloyd,73CMRj62VK8nUS4ezD2wvi,False,75,64,19,0.527,0.796,1,-5.111,0,0.062,0.017,0,0.0798,0.534,155.99,240107,4
2011-03-12,90,Welcome To My Hood,"DJ Khaled Featuring Rick Ross, Plies, Lil Wayne & T-Pain",2NYYUTe0vuU5Tq4smECz71,True,0,90,1,0.585,0.815,7,-4.203,1,0.228,0.0221,0,0.14,0.541,140.077,430733,4
2011-03-12,91,Who's That Chick?,David Guetta Featuring Rihanna,2NYYUTe0vuU5Tq4smECz71,False,87,51,9,0.675,0.601,11,-4.733,0,0.116,0.00372,0,0.0458,0.931,127.938,201040,4
2011-03-12,92,Bleed Red,Ronnie Dunn,2NYYUTe0vuU5Tq4smECz71,False,97,92,3,0.487,0.668,10,-4.251,1,0.0321,0.346,4.56e-05,0.107,0.184,90.083,229840,4
2011-03-12,93,Price Tag,Jessie J Featuring B.o.B,2NYYUTe0vuU5Tq4smECz71,False,99,88,4,0.638,0.831,5,-3.944,1,0.182,0.0281,3.06e-06,0.277,0.685,175.038,223053,4
2011-03-12,94,I Just Had Sex,The Lonely Island Featuring Akon,2NYYUTe0vuU5Tq4smECz71,False,84,30,10,0.615,0.811,6,-4.316,1,0.144,0.0188,0,0.196,0.808,167.995,166560,4
2011-03-12,95,H*A*M,Kanye West Jay Z,2NYYUTe0vuU5Tq4smECz71,False,93,23,7,0.657,0.524,8,-4.907,1,0.061,0.0462,0,0.322,0.0383,140.021,275733,4
2011-03-12,96,Kush,Dr. Dre Featuring Snoop Dogg & Akon,2NYYUTe0vuU5Tq4smECz71,False,89,34,15,0.444,0.866,7,-6.217,1,0.111,0.000622,4.72e-05,0.105,0.375,94.968,235120,4
2011-03-12,97,I Smile,Kirk Franklin,0UQDSP8cz6WmLJckO5jqUQ,True,0,97,1,0.745,0.753,1,-2.408,1,0.164,0.223,0,0.705,0.589,144.057,307973,4
2011-03-12,98,The Shape I'm In,Joe Nichols,4A7sLRJs1rvlV7aEy73PJF,True,0,98,1,0.64,0.659,3,-4.986,1,0.0315,0.311,3.36e-06,0.253,0.683,79.941,188973,4
2011-03-12,99,U Smile,Justin Bieber,4A7sLRJs1rvlV7aEy73PJF,False,94,27,4,0.705,0.59,1,-5.308,1,0.0284,0.504,0,0.116,0.421,112.565,196907,3
2011-03-12,100,Country Boy,Aaron Lewis Featuring George Jones & Charlie Daniels,77A7dWpSxVoauUbJn83Oj3,True,0,100,1,0.595,0.667,6,-6.442,1,0.034,0.296,0,0.109,0.272,121.949,283347,4
