date,position,title,artist,spotify_id,is_new,last_pos,peak_pos,weeks,danceability,energy,key,loudness,mode,speechiness,acousticness,instrumentalness,liveness,valence,tempo,duration_ms,time_signature
2011-10-29,1,Someone Like You,Adele,42qh86p7TLXyumxSHn65kc,False,1,1,15,0.556,0.319,9,-8.251,1,0.0281,0.893,0,0.0996,0.294,135.187,285240,4
2011-10-29,2,Moves Like Jagger,Maroon 5 Featuring Christina Aguilera,42qh86p7TLXyumxSHn65kc,False,2,1,17,0.708,0.784,11,-3.742,0,0.049,0.012,0,0.368,0.697,128.015,202859,4
2011-10-29,3,Pumped Up Kicks,Foster The People,42qh86p7TLXyumxSHn65kc,False,3,3,25,0.733,0.71,5,-5.849,0,0.0292,0.145,0.115,0.0956,0.965,127.975,239600,4
2011-10-29,4,Sexy And I Know It,LMFAO,42qh86p7TLXyumxSHn65kc,False,4,4,7,0.707,0.861,7,-4.225,1,0.316,0.1,0,0.191,0.795,130.021,199480,4
2011-10-29,5,Stereo Hearts,Gym Class Heroes Featuring Adam Levine,42qh86p7TLXyumxSHn65kc,False,5,4,18,0.646,0.795,9,-3.293,1,0.0976,0.0319,0,0.267,0.796,89.99,210960,4
2011-10-29,6,We Found Love,Rihanna Featuring Calvin Harris,42qh86p7TLXyumxSHn65kc,False,7,6,4,0.734,0.766,1,-4.485,1,0.0383,0.025,0.00138,0.108,0.6,127.986,215227,4
2011-10-29,7,Without You,David Guetta Featuring Usher,42qh86p7TLXyumxSHn65kc,False,8,7,7,0.608,0.614,2,-3.727,1,0.0285,0.227,3.82e-06,0.157,0.402,127.885,208133,4
2011-10-29,8,You Make Me Feel...,Cobra Starship Featuring Sabi,42qh86p7TLXyumxSHn65kc,False,9,7,14,0.668,0.857,7,-2.944,0,0.0535,0.0191,6.71e-06,0.0385,0.748,131.959,215693,4
2011-10-29,9,Party Rock Anthem,LMFAO Featuring Lauren Bennett & GoonRock,42qh86p7TLXyumxSHn65kc,False,6,1,30,0.75,0.727,5,-4.21,0,0.142,0.0189,0,0.266,0.359,129.993,262173,4
2011-10-29,10,"Young, Wild & Free",Snoop Dogg & Wiz Khalifa Featuring Bruno Mars,5HQVUIKwCEXpe7JIHyY734,True,0,10,1,0.715,0.655,0,-6.425,1,0.137,0.0525,0,0.115,0.531,95.078,207333,4
2011-10-29,11,You And I,Lady Gaga,5HQVUIKwCEXpe7JIHyY734,False,10,6,11,0.516,0.709,2,-5.234,1,0.0478,0.0745,0,0.0935,0.515,127.073,307347,4
2011-10-29,12,In The Dark,Dev,5HQVUIKwCEXpe7JIHyY734,False,11,11,11,0.736,0.823,8,-4.231,1,0.0675,0.00358,0.000914,0.33,0.442,124.954,226227,4
2011-10-29,13,Super Bass,Nicki Minaj,5HQVUIKwCEXpe7JIHyY734,False,14,3,25,0.723,0.86,11,-4.357,1,0.203,0.271,4.56e-06,0.598,0.667,126.979,200013,4
2011-10-29,14,Give Me Everything,"Pitbull Featuring Ne-Yo, Afrojack & Nayer",5HQVUIKwCEXpe7JIHyY734,False,13,1,29,0.671,0.939,8,-3.206,1,0.161,0.191,0,0.298,0.53,129.024,252307,4
2011-10-29,15,Headlines,Drake,5HQVUIKwCEXpe7JIHyY734,False,17,13,10,0.636,0.566,6,-7.16,0,0.106,0.365,0.000353,0.0917,0.425,151.894,235987,4
2011-10-29,16,Lighters,Bad Meets Evil Featuring Bruno Mars,5HQVUIKwCEXpe7JIHyY734,False,12,4,18,0.676,0.695,0,-8.327,1,0.245,0.352,0,0.119,0.144,90.268,303813,4
2011-10-29,17,It Girl,Jason Derulo,5HQVUIKwCEXpe7JIHyY734,False,18,17,10,0.668,0.718,1,-4.736,0,0.0605,0.0165,0,0.104,0.345,91.993,192200,4
2011-10-29,18,Good Life,OneRepublic,5HQVUIKwCEXpe7JIHyY734,False,20,8,29,0.634,0.69,6,-7.804,1,0.052,0.0771,0,0.132,0.645,94.988,253307,4
2011-10-29,19,She Will,Lil Wayne Featuring Drake,5HQVUIKwCEXpe7JIHyY734,False,22,3,9,0.364,0.841,8,-4.831,1,0.119,0.000402,0,0.242,0.0837,100.14,305840,5
2011-10-29,20,How To Love,Lil Wayne,5HQVUIKwCEXpe7JIHyY734,False,16,5,21,0.644,0.661,11,-6.093,1,0.0418,0.000177,5.14e-06,0.108,0.272,154.001,240307,4
2011-10-29,21,Mr. Saxobeat,Alexandra Stan,5HQVUIKwCEXpe7JIHyY734,False,26,21,14,0.72,0.925,4,-4.165,0,0.0511,0.0276,0.000238,0.14,0.781,127.004,195105,4
2011-10-29,22,God Gave Me You,Blake Shelton,5HQVUIKwCEXpe7JIHyY734,False,24,22,14,0.483,0.844,2,-5.043,1,0.0314,0.00481,7.29e-05,0.405,0.543,151.977,229533,4
2011-10-29,23,Rolling In The Deep,Adele,5HQVUIKwCEXpe7JIHyY734,False,21,1,41,0.73,0.769,8,-5.114,1,0.0298,0.138,0,0.0473,0.507,104.948,228093,4
2011-10-29,24,Mr. Know It All,Kelly Clarkson,5HQVUIKwCEXpe7JIHyY734,False,27,18,6,0.676,0.807,5,-5.131,1,0.029,0.0284,0,0.0701,0.443,95.956,232520,4
2011-10-29,25,5 O'Clock,T-Pain Featuring Wiz Khalifa & Lily Allen,5HQVUIKwCEXpe7JIHyY734,False,30,25,3,0.4,0.882,7,-1.958,0,0.334,0.168,0,0.124,0.385,167.114,281533,4
2011-10-29,26,Cheers (Drink To That),Rihanna,5HQVUIKwCEXpe7JIHyY734,False,15,7,12,0.576,0.912,9,-3.623,1,0.0403,0.0182,0,0.293,0.727,79.981,261747,4
2011-10-29,27,Ni**as in Paris,Jay Z Kanye West,5HQVUIKwCEXpe7JIHyY734,False,32,27,10,0.789,0.858,1,-5.542,1,0.311,0.127,0,0.349,0.775,140.022,219333,4
2011-10-29,28,Just A Kiss,Lady Antebellum,5HQVUIKwCEXpe7JIHyY734,False,31,7,24,0.593,0.639,1,-5.826,1,0.0307,0.446,0,0.0998,0.332,142.881,218840,4
2011-10-29,29,Take A Back Road,Rodney Atkins,5HQVUIKwCEXpe7JIHyY734,False,23,23,20,0.581,0.856,3,-4.0,1,0.0783,0.183,0,0.0871,0.918,169.902,209427,4
2011-10-29,30,Last Friday Night (T.G.I.F.),Katy Perry,5HQVUIKwCEXpe7JIHyY734,False,25,1,21,0.652,0.812,3,-3.797,0,0.0409,0.00125,3.01e-05,0.667,0.72,126.023,230733,4
2011-10-29,31,Tonight Tonight,Hot Chelle Rae,5HQVUIKwCEXpe7JIHyY734,False,28,7,27,0.686,0.783,4,-4.977,1,0.119,0.0764,0,0.163,0.814,99.978,200467,4
2011-10-29,32,Nothing,The Script,5HQVUIKwCEXpe7JIHyY734,False,34,32,10,0.473,0.833,2,-5.013,1,0.039,0.00369,0,0.118,0.503,157.012,272213,4
2011-10-29,33,Crazy Girl,Eli Young Band,5HQVUIKwCEXpe7JIHyY734,False,36,33,31,0.366,0.651,4,-3.842,1,0.031,0.000415,0.00526,0.271,0.257,151.343,200707,3
2011-10-29,34,Fly,Nicki Minaj Featuring Rihanna,5HQVUIKwCEXpe7JIHyY734,False,39,34,8,0.665,0.848,10,-4.926,1,0.0386,0.0148,0.000118,0.1,0.196,119.897,212920,4
2011-10-29,35,If I Die Young,The Band Perry,5HQVUIKwCEXpe7JIHyY734,False,33,14,47,0.606,0.497,4,-6.611,1,0.0277,0.348,0,0.275,0.362,130.739,222773,4
2011-10-29,36,Marvin & Chardonnay,Big Sean Featuring Kanye West & Roscoe Dash,5HQVUIKwCEXpe7JIHyY734,False,35,32,13,0.613,0.807,11,-2.739,0,0.0382,0.0671,0,0.322,0.813,133.023,222867,4
2011-10-29,37,I Wanna Go,Britney Spears,5HQVUIKwCEXpe7JIHyY734,False,29,7,19,0.696,0.546,5,-6.55,1,0.0414,0.00379,3.8e-06,0.332,0.787,130.002,210267,4
2011-10-29,38,Paradise,Coldplay,5HQVUIKwCEXpe7JIHyY734,False,68,16,5,0.449,0.585,5,-6.761,1,0.0268,0.0509,8.75e-05,0.0833,0.212,139.631,278719,4
2011-10-29,39,Better With The Lights Off,New Boyz Feat. Chris Brown,5HQVUIKwCEXpe7JIHyY734,False,38,38,16,0.573,0.848,7,-2.742,1,0.057,0.0521,0,0.25,0.561,112.084,219080,4
2011-10-29,40,Strange Clouds,B.o.B Featuring Lil Wayne,5HQVUIKwCEXpe7JIHyY734,False,19,7,3,0.531,0.665,8,-6.672,0,0.286,0.0607,0,0.131,0.8,73.726,226293,4
2011-10-29,41,I'm On One,"DJ Khaled Featuring Drake, Rick Ross & Lil Wayne",5HQVUIKwCEXpe7JIHyY734,False,37,10,22,0.413,0.807,11,-3.499,0,0.318,0.0536,0,0.631,0.438,149.33,296147,4
2011-10-29,42,Good Feeling,Flo Rida,5HQVUIKwCEXpe7JIHyY734,False,77,42,3,0.706,0.89,1,-4.444,0,0.0688,0.0588,0.00286,0.306,0.684,128.011,248133,4
2011-10-29,43,Heartbeat,The Fray,2atYprr9JsQaLynGhrWhld,True,0,43,1,0.458,0.821,9,-5.076,1,0.0334,0.000594,9.46e-05,0.161,0.323,144.46,220693,4
2011-10-29,44,The Edge Of Glory,Lady Gaga,2atYprr9JsQaLynGhrWhld,False,40,3,23,0.581,0.772,9,-6.544,1,0.0401,0.000343,0.0191,0.11,0.361,127.952,320587,4
2011-10-29,45,Love You Like A Love Song,Selena Gomez & The Scene,2atYprr9JsQaLynGhrWhld,False,52,35,17,0.779,0.614,1,-6.294,0,0.0406,0.0499,0,0.139,0.932,117.025,187611,4
2011-10-29,46,Work Out,J. Cole,2atYprr9JsQaLynGhrWhld,False,48,46,7,0.831,0.427,2,-6.903,1,0.106,0.0531,0,0.307,0.216,93.004,235320,4
2011-10-29,47,It Will Rain,Bruno Mars,2atYprr9JsQaLynGhrWhld,False,64,28,3,0.576,0.835,2,-6.826,1,0.0486,0.337,0,0.082,0.476,150.017,257720,4
2011-10-29,48,Easy,Rascal Flatts Featuring Natasha Bedingfield,2atYprr9JsQaLynGhrWhld,False,50,48,12,0.343,0.594,2,-4.876,1,0.0344,0.128,0,0.128,0.425,120.998,218480,3
2011-10-29,49,Here For A Good Time,George Strait,2atYprr9JsQaLynGhrWhld,False,46,46,16,0.596,0.768,6,-6.753,1,0.0369,0.0858,6.23e-06,0.116,0.532,127.93,180267,4
2011-10-29,50,Sparks Fly,Taylor Swift,2atYprr9JsQaLynGhrWhld,False,54,17,12,0.605,0.787,5,-3.002,1,0.0308,0.0396,1.42e-06,0.163,0.374,114.987,260933,4
2011-10-29,51,Not Over You,Gavin DeGraw,2atYprr9JsQaLynGhrWhld,False,57,50,10,0.63,0.894,10,-4.592,1,0.0544,0.255,0,0.181,0.364,142.051,218520,4
2011-10-29,52,We Owned The Night,Lady Antebellum,2atYprr9JsQaLynGhrWhld,False,47,47,9,0.657,0.714,1,-6.965,1,0.0273,0.281,0.000145,0.0838,0.488,99.991,197800,4
2011-10-29,53,Tattoos On This Town,Jason Aldean,2atYprr9JsQaLynGhrWhld,False,60,53,4,0.359,0.784,7,-4.404,1,0.0438,0.0181,2.72e-05,0.0989,0.444,78.494,202467,4
2011-10-29,54,I Don't Want This Night To End,Luke Bryan,2atYprr9JsQaLynGhrWhld,False,73,54,3,0.616,0.728,9,-4.02,0,0.0278,0.0275,0,0.228,0.375,111.934,219973,4
2011-10-29,55,Baggage Claim,Miranda Lambert,2atYprr9JsQaLynGhrWhld,False,58,55,10,0.701,0.934,8,-2.777,1,0.0403,0.0657,1.53e-06,0.0671,0.964,81.0,197547,4
2011-10-29,56,Long Hot Summer,Keith Urban,2atYprr9JsQaLynGhrWhld,False,45,45,14,0.657,0.785,3,-8.428,1,0.037,0.0301,4.62e-06,0.0927,0.769,127.987,273587,4
2011-10-29,57,Made In America,Toby Keith,2atYprr9JsQaLynGhrWhld,False,43,40,19,0.497,0.701,9,-5.996,1,0.0306,0.0507,0,0.103,0.376,172.126,193133,4
2011-10-29,58,Keep Your Head Up,Andy Grammer,2atYprr9JsQaLynGhrWhld,False,61,53,20,0.674,0.778,0,-5.367,1,0.0376,0.0469,0,0.145,0.816,90.01,189933,4
2011-10-29,59,Country Must Be Country Wide,Brantley Gilbert,2atYprr9JsQaLynGhrWhld,False,63,59,16,0.409,0.765,11,-5.696,1,0.0412,0.0249,6.16e-06,0.104,0.5,83.093,214827,4
2011-10-29,60,Take Over Control,Afrojack Featuring Eva Simons,2atYprr9JsQaLynGhrWhld,False,44,41,18,0.735,0.699,0,-4.435,0,0.084,0.121,2.82e-05,0.0809,0.603,129.944,220520,4
2011-10-29,61,Marvins Room,Drake,2atYprr9JsQaLynGhrWhld,False,59,21,13,0.492,0.26,9,-17.341,0,0.0921,0.646,0.00178,0.0705,0.312,111.519,347227,5
2011-10-29,62,Otis,Jay Z Kanye West Featuring Otis Redding,2atYprr9JsQaLynGhrWhld,False,56,12,13,0.754,0.631,7,-4.751,0,0.307,0.552,0,0.5,0.432,94.577,178213,4
2011-10-29,63,Remind Me,Brad Paisley Duet With Carrie Underwood,2atYprr9JsQaLynGhrWhld,False,55,17,19,0.484,0.78,5,-3.275,1,0.0312,0.0533,1.27e-06,0.507,0.311,140.758,253000,4
2011-10-29,64,That Way,Wale Featuring Jeremih & Rick Ross,2atYprr9JsQaLynGhrWhld,False,71,64,7,0.683,0.691,6,-6.435,0,0.23,0.0379,0,0.0578,0.295,73.469,269267,4
2011-10-29,65,Brighter Than The Sun,Colbie Caillat,2atYprr9JsQaLynGhrWhld,False,69,65,9,0.629,0.793,9,-5.942,1,0.0346,0.00952,1.15e-06,0.218,0.588,95.981,231213,4
2011-10-29,66,Keep Me In Mind,Zac Brown Band,2atYprr9JsQaLynGhrWhld,False,83,66,3,0.684,0.715,6,-6.132,1,0.0336,0.159,0,0.181,0.564,96.018,214107,4
2011-10-29,67,Best Thing I Never Had,Beyonce,2atYprr9JsQaLynGhrWhld,False,65,16,20,0.545,0.649,6,-4.062,1,0.0324,0.143,1.57e-05,0.0894,0.297,99.099,253747,4
2011-10-29,68,Drink In My Hand,Eric Church,2atYprr9JsQaLynGhrWhld,False,78,68,4,0.626,0.913,0,-4.452,1,0.0318,0.00635,0,0.293,0.946,113.044,191307,4
2011-10-29,69,Dance (A$$),Big Sean Featuring Nicki Minaj,2atYprr9JsQaLynGhrWhld,False,93,69,2,0.765,0.695,2,-6.57,1,0.342,0.02,0.0437,0.13,0.7,159.865,197760,4
2011-10-29,70,When We Stand Together,Nickelback,2atYprr9JsQaLynGhrWhld,False,75,48,3,0.446,0.9,10,-3.541,0,0.0489,0.000102,1.89e-05,0.0404,0.88,187.961,190787,4
2011-10-29,71,I'm Gonna Love You Through It,Martina McBride,2atYprr9JsQaLynGhrWhld,False,0,71,2,0.431,0.657,5,-5.12,1,0.0304,0.317,0,0.0893,0.259,142.527,227613,4
2011-10-29,72,All Your Life,The Band Perry,2atYprr9JsQaLynGhrWhld,False,80,72,6,0.536,0.521,9,-5.373,1,0.0261,0.227,0,0.165,0.455,131.937,231933,4
2011-10-29,73,The Adventures Of Rain Dance Maggie,Red Hot Chili Peppers,2atYprr9JsQaLynGhrWhld,False,72,38,13,0.683,0.734,4,-4.523,0,0.029,0.00112,0.0139,0.258,0.576,106.254,282400,4
2011-10-29,74,Mrs. Right,Mindless Behavior Featuring Diggy,2atYprr9JsQaLynGhrWhld,False,79,73,7,0.439,0.753,0,-4.799,0,0.0932,0.057,0,0.1,0.538,95.339,248187,5
2011-10-29,75,I Like It Like That,Hot Chelle Rae Featuring New Boyz,2atYprr9JsQaLynGhrWhld,False,51,51,2,0.742,0.784,1,-5.458,1,0.0552,0.0308,0,0.354,0.65,101.002,188200,4
2011-10-29,76,Body 2 Body,Ace Hood Featuring Chris Brown,2atYprr9JsQaLynGhrWhld,False,88,76,5,0.603,0.82,1,-4.587,0,0.0566,0.00252,0,0.178,0.561,152.057,235307,4
2011-10-29,77,Skyscraper,Demi Lovato,2atYprr9JsQaLynGhrWhld,False,74,10,14,0.573,0.581,7,-3.325,1,0.0276,0.148,0,0.128,0.188,103.82,221293,4
2011-10-29,78,Wet The Bed,Chris Brown Feat. Ludacris,2atYprr9JsQaLynGhrWhld,False,81,77,6,0.58,0.66,6,-7.405,0,0.0429,0.0166,0,0.174,0.411,123.801,266307,4
2011-10-29,79,Dedication To My Ex (Miss That),Lloyd Featuring Andre 3000 & Lil Wayne,2atYprr9JsQaLynGhrWhld,False,82,79,3,0.835,0.724,0,-4.624,1,0.057,0.0169,5.48e-06,0.0936,0.964,119.037,236147,4
2011-10-29,80,One More Drinkin' Song,Jerrod Niemann,2atYprr9JsQaLynGhrWhld,False,86,77,12,0.734,0.698,9,-5.833,1,0.0331,0.473,8.02e-05,0.297,0.605,114.031,167813,4
2011-10-29,81,Just Fishin',Trace Adkins,2atYprr9JsQaLynGhrWhld,False,67,61,20,0.586,0.674,11,-5.69,1,0.0246,0.00764,0.0777,0.243,0.395,86.5,210333,4
2011-10-29,82,I Got You,Thompson Square,2atYprr9JsQaLynGhrWhld,False,89,82,9,0.533,0.799,2,-2.594,1,0.0531,0.0123,0.000879,0.106,0.521,127.04,183867,4
2011-10-29,83,Crawling Back To You,Daughtry,2atYprr9JsQaLynGhrWhld,False,41,41,2,0.426,0.908,0,-3.437,0,0.0504,0.00686,0,0.167,0.16,150.979,225440,4
2011-10-29,84,Let It Rain,David Nail Featuring Sarah Buxton,2atYprr9JsQaLynGhrWhld,False,90,84,5,0.56,0.619,4,-3.013,1,0.0405,0.385,1.03e-06,0.247,0.561,77.881,222253,4
2011-10-29,85,Countdown,Beyonce,3axkNosdVQLZiq1HakuGhc,True,0,85,1,0.665,0.787,5,-5.73,1,0.151,0.308,0,0.219,0.699,167.349,212147,4
2011-10-29,86,Calling All The Monsters,China Anne McClain,3axkNosdVQLZiq1HakuGhc,False,0,86,2,0.561,0.826,2,-5.842,1,0.0972,0.00289,0,0.432,0.499,141.98,206507,4
2011-10-29,87,Party,Beyonce Featuring Andre 3000,3axkNosdVQLZiq1HakuGhc,False,95,87,2,0.648,0.593,10,-6.267,1,0.0506,0.0188,0,0.169,0.712,160.979,245480,4
2011-10-29,88,Got 2 Luv U,Sean Paul Featuring Alexis Jordan,3axkNosdVQLZiq1HakuGhc,False,85,84,5,0.605,0.793,7,-3.084,0,0.297,0.0825,0,0.124,0.647,184.032,196640,4
2011-10-29,89,Still Got It,Tyga Featuring Drake,51B1RzOwX8ybRMb66Rhsmu,True,0,89,1,0.447,0.834,8,-6.139,0,0.373,0.437,2.46e-06,0.383,0.296,94.63,224507,4
2011-10-29,90,Sail,AWOLNATION,51B1RzOwX8ybRMb66Rhsmu,False,87,82,9,0.825,0.435,1,-9.582,1,0.0568,0.452,0.609,0.0953,0.243,119.038,259102,4
2011-10-29,91,Good Good Night,Roscoe Dash,0Rktu1dU3VH295WpdK36vs,True,0,91,1,0.645,0.958,10,-3.872,0,0.286,0.133,0,0.327,0.834,160.084,205053,4
2011-10-29,92,Criminal,Britney Spears,6T689Jvh5KrSXyaPtUWZtQ,True,0,92,1,0.696,0.734,7,-5.294,1,0.0298,0.0485,0,0.183,0.711,107.987,225080,4
2011-10-29,93,Quickie,Miguel,6T689Jvh5KrSXyaPtUWZtQ,False,84,62,13,0.372,0.642,9,-4.819,0,0.148,0.216,0,0.114,0.647,67.839,226360,4
2011-10-29,94,The One That Got Away,Katy Perry,3oL3XRtkP1WVbMxf7dtTdu,True,0,94,1,0.687,0.792,1,-4.023,0,0.0353,0.000802,0,0.2,0.864,133.962,227333,4
2011-10-29,95,Rain Over Me,Pitbull Featuring Marc Anthony,3oL3XRtkP1WVbMxf7dtTdu,False,94,30,16,0.61,0.906,0,-2.117,1,0.0648,0.00416,0,0.758,0.294,127.916,231573,4
2011-10-29,96,Domino,Jessie J,6MAdEUilV2p9RQUqE5bMAK,True,0,96,1,0.757,0.547,7,-4.573,1,0.0355,0.0115,0,0.0445,0.793,126.977,231693,4
2011-10-29,97,Make Me Proud,Drake Featuring Nicki Minaj,7yfg0Eer6UZZt5tZ1XdsWz,True,0,97,1,0.684,0.486,1,-10.155,1,0.132,0.00268,0.000148,0.157,0.355,131.913,219893,4
2011-10-29,98,Papi,Jennifer Lopez,7yfg0Eer6UZZt5tZ1XdsWz,False,96,96,3,0.705,0.805,4,-4.884,0,0.0593,0.134,0.000152,0.367,0.886,120.021,223493,4
2011-10-29,99,Lost In Paradise,Evanescence,7c8unZeNL9gI6Go9DgGYpb,True,0,99,1,0.266,0.571,8,-4.983,1,0.0376,0.0532,3.96e-06,0.073,0.104,113.059,282293,4
2011-10-29,100,Faster,Matt Nathanson,7c8unZeNL9gI6Go9DgGYpb,False,92,74,12,0.742,0.853,9,-4.147,1,0.0393,0.00743,4.79e-06,0.332,0.95,107.03,208280,4
