date,position,title,artist,spotify_id,is_new,last_pos,peak_pos,weeks,danceability,energy,key,loudness,mode,speechiness,acousticness,instrumentalness,liveness,valence,tempo,duration_ms,time_signature
2007-09-08,1,Big Girls Don't Cry,Fergie,6xfL1KzGxg48ACVlQE9qXr,False,2,1,19,0.708,0.641,7,-4.296,1,0.0335,0.205,0,0.0945,0.253,113.082,268120,4
2007-09-08,2,Crank That (Soulja Boy),Soulja Boy Tell'em,6xfL1KzGxg48ACVlQE9qXr,False,6,2,7,0.736,0.74,0,-2.18,1,0.0786,0.515,0,0.0468,0.803,140.141,221933,4
2007-09-08,3,Stronger,Kanye West,6xfL1KzGxg48ACVlQE9qXr,False,5,3,5,0.617,0.717,10,-7.858,0,0.153,0.00564,0,0.408,0.49,103.992,311867,4
2007-09-08,4,The Way I Are,Timbaland Featuring Keri Hilson,6xfL1KzGxg48ACVlQE9qXr,False,3,3,13,0.731,0.807,3,-6.492,0,0.1,0.181,0.751,0.319,0.765,114.759,179120,4
2007-09-08,5,Beautiful Girls,Sean Kingston,6xfL1KzGxg48ACVlQE9qXr,False,1,1,14,0.762,0.661,1,-6.075,0,0.0687,0.15,0,0.256,0.769,130.009,225373,4
2007-09-08,6,Hey There Delilah,Plain White T's,6xfL1KzGxg48ACVlQE9qXr,False,4,1,22,0.656,0.291,2,-10.572,1,0.0293,0.872,0,0.114,0.298,103.971,232533,4
2007-09-08,7,Bartender,T-Pain Featuring Akon,6xfL1KzGxg48ACVlQE9qXr,False,7,6,13,0.675,0.394,8,-8.539,1,0.133,0.0611,0,0.214,0.405,104.987,238800,4
2007-09-08,8,Make Me Better,Fabolous Featuring Ne-Yo,6xfL1KzGxg48ACVlQE9qXr,False,9,8,14,0.607,0.599,11,-6.886,1,0.0995,0.33,0,0.199,0.562,86.491,253573,4
2007-09-08,9,Shawty,Plies Featuring T-Pain,6xfL1KzGxg48ACVlQE9qXr,False,11,9,11,0.444,0.708,4,-5.926,0,0.126,0.0419,0,0.0775,0.26,105.412,255413,5
2007-09-08,10,Umbrella,Rihanna Featuring Jay-Z,6xfL1KzGxg48ACVlQE9qXr,False,8,1,20,0.583,0.829,1,-4.603,1,0.134,0.00864,0,0.0426,0.575,174.028,275987,4
2007-09-08,11,Rockstar,Nickelback,6xfL1KzGxg48ACVlQE9qXr,False,16,11,29,0.616,0.91,0,-3.004,1,0.0386,0.0459,0,0.343,0.693,144.072,252040,4
2007-09-08,12,Let It Go,Keyshia Cole Featuring Missy Elliott & Lil Kim,6xfL1KzGxg48ACVlQE9qXr,False,12,12,10,0.806,0.721,10,-5.167,0,0.215,0.197,0,0.209,0.781,94.967,238333,4
2007-09-08,13,Wait For You,Elliott Yamin,6xfL1KzGxg48ACVlQE9qXr,False,13,13,19,0.764,0.487,0,-6.734,1,0.0281,0.25,0,0.184,0.352,116.027,261320,4
2007-09-08,14,A Bay Bay,Hurricane Chris,6xfL1KzGxg48ACVlQE9qXr,False,10,7,12,0.577,0.668,6,-4.884,1,0.514,0.105,0,0.0924,0.702,60.709,257120,3
2007-09-08,15,Bed,J. Holiday,6xfL1KzGxg48ACVlQE9qXr,False,24,15,6,0.684,0.606,5,-7.268,0,0.0504,0.17,0,0.058,0.723,127.901,275107,4
2007-09-08,16,Who Knew,P!nk,6xfL1KzGxg48ACVlQE9qXr,False,20,16,12,0.688,0.734,9,-4.569,1,0.0274,0.00462,0,0.0756,0.46,140.004,208493,4
2007-09-08,17,Me Love,Sean Kingston,6xfL1KzGxg48ACVlQE9qXr,False,14,14,4,0.66,0.847,1,-3.25,1,0.191,0.0628,0,0.112,0.925,180.01,204293,4
2007-09-08,18,S.O.S.,Jonas Brothers,6xfL1KzGxg48ACVlQE9qXr,False,17,17,3,0.584,0.696,7,-3.836,1,0.0694,0.000728,0,0.184,0.699,137.112,153347,4
2007-09-08,19,Buy U A Drank (Shawty Snappin'),T-Pain Featuring Yung Joc,6xfL1KzGxg48ACVlQE9qXr,False,15,1,27,0.451,0.55,1,-8.137,1,0.262,0.0108,0,0.0737,0.594,80.001,227960,4
2007-09-08,20,"Sorry, Blame It On Me",Akon,6xfL1KzGxg48ACVlQE9qXr,False,22,7,6,0.709,0.65,7,-7.371,1,0.273,0.251,2.32e-05,0.0731,0.543,176.141,295720,4
2007-09-08,21,Ayo Technology,50 Cent Featuring Justin Timberlake & Timbaland,6xfL1KzGxg48ACVlQE9qXr,False,18,18,3,0.63,0.782,8,-5.44,0,0.132,0.0828,0,0.034,0.418,140.144,247947,4
2007-09-08,22,Shut Up And Drive,Rihanna,6xfL1KzGxg48ACVlQE9qXr,False,19,15,12,0.735,0.826,1,-4.902,1,0.0349,0.00101,0.129,0.197,0.74,132.964,212280,4
2007-09-08,23,LoveStoned,Justin Timberlake,6xfL1KzGxg48ACVlQE9qXr,False,27,23,8,0.859,0.681,1,-6.247,1,0.0549,0.34,0.000161,0.213,0.852,121.243,444333,4
2007-09-08,24,When You're Gone,Avril Lavigne,6xfL1KzGxg48ACVlQE9qXr,False,26,24,10,0.458,0.719,4,-3.921,0,0.0323,0.189,0,0.228,0.168,142.032,240493,4
2007-09-08,25,The Great Escape,Boys Like Girls,6xfL1KzGxg48ACVlQE9qXr,False,29,25,15,0.423,0.94,1,-4.012,0,0.0635,0.00166,0,0.178,0.505,149.934,206520,4
2007-09-08,26,Home,Daughtry,6xfL1KzGxg48ACVlQE9qXr,False,25,5,26,0.443,0.853,6,-3.885,1,0.0361,0.00217,1.77e-06,0.198,0.338,143.986,255652,4
2007-09-08,27,Party Like A Rockstar,Shop Boyz,6xfL1KzGxg48ACVlQE9qXr,False,21,2,19,0.656,0.92,6,-4.133,0,0.0441,0.00495,0.00633,0.347,0.784,150.068,214640,4
2007-09-08,28,Makes Me Wonder,Maroon 5,6xfL1KzGxg48ACVlQE9qXr,False,23,1,21,0.799,0.856,7,-2.427,1,0.0352,0.00383,0.00062,0.0621,0.892,113.994,212227,4
2007-09-08,29,First Time,Lifehouse,6xfL1KzGxg48ACVlQE9qXr,False,32,29,16,0.442,0.952,3,-2.214,1,0.0541,2.41e-05,0,0.205,0.505,130.682,203640,4
2007-09-08,30,Before He Cheats,Carrie Underwood,6xfL1KzGxg48ACVlQE9qXr,False,28,8,52,0.519,0.749,6,-3.318,0,0.0405,0.271,0,0.119,0.29,147.905,199947,4
2007-09-08,32,I Got It From My Mama,will.i.am,,False,57,32,3,0.888,0.777,6,-6.262,1,0.0505,0.0961,3.14e-05,0.0514,0.876,118.998,241520,4
2007-09-08,33,Sexy Lady,Yung Berg Featuring Junior,,False,30,18,18,0.374,0.669,0,-7.098,1,0.303,0.00051,0,0.304,0.274,184.978,229840,4
2007-09-08,34,Gotta Go My Own Way,Zac Efron & Vanessa Anne Hudgens,,False,60,34,2,0.555,0.692,9,-4.767,1,0.0277,0.0864,3.25e-05,0.232,0.313,88.995,222360,4
2007-09-08,35,The Sweet Escape,Gwen Stefani Featuring Akon,,False,36,2,37,0.756,0.77,1,-3.502,1,0.0343,0.191,0,0.178,0.73,119.961,246467,4
2007-09-08,36,Do You,Ne-Yo,,False,31,26,13,0.588,0.614,5,-5.857,0,0.0726,0.31,0,0.321,0.59,121.299,228267,5
2007-09-08,37,You Know What It Is,T.I. Featuring Wyclef Jean,,False,54,37,8,0.657,0.853,1,-4.757,0,0.252,0.17,0,0.0956,0.746,173.066,287133,4
2007-09-08,38,Thnks Fr Th Mmrs,Fall Out Boy,,False,37,11,20,0.459,0.891,10,-5.057,0,0.0623,0.00511,0,0.106,0.588,154.837,203507,4
2007-09-08,39,What I've Done,Linkin Park,,False,39,7,21,0.623,0.93,5,-5.285,1,0.0324,0.0141,1.64e-06,0.138,0.287,120.119,205613,4
2007-09-08,40,Whine Up,Kat DeLuna Featuring Elephant Man,,False,44,29,13,0.817,0.563,9,-6.276,1,0.055,0.0526,1.32e-06,0.154,0.488,125.02,205747,4
2007-09-08,41,Potential Breakup Song,Aly & AJ,,False,50,17,9,0.554,0.899,6,-4.149,0,0.0385,0.000469,0.000365,0.0867,0.556,157.995,218333,4
2007-09-08,42,Cyclone,Baby Bash Featuring T-Pain,,False,52,42,5,0.644,0.725,11,-4.622,1,0.0701,0.0112,0,0.146,0.584,77.977,222053,4
2007-09-08,43,Never Wanted Nothing More,Kenny Chesney,,False,40,22,10,0.528,0.742,7,-7.044,1,0.0526,0.0412,1.99e-05,0.236,0.746,177.842,207720,4
2007-09-08,44,When I See U,Fantasia,,False,41,32,21,0.569,0.596,8,-6.486,1,0.171,0.457,8.99e-05,0.205,0.757,93.134,217347,4
2007-09-08,45,These Are My People,Rodney Atkins,,False,47,45,12,0.558,0.896,0,-3.687,1,0.0545,0.0316,0,0.528,0.63,90.064,213653,4
2007-09-08,46,Bet On It,Zac Efron,,False,66,46,2,0.474,0.724,2,-8.12,1,0.338,0.133,0,0.0694,0.384,116.956,187873,3
2007-09-08,47,Summer Love,Justin Timberlake,,False,45,6,20,0.606,0.591,0,-7.228,0,0.087,0.0756,0,0.328,0.477,95.802,252973,4
2007-09-08,48,If You're Reading This,Tim McGraw,,False,43,43,3,0.305,0.304,11,-8.383,1,0.0285,0.823,0,0.67,0.341,145.49,252720,4
2007-09-08,50,Teardrops On My Guitar,Taylor Swift,,False,49,33,25,0.621,0.417,10,-6.941,1,0.0231,0.288,0,0.119,0.289,99.953,203040,4
2007-09-08,51,Can't Leave 'Em Alone,Ciara Featuring 50 Cent,,False,55,51,6,0.527,0.696,1,-6.015,0,0.361,0.209,0,0.0516,0.499,100.614,244760,4
2007-09-08,52,What Time Is It,High School Musical 2 Cast,,False,33,6,6,0.654,0.951,0,-4.479,1,0.0652,0.0062,5.17e-06,0.0404,0.76,121.918,236373,4
2007-09-08,54,Paralyzer,Finger Eleven,,False,59,54,12,0.644,0.939,11,-3.486,0,0.0456,0.157,0,0.233,0.861,106.031,208107,4
2007-09-08,55,Big Things Poppin' (Do It),T.I.,,False,35,9,14,0.597,0.715,7,-6.741,1,0.036,0.00425,0.911,0.191,0.539,169.036,289987,4
2007-09-08,56,teachme,Musiq Soulchild,,False,51,42,16,0.499,0.61,8,-5.11,0,0.135,0.473,0,0.0722,0.436,172.969,260773,3
2007-09-08,57,Misery Business,Paramore,,False,34,34,6,0.517,0.906,1,-3.677,1,0.0735,0.00272,9.26e-06,0.113,0.731,172.977,211520,4
2007-09-08,58,Online,Brad Paisley,,False,62,58,6,0.557,0.856,7,-5.294,1,0.0687,0.0882,0.0326,0.681,0.846,133.527,289413,4
2007-09-08,59,Bubbly,Colbie Caillat,,False,68,59,9,0.697,0.474,9,-6.663,1,0.0351,0.603,0,0.11,0.249,127.904,196280,4
2007-09-08,60,Hold On,Jonas Brothers,,False,53,53,5,0.468,0.892,11,-3.555,1,0.132,0.00399,0,0.368,0.817,149.162,164973,4
2007-09-08,61,Rehab,Amy Winehouse,,False,48,9,19,0.434,0.872,0,-2.974,1,0.0702,0.0473,1.83e-06,0.396,0.732,71.515,213760,4
2007-09-08,62,Over You,Daughtry,,False,75,62,3,0.425,0.922,3,-2.6,1,0.0412,0.0174,0,0.104,0.564,156.045,204661,4
2007-09-08,63,Wake Up Call,Maroon 5,,False,80,63,3,0.632,0.949,4,-2.671,0,0.0593,0.0302,0,0.0871,0.969,164.118,201307,4
2007-09-08,64,Everything,Michael Buble,,False,63,46,16,0.686,0.688,6,-4.981,0,0.0254,0.39,1.03e-06,0.0924,0.493,123.125,212373,4
2007-09-08,66,Like This,Mims,,False,58,32,16,0.771,0.693,7,-7.483,1,0.293,0.0317,0,0.342,0.525,97.163,203627,4
2007-09-08,67,Clothes Off!!,Gym Class Heroes,,False,46,46,2,0.761,0.69,11,-5.56,1,0.11,0.0225,0,0.34,0.742,114.987,235480,4
2007-09-08,68,Love Me If You Can,Toby Keith,,False,71,68,5,0.57,0.633,5,-6.26,1,0.0285,0.242,0.00176,0.0866,0.339,148.027,216867,4
2007-09-08,69,Take Me There,Rascal Flatts,,False,67,67,5,0.499,0.857,4,-4.501,1,0.0374,0.00476,0,0.102,0.324,83.977,266587,4
2007-09-08,71,Proud Of The House We Built,Brooks & Dunn,,False,78,71,5,0.617,0.789,6,-4.973,1,0.0445,0.0638,0.00481,0.11,0.546,119.982,226187,4
2007-09-08,72,All My Friends Say,Luke Bryan,,False,79,72,4,0.683,0.9,9,-4.422,1,0.0333,0.0439,0,0.177,0.962,117.036,242800,4
2007-09-08,73,Lean Like A Cholo,Down A.K.A. Kilo,,False,65,34,17,0.877,0.839,8,-3.988,1,0.275,0.102,0,0.0735,0.926,71.977,198217,5
2007-09-08,74,Int'l Players Anthem (I Choose You),UGK Featuring OutKast,,False,70,70,3,0.675,0.68,4,-5.01,0,0.256,0.0655,0,0.354,0.845,155.698,259040,4
2007-09-08,75,Easy,Paula DeAnda Featuring Bow Wow,,False,64,64,9,0.815,0.806,0,-4.246,0,0.032,0.0786,2.76e-06,0.276,0.95,121.006,236573,4
2007-09-08,76,Fabulous,Ashley Tisdale & Lucas Grabeel,0rc643k3fDfLiMzZrJKn7g,True,0,76,1,0.621,0.84,2,-2.881,1,0.0398,0.553,0,0.156,0.543,132.052,181120,4
2007-09-08,77,Until The End Of Time,Justin Timberlake Duet With Beyonce,0rc643k3fDfLiMzZrJKn7g,False,82,77,8,0.866,0.229,2,-14.31,1,0.0497,0.0884,0.0543,0.147,0.52,119.888,322794,4
2007-09-08,78,Bleed It Out,Linkin Park,0rc643k3fDfLiMzZrJKn7g,False,77,69,4,0.529,0.967,1,-3.647,0,0.0508,0.114,0,0.61,0.596,140.127,166373,4
2007-09-08,79,Can't Tell Me Nothing,Kanye West,0rc643k3fDfLiMzZrJKn7g,False,88,79,8,0.596,0.62,5,-6.133,0,0.039,0.0122,0,0.82,0.102,80.029,271600,4
2007-09-08,80,Everyday America,Sugarland,0rc643k3fDfLiMzZrJKn7g,False,81,72,8,0.638,0.847,7,-2.574,1,0.0465,0.337,4.06e-06,0.0725,0.658,101.013,232133,4
2007-09-08,81,I Need You,Tim McGraw With Faith Hill,0rc643k3fDfLiMzZrJKn7g,False,61,50,15,0.532,0.434,4,-12.471,1,0.0333,0.365,0.0166,0.114,0.336,79.648,244297,3
2007-09-08,82,The Pretender,Foo Fighters,0rc643k3fDfLiMzZrJKn7g,False,72,56,3,0.433,0.959,9,-4.04,1,0.0431,0.000917,0,0.028,0.365,172.984,269373,4
2007-09-08,83,Free And Easy (Down The Road I Go),Dierks Bentley,0rc643k3fDfLiMzZrJKn7g,False,89,83,4,0.557,0.825,6,-4.657,1,0.0283,0.00525,0.00164,0.177,0.841,120.017,201120,4
2007-09-08,84,How Do I Breathe,Mario,0rc643k3fDfLiMzZrJKn7g,False,76,46,10,0.684,0.455,5,-8.216,1,0.0307,0.215,1.08e-06,0.263,0.487,97.956,216893,4
2007-09-08,85,I Get Money,50 Cent,1FKFCvi0i46qEJLZSEBH8p,True,0,85,1,0.525,0.933,9,-4.673,1,0.356,0.159,0.000241,0.311,0.457,122.631,223720,5
2007-09-08,86,Hood Figga,Gorilla Zoe,1FKFCvi0i46qEJLZSEBH8p,False,95,86,5,0.814,0.713,1,-5.089,1,0.107,0.0162,0,0.123,0.145,174.264,200933,4
2007-09-08,87,Teenagers,My Chemical Romance,1FKFCvi0i46qEJLZSEBH8p,False,93,67,11,0.463,0.857,4,-3.063,1,0.0632,0.0506,0,0.184,0.856,111.647,161920,4
2007-09-08,88,A Different World,Bucky Covington,1FKFCvi0i46qEJLZSEBH8p,False,69,58,19,0.62,0.686,9,-5.027,1,0.0276,0.0327,0,0.101,0.464,128.962,208573,4
2007-09-08,89,Cupid Shuffle,Cupid,1FKFCvi0i46qEJLZSEBH8p,False,86,66,8,0.785,0.582,5,-4.877,0,0.237,0.191,0,0.2,0.861,71.774,231360,4
2007-09-08,90,4 In The Morning,Gwen Stefani,1FKFCvi0i46qEJLZSEBH8p,False,83,54,14,0.698,0.826,10,-6.261,1,0.031,0.2,0.00013,0.114,0.502,92.409,291107,4
2007-09-08,91,Wipe Me Down,Lil Boosie Featuring Foxx & Webbie,1FKFCvi0i46qEJLZSEBH8p,False,85,38,17,0.836,0.906,1,-2.902,1,0.279,0.000426,0,0.227,0.718,165.091,272347,4
2007-09-08,92,I Told You So,Keith Urban,1FKFCvi0i46qEJLZSEBH8p,False,73,48,16,0.627,0.841,1,-5.885,0,0.0316,0.00788,1.47e-06,0.0552,0.73,105.995,242760,4
2007-09-08,93,So Small,Carrie Underwood,1FKFCvi0i46qEJLZSEBH8p,False,98,93,2,0.426,0.784,3,-3.225,1,0.0421,0.306,0,0.0695,0.272,147.939,225213,3
2007-09-08,94,Do You Know? (The Ping Pong Song)/Dimelo,Enrique Iglesias,1FKFCvi0i46qEJLZSEBH8p,False,96,21,15,0.755,0.763,8,-4.328,1,0.0501,0.0513,0,0.0326,0.696,114.992,218053,4
2007-09-08,95,Tough,Craig Morgan,1FKFCvi0i46qEJLZSEBH8p,False,87,76,8,0.605,0.386,8,-8.008,1,0.0337,0.553,0,0.152,0.148,132.885,195907,4
2007-09-08,96,Apologize,Timbaland Featuring OneRepublic,1FKFCvi0i46qEJLZSEBH8p,False,91,91,4,0.657,0.609,8,-6.025,1,0.0291,0.0357,0,0.0973,0.0893,118.013,184400,4
2007-09-08,97,(You Want To) Make A Memory,Bon Jovi,1FKFCvi0i46qEJLZSEBH8p,False,99,27,17,0.532,0.887,0,-3.757,1,0.0335,0.0778,0.000214,0.294,0.795,122.511,249293,4
2007-09-08,98,All For One,High School Musical 2 Cast,1FKFCvi0i46qEJLZSEBH8p,False,92,92,2,0.657,0.985,5,-3.22,1,0.109,0.119,0,0.641,0.776,150.038,253787,4
2007-09-08,99,Tambourine,Eve,1FKFCvi0i46qEJLZSEBH8p,False,84,37,16,0.82,0.854,1,-4.153,1,0.22,0.239,0,0.359,0.574,102.623,192440,4
2007-09-08,100,Never Too Late,Three Days Grace,1FKFCvi0i46qEJLZSEBH8p,False,0,96,4,0.433,0.778,2,-4.68,0,0.0371,0.00838,0,0.163,0.217,149.864,209333,4
