date,position,title,artist,spotify_id,is_new,last_pos,peak_pos,weeks,danceability,energy,key,loudness,mode,speechiness,acousticness,instrumentalness,liveness,valence,tempo,duration_ms,time_signature
2009-10-17,1,Down,Jay Sean Featuring Lil Wayne,4PyKicaf5RL5tlidl6ZMO5,False,2,1,14,0.657,0.695,2,-4.493,1,0.0321,0.0108,0,0.0822,0.683,65.997,212107,4
2009-10-17,2,Party In The U.S.A.,Miley Cyrus,4PyKicaf5RL5tlidl6ZMO5,False,3,2,8,0.652,0.698,10,-4.667,0,0.042,0.00112,0.000115,0.0886,0.47,96.021,202067,4
2009-10-17,3,Run This Town,"Jay-Z, Rihanna & Kanye West",4PyKicaf5RL5tlidl6ZMO5,False,4,2,10,0.632,0.924,1,-1.802,1,0.29,0.281,0,0.263,0.441,86.844,267520,4
2009-10-17,4,Whatcha Say,Jason Derulo,4PyKicaf5RL5tlidl6ZMO5,False,5,4,8,0.615,0.711,11,-5.507,1,0.0779,0.0444,0,0.145,0.711,144.036,221253,4
2009-10-17,5,I Gotta Feeling,The Black Eyed Peas,4PyKicaf5RL5tlidl6ZMO5,False,1,1,17,0.744,0.774,0,-6.399,1,0.0268,0.0751,0,0.512,0.649,127.958,289187,4
2009-10-17,6,Paparazzi,Lady Gaga,4PyKicaf5RL5tlidl6ZMO5,False,7,6,6,0.762,0.692,5,-3.973,0,0.0438,0.113,0,0.094,0.397,114.906,208307,4
2009-10-17,7,You Belong With Me,Taylor Swift,4PyKicaf5RL5tlidl6ZMO5,False,6,2,24,0.687,0.783,6,-4.44,1,0.0386,0.162,1.35e-05,0.114,0.443,129.964,231133,4
2009-10-17,8,Obsessed,Mariah Carey,4PyKicaf5RL5tlidl6ZMO5,False,9,7,13,0.742,0.468,10,-5.557,0,0.0625,0.0465,0,0.826,0.369,86.443,242200,4
2009-10-17,9,Use Somebody,Kings Of Leon,4PyKicaf5RL5tlidl6ZMO5,False,8,4,36,0.276,0.715,0,-5.356,1,0.0432,0.00552,0.000417,0.201,0.173,137.028,230760,4
2009-10-17,10,Empire State Of Mind,Jay-Z + Alicia Keys,4PyKicaf5RL5tlidl6ZMO5,False,10,5,4,0.491,0.956,11,-1.538,1,0.392,0.0295,0,0.46,0.811,173.585,276920,4
2009-10-17,11,Fireflies,Owl City,4PyKicaf5RL5tlidl6ZMO5,False,24,11,7,0.512,0.662,3,-6.797,1,0.0439,0.0275,0,0.118,0.472,180.114,228347,4
2009-10-17,12,Sweet Dreams,Beyonce,4PyKicaf5RL5tlidl6ZMO5,False,15,12,11,0.694,0.825,1,-5.986,1,0.111,0.0895,1.86e-05,0.0618,0.788,121.949,208067,4
2009-10-17,13,Forever,"Drake Featuring Kanye West, Lil Wayne & Eminem",4PyKicaf5RL5tlidl6ZMO5,False,12,8,3,0.415,0.926,5,-1.304,0,0.374,0.253,0,0.256,0.542,158.423,357347,4
2009-10-17,14,Cowboy Casanova,Carrie Underwood,4PyKicaf5RL5tlidl6ZMO5,False,11,11,3,0.597,0.82,5,-2.529,1,0.0582,0.0328,0,0.119,0.576,119.969,236787,4
2009-10-17,15,Hotel Room Service,Pitbull,4PyKicaf5RL5tlidl6ZMO5,False,14,8,16,0.851,0.629,1,-8.385,1,0.175,0.00705,0.000372,0.0746,0.789,125.984,237640,4
2009-10-17,16,Break Up,Mario Featuring Gucci Mane & Sean Garrett,4PyKicaf5RL5tlidl6ZMO5,False,20,14,16,0.44,0.517,0,-7.355,1,0.363,0.428,0,0.173,0.475,73.881,249027,4
2009-10-17,17,She Wolf,Shakira,4PyKicaf5RL5tlidl6ZMO5,False,13,11,12,0.865,0.69,7,-7.448,1,0.0444,0.289,0.0138,0.225,0.868,121.983,188867,4
2009-10-17,18,Say Hey (I Love You),Michael Franti & Spearhead Featuring Cherine Anderson,4PyKicaf5RL5tlidl6ZMO5,False,22,18,11,0.738,0.983,5,-4.374,0,0.0855,0.038,5.93e-06,0.183,0.957,92.998,235760,4
2009-10-17,19,Throw It In The Bag,Fabolous Featuring The-Dream,4PyKicaf5RL5tlidl6ZMO5,False,18,14,18,0.789,0.55,11,-7.423,0,0.0473,0.174,0,0.0614,0.696,172.049,231573,4
2009-10-17,20,Be On You,Flo Rida Featuring Ne-Yo,4PyKicaf5RL5tlidl6ZMO5,False,23,19,12,0.398,0.709,4,-4.602,0,0.211,0.334,0,0.142,0.714,78.089,243227,1
2009-10-17,21,Best I Ever Had,Drake,4PyKicaf5RL5tlidl6ZMO5,False,16,2,22,0.395,0.922,1,-2.176,1,0.375,0.19,0,0.134,0.558,162.361,257690,4
2009-10-17,22,Good Girls Go Bad,Cobra Starship Featuring Leighton Meester,4PyKicaf5RL5tlidl6ZMO5,False,17,7,19,0.594,0.874,0,-3.716,1,0.0815,0.0116,0,0.549,0.628,119.964,196413,4
2009-10-17,23,Already Gone,Kelly Clarkson,4PyKicaf5RL5tlidl6ZMO5,False,27,23,10,0.209,0.872,9,-2.996,1,0.0757,0.217,0,0.0768,0.294,78.139,281560,4
2009-10-17,24,Replay,Iyaz,4PyKicaf5RL5tlidl6ZMO5,False,51,24,7,0.706,0.751,9,-6.323,1,0.0708,0.173,0,0.168,0.195,91.031,182307,4
2009-10-17,25,Knock You Down,Keri Hilson Featuring Kanye West & Ne-Yo,4PyKicaf5RL5tlidl6ZMO5,False,19,3,28,0.588,0.877,8,-4.78,1,0.16,0.00952,0,0.171,0.645,155.165,326187,4
2009-10-17,26,One Time,Justin Bieber,4PyKicaf5RL5tlidl6ZMO5,False,26,26,11,0.691,0.853,1,-2.528,0,0.0372,0.0631,7.13e-05,0.082,0.762,145.999,215867,4
2009-10-17,27,Successful,Drake Featuring Trey Songz & Lil Wayne,4PyKicaf5RL5tlidl6ZMO5,False,21,17,12,0.562,0.544,8,-5.065,1,0.369,0.536,0,0.17,0.231,159.517,375050,4
2009-10-17,28,Somebody To Love,Glee Cast,4PyKicaf5RL5tlidl6ZMO5,False,85,28,2,0.553,0.795,8,-4.001,1,0.0436,0.22,0,0.358,0.389,116.765,282147,3
2009-10-17,29,Love Drunk,Boys Like Girls,4PyKicaf5RL5tlidl6ZMO5,False,28,22,14,0.44,0.976,10,-3.17,1,0.141,0.00177,3.39e-06,0.16,0.412,150.005,226707,4
2009-10-17,30,Need You Now,Lady Antebellum,4PyKicaf5RL5tlidl6ZMO5,False,37,30,8,0.587,0.622,4,-5.535,1,0.0303,0.0927,0.000636,0.2,0.231,107.943,277573,4
2009-10-17,31,Fallin' For You,Colbie Caillat,4PyKicaf5RL5tlidl6ZMO5,False,33,12,14,0.644,0.834,4,-6.473,1,0.0275,0.156,0,0.112,0.593,117.043,215547,4
2009-10-17,32,Meet Me Halfway,The Black Eyed Peas,4PyKicaf5RL5tlidl6ZMO5,False,47,32,3,0.8,0.621,11,-6.838,0,0.0651,0.00409,2.47e-05,0.131,0.448,130.002,284413,4
2009-10-17,33,Toes,Zac Brown Band,4PyKicaf5RL5tlidl6ZMO5,False,32,31,11,0.8,0.759,11,-5.398,1,0.0378,0.655,0,0.0897,0.821,129.979,262773,4
2009-10-17,34,Sexy Chick,David Guetta Featuring Akon,4PyKicaf5RL5tlidl6ZMO5,False,45,34,9,0.809,0.562,11,-7.694,0,0.0534,0.0816,0.000418,0.105,0.798,130.003,194347,4
2009-10-17,35,Battlefield,Jordin Sparks,4PyKicaf5RL5tlidl6ZMO5,False,25,10,21,0.613,0.634,2,-3.472,1,0.0339,0.0178,0,0.0719,0.37,144.953,241348,4
2009-10-17,36,Never Say Never,The Fray,4PyKicaf5RL5tlidl6ZMO5,False,36,32,17,0.23,0.492,8,-5.767,1,0.0317,0.568,8.18e-06,0.176,0.262,160.139,256613,4
2009-10-17,37,Big Green Tractor,Jason Aldean,4PyKicaf5RL5tlidl6ZMO5,False,29,18,17,0.623,0.59,4,-5.014,1,0.028,0.646,0,0.295,0.579,137.071,204200,4
2009-10-17,38,Boom Boom Pow,The Black Eyed Peas,4PyKicaf5RL5tlidl6ZMO5,False,30,1,30,0.867,0.857,9,-5.892,1,0.0663,0.13,0.00171,0.13,0.402,130.048,251440,4
2009-10-17,39,Gettin' You Home,Chris Young,4PyKicaf5RL5tlidl6ZMO5,False,43,39,8,0.639,0.678,7,-5.02,1,0.0278,0.44,1.45e-06,0.221,0.531,106.966,212133,4
2009-10-17,40,American Ride,Toby Keith,4PyKicaf5RL5tlidl6ZMO5,False,39,36,10,0.519,0.907,9,-2.681,1,0.0665,0.0829,1.57e-06,0.325,0.794,174.085,165693,4
2009-10-17,41,No Surprise,Daughtry,4PyKicaf5RL5tlidl6ZMO5,False,34,15,22,0.508,0.823,3,-3.711,1,0.031,0.00741,0,0.104,0.152,95.98,270640,4
2009-10-17,42,Evacuate The Dancefloor,Cascada,4PyKicaf5RL5tlidl6ZMO5,False,46,39,8,0.76,0.696,0,-5.811,1,0.0491,0.0195,0,0.278,0.903,127.029,205884,4
2009-10-17,43,21 Guns,Green Day,4PyKicaf5RL5tlidl6ZMO5,False,31,22,15,0.268,0.742,5,-4.939,1,0.0355,0.0518,0,0.626,0.416,159.779,321093,4
2009-10-17,44,I Know You Want Me (Calle Ocho),Pitbull,4PyKicaf5RL5tlidl6ZMO5,False,35,2,32,0.817,0.733,2,-6.009,1,0.145,0.0152,4.31e-05,0.107,0.833,127.056,237120,4
2009-10-17,45,Only You Can Love Me This Way,Keith Urban,4PyKicaf5RL5tlidl6ZMO5,False,42,42,12,0.566,0.429,2,-9.478,1,0.0286,0.457,3.38e-05,0.173,0.325,147.957,247680,4
2009-10-17,46,Drop It Low,Ester Dean Featuring Chris Brown,4PyKicaf5RL5tlidl6ZMO5,False,49,46,4,0.723,0.714,11,-5.036,1,0.0537,0.0019,5.43e-05,0.0836,0.386,88.047,190533,4
2009-10-17,47,Waking Up In Vegas,Katy Perry,4PyKicaf5RL5tlidl6ZMO5,False,40,9,23,0.524,0.878,5,-3.108,0,0.0346,0.0012,0,0.098,0.59,130.989,199187,4
2009-10-17,48,Please Don't Leave Me,P!nk,4PyKicaf5RL5tlidl6ZMO5,False,41,17,25,0.589,0.845,6,-4.497,1,0.0378,0.00883,0,0.326,0.746,138.026,231560,4
2009-10-17,49,Wasted,Gucci Mane Featuring Plies Or OJ Da Juiceman,4PyKicaf5RL5tlidl6ZMO5,False,50,49,5,0.702,0.727,5,-3.443,1,0.155,0.0827,0,0.0831,0.549,155.093,249840,4
2009-10-17,50,Pretty Wings,Maxwell,4PyKicaf5RL5tlidl6ZMO5,False,44,33,23,0.563,0.402,9,-10.496,1,0.0668,0.252,2.07e-06,0.0886,0.2,115.561,310520,4
2009-10-17,51,Alone,Glee Cast Featuring Kristin Chenoweth,1LL2jGP1hehUlAccRCxmV4,True,0,51,1,0.407,0.685,6,-6.549,1,0.0302,0.292,3.37e-05,0.0823,0.221,175.832,221693,4
2009-10-17,52,Imma Star (Everywhere We Are),Jeremih,1LL2jGP1hehUlAccRCxmV4,False,54,51,11,0.66,0.361,6,-10.418,1,0.089,0.438,0,0.39,0.604,148.073,261373,4
2009-10-17,53,Welcome To The Future,Brad Paisley,1LL2jGP1hehUlAccRCxmV4,False,62,53,9,0.516,0.86,7,-5.856,1,0.0319,0.0327,0.000131,0.162,0.43,141.702,351453,4
2009-10-17,54,Small Town USA,Justin Moore,1LL2jGP1hehUlAccRCxmV4,False,53,44,18,0.594,0.601,6,-5.996,1,0.029,0.122,5.69e-06,0.181,0.531,131.931,218853,4
2009-10-17,55,I'm Alive,Kenny Chesney With Dave Matthews,1LL2jGP1hehUlAccRCxmV4,False,64,55,7,0.564,0.244,3,-11.149,1,0.0329,0.758,0.000607,0.106,0.346,78.076,197627,4
2009-10-17,56,La La La,LMFAO,1LL2jGP1hehUlAccRCxmV4,False,55,55,3,0.607,0.807,0,-6.548,0,0.126,0.0067,1.18e-06,0.251,0.565,128.046,210560,4
2009-10-17,57,Ice Cream Paint Job,Dorrough,1LL2jGP1hehUlAccRCxmV4,False,52,27,19,0.851,0.598,0,-8.356,1,0.439,0.000595,0,0.343,0.654,180.046,237320,4
2009-10-17,58,LOL :-),Trey Songz Featuring Gucci Mane & Soulja Boy Tell'em,1LL2jGP1hehUlAccRCxmV4,False,63,51,5,0.807,0.747,10,-5.495,1,0.112,0.00701,0,0.107,0.784,154.991,246907,4
2009-10-17,59,Do I,Luke Bryan,1LL2jGP1hehUlAccRCxmV4,False,65,59,5,0.581,0.691,9,-5.33,1,0.0333,0.257,0,0.11,0.299,137.985,239413,4
2009-10-17,60,I Want To Know What Love Is,Mariah Carey,1LL2jGP1hehUlAccRCxmV4,False,75,60,3,0.591,0.42,6,-6.399,1,0.0334,0.122,1.18e-06,0.168,0.318,79.957,207133,4
2009-10-17,61,Her Diamonds,Rob Thomas,1LL2jGP1hehUlAccRCxmV4,False,56,23,20,0.555,0.924,7,-4.93,1,0.0604,0.0159,0,0.075,0.865,87.606,280000,4
2009-10-17,62,Smile,Uncle Kracker,1LL2jGP1hehUlAccRCxmV4,False,59,47,9,0.541,0.812,4,-3.764,1,0.0336,0.203,0,0.42,0.607,141.056,201627,4
2009-10-17,63,New Divide,Linkin Park,1LL2jGP1hehUlAccRCxmV4,False,58,6,20,0.493,0.808,5,-3.365,0,0.0362,0.000235,0,0.0983,0.38,117.971,268613,4
2009-10-17,64,Face Drop,Sean Kingston,1LL2jGP1hehUlAccRCxmV4,False,70,64,4,0.634,0.827,2,-3.687,1,0.0393,0.00104,0,0.326,0.739,83.994,184573,4
2009-10-17,65,Doesn't Mean Anything,Alicia Keys,1LL2jGP1hehUlAccRCxmV4,False,61,61,2,0.712,0.407,4,-7.104,0,0.0308,0.036,0.000291,0.0963,0.0997,103.97,272613,4
2009-10-17,66,The Fixer,Pearl Jam,1LL2jGP1hehUlAccRCxmV4,False,57,56,6,0.515,0.934,11,-5.079,0,0.0371,7.94e-05,0.0047,0.327,0.894,152.24,177560,3
2009-10-17,67,Uprising,Muse,1LL2jGP1hehUlAccRCxmV4,False,66,37,4,0.602,0.905,2,-4.046,1,0.0775,0.000202,0.064,0.117,0.411,128.019,304840,4
2009-10-17,68,I'm Going In,Drake Featuring Lil Wayne & Young Jeezy,1LL2jGP1hehUlAccRCxmV4,False,60,40,3,0.422,0.635,2,-8.25,0,0.105,0.403,0,0.0772,0.276,124.128,372587,4
2009-10-17,69,Starstrukk,3OH!3 Featuring Katy Perry,1LL2jGP1hehUlAccRCxmV4,False,73,69,7,0.607,0.805,11,-5.579,0,0.0608,0.00175,0,0.231,0.232,139.894,202667,4
2009-10-17,70,God In Me,"Mary Mary Featuring Kierra ""KiKi"" Sheard",1LL2jGP1hehUlAccRCxmV4,False,68,68,14,0.673,0.673,5,-5.824,0,0.0948,0.0336,0,0.214,0.428,176.088,192680,4
2009-10-17,71,Love Your Love The Most,Eric Church,1LL2jGP1hehUlAccRCxmV4,False,69,63,15,0.333,0.524,10,-6.788,1,0.0301,0.194,0,0.124,0.438,73.393,170387,4
2009-10-17,72,Number One,R. Kelly Featuring Keri Hilson,1LL2jGP1hehUlAccRCxmV4,False,80,72,6,0.65,0.813,0,-4.673,1,0.112,0.228,0,0.18,0.576,136.796,260867,4
2009-10-17,73,Wheels,Foo Fighters,3KsatAMRt1a7iryhWt5I8U,True,0,73,1,0.426,0.792,9,-4.709,1,0.0374,0.000495,5.1e-06,0.142,0.557,161.994,278213,4
2009-10-17,74,Funhouse,P!nk,3KsatAMRt1a7iryhWt5I8U,False,97,74,2,0.792,0.865,11,-3.04,0,0.0337,0.00503,1.64e-06,0.0375,0.833,103.935,204627,4
2009-10-17,75,Runaway,Love And Theft,3KsatAMRt1a7iryhWt5I8U,False,79,65,6,0.405,0.721,1,-6.97,1,0.283,0.329,0,0.252,0.815,92.854,280680,4
2009-10-17,76,Don't Stop Believin',Glee Cast,3KsatAMRt1a7iryhWt5I8U,False,0,4,5,0.473,0.604,7,-4.034,1,0.0337,0.0376,0,0.103,0.271,123.848,232000,4
2009-10-17,77,I Will Not Bow,Breaking Benjamin,3KsatAMRt1a7iryhWt5I8U,False,67,40,5,0.533,0.955,8,-3.708,1,0.0653,0.000165,1.36e-05,0.38,0.55,107.984,216733,4
2009-10-17,78,Careful,Paramore,63L9AjBDN3SOMbJlBkFqiZ,True,0,78,1,0.417,0.945,8,-3.703,1,0.0805,0.00019,8.63e-05,0.2,0.607,164.997,230440,4
2009-10-17,79,Under,Pleasure P,63L9AjBDN3SOMbJlBkFqiZ,False,82,79,6,0.675,0.678,5,-7.151,0,0.0625,0.202,1.49e-06,0.144,0.474,119.986,231160,4
2009-10-17,80,You're A Jerk,New Boyz,63L9AjBDN3SOMbJlBkFqiZ,False,77,24,16,0.931,0.456,4,-6.206,1,0.348,0.153,0,0.0914,0.522,99.048,189053,4
2009-10-17,81,Fifteen,Taylor Swift,63L9AjBDN3SOMbJlBkFqiZ,False,89,65,5,0.556,0.651,7,-4.396,1,0.0266,0.067,0,0.145,0.203,95.485,294333,4
2009-10-17,82,Falling Down,Selena Gomez & The Scene,63L9AjBDN3SOMbJlBkFqiZ,False,91,82,6,0.58,0.898,0,-3.517,1,0.0832,0.000146,7.87e-06,0.359,0.805,140.016,184680,4
2009-10-17,83,Young Forever,Jay-Z + Mr. Hudson,63L9AjBDN3SOMbJlBkFqiZ,False,72,41,4,0.637,0.69,9,-3.214,0,0.0693,0.417,0,0.211,0.103,140.329,253907,4
2009-10-17,84,Sounds Like Life To Me,Darryl Worley,63L9AjBDN3SOMbJlBkFqiZ,False,84,84,10,0.532,0.596,2,-6.512,1,0.0282,0.0224,0,0.134,0.418,85.944,223040,4
2009-10-17,85,Red Light,David Nail,63L9AjBDN3SOMbJlBkFqiZ,False,95,85,2,0.387,0.804,9,-2.601,1,0.0372,0.0917,1.98e-05,0.171,0.428,163.853,246333,3
2009-10-17,86,Break,Three Days Grace,63L9AjBDN3SOMbJlBkFqiZ,False,93,86,4,0.578,0.897,0,-3.906,1,0.0357,0.000666,0,0.0924,0.737,115.491,193107,4
2009-10-17,87,I'm In Miami Trick,LMFAO,63L9AjBDN3SOMbJlBkFqiZ,False,81,51,19,0.88,0.884,7,-4.188,1,0.18,0.00476,0,0.052,0.57,127.944,195253,4
2009-10-17,88,Maybe This Time,Glee Cast Featuring Kristin Chenoweth,6cUf9i28VLmBKCBTyiS4vT,True,0,88,1,0.399,0.382,6,-8.11,1,0.168,0.46,1.66e-05,0.119,0.194,86.463,179507,4
2009-10-17,89,Live Like We're Dying,Kris Allen,1HfxPaJggVwFsvOtHbVzMz,True,0,89,1,0.589,0.893,0,-2.948,1,0.0397,0.0273,0,0.343,0.94,92.011,212507,4
2009-10-17,90,Bonfire,Craig Morgan,1HfxPaJggVwFsvOtHbVzMz,False,98,90,2,0.426,0.917,0,-2.968,1,0.103,0.119,0,0.153,0.506,175.716,179707,4
2009-10-17,91,I Wanna Make You Close Your Eyes,Dierks Bentley,0V6Na986SNXm1CpreVF56E,True,0,91,1,0.599,0.61,1,-5.745,1,0.0232,0.104,4.83e-05,0.115,0.359,95.979,239119,4
2009-10-17,92,Check My Brain,Alice In Chains,0V6Na986SNXm1CpreVF56E,False,94,92,3,0.441,0.845,10,-3.315,1,0.0462,3.28e-06,0.0533,0.723,0.304,113.989,237907,4
2009-10-17,93,Living For The Night,George Strait,0V6Na986SNXm1CpreVF56E,False,74,53,17,0.428,0.44,1,-6.48,1,0.0241,0.63,0.000862,0.116,0.265,78.463,221773,4
2009-10-17,94,Bad Habits,Maxwell,0V6Na986SNXm1CpreVF56E,False,96,94,2,0.661,0.67,11,-7.645,0,0.258,0.0873,2.01e-06,0.0794,0.661,148.02,352280,4
2009-10-17,95,I'll Just Hold On,Blake Shelton,0V6Na986SNXm1CpreVF56E,False,78,76,14,0.41,0.796,0,-4.222,1,0.0326,0.0365,0.000156,0.307,0.342,164.161,239200,4
2009-10-17,96,Consider Me Gone,Reba,0fNCLvSVUEK7NTwhu5vk5B,True,0,96,1,0.587,0.732,8,-3.851,1,0.0296,0.098,0,0.0917,0.453,97.031,218053,4
2009-10-17,97,Boots On,Randy Houser,0fNCLvSVUEK7NTwhu5vk5B,False,87,53,19,0.713,0.887,8,-4.564,1,0.0322,0.0387,1.79e-05,0.273,0.88,112.016,170813,4
2009-10-17,98,"Hey, Soul Sister",Train,4HlFJV71xXKIGcU3kRyttv,True,0,98,1,0.673,0.886,1,-4.44,0,0.0431,0.185,0,0.0826,0.795,97.012,216773,4
2009-10-17,100,Regret,LeToya Featuring Ludacris,0n6Rakh2ND1JR03sXEviS2,True,0,100,1,0.692,0.714,5,-5.602,0,0.354,0.0151,0,0.067,0.501,179.975,245293,4
