date,position,title,artist,spotify_id,is_new,last_pos,peak_pos,weeks,danceability,energy,key,loudness,mode,speechiness,acousticness,instrumentalness,liveness,valence,tempo,duration_ms,time_signature
2007-02-24,1,Say It Right,Nelly Furtado,0AezqhM99T5CS0mrEz3OM3,False,2,1,14,0.871,0.869,1,-6.308,1,0.139,0.0409,0.00111,0.053,0.834,116.95,223080,4
2007-02-24,2,Irreplaceable,Beyonce,0AezqhM99T5CS0mrEz3OM3,False,1,1,17,0.447,0.694,7,-4.637,0,0.382,0.0293,5.46e-06,0.167,0.509,175.868,227853,4
2007-02-24,3,The Sweet Escape,Gwen Stefani Featuring Akon,0AezqhM99T5CS0mrEz3OM3,False,5,3,9,0.756,0.77,1,-3.502,1,0.0343,0.191,0,0.178,0.73,119.961,246467,4
2007-02-24,4,"This Ain't A Scene, It's An Arms Race",Fall Out Boy,0AezqhM99T5CS0mrEz3OM3,False,3,2,4,0.435,0.887,9,-4.07,1,0.0636,0.000747,0,0.0327,0.408,199.935,212040,4
2007-02-24,5,Runaway Love,Ludacris Featuring Mary J. Blige,0AezqhM99T5CS0mrEz3OM3,False,6,5,13,0.405,0.721,1,-6.97,1,0.283,0.329,0,0.252,0.815,92.854,280680,4
2007-02-24,6,It's Not Over,Daughtry,0AezqhM99T5CS0mrEz3OM3,False,4,4,12,0.428,0.919,10,-3.245,0,0.0618,0.0503,0,0.245,0.294,145.927,214831,4
2007-02-24,7,Cupid's Chokehold/Breakfast In America,Gym Class Heroes Featuring Patrick Stump,0AezqhM99T5CS0mrEz3OM3,False,15,7,6,0.72,0.744,1,-6.938,0,0.12,0.237,0,0.255,0.619,78.953,243773,4
2007-02-24,8,What Goes Around...Comes Around,Justin Timberlake,0AezqhM99T5CS0mrEz3OM3,False,11,8,10,0.687,0.723,7,-4.751,1,0.0709,0.122,0.00102,0.573,0.432,76.0,448573,4
2007-02-24,9,Glamorous,Fergie Featuring Ludacris,0AezqhM99T5CS0mrEz3OM3,False,31,9,5,0.81,0.755,0,-6.408,1,0.201,0.288,0,0.0857,0.623,130.99,246573,4
2007-02-24,10,I Wanna Love You,Akon Featuring Snoop Dogg,0AezqhM99T5CS0mrEz3OM3,False,7,1,20,0.866,0.454,0,-9.383,1,0.0414,0.0373,1.49e-06,0.275,0.368,99.985,247067,4
2007-02-24,11,Don't Matter,Akon,0AezqhM99T5CS0mrEz3OM3,False,30,11,4,0.798,0.443,2,-6.062,1,0.0403,0.244,0,0.326,0.354,125.232,293053,4
2007-02-24,12,You,Lloyd Featuring Lil Wayne,0AezqhM99T5CS0mrEz3OM3,False,9,9,14,0.412,0.876,5,-6.008,0,0.47,0.102,0,0.297,0.703,130.159,273133,5
2007-02-24,13,Walk It Out,Unk,0AezqhM99T5CS0mrEz3OM3,False,10,10,23,0.794,0.777,1,-3.696,0,0.0813,0.0982,0,0.202,0.706,160.022,173040,4
2007-02-24,14,We Fly High,Jim Jones,0AezqhM99T5CS0mrEz3OM3,False,8,5,19,0.506,0.799,1,-6.58,1,0.38,0.0791,0,0.0929,0.461,120.405,236080,5
2007-02-24,15,Make It Rain,Fat Joe Featuring Lil Wayne,0AezqhM99T5CS0mrEz3OM3,False,13,13,15,0.744,0.697,11,-5.063,0,0.197,0.0106,0,0.0842,0.767,149.28,247413,4
2007-02-24,16,On The Hotline,Pretty Ricky,0AezqhM99T5CS0mrEz3OM3,False,12,12,7,0.704,0.854,10,-5.477,0,0.183,0.0185,0,0.148,0.688,92.988,242587,4
2007-02-24,17,Here (In Your Arms),Hellogoodbye,0AezqhM99T5CS0mrEz3OM3,False,14,14,15,0.701,0.608,5,-6.819,1,0.0374,0.206,0.0041,0.273,0.794,126.044,240547,4
2007-02-24,18,Ice Box,Omarion,0AezqhM99T5CS0mrEz3OM3,False,19,18,11,0.775,0.731,8,-5.446,1,0.134,0.189,0,0.129,0.821,131.105,256427,4
2007-02-24,19,Fergalicious,Fergie,0AezqhM99T5CS0mrEz3OM3,False,16,2,21,0.906,0.584,8,-7.72,0,0.316,0.0576,0,0.128,0.831,129.055,292373,4
2007-02-24,20,My Love,Justin Timberlake Featuring T.I.,0AezqhM99T5CS0mrEz3OM3,False,21,1,23,0.771,0.68,11,-5.881,0,0.224,0.277,1.18e-05,0.682,0.808,119.952,276160,4
2007-02-24,21,Smack That,Akon Featuring Eminem,0AezqhM99T5CS0mrEz3OM3,False,18,2,21,0.939,0.742,5,-5.171,0,0.0467,0.321,0,0.107,0.924,118.978,212360,4
2007-02-24,22,How To Save A Life,The Fray,0AezqhM99T5CS0mrEz3OM3,False,17,3,44,0.64,0.743,10,-4.08,1,0.0379,0.269,0,0.101,0.361,122.035,262533,4
2007-02-24,23,Welcome To The Black Parade,My Chemical Romance,0AezqhM99T5CS0mrEz3OM3,False,20,9,22,0.217,0.905,2,-4.103,1,0.0752,0.000289,0.00011,0.222,0.236,96.95,311107,4
2007-02-24,24,Waiting On The World To Change,John Mayer,0AezqhM99T5CS0mrEz3OM3,False,25,15,31,0.577,0.756,2,-5.82,1,0.115,0.159,0.000232,0.249,0.663,176.75,201173,4
2007-02-24,25,Lost Without U,Robin Thicke,0AezqhM99T5CS0mrEz3OM3,False,29,25,9,0.664,0.351,0,-12.136,1,0.118,0.226,2.38e-06,0.106,0.816,113.204,254147,5
2007-02-24,26,Promise,Ciara,0AezqhM99T5CS0mrEz3OM3,False,22,11,14,0.697,0.629,9,-5.757,1,0.0425,0.409,3.8e-06,0.0819,0.439,123.279,267413,4
2007-02-24,27,Walk Away (Remember Me),Paula DeAnda Featuring The DEY,0AezqhM99T5CS0mrEz3OM3,False,24,18,19,0.672,0.585,0,-5.797,1,0.0582,0.192,0,0.156,0.834,77.998,238160,4
2007-02-24,28,Lips Of An Angel,Hinder,0AezqhM99T5CS0mrEz3OM3,False,26,3,31,0.476,0.736,2,-5.38,1,0.0343,0.0217,1.08e-06,0.203,0.251,129.084,261853,4
2007-02-24,29,Snow ((Hey Oh)),Red Hot Chili Peppers,0AezqhM99T5CS0mrEz3OM3,False,34,29,13,0.427,0.9,11,-3.674,1,0.0499,0.116,1.75e-05,0.119,0.599,104.655,334667,4
2007-02-24,30,SexyBack,Justin Timberlake,0AezqhM99T5CS0mrEz3OM3,False,35,1,32,0.967,0.583,7,-5.562,0,0.0789,0.0584,0,0.0519,0.964,117.0,242733,4
2007-02-24,31,It Ends Tonight,The All-American Rejects,0AezqhM99T5CS0mrEz3OM3,False,28,8,20,0.454,0.636,0,-4.731,1,0.0273,0.00228,0,0.154,0.313,87.89,244827,4
2007-02-24,32,Suddenly I See,KT Tunstall,0AezqhM99T5CS0mrEz3OM3,False,23,21,28,0.587,0.767,0,-5.713,1,0.0449,0.225,0,0.112,0.664,100.38,201707,4
2007-02-24,33,Chasing Cars,Snow Patrol,0AezqhM99T5CS0mrEz3OM3,False,33,5,39,0.563,0.592,9,-4.571,1,0.0276,0.209,5.08e-05,0.132,0.136,104.016,267933,4
2007-02-24,34,Top Back,T.I.,0AezqhM99T5CS0mrEz3OM3,False,46,34,10,0.597,0.678,2,-5.743,1,0.3,0.0103,0,0.381,0.659,160.074,282413,4
2007-02-24,35,Shortie Like Mine,Bow Wow Featuring Chris Brown & Johnta Austin,0AezqhM99T5CS0mrEz3OM3,False,27,9,19,0.758,0.642,7,-8.128,0,0.221,0.0745,0,0.191,0.701,142.078,268067,4
2007-02-24,36,Before He Cheats,Carrie Underwood,0AezqhM99T5CS0mrEz3OM3,False,37,16,24,0.519,0.749,6,-3.318,0,0.0405,0.271,0,0.119,0.29,147.905,199947,4
2007-02-24,37,Keep Holding On,Avril Lavigne,0AezqhM99T5CS0mrEz3OM3,False,39,17,11,0.274,0.786,7,-2.354,1,0.0333,0.0374,0,0.143,0.146,161.061,239907,3
2007-02-24,38,Boston,Augustana,0AezqhM99T5CS0mrEz3OM3,False,38,35,19,0.404,0.571,0,-5.069,1,0.0303,0.182,2.08e-05,0.129,0.29,147.01,245933,4
2007-02-24,39,If Everyone Cared,Nickelback,0AezqhM99T5CS0mrEz3OM3,False,32,32,4,0.519,0.85,6,-4.678,0,0.0354,0.000246,0.014,0.279,0.211,132.022,218013,4
2007-02-24,40,Face Down,The Red Jumpsuit Apparatus,0AezqhM99T5CS0mrEz3OM3,False,43,40,27,0.545,0.932,7,-2.189,0,0.0399,0.000665,0,0.127,0.464,92.956,192000,4
2007-02-24,41,The Way I Live,Baby Boy Da Prince Featuring Lil Boosie,0AezqhM99T5CS0mrEz3OM3,False,52,41,9,0.88,0.438,0,-7.562,1,0.248,0.0147,0,0.0907,0.714,90.02,324907,4
2007-02-24,42,Poppin',Chris Brown Featuring Jay Biz,0AezqhM99T5CS0mrEz3OM3,False,42,42,11,0.767,0.419,9,-3.011,0,0.0369,0.00895,0,0.0521,0.547,122.963,265333,4
2007-02-24,43,Stupid Boy,Keith Urban,0AezqhM99T5CS0mrEz3OM3,False,47,43,10,0.5,0.609,3,-7.215,1,0.0326,0.0822,0.000255,0.341,0.562,145.884,376387,4
2007-02-24,44,Watching You,Rodney Atkins,0AezqhM99T5CS0mrEz3OM3,False,41,36,15,0.625,0.848,2,-4.008,1,0.0314,0.105,0,0.23,0.716,137.993,235427,4
2007-02-24,45,Throw Some D's,Rich Boy Featuring Polow Da Don,0AezqhM99T5CS0mrEz3OM3,False,49,45,10,0.697,0.86,11,-5.181,1,0.43,0.0368,0,0.0721,0.433,160.895,263920,4
2007-02-24,46,This Is Why I'm Hot,Mims,0AezqhM99T5CS0mrEz3OM3,False,59,46,4,0.621,0.6,8,-6.349,1,0.576,0.277,0,0.495,0.485,80.021,253707,4
2007-02-24,47,Break It Off,Rihanna & Sean Paul,0AezqhM99T5CS0mrEz3OM3,False,45,45,11,0.897,0.738,10,-5.314,0,0.228,0.0166,0,0.0573,0.798,133.966,213373,4
2007-02-24,48,Far Away,Nickelback,0AezqhM99T5CS0mrEz3OM3,False,36,8,30,0.518,0.797,6,-5.153,1,0.0309,0.000681,0,0.107,0.293,132.918,238173,4
2007-02-24,49,Smile,Lily Allen,0AezqhM99T5CS0mrEz3OM3,False,54,49,3,0.632,0.639,5,-5.938,1,0.0259,0.00143,0,0.221,0.733,95.506,196893,4
2007-02-24,50,She's Everything,Brad Paisley,0AezqhM99T5CS0mrEz3OM3,False,51,35,19,0.355,0.478,0,-8.323,1,0.0335,0.569,2.9e-06,0.194,0.269,102.971,266920,4
2007-02-24,51,Last Night,Diddy Featuring Keyshia Cole,0AezqhM99T5CS0mrEz3OM3,False,64,51,4,0.916,0.849,3,-5.034,0,0.0639,0.166,0.000193,0.0859,0.974,121.002,255773,4
2007-02-24,52,That's That,Snoop Dogg Featuring R. Kelly,0AezqhM99T5CS0mrEz3OM3,False,44,20,13,0.866,0.619,9,-4.774,0,0.19,0.0202,0,0.0371,0.733,82.05,257813,4
2007-02-24,53,Into The Ocean,Blue October,0AezqhM99T5CS0mrEz3OM3,False,57,53,10,0.758,0.606,0,-6.444,1,0.0325,0.282,0,0.144,0.361,107.95,239947,4
2007-02-24,54,Tell Me,Diddy Featuring Christina Aguilera,0AezqhM99T5CS0mrEz3OM3,False,55,47,17,0.548,0.938,8,-4.97,1,0.279,0.235,0,0.531,0.334,98.868,246147,4
2007-02-24,55,Buddy,Musiq Soulchild,0AezqhM99T5CS0mrEz3OM3,False,91,55,3,0.735,0.839,6,-4.705,0,0.271,0.0534,0,0.0942,0.834,89.942,223813,4
2007-02-24,56,King Kong,Jibbs Featuring Chamillionaire,0AezqhM99T5CS0mrEz3OM3,False,62,56,7,0.774,0.778,1,-5.066,1,0.246,0.0207,0,0.237,0.514,77.992,275267,4
2007-02-24,57,Nothing Left To Lose,Mat Kearney,0AezqhM99T5CS0mrEz3OM3,False,50,41,16,0.445,0.71,4,-6.819,1,0.0275,0.103,6.14e-05,0.169,0.468,148.011,263253,4
2007-02-24,58,She's Like The Wind,Lumidee Featuring Tony Sunshine,0AezqhM99T5CS0mrEz3OM3,False,74,58,4,0.4,0.646,9,-8.066,0,0.259,0.0871,0,0.126,0.267,208.078,257533,4
2007-02-24,59,Hurt,Christina Aguilera,0AezqhM99T5CS0mrEz3OM3,False,53,19,20,0.327,0.295,4,-6.907,0,0.0313,0.775,0,0.107,0.143,148.574,243373,4
2007-02-24,60,Over It,Katharine McPhee,0AezqhM99T5CS0mrEz3OM3,False,48,48,2,0.462,0.801,8,-4.191,1,0.0664,0.0415,0,0.0523,0.491,84.541,215200,4
2007-02-24,61,Say OK,Vanessa Hudgens,0AezqhM99T5CS0mrEz3OM3,False,67,61,2,0.469,0.689,9,-7.017,0,0.0475,0.00607,0.00119,0.114,0.531,126.505,221867,3
2007-02-24,62,Go Getta,Young Jeezy Featuring R. Kelly,0AezqhM99T5CS0mrEz3OM3,False,73,62,4,0.392,0.751,3,-6.586,0,0.155,0.105,0,0.15,0.438,173.825,229347,4
2007-02-24,63,Pain,Three Days Grace,0AezqhM99T5CS0mrEz3OM3,False,63,56,11,0.416,0.741,7,-4.001,1,0.0335,0.00804,0,0.273,0.286,160.515,202973,4
2007-02-24,64,Alyssa Lies,Jason Michael Carroll,0AezqhM99T5CS0mrEz3OM3,False,68,64,7,0.496,0.602,7,-5.29,1,0.0265,0.334,0.00356,0.147,0.398,75.519,259573,4
2007-02-24,65,It Just Comes Natural,George Strait,0AezqhM99T5CS0mrEz3OM3,False,66,58,15,0.405,0.775,10,-2.907,1,0.0335,0.358,0,0.211,0.422,200.389,176427,4
2007-02-24,66,Fidelity,Regina Spektor,0AezqhM99T5CS0mrEz3OM3,False,69,53,7,0.923,0.518,5,-6.008,1,0.0492,0.52,0.000142,0.104,0.682,93.023,226680,4
2007-02-24,67,Ladies Love Country Boys,Trace Adkins,0AezqhM99T5CS0mrEz3OM3,False,70,66,10,0.661,0.959,7,-4.439,1,0.0408,0.0539,1.74e-05,0.381,0.96,116.284,221413,4
2007-02-24,68,Wind It Up,Gwen Stefani,0AezqhM99T5CS0mrEz3OM3,False,65,6,15,0.959,0.906,8,-6.902,1,0.0546,0.327,0.000319,0.337,0.944,119.998,190427,4
2007-02-24,69,Wait A Minute,The Pussycat Dolls Featuring Timbaland,0AezqhM99T5CS0mrEz3OM3,False,60,28,14,0.867,0.854,8,-5.211,1,0.0478,0.0496,2.73e-05,0.323,0.972,136.446,221947,4
2007-02-24,70,I Luv It,Young Jeezy,0AezqhM99T5CS0mrEz3OM3,False,58,14,13,0.641,0.765,9,-6.626,1,0.0383,0.000975,0,0.387,0.19,91.009,240613,4
2007-02-24,71,Push It To The Limit,Corbin Bleu,0AezqhM99T5CS0mrEz3OM3,False,56,14,4,0.815,0.906,5,-3.194,0,0.0561,0.0116,2.06e-06,0.0691,0.783,125.974,196960,4
2007-02-24,72,Amarillo Sky,Jason Aldean,0AezqhM99T5CS0mrEz3OM3,False,72,59,18,0.491,0.776,2,-3.887,1,0.0393,0.314,0,0.146,0.428,154.988,202547,4
2007-02-24,73,Wouldn't Get Far,The Game Featuring Kanye West,0AezqhM99T5CS0mrEz3OM3,False,92,73,2,0.434,0.764,4,-5.367,0,0.276,0.152,0,0.425,0.702,92.605,251040,4
2007-02-24,74,White & Nerdy,"""Weird Al"" Yankovic",0AezqhM99T5CS0mrEz3OM3,False,76,9,20,0.791,0.613,1,-11.628,0,0.0763,0.0986,0,0.0765,0.896,143.017,170640,4
2007-02-24,75,Little Bit Of Life,Craig Morgan,0AezqhM99T5CS0mrEz3OM3,False,80,75,9,0.667,0.834,7,-4.743,1,0.0344,0.292,0,0.287,0.703,96.944,251720,4
2007-02-24,76,From Yesterday,30 Seconds To Mars,0AezqhM99T5CS0mrEz3OM3,False,87,76,4,0.468,0.876,10,-4.841,1,0.0692,0.00578,0.00625,0.035,0.13,135.062,247373,4
2007-02-24,77,Outside Looking In,Jordan Pruitt,1wF2QB0bAAYQdPUIn0L0VE,True,0,77,1,0.69,0.29,5,-6.544,1,0.0282,0.676,0,0.109,0.42,95.976,159467,4
2007-02-24,78,Not Fade Away,Sheryl Crow,7FzlbCUcpAfh0ar1yNiKXK,True,0,78,1,0.579,0.913,2,-4.009,1,0.0614,0.0159,3.72e-05,0.117,0.912,192.062,125080,4
2007-02-24,79,Zoom,Lil' Boosie Featuring Yung Joc,7FzlbCUcpAfh0ar1yNiKXK,False,75,61,11,0.779,0.616,11,-8.852,0,0.15,0.00265,8.27e-05,0.339,0.171,160.919,285040,4
2007-02-24,80,Be Good To Me,Ashley Tisdale,7FzlbCUcpAfh0ar1yNiKXK,False,96,80,2,0.655,0.857,0,-4.148,1,0.0994,0.141,0,0.298,0.719,97.994,213827,4
2007-02-24,81,And I Am Telling You I'm Not Going,Jennifer Hudson,7FzlbCUcpAfh0ar1yNiKXK,False,79,73,7,0.464,0.735,5,-5.202,0,0.0861,0.187,0,0.161,0.339,122.714,305373,4
2007-02-24,82,Wasted,Carrie Underwood,7FzlbCUcpAfh0ar1yNiKXK,False,94,82,2,0.548,0.775,8,-3.285,1,0.0306,0.0936,0,0.0721,0.311,94.998,274267,4
2007-02-24,83,Red High Heels,Kellie Pickler,7FzlbCUcpAfh0ar1yNiKXK,False,78,64,11,0.626,0.842,5,-3.74,1,0.0337,0.13,0,0.0734,0.54,115.72,222853,4
2007-02-24,84,Beer In Mexico,Kenny Chesney,7FzlbCUcpAfh0ar1yNiKXK,False,90,84,3,0.58,0.906,2,-6.976,1,0.0405,0.00119,0.000579,0.0933,0.476,137.97,271813,4
2007-02-24,85,Settlin',Sugarland,7FzlbCUcpAfh0ar1yNiKXK,False,97,85,2,0.624,0.934,3,-1.825,1,0.0479,0.112,0.000221,0.127,0.573,122.056,207067,4
2007-02-24,86,Grace Kelly,MIKA,7FzlbCUcpAfh0ar1yNiKXK,False,81,81,2,0.671,0.82,0,-5.796,1,0.048,0.0194,0.0133,0.361,0.685,122.361,187733,4
2007-02-24,87,Give It To Me,Timbaland Featuring Nelly Furtado & Justin Timberlake,0wbDgMuAoy7O7pL3a69uZx,True,0,87,1,0.975,0.711,8,-3.904,1,0.0632,0.168,0.000552,0.0799,0.815,110.621,234027,4
2007-02-24,88,Streetcorner Symphony,Rob Thomas,0wbDgMuAoy7O7pL3a69uZx,False,85,64,20,0.633,0.886,1,-3.892,1,0.0456,0.109,0,0.0438,0.753,81.811,247827,4
2007-02-24,89,Hillbilly Deluxe,Brooks & Dunn,0wbDgMuAoy7O7pL3a69uZx,False,89,89,3,0.568,0.829,7,-4.713,1,0.0461,0.312,2.57e-06,0.514,0.551,155.041,258693,4
2007-02-24,90,Candyman,Christina Aguilera,0wbDgMuAoy7O7pL3a69uZx,False,0,90,2,0.686,0.789,8,-4.713,0,0.23,0.0125,0.0147,0.142,0.72,172.976,194213,4
2007-02-24,91,Listen,Beyonce,0wbDgMuAoy7O7pL3a69uZx,False,84,61,8,0.432,0.637,11,-3.905,1,0.0475,0.416,0,0.113,0.187,122.394,219547,4
2007-02-24,92,I'll Wait For You,Joe Nichols,0wbDgMuAoy7O7pL3a69uZx,False,98,92,2,0.461,0.412,9,-8.644,1,0.0283,0.288,0,0.138,0.331,143.979,247320,4
2007-02-24,93,1st Time,Yung Joc Featuring Marques Houston & Trey Songz,5ehwXxbiFNYwlmntoKom7h,True,0,93,1,0.686,0.603,6,-6.112,1,0.202,0.0981,0,0.102,0.778,133.034,267627,4
2007-02-24,94,2 Step,Unk,7beqVxFB2g7DlL09mvfjDv,True,0,94,1,0.763,0.797,11,-2.274,0,0.0977,0.0583,0,0.299,0.645,77.003,195787,4
2007-02-24,95,Famous Last Words,My Chemical Romance,7beqVxFB2g7DlL09mvfjDv,False,88,88,3,0.467,0.883,2,-3.679,0,0.106,0.000321,0.000152,0.125,0.309,122.252,299227,4
2007-02-24,96,U + Ur Hand,P!nk,7beqVxFB2g7DlL09mvfjDv,False,100,89,7,0.709,0.891,0,-3.688,1,0.0528,0.00144,0,0.034,0.886,141.04,214387,4
2007-02-24,97,Thinking About You,Norah Jones,7beqVxFB2g7DlL09mvfjDv,False,82,82,2,0.65,0.299,8,-10.76,1,0.03,0.605,0.0118,0.219,0.294,123.597,197280,4
2007-02-24,98,Anyway,Martina McBride,7beqVxFB2g7DlL09mvfjDv,False,99,98,2,0.527,0.503,5,-6.769,1,0.0252,0.0971,1.98e-05,0.107,0.305,137.021,280867,4
2007-02-24,99,Dashboard,Modest Mouse,7beqVxFB2g7DlL09mvfjDv,False,61,61,2,0.639,0.903,11,-5.013,0,0.0371,0.00963,7.06e-05,0.174,0.96,135.938,246173,4
2007-02-24,100,Rock Yo Hips,Crime Mob Featuring Lil Scrappy,76dZuMVXjIyLPRLv00skGd,True,0,100,1,0.847,0.667,6,-5.7,1,0.17,0.0869,0,0.443,0.707,77.492,226547,4
