date,position,title,artist,spotify_id,is_new,last_pos,peak_pos,weeks,danceability,energy,key,loudness,mode,speechiness,acousticness,instrumentalness,liveness,valence,tempo,duration_ms,time_signature
1993-05-08,1,Freak Me,Silk,,False,1,1,12,0.697,0.608,4,-10.976,0,0.0463,0.0295,0,0.276,0.725,133.879,274533,4
1993-05-08,2,That's The Way Love Goes,Janet Jackson,,False,14,2,2,0.703,0.7,5,-6.789,1,0.0693,0.302,0.471,0.0718,0.582,97.675,265107,4
1993-05-08,3,Informer,Snow,,False,2,1,18,0.763,0.742,6,-10.975,0,0.188,0.0984,0,0.38,0.483,98.145,268910,4
1993-05-08,4,"Love Is (From ""Beverly Hills, 90210"")",Vanessa Williams/Brian McKnight,,False,5,4,16,0.487,0.361,1,-9.97,1,0.0236,0.379,2.88e-05,0.12,0.177,79.857,284960,4
1993-05-08,5,I Have Nothing,Whitney Houston,,False,4,4,11,0.541,0.401,0,-10.499,1,0.0365,0.576,0,0.164,0.24,152.943,289160,3
1993-05-08,6,"Nuthin' But A ""G"" Thang",Dr. Dre,,False,3,2,15,0.801,0.699,11,-8.18,0,0.279,0.00575,0,0.146,0.655,94.605,238467,4
1993-05-08,7,Don't Walk Away,Jade,,False,6,4,21,0.831,0.915,10,-7.501,0,0.128,0.147,0.00571,0.196,0.881,102.979,216373,4
1993-05-08,8,I'm So Into You,SWV,,False,7,7,14,0.85,0.513,7,-10.663,1,0.0513,0.0624,0.00249,0.0689,0.623,99.01,278333,4
1993-05-08,9,Looking Through Patient Eyes,P.M. Dawn,,False,9,9,8,0.786,0.372,8,-17.765,1,0.0536,0.19,5.9e-06,0.129,0.685,102.237,249667,4
1993-05-08,10,Ditty,Paperboy,,False,10,10,21,0.838,0.452,11,-15.219,0,0.0547,0.0509,0,0.0666,0.708,99.075,245030,4
1993-05-08,11,Two Princes,Spin Doctors,,False,8,7,15,0.543,0.912,7,-10.71,1,0.0601,0.00162,2.1e-06,0.0565,0.836,103.731,256733,4
1993-05-08,12,Knockin' Da Boots,H-Town,,False,28,12,5,0.726,0.501,1,-13.884,0,0.154,0.155,0,0.0893,0.582,128.099,330945,4
1993-05-08,13,Comforter,Shai,,False,12,10,16,0.725,0.384,7,-12.64,1,0.0317,0.00569,0.00022,0.158,0.497,121.9,250600,4
1993-05-08,14,Hip Hop Hooray,Naughty By Nature,,False,13,8,15,0.862,0.642,6,-13.652,0,0.101,0.102,0,0.272,0.765,99.201,267267,4
1993-05-08,15,Who Is It,Michael Jackson,,False,18,15,5,0.861,0.594,5,-4.658,1,0.121,0.0153,0.000326,0.104,0.506,103.159,393307,4
1993-05-08,16,"The Crying Game (From ""The Crying Game"")",Boy George,,False,16,16,9,0.593,0.54,4,-13.302,0,0.0299,0.076,0.00108,0.111,0.577,99.995,202973,4
1993-05-08,17,Cat's In The Cradle,Ugly Kid Joe,,False,11,6,13,0.511,0.517,8,-9.653,1,0.0328,0.13,0,0.074,0.433,75.67,241893,4
1993-05-08,18,It Was A Good Day,Ice Cube,,False,15,15,10,0.798,0.744,7,-5.328,0,0.136,0.33,0.000106,0.292,0.794,82.356,260000,4
1993-05-08,19,Nothin' My Love Can't Fix,Joey Lawrence,,False,20,19,10,0.657,0.909,7,-6.322,1,0.0918,0.0131,0.000623,0.211,0.606,106.122,243267,4
1993-05-08,20,If I Ever Lose My Faith In You,Sting,,False,17,17,12,0.575,0.727,2,-9.539,1,0.0281,0.00952,0.00754,0.054,0.504,97.995,270533,4
1993-05-08,21,Angel,Jon Secada,,False,19,18,15,0.485,0.477,0,-8.948,1,0.0262,0.295,3.35e-05,0.202,0.134,151.704,275040,4
1993-05-08,22,Weak,SWV,,False,46,22,3,0.693,0.533,2,-10.954,0,0.0402,0.107,0,0.0695,0.568,127.661,291907,4
1993-05-08,23,Down With The King,Run-D.M.C.,,False,21,21,8,0.786,0.637,1,-12.149,1,0.205,0.07,1.31e-05,0.415,0.762,96.023,302627,4
1993-05-08,24,Livin' On The Edge,Aerosmith,,False,29,24,5,0.399,0.881,2,-4.341,1,0.0347,0.0019,0.00429,0.39,0.272,84.58,380893,4
1993-05-08,25,Connected,Stereo MC's,,False,31,25,7,0.647,0.798,1,-12.142,0,0.0366,0.0497,0.00235,0.0723,0.709,100.631,314133,4
1993-05-08,26,"I'm Every Woman (From ""The Bodyguard"")",Whitney Houston,,False,23,4,18,0.665,0.847,5,-8.314,0,0.0535,0.0178,0.00288,0.126,0.4,119.555,285107,4
1993-05-08,27,Three Little Pigs,Green Jelly,,False,35,27,7,0.449,0.95,7,-4.978,1,0.225,0.0115,3.66e-05,0.514,0.339,144.469,353640,4
1993-05-08,28,That's What Love Can Do,Boy Krazy,,False,27,18,16,0.783,0.773,5,-7.541,0,0.0493,0.0103,0.000162,0.0349,0.744,117.471,202000,4
1993-05-08,29,Mr. Wendal,Arrested Development,,False,24,6,21,0.884,0.37,8,-11.353,1,0.112,0.0188,0.00423,0.026,0.883,109.997,247507,4
1993-05-08,30,Ordinary World,Duran Duran,,False,26,3,18,0.472,0.652,1,-10.171,0,0.0305,0.0131,1.12e-05,0.14,0.401,140.124,340200,4
1993-05-08,31,Show Me Love,Robin S.,,False,40,31,6,0.811,0.833,5,-4.259,1,0.153,0.014,2.06e-05,0.0769,0.567,120.258,252107,4
1993-05-08,32,Come Undone,Duran Duran,,False,42,32,4,0.542,0.793,8,-8.203,1,0.053,0.0423,3.95e-06,0.0814,0.708,173.931,256520,4
1993-05-08,33,Bed Of Roses,Bon Jovi,,False,22,10,16,0.31,0.596,5,-5.599,1,0.0293,0.101,0,0.21,0.16,164.613,394400,3
1993-05-08,34,"The Right Kind Of Love (From ""Beverly Hills, 90210"")",Jeremy Jordan,,False,30,14,22,0.717,0.634,5,-7.736,0,0.036,0.115,0,0.0782,0.896,178.064,273933,4
1993-05-08,35,Simple Life,Elton John,,False,34,30,11,0.663,0.788,5,-7.484,1,0.0314,0.00838,0.143,0.19,0.476,101.779,386000,4
1993-05-08,36,I Got A Man,Positive K,,False,25,14,21,0.812,0.753,7,-13.252,1,0.118,0.0774,0,0.341,0.787,103.754,232773,4
1993-05-08,37,Dedicated,R. Kelly & Public Announcement,,False,37,37,11,0.677,0.495,8,-10.482,1,0.0263,0.139,8.21e-06,0.0351,0.45,136.136,277907,4
1993-05-08,38,Love U More,Sunscreem,,False,36,36,11,0.602,0.821,2,-8.844,1,0.0332,0.191,0,0.265,0.493,126.085,251693,4
1993-05-08,39,Forever In Love,Kenny G,,False,33,18,21,0.331,0.318,5,-14.901,1,0.0313,0.336,0.158,0.17,0.111,82.427,299493,4
1993-05-08,40,Dazzey Duks,Duice,,False,39,38,18,0.884,0.464,1,-12.876,1,0.222,0.000925,4.36e-06,0.0366,0.868,132.172,244867,4
1993-05-08,41,A Whole New World (Aladdin's Theme),Peabo Bryson & Regina Belle,,False,32,1,21,0.516,0.32,2,-10.487,1,0.0303,0.627,0,0.144,0.131,107.894,243493,4
1993-05-08,42,So Alone,Men At Large,,False,38,31,12,0.629,0.364,9,-12.721,0,0.0286,0.0754,0,0.0258,0.471,122.083,447547,4
1993-05-08,43,Buddy X,Neneh Cherry,,False,43,43,7,0.782,0.804,10,-6.895,0,0.0791,9.01e-05,0.298,0.0455,0.573,124.004,392517,4
1993-05-08,44,Love Don't Love You,En Vogue,,False,44,44,7,0.832,0.643,5,-6.754,0,0.0302,0.138,7.68e-05,0.246,0.779,107.964,238173,4
1993-05-08,45,The Morning Papers,Prince And The New Power Generation,,False,45,45,6,0.514,0.719,0,-5.381,0,0.0443,0.175,4.09e-05,0.197,0.438,131.635,237373,4
1993-05-08,46,Tell Me What You Dream,Restless Heart Featuring Warren Hill,,False,49,46,7,0.666,0.464,0,-10.131,0,0.0257,0.117,0.00182,0.328,0.439,94.151,284173,4
1993-05-08,47,I'll Never Get Over You (Getting Over Me),Expose,,False,54,47,7,0.323,0.311,8,-12.671,1,0.0312,0.643,0,0.349,0.146,166.943,230933,4
1993-05-08,48,Have I Told You Lately,Rod Stewart,,False,72,48,3,0.538,0.366,10,-14.072,1,0.0325,0.498,0,0.094,0.293,142.811,241507,4
1993-05-08,49,I Will Always Love You,Whitney Houston,,False,41,1,26,0.332,0.214,4,-12.518,1,0.0349,0.845,5.62e-06,0.0839,0.11,67.531,271093,4
1993-05-08,50,Rhythm Is A Dancer,Snap!,,False,50,5,39,0.794,0.745,9,-11.367,0,0.037,0.273,0.000414,0.143,0.706,124.249,225882,4
1993-05-08,51,I'm Gonna Get You,Bizarre Inc,,False,51,47,16,0.742,0.734,1,-11.393,1,0.04,0.0153,0.728,0.0493,0.723,126.988,319493,4
1993-05-08,52,"Bad Boys (Theme From ""Cops"")",Inner Circle,,False,73,52,2,0.781,0.722,7,-8.376,1,0.0667,0.236,0.000398,0.077,0.533,87.858,229375,4
1993-05-08,53,Supermodel (You Better Work),RuPaul,,False,53,45,13,0.792,0.562,7,-11.379,1,0.0929,0.0152,7.48e-05,0.428,0.592,126.222,239933,4
1993-05-08,54,Sweet Thing,Mary J. Blige,,False,48,28,13,0.69,0.651,9,-7.86,1,0.101,0.343,9.56e-05,0.178,0.691,79.305,225333,4
1993-05-08,55,Come In Out Of The Rain,Wendy Moten,,False,61,55,12,0.59,0.559,5,-8.916,1,0.0269,0.158,3.96e-06,0.361,0.311,114.327,257800,4
1993-05-08,56,Sleeping Satellite,Tasmin Archer,,False,67,56,4,0.6,0.824,5,-9.864,0,0.027,0.171,0.000225,0.258,0.749,96.075,281853,4
1993-05-08,57,Touch My Light,Big Mountain,,False,63,57,5,0.711,0.805,2,-5.329,1,0.0862,0.285,3.21e-05,0.214,0.576,77.995,256923,4
1993-05-08,58,More And More,Captain Hollywood Project,,False,76,58,2,0.661,0.847,7,-11.855,1,0.0349,0.225,0.835,0.0863,0.71,125.862,253573,4
1993-05-08,59,I Feel You,Depeche Mode,,False,56,37,10,0.454,0.933,2,-6.539,1,0.0912,0.024,0.0421,0.493,0.141,122.913,276080,3
1993-05-08,60,Tap The Bottle,Young Black Teenagers,,False,58,55,10,0.889,0.608,11,-9.396,1,0.287,0.00134,0,0.0852,0.569,104.005,240107,4
1993-05-08,61,Rebirth Of Slick (Cool Like Dat),Digable Planets,,False,52,15,17,0.884,0.334,1,-18.943,0,0.228,0.0476,0.0588,0.107,0.571,98.315,261267,4
1993-05-08,62,"Tarzan Boy (From ""Teenage Mutant Ninja Turtles III"")",Baltimora,,False,55,13,33,0.684,0.573,5,-12.3,1,0.0261,0.318,0.028,0.306,0.716,107.363,378947,4
1993-05-08,63,Tonight,Def Leppard,,False,62,62,6,0.477,0.607,2,-8.768,1,0.0262,0.0816,5.21e-06,0.113,0.534,176.09,243321,4
1993-05-08,64,Romeo,Dolly Parton & Friends,,False,59,50,9,0.685,0.661,7,-11.741,1,0.0528,0.241,0,0.0683,0.745,115.862,214027,4
1993-05-08,65,"Let's Go Through The Motions (From ""Who's The Man?"")",Jodeci,,False,66,65,3,0.724,0.509,4,-7.739,0,0.116,0.0779,0,0.169,0.478,171.982,158030,4
1993-05-08,66,That's The Way Love Is,Bobby Brown,,False,77,66,3,0.701,0.881,10,-6.22,0,0.0458,0.0697,3.15e-05,0.0473,0.932,108.35,291467,4
1993-05-08,67,How I'm Comin',LL Cool J,,False,65,57,6,0.755,0.974,11,-8.68,1,0.208,0.0605,0,0.323,0.309,97.094,305893,4
1993-05-08,68,If I Could,Regina Belle,,False,68,68,6,0.264,0.534,5,-7.4,1,0.0331,0.153,0,0.347,0.158,81.516,240267,4
1993-05-08,69,"Silence Is Broken (From ""Nowhere To Run"")",Damn Yankees,,False,71,69,4,0.474,0.648,2,-10.353,0,0.0283,0.003,0,0.322,0.47,84.619,302160,4
1993-05-08,70,I See Your Smile,Gloria Estefan,,False,64,48,12,0.403,0.457,9,-8.984,1,0.0272,0.237,0,0.185,0.231,79.188,274133,4
1993-05-08,71,What You Won't Do For Love,Go West,,False,60,55,9,0.59,0.803,4,-7.088,0,0.0485,0.293,1.49e-05,0.0691,0.809,169.127,266800,4
1993-05-08,72,In These Arms,Bon Jovi,0vTKR5TQD03kASmEGlyDF3,True,0,72,1,0.51,0.915,4,-3.036,1,0.0562,0.00884,1.75e-05,0.205,0.459,123.257,319227,4
1993-05-08,73,Man On The Moon,R.E.M.,0vTKR5TQD03kASmEGlyDF3,False,57,30,14,0.667,0.699,7,-7.574,1,0.026,0.42,0.000442,0.201,0.655,118.567,314173,4
1993-05-08,74,Typical Reasons (Swing My Way),Prince Markie Dee And The Soul Convention,0vTKR5TQD03kASmEGlyDF3,False,69,69,6,0.674,0.565,1,-13.902,1,0.0537,0.161,0,0.0939,0.827,102.556,267812,4
1993-05-08,76,Regret,New Order,,False,81,76,2,0.506,0.931,5,-5.635,1,0.0305,0.00146,0.0227,0.27,0.865,129.568,248973,4
1993-05-08,77,Funky Child,Lords Of The Underground,,False,74,74,7,0.859,0.635,10,-9.532,0,0.193,0.0356,0.00346,0.13,0.53,96.571,271067,4
1993-05-08,78,Kiss Of Life,Sade,,False,79,78,8,0.723,0.47,6,-11.302,0,0.028,0.633,0.0373,0.0968,0.783,97.107,251333,4
1993-05-08,79,Six Feet Deep,Geto Boys,7fOa2YngldFhZpkPpQVwpb,True,0,79,1,0.811,0.502,10,-12.377,0,0.239,0.0778,0.00952,0.374,0.759,137.81,324333,4
1993-05-08,80,Every Little Thing U Do,Christopher Williams,7fOa2YngldFhZpkPpQVwpb,False,87,80,3,0.666,0.639,8,-8.014,0,0.05,0.0606,0.00269,0.0645,0.427,98.196,285867,4
1993-05-08,81,Passin' Me By,The Pharcyde,7fOa2YngldFhZpkPpQVwpb,False,93,81,2,0.759,0.756,4,-8.145,0,0.266,0.0903,2.36e-06,0.265,0.613,87.059,303493,4
1993-05-08,82,"Whoot, There It Is",95 South,7fOa2YngldFhZpkPpQVwpb,False,89,82,2,0.783,0.498,7,-14.387,1,0.0556,0.0157,0.245,0.456,0.519,132.952,276867,4
1993-05-08,83,No Ordinary Love,Sade,7fOa2YngldFhZpkPpQVwpb,False,0,28,21,0.629,0.364,11,-12.259,0,0.038,0.467,0.0204,0.0941,0.701,166.266,440467,4
1993-05-08,84,Good Ol' Days,Levert,7fOa2YngldFhZpkPpQVwpb,False,78,78,8,0.651,0.753,7,-9.143,1,0.0456,0.216,0.000119,0.105,0.915,87.052,245133,4
1993-05-08,85,Deeper,Boss,7fOa2YngldFhZpkPpQVwpb,False,85,85,3,0.631,0.848,6,-6.435,0,0.338,0.055,0,0.385,0.679,83.155,241560,4
1993-05-08,87,Alibis,Tracy Lawrence,,False,83,81,4,0.61,0.31,4,-14.391,1,0.0262,0.437,0,0.22,0.381,107.525,182960,3
1993-05-08,88,Hat 2 Da Back,TLC,,False,70,30,14,0.701,0.697,10,-12.643,0,0.0912,0.000888,0.485,0.301,0.617,108.554,256427,4
1993-05-08,89,What's Up,4 Non Blondes,,False,95,89,3,0.565,0.564,2,-10.044,1,0.0292,0.161,0,0.114,0.454,134.355,295533,4
1993-05-08,90,Hero,David Crosby & Phil Collins,3Y8NZ8VqYDokRluEMkQ3Hp,True,0,90,1,0.66,0.445,3,-9.715,1,0.0256,0.743,0.000186,0.07,0.409,104.984,280240,4
1993-05-08,91,It's My Life,Dr. Alban,3Y8NZ8VqYDokRluEMkQ3Hp,False,92,91,3,0.655,0.933,7,-7.703,1,0.0536,0.00332,0.0365,0.0983,0.472,128.701,239933,4
1993-05-08,92,Candy Everybody Wants,"10,000 Maniacs",3Y8NZ8VqYDokRluEMkQ3Hp,False,84,67,10,0.622,0.876,10,-6.31,1,0.0305,0.0193,0.00684,0.0987,0.867,104.97,185960,4
1993-05-08,93,Lost In Your Eyes,The Jeff Healey Band,18RkEaGWs0TMee1o0xDdN6,True,0,93,1,0.481,0.63,7,-7.503,1,0.0263,0.0656,7.99e-05,0.0559,0.435,80.831,305707,4
1993-05-08,94,I Love The Way You Love Me,John Michael Montgomery,6MnDkyb3VstTCT9ELxjfeE,True,0,94,1,0.447,0.319,8,-10.732,1,0.0264,0.63,1.35e-06,0.106,0.246,162.109,241307,4
1993-05-08,95,Bow Wow Wow,Funkdoobiest,6MnDkyb3VstTCT9ELxjfeE,False,94,89,3,0.899,0.525,11,-11.498,1,0.141,0.023,0.688,0.108,0.696,102.962,253144,4
1993-05-08,97,She's Not Cryin' Anymore,Billy Ray Cyrus,,False,82,70,9,0.611,0.309,2,-12.084,1,0.0246,0.344,1.82e-06,0.338,0.606,88.556,205773,4
1993-05-08,98,Beautiful Girl,INXS,,False,75,46,12,0.675,0.666,11,-6.067,1,0.027,0.0187,0.692,0.112,0.434,120.558,207547,4
1993-05-08,99,Easy,Faith No More,,False,90,58,8,0.506,0.554,10,-6.743,0,0.0339,0.339,0.000355,0.112,0.375,124.724,186960,4
1993-05-08,100,Shoop Shoop (Never Stop Givin' You Love),Michael Cooper,,False,80,67,9,0.702,0.573,2,-10.421,1,0.0375,0.12,0,0.0893,0.627,136.443,256307,4
