date,position,title,artist,spotify_id,is_new,last_pos,peak_pos,weeks,danceability,energy,key,loudness,mode,speechiness,acousticness,instrumentalness,liveness,valence,tempo,duration_ms,time_signature
1992-03-07,1,To Be With You,Mr. Big,,False,1,1,12,0.688,0.375,4,-9.601,1,0.0535,0.286,0,0.133,0.45,83.635,210480,4
1992-03-07,2,I'm Too Sexy,Right Said Fred,,False,2,1,12,0.683,0.739,11,-12.831,0,0.0495,4.91e-05,0.0122,0.293,0.836,122.113,170467,4
1992-03-07,3,Remember The Time,Michael Jackson,,False,4,3,7,0.831,0.921,5,-2.383,0,0.0582,0.153,0.00224,0.305,0.795,108.002,239227,4
1992-03-07,4,I Love Your Smile,Shanice,,False,3,2,16,0.713,0.827,10,-9.759,0,0.113,0.0108,5.74e-06,0.134,0.738,93.934,259627,4
1992-03-07,5,Save The Best For Last,Vanessa Williams,,False,11,5,6,0.528,0.234,3,-15.784,1,0.0283,0.641,0,0.183,0.191,95.911,218733,4
1992-03-07,6,Tears In Heaven,Eric Clapton,,False,12,6,5,0.695,0.336,9,-12.999,1,0.0313,0.8,0.00264,0.701,0.422,79.109,280000,4
1992-03-07,7,Diamonds And Pearls,Prince And The N.P.G.,,False,5,3,14,0.549,0.547,7,-10.119,1,0.0328,0.0532,0.321,0.0655,0.287,81.051,285267,4
1992-03-07,8,Masterpiece,Atlantic Starr,,False,8,8,6,0.642,0.448,5,-10.418,0,0.0259,0.492,1.74e-05,0.0646,0.299,137.831,295347,4
1992-03-07,9,Tell Me What You Want Me To Do,Tevin Campbell,,False,6,6,18,0.609,0.551,6,-7.93,1,0.0291,0.0233,0,0.234,0.512,127.956,256040,4
1992-03-07,10,Good For Me,Amy Grant,,False,13,10,8,0.594,0.883,5,-4.279,1,0.0451,0.329,8.33e-05,0.276,0.863,89.997,239493,4
1992-03-07,11,Don't Let The Sun Go Down On Me,George Michael/Elton John,,False,7,1,14,0.601,0.329,0,-11.636,1,0.0294,0.816,1.52e-05,0.129,0.28,139.917,322884,4
1992-03-07,12,Smells Like Teen Spirit,Nirvana,,False,9,6,14,0.502,0.912,1,-4.556,1,0.0564,2.55e-05,0.000173,0.106,0.72,116.761,301920,4
1992-03-07,13,Missing You Now,Michael Bolton,,False,15,13,7,0.62,0.508,7,-11.621,1,0.0272,0.118,0,0.187,0.289,95.01,273307,4
1992-03-07,14,All 4 Love,Color Me Badd,,False,10,1,18,0.807,0.75,2,-8.29,1,0.0315,0.0346,0.000179,0.149,0.797,106.389,211493,4
1992-03-07,15,I Can't Dance,Genesis,,False,21,15,6,0.914,0.528,3,-9.114,1,0.0508,0.499,4.38e-06,0.0454,0.898,107.557,241360,4
1992-03-07,16,Uhh Ahh,Boyz II Men,,False,18,16,13,0.722,0.661,2,-8.236,1,0.0844,0.151,0,0.233,0.643,126.007,228867,4
1992-03-07,17,Finally,CeCe Peniston,,False,14,5,24,0.791,0.658,7,-11.128,1,0.0445,0.00653,0,0.0472,0.842,120.066,245000,4
1992-03-07,18,Breakin' My Heart (Pretty Brown Eyes),Mint Condition,,False,24,18,10,0.672,0.52,7,-9.965,0,0.0407,0.0985,1.28e-06,0.0365,0.551,137.213,356960,4
1992-03-07,19,Justified And Ancient,The KLF Featuring Tammy Wynette,,False,25,19,6,0.628,0.953,10,-4.989,0,0.0626,0.00276,0.0132,0.427,0.515,111.134,228372,4
1992-03-07,20,Vibeology,Paula Abdul,,False,17,16,8,0.722,0.758,1,-9.33,1,0.0622,0.00485,0.00246,0.0768,0.645,117.975,316333,4
1992-03-07,21,I'll Get By,Eddie Money,,False,23,21,12,0.477,0.563,9,-6.089,1,0.0279,0.578,0,0.0702,0.19,69.964,212200,4
1992-03-07,22,The Way I Feel About You,Karyn White,,False,16,12,15,0.673,0.888,1,-7.056,1,0.0364,0.261,0.000134,0.234,0.801,110.772,275467,4
1992-03-07,23,Thinkin' Back,Color Me Badd,,False,28,23,6,0.587,0.326,6,-11.204,0,0.0242,0.21,1e-05,0.133,0.271,90.821,322533,4
1992-03-07,24,Beauty And The Beast,Celine Dion And Peabo Bryson,,False,32,24,8,0.463,0.4,6,-9.999,0,0.0308,0.643,2.46e-05,0.131,0.121,77.314,249240,4
1992-03-07,25,Mysterious Ways,U2,,False,19,9,16,0.674,0.659,8,-8.049,1,0.0277,0.00156,0.00765,0.108,0.697,99.768,243587,4
1992-03-07,26,Can't Let Go,Mariah Carey,,False,20,2,17,0.478,0.533,10,-11.048,1,0.0404,0.591,0.00704,0.139,0.181,162.369,266560,4
1992-03-07,27,What Becomes Of The Brokenhearted,Paul Young,,False,29,27,6,0.659,0.469,6,-11.256,0,0.0305,0.299,0,0.036,0.707,95.075,274600,4
1992-03-07,28,Make It Happen,Mariah Carey,,False,42,28,3,0.811,0.531,2,-8.537,0,0.0355,0.00657,0.0285,0.0801,0.752,107.853,307000,4
1992-03-07,29,2 Legit 2 Quit,M.C. Hammer,,False,22,5,18,0.853,0.884,1,-6.771,1,0.0836,0.0394,6.83e-06,0.0313,0.668,124.542,333624,4
1992-03-07,30,Until Your Love Comes Back Around,RTZ,,False,31,30,8,0.55,0.534,8,-10.6,1,0.0331,0.229,0,0.0714,0.311,134.662,360400,4
1992-03-07,31,Oochie Coochie,M.C. Brains,,False,33,31,8,0.818,0.801,7,-9.08,1,0.188,0.0359,0,0.257,0.58,119.707,222293,4
1992-03-07,32,Keep It Comin',Keith Sweat,,False,26,17,15,0.667,0.899,11,-7.084,0,0.0809,0.0371,4.12e-06,0.541,0.738,101.477,246373,4
1992-03-07,33,I Can't Make You Love Me,Bonnie Raitt,,False,27,18,16,0.588,0.149,7,-16.728,0,0.0319,0.846,9.65e-05,0.236,0.113,124.689,332960,4
1992-03-07,34,We Got A Love Thang,CeCe Peniston,,False,34,34,6,0.669,0.644,0,-10.47,1,0.0302,0.000172,0.00585,0.356,0.764,120.012,328800,4
1992-03-07,35,Paper Doll,P.M. Dawn,,False,30,28,8,0.725,0.894,6,-9.122,0,0.0838,0.00476,0.259,0.0489,0.529,105.723,293427,4
1992-03-07,36,If You Go Away,NKOTB,,False,52,36,3,0.598,0.632,2,-7.987,1,0.0288,0.232,0.000568,0.0821,0.43,147.815,331760,4
1992-03-07,37,Everything Changes,Kathy Troccoli,,False,49,37,3,0.749,0.874,6,-3.981,1,0.0332,0.0853,2.66e-06,0.0414,0.78,117.776,262200,4
1992-03-07,38,Hazard,Richard Marx,,False,50,38,4,0.674,0.565,7,-10.417,0,0.0259,0.163,0.00169,0.0959,0.655,124.833,275373,4
1992-03-07,39,Again Tonight,John Mellencamp,,False,39,39,6,0.665,0.887,7,-4.45,1,0.0328,0.00158,0.000957,0.101,0.908,119.32,197693,4
1992-03-07,41,Move Any Mountain,The Shamen,,False,38,38,13,0.66,0.991,7,-5.288,1,0.055,0.0031,0.000122,0.061,0.796,121.467,208560,4
1992-03-07,42,Is It Good To You,Heavy D & The Boyz,,False,36,32,16,0.711,0.595,1,-12.99,1,0.036,0.0484,0.0327,0.208,0.836,107.473,292227,4
1992-03-07,43,Stay,Jodeci,,False,41,41,10,0.657,0.369,7,-13.153,0,0.037,0.0706,0,0.494,0.619,129.965,312040,4
1992-03-07,45,Stars,Simply Red,,False,54,45,7,0.716,0.818,7,-7.456,1,0.0256,0.154,0.000806,0.236,0.817,103.668,248600,4
1992-03-07,46,Too Much Passion,The Smithereens,,False,58,46,5,0.668,0.621,6,-9.601,1,0.0247,0.218,0,0.108,0.924,91.861,275733,4
1992-03-07,47,On A Sunday Afternoon,Lighter Shade Of Brown,,False,43,39,15,0.784,0.765,1,-3.545,1,0.212,0.095,0,0.182,0.845,94.812,212880,4
1992-03-07,48,Too Blind To See It,Kym Sims,,False,47,38,17,0.773,0.668,11,-8.678,0,0.117,0.00187,9.17e-06,0.308,0.698,95.27,227699,4
1992-03-07,49,Kiss You Back,Digital Underground,,False,48,40,17,0.844,0.648,9,-10.685,0,0.113,0.0386,0,0.223,0.794,113.074,221467,4
1992-03-07,51,"Mama, I'm Coming Home",Ozzy Osbourne,,False,59,51,4,0.282,0.656,8,-6.557,1,0.0302,0.0105,0,0.0892,0.242,139.352,251867,4
1992-03-07,52,Black Or White,Michael Jackson,,False,35,1,16,0.741,0.894,4,-3.826,1,0.0496,0.0814,0.0527,0.089,0.96,114.879,202853,4
1992-03-07,53,You Showed Me,Salt-N-Pepa,,False,53,53,6,0.79,0.584,1,-15.101,0,0.0752,0.0194,0.000122,0.105,0.697,105.579,247427,4
1992-03-07,54,Addams Groove,M.C. Hammer,,False,37,7,14,0.912,0.582,11,-9.408,0,0.271,0.0333,0,0.0572,0.842,119.996,239040,4
1992-03-07,55,Live And Let Die,Guns N' Roses,,False,40,33,12,0.262,0.777,11,-8.671,1,0.0632,0.0109,0.113,0.12,0.264,152.5,182733,4
1992-03-07,56,No Son Of Mine,Genesis,,False,46,12,19,0.658,0.595,4,-8.704,0,0.0251,0.133,0.000358,0.0978,0.256,103.975,399107,4
1992-03-07,57,Can't Cry Hard Enough,The Williams Brothers,,False,66,57,5,0.444,0.199,0,-14.508,1,0.0266,0.239,0,0.116,0.32,85.904,191960,4
1992-03-07,58,You Are The One,Chris Cuevas,,False,62,58,6,0.489,0.305,9,-12.264,1,0.0242,0.162,0,0.125,0.299,75.578,257133,3
1992-03-07,59,What Goes Around Comes Around,Giggles,,False,65,59,7,0.744,0.819,7,-10.303,1,0.0546,0.0259,0.00229,0.178,0.87,120.355,223467,4
1992-03-07,60,Church Of Your Heart,Roxette,,False,70,60,2,0.581,0.637,7,-6.039,1,0.0273,0.0146,1.15e-05,0.103,0.608,112.437,195987,4
1992-03-07,61,I Need Money,Marky Mark & The Funky Bunch,,False,74,61,4,0.881,0.719,1,-9.42,1,0.194,0.00892,0.005,0.372,0.882,102.835,269000,4
1992-03-07,62,Everything's Gonna Be Alright,Naughty By Nature,,False,68,62,5,0.883,0.647,10,-14.054,0,0.197,0.0633,0,0.254,0.739,101.649,291867,4
1992-03-07,63,Right Now,Van Halen,,False,69,63,5,0.529,0.662,5,-11.745,1,0.0273,0.153,0.00542,0.099,0.302,93.93,320867,4
1992-03-07,64,There Will Never Be Another Tonight,Bryan Adams,,False,44,31,12,0.517,0.918,9,-6.965,1,0.0489,0.0591,0,0.296,0.641,137.136,280133,4
1992-03-07,65,I've Got A Lot To Learn About Love,The Storm,,False,56,26,20,0.583,0.742,9,-8.621,0,0.0255,0.00532,1.08e-06,0.0752,0.57,110.671,265467,4
1992-03-07,66,Ain't 2 Proud 2 Beg,TLC,,False,80,66,3,0.674,0.707,10,-10.799,0,0.0343,0.00265,0.00214,0.352,0.712,104.854,336560,4
1992-03-07,68,Wildside,Marky Mark & The Funky Bunch,,False,64,10,18,0.767,0.356,8,-15.502,0,0.106,0.166,0.309,0.101,0.271,105.404,307267,4
1992-03-07,69,The Choice Is Yours,Black Sheep,,False,94,69,2,0.867,0.679,10,-12.028,0,0.207,0.0336,1.59e-06,0.0742,0.68,101.293,243200,4
1992-03-07,70,The Unforgiven,Metallica,,False,67,35,14,0.539,0.597,7,-9.581,1,0.0258,0.0108,0.00552,0.134,0.251,139.444,387133,4
1992-03-07,71,In Paradise,Laissez Faire,,False,72,64,14,0.71,0.846,7,-6.677,1,0.0835,0.00881,0.0274,0.347,0.78,122.718,349893,4
1992-03-07,72,The Globe,Big Audio,,False,82,72,4,0.917,0.603,2,-9.541,1,0.13,0.172,0,0.0489,0.696,113.951,364640,4
1992-03-07,73,I'm The One You Need,Jody Watley,24zXT3xZXpsHPOYPcrE90c,True,0,73,1,0.761,0.729,7,-8.909,0,0.0352,0.182,0,0.245,0.631,112.184,261040,4
1992-03-07,74,Nu Nu,Lidell Townsell,24zXT3xZXpsHPOYPcrE90c,False,91,74,2,0.936,0.55,3,-12.744,0,0.0548,0.00935,0.000322,0.0688,0.763,120.963,199627,4
1992-03-07,75,Love Me All Up,Stacy Earl,24zXT3xZXpsHPOYPcrE90c,False,71,26,17,0.702,0.859,11,-10.922,1,0.0467,0.0468,0.0928,0.245,0.657,122.879,297360,4
1992-03-07,78,Keep Coming Back,Richard Marx,,False,79,12,19,0.72,0.478,9,-11.074,1,0.0239,0.115,2.27e-05,0.104,0.672,97.073,409360,4
1992-03-07,79,Ain't Gonna Hurt Nobody,Kid 'N Play,,False,77,51,17,0.776,0.735,6,-14.78,0,0.183,0.0532,0.00687,0.286,0.619,110.105,298814,4
1992-03-07,80,Caribbean Blue,Enya,,False,87,80,2,0.386,0.319,4,-16.512,1,0.0332,0.776,0.965,0.106,0.661,157.614,239600,3
1992-03-07,81,Everlasting Love,Tony Terry,,False,92,81,7,0.535,0.644,7,-11.232,1,0.0345,0.0329,0,0.104,0.629,154.062,318933,4
1992-03-07,82,Forever My Lady,Jodeci,,False,73,25,20,0.707,0.5,9,-15.198,0,0.0387,0.136,0,0.237,0.77,117.997,320360,4
1992-03-07,83,Hearts Don't Think (They Feel),Natural Selection,,False,63,28,14,0.511,0.73,7,-9.266,0,0.0496,0.0911,0.000295,0.0559,0.895,196.112,256667,4
1992-03-07,84,Don't Lose The Magic,Shawn Christopher,,False,96,84,2,0.72,0.532,8,-17.31,1,0.0471,0.0003,0.00142,0.0507,0.526,120.271,226013,4
1992-03-07,85,Change,Lisa Stansfield,,False,75,27,19,0.677,0.845,2,-8.27,0,0.0379,0.0253,0.00102,0.325,0.639,105.893,274747,4
1992-03-07,86,Boom! I Got Your Boyfriend,MC Luscious,,False,89,86,5,0.932,0.578,2,-14.006,1,0.166,0.0192,2.34e-05,0.0624,0.644,129.823,267533,4
1992-03-07,87,All Woman,Lisa Stansfield,4ySKy336eck2JSTo52ssnj,True,0,87,1,0.583,0.338,7,-13.63,0,0.064,0.607,9.86e-06,0.0708,0.378,141.889,317373,4
1992-03-07,88,Hold On (Tighter To Love),Clubland,4ySKy336eck2JSTo52ssnj,False,81,79,10,0.796,0.688,7,-7.932,0,0.0558,0.00131,0.361,0.0888,0.573,119.768,404074,4
1992-03-07,89,Poor Georgie,MC Lyte,0wIEQYOLgV9TneTgM3aRVE,True,0,89,1,0.837,0.688,10,-7.307,0,0.216,0.0332,0,0.0999,0.709,95.566,270093,4
1992-03-07,90,Spending My Time,Roxette,0wIEQYOLgV9TneTgM3aRVE,False,86,32,20,0.42,0.574,4,-5.149,1,0.0292,0.238,0.000115,0.127,0.218,170.549,275667,4
1992-03-07,91,I Want You,Jody Watley,0wIEQYOLgV9TneTgM3aRVE,False,84,61,15,0.76,0.611,9,-8.862,0,0.0661,0.000178,0.0157,0.0685,0.646,110.006,260533,4
1992-03-07,92,You Think You Know Her,Cause And Effect,0wIEQYOLgV9TneTgM3aRVE,False,95,92,2,0.648,0.699,0,-11.729,1,0.0328,0.0183,0.111,0.343,0.753,122.964,283933,4
1992-03-07,93,In My Dreams,The Party,0wIEQYOLgV9TneTgM3aRVE,False,93,34,17,0.615,0.955,1,-8.336,0,0.0587,0.0355,0.00273,0.427,0.58,121.883,217038,4
1992-03-07,94,Do You Want It Right Now,Degrees Of Motion,41fN5kdb3dXtELqTng2hAT,True,0,94,1,0.747,0.834,11,-4.729,0,0.0395,0.291,1.31e-06,0.126,0.701,123.972,256837,4
1992-03-07,95,Peace Of Mind (Love Goes On),One 2 One,57nRbNWvaDRzK3FteeItDG,True,0,95,1,0.346,0.035,2,-27.567,0,0.0442,0.927,0.912,0.162,0.0381,58.7,208203,4
1992-03-07,96,Juice (Know The Ledge),Eric B. & Rakim,57nRbNWvaDRzK3FteeItDG,False,100,96,3,0.789,0.904,8,-8.386,1,0.15,0.0377,0.00128,0.0861,0.817,115.719,241547,4
1992-03-07,97,Only Love Can Break Your Heart,St. Etienne,2l2JonC9Mmrqs5sC7G0SlD,True,0,97,1,0.587,0.805,7,-9.137,1,0.036,3.41e-05,0.386,0.17,0.744,102.402,269240,4
1992-03-07,98,You're All That Matters To Me,Curtis Stigers,4uyiiwV6b9XNEpxOkAqrad,True,0,98,1,0.573,0.635,5,-9.587,1,0.0317,0.0808,0,0.0853,0.821,182.75,280533,4
1992-03-07,99,Send Me An Angel,Scorpions,4uyiiwV6b9XNEpxOkAqrad,False,90,44,18,0.153,0.417,1,-11.587,1,0.0318,0.434,0.000622,0.211,0.166,80.87,273333,3
