date,position,title,artist,spotify_id,is_new,last_pos,peak_pos,weeks,danceability,energy,key,loudness,mode,speechiness,acousticness,instrumentalness,liveness,valence,tempo,duration_ms,time_signature
1996-01-06,1,One Sweet Day,Mariah Carey & Boyz II Men,,False,1,1,6,0.568,0.495,1,-8.964,1,0.0299,0.353,0,0.0839,0.303,128.234,281067,4
1996-01-06,2,"Exhale (Shoop Shoop) (From ""Waiting To Exhale"")",Whitney Houston,,False,2,1,7,0.661,0.394,1,-9.032,1,0.0318,0.401,0,0.119,0.107,137.954,204333,4
1996-01-06,3,Hey Lover,LL Cool J,,False,3,3,8,0.707,0.427,5,-12.216,0,0.0698,0.339,0,0.105,0.541,88.08,284693,4
1996-01-06,4,"Gangsta's Paradise (From ""Dangerous Minds"")",Coolio Featuring L.V.,,False,4,1,21,0.647,0.514,8,-10.05,1,0.0593,0.0655,0,0.398,0.387,79.974,240693,4
1996-01-06,5,Diggin' On You,TLC,,False,5,5,8,0.719,0.631,6,-7.411,1,0.0451,0.0235,0.702,0.0686,0.456,80.127,254560,4
1996-01-06,6,Free As A Bird,The Beatles,,False,10,6,2,0.474,0.503,9,-9.074,1,0.0279,0.0438,0.016,0.153,0.457,72.323,265293,4
1996-01-06,7,Breakfast At Tiffany's,Deep Blue Something,,False,8,7,21,0.622,0.829,2,-5.548,1,0.029,0.11,0,0.0954,0.539,110.367,257373,4
1996-01-06,8,Fantasy,Mariah Carey,,False,6,1,15,0.669,0.727,7,-7.588,1,0.0353,0.139,0,0.123,0.807,102.322,243493,4
1996-01-06,10,Name,Goo Goo Dolls,,False,9,8,13,0.464,0.701,9,-5.943,1,0.0341,0.0691,0.00182,0.0766,0.407,73.97,270000,4
1996-01-06,11,Missing,Everything But The Girl,,False,12,11,22,0.677,0.484,9,-10.506,0,0.0324,0.077,4.75e-05,0.135,0.697,123.534,247200,4
1996-01-06,12,You'll See,Madonna,,False,11,6,5,0.601,0.545,4,-9.972,0,0.0311,0.479,0.000224,0.0975,0.234,89.79,281067,4
1996-01-06,13,One Of Us,Joan Osborne,,False,15,13,5,0.316,0.499,9,-7.899,1,0.0298,0.0108,1.81e-05,0.126,0.403,174.782,320467,4
1996-01-06,15,You Remind Me Of Something,R. Kelly,,False,16,4,8,0.631,0.536,6,-7.194,1,0.0586,0.591,0,0.108,0.829,59.999,249920,4
1996-01-06,16,Runaway,Janet Jackson,,False,14,3,17,0.787,0.86,1,-4.974,1,0.0344,0.364,0.041,0.0612,0.862,109.154,214933,4
1996-01-06,17,Beautiful Life,Ace Of Base,,False,17,15,9,0.749,0.988,0,-5.266,0,0.0387,0.202,0.00631,0.17,0.749,135.015,221187,4
1996-01-06,18,Tell Me,Groove Theory,,False,18,5,20,0.8,0.361,6,-10.849,0,0.0635,0.0355,3.75e-06,0.0668,0.887,93.059,236067,4
1996-01-06,19,Tonite's Tha Night,Kris Kross,,False,21,19,5,0.743,0.523,5,-5.456,0,0.103,0.0231,0.0309,0.0701,0.789,90.974,199293,4
1996-01-06,20,Anything,3T,,False,24,20,14,0.686,0.454,10,-10.928,0,0.0328,0.43,0.00021,0.286,0.645,131.977,321000,4
1996-01-06,21,Soon As I Get Home,Faith Evans,,False,22,21,5,0.652,0.498,11,-6.2,1,0.0413,0.519,0,0.149,0.336,120.141,324280,4
1996-01-06,22,Bullet With Butterfly Wings,The Smashing Pumpkins,,False,26,22,9,0.404,0.72,10,-9.18,0,0.0623,5.59e-05,0.836,0.0466,0.475,121.864,258467,4
1996-01-06,23,Back For Good,Take That,,False,19,7,22,0.6,0.504,5,-9.761,1,0.0292,0.308,0,0.137,0.547,78.961,242267,4
1996-01-06,24,Too Hot,Coolio,,False,35,24,5,0.845,0.407,7,-14.983,1,0.203,0.089,0.00985,0.222,0.576,102.598,218933,4
1996-01-06,25,As I Lay Me Down,Sophie B. Hawkins,,False,20,6,32,0.519,0.737,10,-8.7,1,0.0437,0.645,1.77e-06,0.271,0.668,82.999,248893,4
1996-01-06,26,Be My Lover,La Bouche,,False,32,26,9,0.669,0.941,1,-5.765,0,0.0313,0.00129,4.3e-06,0.886,0.841,134.809,240267,4
1996-01-06,27,Time,Hootie & The Blowfish,,False,27,27,9,0.387,0.875,2,-5.741,1,0.0385,0.0373,0,0.152,0.238,105.1,296840,4
1996-01-06,28,Only Wanna Be With You,Hootie & The Blowfish,,False,23,6,23,0.49,0.873,6,-5.861,1,0.0355,0.107,5.19e-06,0.118,0.513,103.272,229587,4
1996-01-06,29,Who Can I Run To,Xscape,,False,28,8,13,0.71,0.545,4,-9.599,1,0.0588,0.483,0,0.0644,0.632,140.233,216333,4
1996-01-06,30,Kiss From A Rose,Seal,,False,25,1,29,0.584,0.533,10,-7.11,0,0.0305,0.684,0,0.306,0.224,131.745,288427,3
1996-01-06,31,Love U 4 Life,Jodeci,,False,33,31,10,0.606,0.648,0,-7.802,1,0.0466,0.349,0,0.639,0.646,59.041,290067,4
1996-01-06,32,Dreaming Of You,Selena,,False,30,22,11,0.553,0.458,8,-10.796,1,0.0381,0.325,9.71e-05,0.0583,0.247,165.807,314867,4
1996-01-06,33,Set U Free,Planet Soul,,False,34,29,12,0.636,0.645,6,-11.64,1,0.0873,0.101,1.64e-05,0.0686,0.711,128.43,258933,4
1996-01-06,34,"Sittin' Up In My Room (From ""Waiting To Exhale"")",Brandy,,False,46,34,2,0.791,0.61,8,-5.408,0,0.0264,0.288,0.00123,0.0457,0.907,93.277,291067,4
1996-01-06,35,Carnival,Natalie Merchant,,False,29,10,23,0.601,0.48,6,-11.41,0,0.0732,0.2,0.0955,0.0297,0.802,188.214,361107,4
1996-01-06,36,Roll To Me,Del Amitri,,False,31,10,27,0.567,0.821,6,-5.894,1,0.0371,0.418,0,0.108,0.895,150.106,132307,4
1996-01-06,37,No One Else,Total,,False,43,37,4,0.782,0.515,6,-8.215,0,0.3,0.185,1.34e-05,0.0577,0.791,182.19,260467,4
1996-01-06,38,Blessed,Elton John,,False,38,34,10,0.601,0.412,5,-11.963,1,0.0361,0.147,0.00585,0.263,0.464,204.064,300733,4
1996-01-06,39,Hook,Blues Traveler,,False,39,39,14,0.562,0.742,9,-6.355,1,0.0346,0.0369,1.47e-06,0.102,0.793,165.6,289200,4
1996-01-06,40,The World I Know,Collective Soul,,False,40,40,8,0.514,0.704,2,-4.724,1,0.0261,0.0515,0.00219,0.228,0.386,76.975,255467,4
1996-01-06,41,Wonder,Natalie Merchant,,False,41,41,5,0.719,0.739,1,-5.577,1,0.0419,0.346,0.0102,0.0581,0.603,115.142,266008,4
1996-01-06,42,"Natural One (From ""Kids"")",Folk Implosion,,False,42,42,5,0.677,0.463,4,-10.743,1,0.0304,0.53,7.17e-06,0.0988,0.481,110.908,179006,4
1996-01-06,43,Run-Around,Blues Traveler,,False,36,8,42,0.629,0.867,7,-7.307,1,0.0603,0.0865,0,0.126,0.876,151.695,279800,4
1996-01-06,44,I'd Lie For You (And That's The Truth),Meat Loaf,,False,37,13,12,0.409,0.626,2,-8.032,1,0.0363,0.556,0,0.415,0.305,170.949,400358,4
1996-01-06,45,Just Tah Let U Know,Eazy-E,,False,47,45,3,0.736,0.741,8,-3.857,0,0.292,0.0645,0,0.137,0.579,92.65,248867,4
1996-01-06,46,I Remember,Boyz II Men,,False,56,46,6,0.537,0.184,9,-15.886,1,0.0381,0.792,0,0.126,0.217,77.817,169840,4
1996-01-06,47,Nobody Knows,The Tony Rich Project,,False,49,47,4,0.64,0.433,5,-9.432,1,0.0374,0.509,4.9e-06,0.103,0.25,176.086,306933,4
1996-01-06,48,Waterfalls,TLC,,False,44,1,31,0.77,0.505,1,-7.345,1,0.0828,0.311,7.4e-05,0.0777,0.757,171.798,279507,4
1996-01-06,49,December,Collective Soul,,False,45,20,35,0.684,0.645,0,-5.707,1,0.0272,0.589,0.00432,0.18,0.366,121.995,285000,4
1996-01-06,50,Get Together,Big Mountain,,False,50,50,4,0.68,0.914,0,-7.392,1,0.0418,0.0529,0.00493,0.226,0.879,97.055,303133,4
1996-01-06,51,Cell Therapy,Goodie Mob,,False,51,39,13,0.849,0.476,0,-10.479,1,0.445,0.0966,0,0.105,0.48,83.21,277133,4
1996-01-06,53,Cruisin',D'Angelo,,False,53,53,10,0.407,0.525,11,-12.725,0,0.166,0.381,0.000452,0.0816,0.329,74.34,384667,4
1996-01-06,54,Danger,Blahzay Blahzay,,False,54,46,14,0.723,0.739,0,-7.943,1,0.401,0.403,0,0.365,0.805,177.886,225267,4
1996-01-06,55,"I Like It, I Love It",Tim McGraw,,False,66,25,20,0.643,0.961,0,-5.298,1,0.0315,0.0196,0,0.948,0.96,124.027,205707,4
1996-01-06,56,You Are Not Alone,Michael Jackson,,False,57,1,19,0.651,0.402,11,-9.303,1,0.028,0.639,7.73e-05,0.0765,0.258,119.873,345600,4
1996-01-06,57,Pretty Girl,Jon B,,False,52,25,19,0.696,0.521,0,-9.32,1,0.0339,0.398,0,0.339,0.646,93.056,258107,4
1996-01-06,58,Where Ever You Are,Terry Ellis,,False,55,52,10,0.732,0.499,5,-6.794,1,0.0346,0.52,8.62e-06,0.0842,0.428,134.027,298080,4
1996-01-06,59,Ridin' Low,L.A.D.,,False,60,59,8,0.699,0.722,5,-6.532,1,0.0735,0.158,0.000452,0.0523,0.673,197.562,252360,4
1996-01-06,60,Comedown,Bush,,False,61,30,19,0.46,0.81,11,-5.008,0,0.0557,6.54e-05,0.000189,0.123,0.38,139.671,326667,4
1996-01-06,61,Brokenhearted,Brandy,,False,63,9,18,0.533,0.516,6,-7.178,1,0.0311,0.488,0,0.0985,0.42,74.921,286493,4
1996-01-06,62,I'll Be There For You/This House Is Not A Home,The Rembrandts,,False,58,17,15,0.258,0.919,9,-6.927,1,0.0809,0.065,0,0.279,0.636,93.62,187293,4
1996-01-06,63,Let's Play House,Tha Dogg Pound Featuring Michel'le,3IrIfSxQaRgLCTKp6ru4ez,True,0,63,1,0.822,0.702,10,-4.759,0,0.0755,0.0919,0.00559,0.191,0.804,91.37,204440,4
1996-01-06,64,East 1999,Bone Thugs-N-Harmony,3IrIfSxQaRgLCTKp6ru4ez,False,76,64,5,0.878,0.607,11,-9.032,0,0.149,0.0748,0,0.659,0.735,129.472,261773,4
1996-01-06,65,Do You Sleep?,Lisa Loeb & Nine Stories,3IrIfSxQaRgLCTKp6ru4ez,False,62,18,16,0.643,0.671,1,-7.158,0,0.0296,0.0383,4.65e-05,0.0496,0.26,90.396,233493,4
1996-01-06,66,I Will Remember You (Live),Sarah McLachlan,3IrIfSxQaRgLCTKp6ru4ez,False,67,66,9,0.606,0.353,9,-11.484,1,0.0315,0.763,0.000578,0.0778,0.179,140.057,291400,4
1996-01-06,67,When Love & Hate Collide,Def Leppard,3IrIfSxQaRgLCTKp6ru4ez,False,59,59,6,0.485,0.53,4,-9.611,1,0.0279,0.0272,0,0.151,0.28,67.97,259160,4
1996-01-06,68,Come With Me,Shai,3IrIfSxQaRgLCTKp6ru4ez,False,64,43,17,0.57,0.32,2,-8.965,1,0.0323,0.644,0,0.244,0.321,183.524,279960,3
1996-01-06,69,Macarena (Bayside Boys Mix),Los Del Rio,3IrIfSxQaRgLCTKp6ru4ez,False,68,45,19,0.927,0.721,8,-12.561,1,0.0908,0.422,4.36e-05,0.0422,0.965,103.018,249382,4
1996-01-06,70,"I Miss You (Come Back Home) (From ""New York Undercover"")",Monifah,3IrIfSxQaRgLCTKp6ru4ez,False,69,66,11,0.639,0.495,5,-10.783,0,0.356,0.0738,0,0.0682,0.833,175.982,233867,4
1996-01-06,71,Sexual Healing,Max-A-Million,3IrIfSxQaRgLCTKp6ru4ez,False,70,60,10,0.775,0.745,8,-7.167,1,0.0563,0.0268,0,0.27,0.691,99.008,243613,4
1996-01-06,72,Throw Your Hands Up,L.V.,3IrIfSxQaRgLCTKp6ru4ez,False,71,65,8,0.849,0.727,9,-4.572,0,0.0534,0.148,2.17e-05,0.0453,0.7,100.927,230227,4
1996-01-06,73,Hooked On You,Silk,3IrIfSxQaRgLCTKp6ru4ez,False,74,54,10,0.598,0.56,6,-7.401,1,0.0278,0.0429,1.2e-05,0.12,0.775,179.529,289933,4
1996-01-06,74,(If You're Not In It For Love) I'm Outta Here!/The Woman In Me,Shania Twain,3IrIfSxQaRgLCTKp6ru4ez,False,81,74,10,0.598,0.839,4,-4.605,1,0.111,0.106,0,0.372,0.783,105.084,156276,4
1996-01-06,75,Hurricane,The Click,3IrIfSxQaRgLCTKp6ru4ez,False,77,63,9,0.824,0.48,0,-6.745,0,0.144,0.178,0,0.167,0.724,88.029,261080,4
1996-01-06,77,It Matters To Me,Faith Hill,,False,87,77,3,0.613,0.355,6,-8.218,1,0.0247,0.567,0,0.0909,0.129,135.622,197667,4
1996-01-06,78,Just A Girl,No Doubt,,False,78,78,4,0.638,0.906,2,-4.824,1,0.0504,0.0662,6.88e-05,0.142,0.767,107.991,209200,4
1996-01-06,79,Runnin',The Pharcyde,,False,75,55,12,0.754,0.785,10,-8.178,0,0.18,0.0287,0.00144,0.319,0.821,94.123,296267,4
1996-01-06,80,Ain't Nuthin' But A She Thing,Salt-N-Pepa,,False,82,38,12,0.835,0.553,6,-8.607,1,0.0784,0.0314,0.000253,0.331,0.314,97.698,271308,4
1996-01-06,81,Boom Boom Boom,The Outhere Brothers,,False,80,65,15,0.723,0.857,7,-9.989,1,0.241,0.0523,2.66e-05,0.149,0.642,129.87,201893,4
1996-01-06,82,Magic Carpet Ride,The Mighty Dub Katz,,False,73,58,13,0.916,0.824,6,-6.947,0,0.0652,0.0153,0.926,0.0844,0.886,128.698,189147,4
1996-01-06,83,Rosealia,Better Than Ezra,,False,79,71,7,0.392,0.676,7,-11.914,1,0.0327,0.00567,0.000111,0.155,0.548,120.926,278973,4
1996-01-06,84,Fast Life,Kool G Rap,,False,84,74,6,0.837,0.774,6,-8.707,1,0.266,0.0273,0,0.365,0.668,91.174,293627,4
1996-01-06,85,Throw Your Set In The Air,Cypress Hill,,False,83,45,13,0.776,0.731,9,-12.264,1,0.43,0.0945,0.000274,0.318,0.485,92.394,245800,4
1996-01-06,86,Where Do U Want Me To Put It,Solo,2PezcbOknrIxEylhhzedVT,True,0,86,1,0.782,0.759,8,-5.87,1,0.0447,0.261,0,0.102,0.779,87.01,243667,4
1996-01-06,87,Fu-Gee-La,Fugees,2PezcbOknrIxEylhhzedVT,False,89,87,2,0.681,0.505,1,-11.709,1,0.138,0.137,0,0.234,0.399,89.953,260067,4
1996-01-06,88,A Mover La Colita,Artie The 1 Man Party,2PezcbOknrIxEylhhzedVT,False,91,65,15,0.846,0.73,11,-7.868,0,0.0521,0.0012,0.711,0.0592,0.733,130.05,184613,4
1996-01-06,89,Solitude,Edwin McCain,2PezcbOknrIxEylhhzedVT,False,88,72,14,0.601,0.494,9,-10.304,1,0.0422,0.63,7.47e-06,0.132,0.308,79.976,270747,4
1996-01-06,90,Sentimental,Deborah Cox,2PezcbOknrIxEylhhzedVT,False,85,27,18,0.773,0.79,5,-8.057,1,0.0782,0.193,0,0.0356,0.712,88.977,270333,4
1996-01-06,91,We've Got It Goin' On,Backstreet Boys,2PezcbOknrIxEylhhzedVT,False,93,69,11,0.758,0.875,3,-4.518,0,0.0363,0.0851,0,0.227,0.91,112.966,219467,4
1996-01-06,92,Automatic Lover (Call For Love),Real McCoy,2PezcbOknrIxEylhhzedVT,False,86,52,12,0.688,0.98,5,-4.862,0,0.034,0.0693,0.462,0.16,0.538,132.992,227933,4
1996-01-06,94,Can't Be Really Gone,Tim McGraw,60s7ZetsxmTF3HchnbzAVR,True,0,94,1,0.561,0.473,5,-9.972,1,0.0263,0.646,3.44e-06,0.298,0.444,106.994,201133,4
1996-01-06,95,Sometimes I Miss You So Much (Dedicated To The Christ Consciousness),P.M. Dawn,60s7ZetsxmTF3HchnbzAVR,False,95,95,3,0.711,0.6,1,-9.842,1,0.0334,0.101,7.68e-05,0.167,0.773,89.409,282533,4
1996-01-06,96,"The Riddler (From ""Batman Forever"")",Method Man,60s7ZetsxmTF3HchnbzAVR,False,99,56,9,0.798,0.668,10,-4.824,1,0.091,0.0571,0.00987,0.204,0.438,168.039,213733,4
1996-01-06,97,1st Of Tha Month,Bone Thugs-N-Harmony,60s7ZetsxmTF3HchnbzAVR,False,96,14,20,0.729,0.581,5,-8.235,0,0.18,0.0777,3.81e-06,0.696,0.508,74.038,314680,4
1996-01-06,99,East Side Rendezvous,Frost,,False,92,73,10,0.798,0.561,4,-8.625,0,0.147,0.412,0,0.0446,0.785,83.971,273400,4
1996-01-06,100,Cold World,Genius/GZA Featuring Inspektah Deck,,False,97,97,2,0.773,0.794,2,-5.486,1,0.215,0.0976,2.89e-05,0.384,0.541,90.848,331000,4
