date,position,title,artist,spotify_id,is_new,last_pos,peak_pos,weeks,danceability,energy,key,loudness,mode,speechiness,acousticness,instrumentalness,liveness,valence,tempo,duration_ms,time_signature
2018-02-17,1,God's Plan,Drake,35ffVv9x4mtzBh5rF1K9sP,False,1,1,3,0.754,0.449,7,-9.211,1,0.109,0.0332,8.29e-05,0.552,0.357,77.169,198973,4
2018-02-17,2,Perfect,Ed Sheeran,35ffVv9x4mtzBh5rF1K9sP,False,2,1,24,0.598,0.448,8,-6.312,1,0.0232,0.162,0,0.106,0.168,95.009,263400,3
2018-02-17,3,Finesse,Bruno Mars & Cardi B,35ffVv9x4mtzBh5rF1K9sP,False,3,3,6,0.704,0.859,5,-4.877,0,0.0996,0.0185,0,0.0215,0.926,105.115,217289,4
2018-02-17,4,Havana,Camila Cabello Featuring Young Thug,35ffVv9x4mtzBh5rF1K9sP,False,4,1,26,0.765,0.523,2,-4.333,1,0.03,0.184,3.56e-05,0.132,0.394,104.988,217307,4
2018-02-17,5,Rockstar,Post Malone Featuring 21 Savage,35ffVv9x4mtzBh5rF1K9sP,False,5,1,21,0.585,0.52,5,-6.136,0,0.0712,0.124,7.01e-05,0.131,0.129,159.801,218147,4
2018-02-17,6,New Rules,Dua Lipa,35ffVv9x4mtzBh5rF1K9sP,False,7,6,28,0.762,0.7,9,-6.021,0,0.0694,0.00261,1.56e-05,0.153,0.608,116.073,209320,4
2018-02-17,7,Pray For Me,The Weeknd & Kendrick Lamar,6huNf4dutXRjJyGn7f5BPS,True,0,7,1,0.732,0.678,2,-4.977,1,0.0886,0.0867,2.41e-05,0.112,0.196,100.626,211421,4
2018-02-17,8,Stir Fry,Migos,6huNf4dutXRjJyGn7f5BPS,False,12,8,7,0.817,0.816,2,-5.402,1,0.269,0.00263,0,0.159,0.508,181.982,190288,4
2018-02-17,9,Meant To Be,Bebe Rexha & Florida Georgia Line,6huNf4dutXRjJyGn7f5BPS,False,11,9,16,0.643,0.783,10,-6.458,1,0.0856,0.047,0,0.083,0.579,154.084,163870,4
2018-02-17,10,Bad At Love,Halsey,6huNf4dutXRjJyGn7f5BPS,False,6,5,23,0.675,0.751,0,-3.539,1,0.0296,0.0604,0,0.0893,0.612,118.384,181279,4
2018-02-17,11,Thunder,Imagine Dragons,6huNf4dutXRjJyGn7f5BPS,False,10,4,41,0.605,0.822,0,-4.833,1,0.0438,0.00671,0.134,0.147,0.288,167.997,187147,4
2018-02-17,12,Let You Down,NF,6huNf4dutXRjJyGn7f5BPS,False,14,12,17,0.662,0.714,5,-5.68,0,0.121,0.312,0,0.179,0.464,147.997,212120,4
2018-02-17,13,Love.,Kendrick Lamar Featuring Zacari,6huNf4dutXRjJyGn7f5BPS,False,15,11,33,0.8,0.585,10,-7.343,1,0.0924,0.264,0,0.153,0.779,126.058,213400,4
2018-02-17,14,MotorSport,"Migos, Nicki Minaj & Cardi B",6huNf4dutXRjJyGn7f5BPS,False,8,6,15,0.904,0.518,2,-5.32,1,0.183,0.0305,0,0.325,0.188,137.996,303077,4
2018-02-17,15,Him & I,G-Eazy & Halsey,6huNf4dutXRjJyGn7f5BPS,False,16,15,10,0.589,0.731,2,-6.343,1,0.0868,0.0534,0,0.308,0.191,87.908,268867,4
2018-02-17,16,No Limit,G-Eazy Featuring A$AP Rocky & Cardi B,6huNf4dutXRjJyGn7f5BPS,False,13,4,22,0.838,0.771,1,-3.791,1,0.244,0.0117,0,0.0853,0.405,175.957,245387,4
2018-02-17,17,Say Something,Justin Timberlake Featuring Chris Stapleton,6huNf4dutXRjJyGn7f5BPS,False,9,9,2,0.707,0.632,10,-7.031,1,0.0789,0.103,1.09e-05,0.0841,0.372,97.04,278893,4
2018-02-17,18,I Fall Apart,Post Malone,6huNf4dutXRjJyGn7f5BPS,False,17,16,20,0.556,0.538,8,-5.408,0,0.0382,0.0689,0,0.196,0.291,143.95,223347,4
2018-02-17,19,Bodak Yellow (Money Moves),Cardi B,6huNf4dutXRjJyGn7f5BPS,False,25,1,32,0.926,0.703,11,-6.337,0,0.103,0.0659,0,0.231,0.485,125.022,223713,4
2018-02-17,20,Bartier Cardi,Cardi B Featuring 21 Savage,6huNf4dutXRjJyGn7f5BPS,False,19,14,7,0.908,0.524,1,-7.955,1,0.181,0.00111,0.000678,0.383,0.109,138.015,224285,4
2018-02-17,21,How Long,Charlie Puth,6huNf4dutXRjJyGn7f5BPS,False,21,21,18,0.845,0.561,1,-5.253,0,0.0778,0.211,3.49e-06,0.0383,0.811,109.974,200853,4
2018-02-17,22,The Middle,"Zedd, Maren Morris & Grey",6huNf4dutXRjJyGn7f5BPS,False,23,22,2,0.753,0.657,7,-3.061,1,0.0449,0.171,0,0.112,0.437,107.01,184732,4
2018-02-17,23,Shape Of You,Ed Sheeran,6huNf4dutXRjJyGn7f5BPS,False,22,1,57,0.825,0.652,1,-3.183,0,0.0802,0.581,0,0.0931,0.931,95.977,233713,4
2018-02-17,24,Gummo,6ix9ine,6huNf4dutXRjJyGn7f5BPS,False,24,12,13,0.66,0.775,2,-4.926,1,0.172,0.0553,0,0.129,0.635,157.036,157643,4
2018-02-17,25,Wolves,Selena Gomez X Marshmello,6huNf4dutXRjJyGn7f5BPS,False,30,20,16,0.725,0.804,11,-4.614,0,0.0422,0.124,0,0.204,0.31,124.996,197993,4
2018-02-17,26,Feel It Still,Portugal. The Man,6huNf4dutXRjJyGn7f5BPS,False,27,4,34,0.801,0.795,1,-5.115,0,0.0504,0.0417,0.000113,0.0717,0.754,79.028,163253,4
2018-02-17,27,Never Be The Same,Camila Cabello,6huNf4dutXRjJyGn7f5BPS,False,32,27,8,0.637,0.713,0,-4.333,1,0.0747,0.181,0.000637,0.137,0.243,129.923,226973,4
2018-02-17,28,Too Good At Goodbyes,Sam Smith,6huNf4dutXRjJyGn7f5BPS,False,20,4,22,0.681,0.372,5,-8.237,1,0.0432,0.64,0,0.169,0.476,91.873,201000,4
2018-02-17,29,Mine,Bazzi,6huNf4dutXRjJyGn7f5BPS,False,41,29,3,0.71,0.789,4,-3.874,1,0.0722,0.0161,2.77e-06,0.451,0.717,142.929,131064,4
2018-02-17,30,Lights Down Low,MAX Featuring gnash,6huNf4dutXRjJyGn7f5BPS,False,38,30,18,0.623,0.493,5,-7.727,0,0.0338,0.0632,0,0.104,0.594,81.019,223847,4
2018-02-17,31,All The Stars,Kendrick Lamar & SZA,6huNf4dutXRjJyGn7f5BPS,False,54,31,5,0.698,0.633,8,-4.946,1,0.0597,0.0605,0.000194,0.0926,0.552,96.924,232187,4
2018-02-17,32,Sky Walker,Miguel Featuring Travis Scott,6huNf4dutXRjJyGn7f5BPS,False,31,29,20,0.674,0.506,6,-10.532,1,0.0434,0.173,0,0.0866,0.183,145.965,259333,4
2018-02-17,33,Plain Jane,A$AP Ferg Featuring Nicki Minaj,6huNf4dutXRjJyGn7f5BPS,False,34,26,20,0.797,0.844,11,-5.482,1,0.275,0.0651,0,0.087,0.52,170.142,173600,4
2018-02-17,34,Filthy,Justin Timberlake,6huNf4dutXRjJyGn7f5BPS,False,51,9,5,0.745,0.579,1,-5.771,1,0.138,0.0354,0.0118,0.246,0.645,97.002,293947,4
2018-02-17,35,Young Dumb & Broke,Khalid,6huNf4dutXRjJyGn7f5BPS,False,35,18,30,0.798,0.539,1,-6.351,1,0.0421,0.199,1.66e-05,0.165,0.394,136.949,202547,4
2018-02-17,36,Gucci Gang,Lil Pump,6huNf4dutXRjJyGn7f5BPS,False,26,3,22,0.936,0.523,5,-6.71,1,0.0597,0.239,0,0.117,0.699,119.889,124056,4
2018-02-17,37,Marry Me,Thomas Rhett,6huNf4dutXRjJyGn7f5BPS,False,39,35,10,0.333,0.412,3,-8.633,1,0.029,0.0977,0,0.113,0.474,85.028,205453,4
2018-02-17,38,Sorry Not Sorry,Demi Lovato,6huNf4dutXRjJyGn7f5BPS,False,42,6,31,0.705,0.64,11,-6.928,0,0.225,0.0237,0,0.262,0.887,144.077,203760,4
2018-02-17,39,Outside Today,YoungBoy Never Broke Again,6huNf4dutXRjJyGn7f5BPS,False,45,39,4,0.851,0.666,11,-5.334,0,0.0694,0.139,0,0.105,0.0585,134.068,129105,4
2018-02-17,40,1-800-273-8255,Logic Featuring Alessia Cara & Khalid,6huNf4dutXRjJyGn7f5BPS,False,33,3,41,0.62,0.574,5,-7.788,0,0.0479,0.569,0,0.19,0.357,100.023,250173,4
2018-02-17,41,I Get The Bag,Gucci Mane Featuring Migos,6huNf4dutXRjJyGn7f5BPS,False,37,11,25,0.89,0.633,11,-5.475,1,0.168,0.0232,0.000343,0.0993,0.425,139.948,233087,4
2018-02-17,42,River,Eminem Featuring Ed Sheeran,6huNf4dutXRjJyGn7f5BPS,False,44,11,8,0.748,0.749,8,-5.916,0,0.516,0.142,0,0.0713,0.659,90.09,221013,4
2018-02-17,43,Ric Flair Drip,Offset & Metro Boomin,6huNf4dutXRjJyGn7f5BPS,False,46,39,15,0.88,0.428,9,-8.28,1,0.206,0.149,5.07e-05,0.114,0.333,100.007,172800,4
2018-02-17,44,Lemon,N*E*R*D & Rihanna,6huNf4dutXRjJyGn7f5BPS,False,47,40,14,0.916,0.727,1,-6.556,1,0.0861,0.00214,0.000145,0.118,0.201,94.997,219707,4
2018-02-17,45,End Game,Taylor Swift Featuring Ed Sheeran & Future,6huNf4dutXRjJyGn7f5BPS,False,43,18,12,0.649,0.589,2,-6.237,1,0.0558,0.00845,0,0.108,0.151,159.073,244827,4
2018-02-17,46,Let Me Go,Hailee Steinfeld & Alesso Featuring Florida Georgia Line & Watt,6huNf4dutXRjJyGn7f5BPS,False,50,40,20,0.664,0.708,8,-4.154,1,0.0474,0.0337,0,0.0841,0.742,103.07,174800,4
2018-02-17,47,Roll In Peace,Kodak Black Featuring XXXTENTACION,6huNf4dutXRjJyGn7f5BPS,False,40,31,25,0.747,0.524,10,-6.807,0,0.245,0.0306,0,0.2,0.363,140.053,213132,4
2018-02-17,48,Walk It Talk It,Migos Featuring Drake,6huNf4dutXRjJyGn7f5BPS,False,18,18,2,0.907,0.633,2,-5.145,1,0.184,0.0876,2.6e-06,0.106,0.395,145.914,276147,4
2018-02-17,49,El Farsante,Ozuna & Romeo Santos,6huNf4dutXRjJyGn7f5BPS,False,92,49,2,0.737,0.742,6,-2.875,1,0.0441,0.218,0,0.316,0.386,119.966,258000,4
2018-02-17,50,Narcos,Migos,6huNf4dutXRjJyGn7f5BPS,False,36,36,2,0.936,0.585,0,-6.914,1,0.125,0.0142,0,0.132,0.242,124.991,255379,4
2018-02-17,51,Written In The Sand,Old Dominion,6huNf4dutXRjJyGn7f5BPS,False,58,51,12,0.725,0.438,6,-9.602,1,0.0575,0.593,0,0.0842,0.76,83.984,184080,4
2018-02-17,52,You Make It Easy,Jason Aldean,6huNf4dutXRjJyGn7f5BPS,False,28,28,2,0.375,0.574,7,-5.305,1,0.0315,0.143,0,0.11,0.406,132.025,196800,3
2018-02-17,53,Good Old Days,Macklemore Featuring Kesha,6huNf4dutXRjJyGn7f5BPS,False,59,53,16,0.712,0.51,8,-8.162,1,0.0633,0.446,2.46e-05,0.112,0.268,122.964,240507,4
2018-02-17,54,Five More Minutes,Scotty McCreery,6huNf4dutXRjJyGn7f5BPS,False,61,54,10,0.494,0.634,7,-4.933,1,0.0282,0.259,1.15e-06,0.109,0.28,156.03,241147,4
2018-02-17,55,Wait,Maroon 5,6huNf4dutXRjJyGn7f5BPS,False,56,55,4,0.655,0.603,8,-5.014,1,0.0555,0.0959,0,0.107,0.452,126.088,190643,4
2018-02-17,56,The Champion,Carrie Underwood Featuring Ludacris,6huNf4dutXRjJyGn7f5BPS,False,0,47,2,0.663,0.875,6,-3.301,1,0.183,0.0821,0,0.124,0.51,91.056,223999,4
2018-02-17,57,Pick It Up,Famous Dex Featuring A$AP Rocky,6huNf4dutXRjJyGn7f5BPS,False,66,57,13,0.921,0.467,1,-8.443,1,0.119,0.0149,0.000238,0.334,0.287,135.995,191252,4
2018-02-17,58,Yours,Russell Dickerson,6huNf4dutXRjJyGn7f5BPS,False,57,49,17,0.554,0.722,11,-6.005,1,0.034,0.119,0,0.0861,0.558,134.058,216960,4
2018-02-17,59,Broken Halos,Chris Stapleton,6huNf4dutXRjJyGn7f5BPS,False,62,59,11,0.613,0.564,8,-7.085,1,0.0251,0.134,1.65e-06,0.0585,0.538,78.388,180907,4
2018-02-17,60,New Freezer,Rich The Kid Featuring Kendrick Lamar,6huNf4dutXRjJyGn7f5BPS,False,75,60,2,0.884,0.698,0,-9.101,1,0.364,0.0405,0,0.195,0.575,140.068,191938,4
2018-02-17,61,Heaven,Kane Brown,6huNf4dutXRjJyGn7f5BPS,False,67,61,7,0.677,0.556,9,-6.544,1,0.0306,0.263,0,0.105,0.521,80.009,179507,4
2018-02-17,62,You Broke Up With Me,Walker Hayes,6huNf4dutXRjJyGn7f5BPS,False,69,62,16,0.847,0.699,0,-8.286,1,0.0733,0.525,0,0.267,0.874,120.002,196667,4
2018-02-17,63,This Is Me,Keala Settle & The Greatest Showman Ensemble,6huNf4dutXRjJyGn7f5BPS,False,71,58,6,0.284,0.704,2,-7.276,1,0.186,0.00583,0.000115,0.0424,0.1,191.702,234707,4
2018-02-17,64,Betrayed,Lil Xan,6huNf4dutXRjJyGn7f5BPS,False,65,64,13,0.821,0.434,10,-9.194,0,0.118,0.434,0,0.128,0.241,120.012,187173,4
2018-02-17,65,One Foot,WALK THE MOON,6huNf4dutXRjJyGn7f5BPS,False,74,65,6,0.582,0.821,0,-4.861,1,0.0365,0.00754,2.1e-06,0.818,0.468,100.025,261373,4
2018-02-17,66,Like I Loved You,Brett Young,6huNf4dutXRjJyGn7f5BPS,False,70,46,20,0.582,0.568,1,-6.051,1,0.0297,0.196,0,0.0841,0.64,76.025,207187,4
2018-02-17,67,KEKE,"6ix9ine, Fetty Wap & A Boogie Wit da Hoodie",6huNf4dutXRjJyGn7f5BPS,False,63,43,4,0.599,0.857,7,-5.7,1,0.299,0.0321,0,0.4,0.469,187.985,151915,4
2018-02-17,68,Echame La Culpa,Luis Fonsi & Demi Lovato,6huNf4dutXRjJyGn7f5BPS,False,72,47,12,0.733,0.897,0,-3.652,1,0.0389,0.0391,0,0.117,0.649,96.006,173800,4
2018-02-17,69,King's Dead,"Jay Rock, Kendrick Lamar, Future & James Blake",6huNf4dutXRjJyGn7f5BPS,False,99,69,4,0.645,0.705,1,-5.008,1,0.299,0.000813,0,0.128,0.376,137.133,229670,4
2018-02-17,70,Nowadays,Lil Skies Featuring Landon Cube,6huNf4dutXRjJyGn7f5BPS,False,68,55,5,0.745,0.646,6,-6.987,0,0.17,0.157,0,0.338,0.46,79.993,203908,4
2018-02-17,71,Losing Sleep,Chris Young,6huNf4dutXRjJyGn7f5BPS,False,60,60,20,0.584,0.621,1,-5.703,1,0.0443,0.0715,1.68e-06,0.389,0.634,92.003,178253,4
2018-02-17,72,Notice Me,Migos Featuring Post Malone,6huNf4dutXRjJyGn7f5BPS,False,52,52,2,0.793,0.344,6,-9.757,1,0.357,0.112,1.68e-06,0.15,0.45,166.105,233880,4
2018-02-17,73,Man Of The Woods,Justin Timberlake,4KTU5aa5s547f1JF5DImhF,True,0,73,1,0.624,0.452,0,-8.206,1,0.0681,0.315,1.02e-05,0.311,0.724,199.775,243987,4
2018-02-17,74,All On Me,Devin Dawson,4KTU5aa5s547f1JF5DImhF,False,76,74,11,0.634,0.668,5,-5.488,1,0.0291,0.14,0,0.216,0.635,80.989,224627,4
2018-02-17,75,Legends,Kelsea Ballerini,4KTU5aa5s547f1JF5DImhF,False,84,75,10,0.577,0.727,4,-5.848,1,0.0319,0.0547,0,0.0891,0.24,112.041,244467,4
2018-02-17,76,No Smoke,YoungBoy Never Broke Again,4KTU5aa5s547f1JF5DImhF,False,77,61,10,0.658,0.736,9,-6.097,0,0.308,0.113,0,0.0978,0.804,143.966,160000,4
2018-02-17,77,Red Roses,Lil Skies Featuring Landon Cube,4KTU5aa5s547f1JF5DImhF,False,80,69,5,0.691,0.683,0,-7.335,1,0.0954,0.547,0,0.221,0.456,140.002,262544,4
2018-02-17,78,Beautiful Trauma,P!nk,4KTU5aa5s547f1JF5DImhF,False,88,78,7,0.412,0.619,7,-6.39,1,0.0725,0.0868,2.55e-06,0.4,0.234,95.977,250053,4
2018-02-17,79,Tell Me You Love Me,Demi Lovato,4KTU5aa5s547f1JF5DImhF,False,78,53,11,0.705,0.64,11,-6.928,0,0.225,0.0237,0,0.262,0.887,144.077,203760,4
2018-02-17,80,Candy Paint,Post Malone,4KTU5aa5s547f1JF5DImhF,False,82,50,16,0.664,0.667,4,-5.941,1,0.154,0.64,1.22e-06,0.0753,0.381,180.064,227533,4
2018-02-17,81,Dura,Daddy Yankee,7qpG4LZE1XiiQ8a4bshlso,True,0,81,1,0.783,0.84,1,-3.416,1,0.051,0.174,0,0.412,0.838,95.002,200480,4
2018-02-17,82,La Modelo,Ozuna x Cardi B,7qpG4LZE1XiiQ8a4bshlso,False,79,52,7,0.574,0.734,1,-2.697,1,0.0728,0.241,0.00806,0.0962,0.769,98.023,255507,4
2018-02-17,83,Diplomatic Immunity,Drake,7qpG4LZE1XiiQ8a4bshlso,False,55,7,3,0.654,0.839,9,-5.076,0,0.443,0.00531,0,0.308,0.549,74.886,255867,4
2018-02-17,84,Most People Are Good,Luke Bryan,7qpG4LZE1XiiQ8a4bshlso,False,94,84,2,0.586,0.732,8,-6.171,1,0.0279,0.176,0,0.148,0.582,150.109,221801,4
2018-02-17,85,Rewrite The Stars,Zac Efron & Zendaya,7qpG4LZE1XiiQ8a4bshlso,False,81,70,6,0.684,0.619,10,-7.005,1,0.0386,0.0716,0,0.122,0.284,125.046,217440,4
2018-02-17,86,Codeine Dreaming,Kodak Black Featuring Lil Wayne,7qpG4LZE1XiiQ8a4bshlso,False,86,52,11,0.736,0.604,1,-7.357,0,0.222,0.0652,6.43e-05,0.124,0.574,155.007,264532,4
2018-02-17,87,Whatever It Takes,Imagine Dragons,7qpG4LZE1XiiQ8a4bshlso,False,0,87,2,0.672,0.655,10,-5.021,0,0.0311,0.0362,0,0.117,0.556,134.945,201240,4
2018-02-17,88,IDGAF,Dua Lipa,7qpG4LZE1XiiQ8a4bshlso,False,93,88,4,0.836,0.543,7,-5.975,1,0.095,0.0397,0,0.0824,0.507,97.027,217947,4
2018-02-17,89,BBO (Bad Bitches Only),Migos Featuring 21 Savage,7qpG4LZE1XiiQ8a4bshlso,False,48,48,2,0.808,0.771,4,-5.719,0,0.0645,0.0413,1.29e-06,0.18,0.471,161.94,251859,4
2018-02-17,90,Hardaway,Derez De'Shon,25qhnRgAcImQWfaswqRkwN,True,0,90,1,0.537,0.518,1,-5.987,1,0.188,0.118,0,0.146,0.427,132.527,236032,4
2018-02-17,91,Mayores,Becky G Featuring Bad Bunny,25qhnRgAcImQWfaswqRkwN,False,95,74,16,0.745,0.836,5,-4.336,0,0.0444,0.145,0.00314,0.116,0.874,96.993,203187,4
2018-02-17,92,At The Club,Jacquees X Dej Loaf,0NqZ65jPelNB13gzsvH2Ma,True,0,92,1,0.795,0.668,7,-7.288,0,0.093,0.124,0,0.0739,0.372,92.029,173054,4
2018-02-17,93,The Long Way,Brett Eldredge,5vuMtXS5kQ7F0o9V9rG1dG,True,0,93,1,0.488,0.637,10,-7.63,1,0.0401,0.265,0,0.106,0.23,88.865,208720,4
2018-02-17,94,Singles You Up,Jordan Davis,4LiMQ6G9n84rDUBs9wtwz6,True,0,94,1,0.491,0.907,7,-3.594,1,0.0481,0.0491,0,0.242,0.631,199.943,182667,4
2018-02-17,95,Criminal,Natti Natasha x Ozuna,4LiMQ6G9n84rDUBs9wtwz6,False,0,95,2,0.814,0.813,2,-3.023,0,0.0561,0.03,9.33e-05,0.255,0.839,79.997,232550,4
2018-02-17,96,Corazon,Maluma X Nego do Borel,4LiMQ6G9n84rDUBs9wtwz6,False,100,87,6,0.722,0.738,9,-6.073,0,0.247,0.328,1.47e-05,0.198,0.748,198.075,184720,4
2018-02-17,97,Sick Boy,The Chainsmokers,4LiMQ6G9n84rDUBs9wtwz6,False,90,65,3,0.663,0.577,11,-7.518,0,0.0531,0.109,0,0.12,0.454,89.996,193200,4
2018-02-17,98,A Girl Like You,Easton Corbin,3AsNVBJ7LHsltdu9490ZiS,True,0,98,1,0.735,0.768,5,-4.481,1,0.0353,0.0197,0,0.0643,0.83,104.991,217840,4
2018-02-17,99,Rock,Plies,3AsNVBJ7LHsltdu9490ZiS,False,0,99,2,0.852,0.691,6,-5.175,0,0.139,0.0375,0,0.0517,0.658,61.115,174653,4
2018-02-17,100,Supplies,Justin Timberlake,3AsNVBJ7LHsltdu9490ZiS,False,0,71,2,0.793,0.554,11,-6.624,0,0.0451,0.00695,0,0.127,0.225,119.993,225600,4
