date,position,title,artist,spotify_id,is_new,last_pos,peak_pos,weeks,danceability,energy,key,loudness,mode,speechiness,acousticness,instrumentalness,liveness,valence,tempo,duration_ms,time_signature
2014-10-18,1,All About That Bass,Meghan Trainor,4iEOVEULZRvmzYSZY2ViKN,False,1,1,13,0.807,0.887,9,-3.726,1,0.0503,0.0573,2.87e-06,0.124,0.961,134.052,187920,4
2014-10-18,2,Shake It Off,Taylor Swift,4iEOVEULZRvmzYSZY2ViKN,False,2,1,7,0.648,0.785,7,-5.414,1,0.165,0.0561,0,0.148,0.943,160.02,219200,4
2014-10-18,3,Black Widow,Iggy Azalea Featuring Rita Ora,4iEOVEULZRvmzYSZY2ViKN,False,4,3,14,0.743,0.72,11,-3.753,1,0.124,0.192,0.000386,0.109,0.519,163.99,209423,4
2014-10-18,4,Bang Bang,"Jessie J, Ariana Grande & Nicki Minaj",4iEOVEULZRvmzYSZY2ViKN,False,5,3,10,0.706,0.786,0,-3.417,0,0.091,0.26,0,0.38,0.751,150.028,199387,4
2014-10-18,5,Anaconda,Nicki Minaj,4iEOVEULZRvmzYSZY2ViKN,False,3,2,9,0.964,0.605,9,-6.223,1,0.179,0.0668,7.78e-06,0.214,0.646,129.994,260240,4
2014-10-18,6,Habits (Stay High),Tove Lo,4iEOVEULZRvmzYSZY2ViKN,False,7,6,19,0.729,0.65,5,-3.539,1,0.0313,0.0702,6.69e-05,0.0829,0.347,110.02,209160,4
2014-10-18,7,Don't Tell 'Em,Jeremih Featuring YG,4iEOVEULZRvmzYSZY2ViKN,False,9,7,15,0.856,0.527,2,-5.225,1,0.0997,0.392,0,0.11,0.386,98.052,266840,4
2014-10-18,8,Animals,Maroon 5,4iEOVEULZRvmzYSZY2ViKN,False,33,8,7,0.279,0.742,4,-6.46,0,0.0898,0.000185,0,0.593,0.328,189.868,231013,4
2014-10-18,9,Stay With Me,Sam Smith,4iEOVEULZRvmzYSZY2ViKN,False,6,2,26,0.418,0.42,0,-6.444,1,0.0414,0.588,6.39e-05,0.11,0.184,84.094,172724,4
2014-10-18,10,Break Free,Ariana Grande Featuring Zedd,4iEOVEULZRvmzYSZY2ViKN,False,8,4,14,0.687,0.702,7,-5.324,0,0.0455,0.0064,4.35e-05,0.204,0.284,129.956,214840,4
2014-10-18,11,Rather Be,Clean Bandit Featuring Jess Glynne,4iEOVEULZRvmzYSZY2ViKN,False,10,10,17,0.799,0.586,11,-6.735,1,0.0377,0.162,2.03e-06,0.193,0.549,120.97,227833,4
2014-10-18,12,Hot Boy,Bobby Shmurda,4iEOVEULZRvmzYSZY2ViKN,False,14,12,10,0.859,0.5,9,-7.628,1,0.347,0.042,1.6e-05,0.0616,0.186,83.981,194561,4
2014-10-18,13,Steal My Girl,One Direction,2Bs4jQEGMycglOfWPBqrVG,True,0,13,1,0.536,0.768,10,-5.948,0,0.0347,0.00433,0,0.114,0.545,77.217,228133,4
2014-10-18,14,Rude,MAGIC!,2Bs4jQEGMycglOfWPBqrVG,False,13,1,24,0.774,0.756,1,-4.995,1,0.0389,0.0423,0,0.305,0.931,144.032,224840,4
2014-10-18,15,Chandelier,Sia,2Bs4jQEGMycglOfWPBqrVG,False,12,8,22,0.399,0.787,1,-2.88,1,0.0499,0.0197,6.07e-05,0.0685,0.572,117.089,216120,5
2014-10-18,16,Boom Clap,Charli XCX,2Bs4jQEGMycglOfWPBqrVG,False,11,8,18,0.659,0.911,4,-2.28,1,0.0786,0.154,0.000304,0.191,0.576,91.999,169866,4
2014-10-18,17,Don't,Ed Sheeran,2Bs4jQEGMycglOfWPBqrVG,False,17,17,17,0.806,0.608,1,-7.008,1,0.0659,0.0113,0,0.635,0.849,95.049,219840,4
2014-10-18,18,Maps,Maroon 5,2Bs4jQEGMycglOfWPBqrVG,False,15,6,16,0.742,0.713,1,-5.522,0,0.0303,0.0205,0,0.059,0.879,120.032,189960,4
2014-10-18,19,Cool Kids,Echosmith,2Bs4jQEGMycglOfWPBqrVG,False,20,19,13,0.719,0.671,8,-6.279,1,0.0336,0.0372,8.21e-06,0.12,0.786,130.027,237627,4
2014-10-18,20,Burnin' It Down,Jason Aldean,2Bs4jQEGMycglOfWPBqrVG,False,19,12,11,0.681,0.795,6,-6.652,1,0.049,0.305,9.41e-06,0.109,0.64,135.939,219160,4
2014-10-18,21,Bailando,Enrique Iglesias Featuring Descemer Bueno & Gente de Zona,2Bs4jQEGMycglOfWPBqrVG,False,16,12,23,0.723,0.777,7,-3.503,1,0.108,0.0426,3.68e-06,0.0451,0.961,91.017,243413,4
2014-10-18,22,Am I Wrong,Nico & Vinz,2Bs4jQEGMycglOfWPBqrVG,False,18,4,25,0.729,0.675,8,-6.003,1,0.0312,0.175,1.58e-06,0.55,0.779,119.968,245867,4
2014-10-18,23,Trumpets,Jason Derulo,2Bs4jQEGMycglOfWPBqrVG,False,27,23,19,0.635,0.691,0,-4.862,1,0.258,0.555,0,0.097,0.638,82.142,217419,4
2014-10-18,24,Something In The Water,Carrie Underwood,10RQKVSr4rS0coExTmi4dF,True,0,24,1,0.451,0.893,7,-2.721,1,0.0627,0.0243,0,0.0813,0.0971,139.763,238173,4
2014-10-18,25,A Sky Full Of Stars,Coldplay,10RQKVSr4rS0coExTmi4dF,False,21,10,23,0.545,0.675,6,-6.474,1,0.0279,0.00617,0.00197,0.209,0.162,124.97,267867,4
2014-10-18,26,Lifestyle,Rich Gang Featuring Young Thug & Rich Homie Quan,10RQKVSr4rS0coExTmi4dF,False,29,26,12,0.546,0.667,1,-5.236,1,0.274,0.0152,0,0.0895,0.471,87.666,269693,4
2014-10-18,27,All Of Me,John Legend,10RQKVSr4rS0coExTmi4dF,False,26,1,52,0.422,0.264,8,-7.064,1,0.0322,0.922,0,0.132,0.331,119.93,269560,4
2014-10-18,28,Dirt,Florida Georgia Line,10RQKVSr4rS0coExTmi4dF,False,23,11,13,0.547,0.878,2,-4.224,1,0.0451,0.0638,7.08e-06,0.106,0.592,121.973,230587,4
2014-10-18,29,New Flame,Chris Brown Featuring Usher & Rick Ross,10RQKVSr4rS0coExTmi4dF,False,31,27,12,0.702,0.629,1,-4.292,1,0.041,0.0506,0,0.0963,0.446,141.967,244227,4
2014-10-18,30,Fancy,Iggy Azalea Featuring Charli XCX,10RQKVSr4rS0coExTmi4dF,False,22,1,31,0.912,0.716,10,-4.141,0,0.0697,0.0904,0,0.0491,0.377,94.981,199938,4
2014-10-18,31,Fireball,Pitbull Featuring John Ryan,10RQKVSr4rS0coExTmi4dF,False,30,30,9,0.69,0.937,10,-5.393,1,0.0642,0.0894,0.000104,0.0532,0.794,122.951,235012,4
2014-10-18,32,Blame,Calvin Harris Featuring John Newman,10RQKVSr4rS0coExTmi4dF,False,38,31,4,0.414,0.857,0,-4.078,0,0.0808,0.0287,0.00574,0.343,0.348,128.024,212960,4
2014-10-18,33,Happy,Pharrell Williams,10RQKVSr4rS0coExTmi4dF,False,32,1,40,0.647,0.822,5,-4.662,0,0.183,0.219,0,0.0908,0.962,160.019,232720,4
2014-10-18,34,2 On,Tinashe Featuring ScHoolboy Q,10RQKVSr4rS0coExTmi4dF,False,36,24,22,0.742,0.595,9,-7.51,1,0.107,0.15,0,0.111,0.431,101.013,227000,4
2014-10-18,35,Problem,Ariana Grande Featuring Iggy Azalea,10RQKVSr4rS0coExTmi4dF,False,28,2,23,0.66,0.805,1,-5.352,0,0.153,0.0192,8.83e-06,0.159,0.625,103.008,193920,4
2014-10-18,36,This Is How We Do,Katy Perry,10RQKVSr4rS0coExTmi4dF,False,25,24,10,0.69,0.636,9,-6.028,0,0.0457,0.0203,0,0.147,0.8,96.0,204285,4
2014-10-18,37,Amnesia,5 Seconds Of Summer,10RQKVSr4rS0coExTmi4dF,False,24,16,14,0.572,0.499,2,-5.237,1,0.0311,0.0283,0,0.213,0.108,101.593,237248,4
2014-10-18,38,0 To 100 / The Catch Up,Drake,10RQKVSr4rS0coExTmi4dF,False,35,35,11,0.559,0.716,11,-3.964,0,0.39,0.737,0,0.252,0.504,176.618,275227,4
2014-10-18,39,Waves,Mr. Probz,10RQKVSr4rS0coExTmi4dF,False,43,39,7,0.829,0.51,5,-9.334,0,0.0369,0.00821,0.00143,0.0829,0.45,119.994,208133,4
2014-10-18,40,Jealous,Nick Jonas,10RQKVSr4rS0coExTmi4dF,False,58,40,4,0.684,0.71,11,-3.614,0,0.0779,0.0132,0,0.444,0.451,93.007,222187,4
2014-10-18,41,Latch,Disclosure Featuring Sam Smith,10RQKVSr4rS0coExTmi4dF,False,37,7,29,0.729,0.735,1,-5.455,1,0.0919,0.0178,0.000193,0.089,0.544,121.986,255867,4
2014-10-18,42,No Flex Zone,Rae Sremmurd,10RQKVSr4rS0coExTmi4dF,False,40,36,10,0.925,0.518,8,-5.831,1,0.106,0.00433,0,0.0976,0.241,120.064,231067,4
2014-10-18,43,Neon Light,Blake Shelton,10RQKVSr4rS0coExTmi4dF,False,49,43,7,0.666,0.78,2,-5.847,1,0.048,0.0189,1.01e-06,0.0635,0.923,154.056,221402,4
2014-10-18,44,Leave The Night On,Sam Hunt,10RQKVSr4rS0coExTmi4dF,False,42,42,15,0.514,0.951,9,-3.813,1,0.0603,0.0951,0,0.349,0.838,171.96,192160,4
2014-10-18,45,No Mediocre,T.I. Featuring Iggy Azalea,10RQKVSr4rS0coExTmi4dF,False,41,33,16,0.78,0.45,1,-9.539,1,0.0465,0.0826,0,0.0809,0.178,95.486,201600,4
2014-10-18,46,Roller Coaster,Luke Bryan,10RQKVSr4rS0coExTmi4dF,False,44,43,12,0.602,0.79,8,-4.46,1,0.0355,0.026,7.43e-05,0.162,0.274,108.008,259080,4
2014-10-18,47,Dark Horse,Katy Perry Featuring Juicy J,10RQKVSr4rS0coExTmi4dF,False,46,1,55,0.645,0.585,6,-6.122,1,0.0513,0.00314,0,0.165,0.353,131.931,215672,4
2014-10-18,48,i,Kendrick Lamar,10RQKVSr4rS0coExTmi4dF,False,39,39,2,0.755,0.884,10,-5.296,0,0.0638,0.0208,2.97e-06,0.248,0.897,121.927,231933,4
2014-10-18,49,American Kids,Kenny Chesney,10RQKVSr4rS0coExTmi4dF,False,34,23,16,0.733,0.589,7,-7.37,1,0.1,0.0476,5.85e-06,0.0366,0.867,170.097,182960,4
2014-10-18,50,Counting Stars,OneRepublic,10RQKVSr4rS0coExTmi4dF,False,47,2,68,0.664,0.705,1,-4.972,0,0.0382,0.0654,0,0.115,0.477,122.017,257840,4
2014-10-18,51,Shower,Becky G,10RQKVSr4rS0coExTmi4dF,False,48,16,18,0.699,0.529,2,-7.548,1,0.0487,0.0317,3.59e-05,0.285,0.121,119.987,206167,4
2014-10-18,52,I'm Not The Only One,Sam Smith,10RQKVSr4rS0coExTmi4dF,False,63,52,5,0.677,0.485,5,-5.795,1,0.0361,0.529,2.04e-05,0.0766,0.493,82.001,239317,4
2014-10-18,53,Riptide,Vance Joy,10RQKVSr4rS0coExTmi4dF,False,52,52,15,0.484,0.731,1,-6.694,1,0.0379,0.431,0,0.151,0.51,101.654,204280,4
2014-10-18,54,Centuries,Fall Out Boy,10RQKVSr4rS0coExTmi4dF,False,55,22,4,0.393,0.858,4,-2.868,0,0.0729,0.00359,0,0.102,0.56,176.042,228360,4
2014-10-18,55,Ready Set Roll,Chase Rice,10RQKVSr4rS0coExTmi4dF,False,54,54,19,0.513,0.803,0,-4.45,1,0.0777,0.0161,0,0.667,0.746,156.038,190587,4
2014-10-18,56,No Type,Rae Sremmurd,10RQKVSr4rS0coExTmi4dF,False,77,56,2,0.891,0.486,6,-7.803,1,0.159,0.0158,3.78e-06,0.0925,0.239,125.01,200080,4
2014-10-18,57,Stolen Dance,Milky Chance,10RQKVSr4rS0coExTmi4dF,False,56,56,11,0.885,0.581,11,-8.813,1,0.0378,0.427,0.000204,0.0759,0.728,114.016,313684,4
2014-10-18,58,Studio,ScHoolboy Q Featuring BJ The Chicago Kid,10RQKVSr4rS0coExTmi4dF,False,51,38,18,0.709,0.589,8,-7.776,0,0.0433,0.0507,0,0.0585,0.58,133.922,278067,3
2014-10-18,59,About The Money,T.I. Featuring Young Thug,10RQKVSr4rS0coExTmi4dF,False,59,59,9,0.81,0.721,9,-4.964,0,0.265,0.0487,0,0.0886,0.552,101.997,270120,4
2014-10-18,60,Somethin' Bad,Miranda Lambert Duet With Carrie Underwood,10RQKVSr4rS0coExTmi4dF,False,57,19,20,0.68,0.888,9,-5.308,1,0.055,0.0527,2.82e-06,0.0575,0.484,90.076,169587,4
2014-10-18,61,Just Gettin' Started,Jason Aldean,1WtdhlaiUoDTrVNSwaya0L,True,0,61,1,0.507,0.805,9,-4.611,0,0.0867,0.396,1.16e-06,0.106,0.513,167.983,195480,4
2014-10-18,62,Take Me To Church,Hozier,1WtdhlaiUoDTrVNSwaya0L,False,64,62,8,0.566,0.664,4,-5.303,0,0.0464,0.634,0,0.116,0.437,128.945,241693,4
2014-10-18,63,Bartender,Lady Antebellum,1WtdhlaiUoDTrVNSwaya0L,False,60,31,20,0.631,0.937,11,-3.858,0,0.034,0.0198,7.38e-06,0.327,0.654,101.011,198267,4
2014-10-18,64,Hope You Get Lonely Tonight,Cole Swindell,1WtdhlaiUoDTrVNSwaya0L,False,50,50,16,0.45,0.795,10,-4.249,1,0.0355,0.103,0,0.166,0.364,151.884,227987,4
2014-10-18,65,Girl In A Country Song,Maddie & Tae,1WtdhlaiUoDTrVNSwaya0L,False,62,62,9,0.59,0.908,8,-3.789,1,0.084,0.285,0,0.36,0.874,160.028,217840,4
2014-10-18,66,"Touchin, Lovin",Trey Songz Featuring Nicki Minaj,1WtdhlaiUoDTrVNSwaya0L,False,65,65,5,0.813,0.58,11,-6.724,1,0.0746,0.0405,8.45e-06,0.349,0.443,100.045,221972,4
2014-10-18,67,Sunshine & Whiskey,Frankie Ballard,1WtdhlaiUoDTrVNSwaya0L,False,61,61,13,0.67,0.737,9,-6.794,1,0.0434,0.223,0,0.325,0.754,92.983,182400,4
2014-10-18,68,Somewhere In My Car,Keith Urban,1WtdhlaiUoDTrVNSwaya0L,False,66,66,6,0.588,0.861,10,-5.531,1,0.0395,0.00546,1.38e-05,0.0797,0.525,118.008,195973,4
2014-10-18,69,Bumpin' The Night,Florida Georgia Line,5ygp81TQpolYKghQjdYZpD,True,0,69,1,0.456,0.865,1,-4.227,1,0.0316,0.0843,0.000512,0.108,0.363,151.978,221080,4
2014-10-18,70,Hold You Down,"DJ Khaled Featuring Chris Brown, August Alsina, Future & Jeremih",5ygp81TQpolYKghQjdYZpD,False,74,70,5,0.525,0.681,6,-4.158,0,0.0683,0.195,0,0.141,0.437,151.875,293120,3
2014-10-18,71,Booty,Jennifer Lopez Featuring Iggy Azalea Or Pitbull,5ygp81TQpolYKghQjdYZpD,False,45,18,3,0.709,0.949,0,-4.155,1,0.0509,0.00296,0.00022,0.26,0.398,128.966,209700,4
2014-10-18,72,Small Town Throwdown,Brantley Gilbert Featuring Justin Moore & Thomas Rhett,5ygp81TQpolYKghQjdYZpD,False,68,67,17,0.555,0.863,7,-3.867,1,0.0379,0.0246,0,0.0563,0.699,98.006,201680,4
2014-10-18,73,Day Drinking,Little Big Town,5ygp81TQpolYKghQjdYZpD,False,73,73,11,0.591,0.959,9,-2.515,1,0.057,0.103,0,0.779,0.86,163.883,178840,4
2014-10-18,74,Yellow Flicker Beat,Lorde,0Nf53RDPZEjFrQE4B5n6Vf,True,0,74,1,0.585,0.61,1,-8.388,1,0.0353,0.103,0.000314,0.113,0.0597,94.969,232507,4
2014-10-18,75,V. 3005,Childish Gambino,0Nf53RDPZEjFrQE4B5n6Vf,False,67,67,18,0.676,0.446,6,-7.153,0,0.329,0.119,0,0.112,0.655,82.912,234215,4
2014-10-18,76,Secrets,Mary Lambert,0Nf53RDPZEjFrQE4B5n6Vf,False,72,72,5,0.789,0.555,0,-5.9,1,0.041,0.026,0.000135,0.215,0.713,93.229,223405,4
2014-10-18,77,Superheroes,The Script,0Nf53RDPZEjFrQE4B5n6Vf,False,80,77,3,0.491,0.885,3,-4.121,1,0.0395,0.00219,0,0.0741,0.641,166.992,245467,4
2014-10-18,78,I Don't F**k With You,Big Sean Featuring E-40,0Nf53RDPZEjFrQE4B5n6Vf,False,70,70,2,0.815,0.724,1,-5.658,1,0.0712,0.0385,0,0.334,0.366,97.957,284413,4
2014-10-18,79,Tuesday,I LOVE MAKONNEN Featuring Drake,0Nf53RDPZEjFrQE4B5n6Vf,False,90,79,2,0.77,0.664,0,-5.604,1,0.211,0.215,0.000118,0.105,0.472,140.163,321987,4
2014-10-18,80,Hideaway,Kiesza,0Nf53RDPZEjFrQE4B5n6Vf,False,75,51,12,0.838,0.72,7,-4.135,0,0.0483,0.0862,0.00697,0.0772,0.204,122.99,251987,4
2014-10-18,81,Believe Me,Lil Wayne Featuring Drake,0Nf53RDPZEjFrQE4B5n6Vf,False,69,26,19,0.844,0.491,10,-8.807,0,0.17,0.272,0,0.111,0.196,91.935,337640,4
2014-10-18,82,Try,Colbie Caillat,0Nf53RDPZEjFrQE4B5n6Vf,False,87,55,7,0.603,0.376,1,-9.77,1,0.0288,0.807,0,0.108,0.538,139.995,224573,4
2014-10-18,83,Fight Night,Migos,0Nf53RDPZEjFrQE4B5n6Vf,False,82,69,13,0.874,0.706,1,-5.132,1,0.207,0.182,0,0.334,0.895,89.968,216248,4
2014-10-18,84,Bo$$,Fifth Harmony,0Nf53RDPZEjFrQE4B5n6Vf,False,79,43,13,0.813,0.872,9,-5.224,1,0.107,0.00621,0,0.0498,0.736,103.016,171413,4
2014-10-18,85,***Flawless,Beyonce Featuring Nicki Minaj Or Chimamanda Ngozi Adichie,0Nf53RDPZEjFrQE4B5n6Vf,False,81,81,6,0.639,0.659,8,-7.273,1,0.215,0.241,8.33e-06,0.484,0.457,136.801,234413,4
2014-10-18,86,Handsome And Wealthy,Migos,0Nf53RDPZEjFrQE4B5n6Vf,False,92,86,2,0.858,0.665,2,-2.907,1,0.101,0.00348,0,0.094,0.237,146.031,210557,4
2014-10-18,87,No Love,August Alsina,0Nf53RDPZEjFrQE4B5n6Vf,False,88,73,3,0.462,0.615,0,-7.982,0,0.153,0.00543,0,0.856,0.344,130.967,276080,4
2014-10-18,88,Look At You,Big & Rich,0Nf53RDPZEjFrQE4B5n6Vf,False,84,84,5,0.503,0.822,11,-4.941,1,0.0506,0.0681,0,0.145,0.714,164.013,223707,4
2014-10-18,89,Heroes (We Could Be),Alesso Featuring Tove Lo,3zU9rdflI65tK4dkkNSp77,True,0,89,1,0.503,0.748,5,-4.124,1,0.0619,0.0305,0,0.343,0.356,125.896,210013,4
2014-10-18,90,24 Hours,TeeFLii Featuring 2 Chainz,3zU9rdflI65tK4dkkNSp77,False,85,85,6,0.835,0.711,1,-6.682,1,0.0441,0.02,0,0.15,0.396,99.957,215720,4
2014-10-18,91,Later On,The Swon Brothers,3zU9rdflI65tK4dkkNSp77,False,86,86,8,0.411,0.903,2,-2.948,1,0.144,0.0544,0,0.104,0.614,180.078,217160,4
2014-10-18,92,Hookah,Tyga Featuring Young Thug,3zU9rdflI65tK4dkkNSp77,False,91,85,8,0.678,0.484,1,-6.647,0,0.43,0.735,0,0.117,0.219,190.04,202320,4
2014-10-18,93,Really Don't Care,Demi Lovato Featuring Cher Lloyd,3zU9rdflI65tK4dkkNSp77,False,78,26,18,0.705,0.729,7,-3.601,1,0.0847,0.122,0,0.185,0.849,121.019,201600,4
2014-10-18,94,U Guessed It,OG Maco Featuring 2 Chainz,4UUFTQKwwId0n1P9t4ZQhx,True,0,94,1,0.843,0.286,1,-10.575,1,0.352,0.0125,1.69e-06,0.0681,0.265,120.06,146064,4
2014-10-18,95,You And Your Friends,Wiz Khalifa Featuring Snoop Dogg & Ty Dolla $ign,4UUFTQKwwId0n1P9t4ZQhx,False,95,95,3,0.783,0.662,7,-6.124,1,0.0415,0.126,0,0.101,0.523,96.987,186373,4
2014-10-18,96,Close Your Eyes,Parmalee,4UUFTQKwwId0n1P9t4ZQhx,False,98,96,2,0.551,0.863,11,-3.506,1,0.0322,0.0158,0,0.0843,0.817,143.952,214933,4
2014-10-18,97,Shotgun Rider,Tim McGraw,3LbvNFkqDTrE1liGMmZBDL,True,0,97,1,0.468,0.904,7,-4.574,1,0.0494,0.126,3.89e-06,0.165,0.7,167.998,235387,4
2014-10-18,98,Walk Thru,Rich Homie Quan Featuring Problem,3LbvNFkqDTrE1liGMmZBDL,False,89,74,7,0.691,0.492,4,-10.815,0,0.196,0.405,0,0.0955,0.54,92.019,187826,4
2014-10-18,99,Feelin' It,Scotty McCreery,3LbvNFkqDTrE1liGMmZBDL,False,96,96,2,0.586,0.759,7,-5.338,1,0.0457,0.1,0,0.084,0.687,184.031,198227,4
2014-10-18,100,Meanwhile Back At Mama's,Tim McGraw Featuring Faith Hill,3LbvNFkqDTrE1liGMmZBDL,False,83,41,19,0.524,0.679,6,-8.68,1,0.0435,0.583,5.79e-05,0.163,0.676,172.977,228107,4
