date,position,title,artist,spotify_id,is_new,last_pos,peak_pos,weeks,danceability,energy,key,loudness,mode,speechiness,acousticness,instrumentalness,liveness,valence,tempo,duration_ms,time_signature
2005-08-06,1,We Belong Together,Mariah Carey,5ynxx6zC4dgzsMHLYQ04Dc,False,1,1,17,0.837,0.462,0,-7.89,1,0.0601,0.0339,0,0.09,0.762,139.986,201400,4
2005-08-06,2,Pon de Replay,Rihanna,5ynxx6zC4dgzsMHLYQ04Dc,False,2,2,9,0.779,0.64,7,-8.415,1,0.159,0.000155,0.00077,0.101,0.498,99.019,246960,4
2005-08-06,3,Don't Cha,The Pussycat Dolls Featuring Busta Rhymes,5ynxx6zC4dgzsMHLYQ04Dc,False,4,3,14,0.877,0.637,1,-3.493,0,0.101,0.00516,2.5e-06,0.0959,0.569,119.988,272080,4
2005-08-06,4,Lose Control,Missy Elliott Featuring Ciara & Fat Man Scoop,5ynxx6zC4dgzsMHLYQ04Dc,False,6,4,12,0.904,0.813,4,-7.105,0,0.121,0.0311,0.00697,0.0471,0.81,125.461,226864,4
2005-08-06,5,Let Me Hold You,Bow Wow Featuring Omarion,5ynxx6zC4dgzsMHLYQ04Dc,False,8,5,11,0.815,0.662,6,-8.244,1,0.199,0.0915,0.000409,0.0898,0.611,151.518,248493,4
2005-08-06,6,Hollaback Girl,Gwen Stefani,5ynxx6zC4dgzsMHLYQ04Dc,False,3,1,19,0.926,0.916,10,-2.221,0,0.0929,0.35,6.17e-06,0.0234,0.904,110.007,199853,4
2005-08-06,7,Behind These Hazel Eyes,Kelly Clarkson,5ynxx6zC4dgzsMHLYQ04Dc,False,7,6,16,0.548,0.889,9,-4.682,1,0.0382,0.00165,0.00109,0.197,0.425,90.048,198973,4
2005-08-06,8,Don't Phunk With My Heart,The Black Eyed Peas,5ynxx6zC4dgzsMHLYQ04Dc,False,5,3,16,0.241,0.799,7,-3.897,1,0.169,0.527,0.915,0.13,0.267,181.969,199599,5
2005-08-06,9,Pimpin' All Over The World,Ludacris Featuring Bobby Valentino,5ynxx6zC4dgzsMHLYQ04Dc,False,12,9,9,0.495,0.883,11,-4.087,1,0.299,0.287,0,0.138,0.782,92.136,329627,4
2005-08-06,10,Get It Poppin',Fat Joe Featuring Nelly,5ynxx6zC4dgzsMHLYQ04Dc,False,9,9,10,0.905,0.55,1,-7.558,1,0.372,0.0628,0,0.0644,0.52,100.813,211320,4
2005-08-06,11,Grind With Me,Pretty Ricky,5ynxx6zC4dgzsMHLYQ04Dc,False,11,7,17,0.7,0.538,1,-5.952,1,0.045,0.000204,0,0.105,0.189,136.518,237733,4
2005-08-06,12,Listen To Your Heart,D.H.T.,5ynxx6zC4dgzsMHLYQ04Dc,False,14,12,10,0.395,0.595,1,-5.93,0,0.0305,0.223,0,0.0881,0.331,172.037,314893,4
2005-08-06,13,You And Me,Lifehouse,5ynxx6zC4dgzsMHLYQ04Dc,False,13,13,25,0.459,0.427,7,-7.734,1,0.0267,0.114,0,0.168,0.354,139.902,195493,3
2005-08-06,14,Just A Lil Bit,50 Cent,5ynxx6zC4dgzsMHLYQ04Dc,False,10,3,20,0.489,0.692,1,-6.672,1,0.41,0.0322,0.00608,0.315,0.527,96.946,237707,4
2005-08-06,15,Scars,Papa Roach,5ynxx6zC4dgzsMHLYQ04Dc,False,18,15,26,0.384,0.921,11,-3.334,1,0.055,0.0948,0,0.168,0.471,89.922,208186,4
2005-08-06,16,Feel Good Inc,Gorillaz,5ynxx6zC4dgzsMHLYQ04Dc,False,25,16,11,0.818,0.705,6,-6.679,1,0.177,0.00836,0.00233,0.613,0.772,138.559,222640,4
2005-08-06,17,Oh,Ciara Featuring Ludacris,5ynxx6zC4dgzsMHLYQ04Dc,False,15,2,20,0.8,0.496,7,-7.135,1,0.0506,0.000298,0,0.0697,0.357,128.29,256347,4
2005-08-06,18,Switch,Will Smith,5ynxx6zC4dgzsMHLYQ04Dc,False,16,7,23,0.877,0.885,1,-4.966,1,0.17,0.007,0.000497,0.557,0.517,102.507,196653,4
2005-08-06,19,Cater 2 U,Destiny's Child,5ynxx6zC4dgzsMHLYQ04Dc,False,22,19,15,0.605,0.584,11,-7.043,0,0.197,0.286,0,0.235,0.464,125.802,245400,4
2005-08-06,20,Best Of You,Foo Fighters,5ynxx6zC4dgzsMHLYQ04Dc,False,19,18,13,0.366,0.94,1,-5.119,0,0.0696,0.000769,9.42e-05,0.188,0.369,130.198,255627,4
2005-08-06,21,Beverly Hills,Weezer,5ynxx6zC4dgzsMHLYQ04Dc,False,23,13,17,0.693,0.823,5,-3.761,1,0.0726,0.0932,0,0.328,0.741,87.904,196093,4
2005-08-06,22,Back Then,Mike Jones,5ynxx6zC4dgzsMHLYQ04Dc,False,28,22,10,0.776,0.736,9,-6.308,1,0.255,0.0101,0,0.18,0.536,159.838,244187,4
2005-08-06,23,Speed Of Sound,Coldplay,5ynxx6zC4dgzsMHLYQ04Dc,False,21,8,14,0.514,0.898,11,-6.765,0,0.0577,0.00488,0.0345,0.0746,0.353,123.067,287907,4
2005-08-06,24,These Boots Are Made For Walkin',Jessica Simpson,5ynxx6zC4dgzsMHLYQ04Dc,False,20,14,4,0.779,0.818,11,-7.7,1,0.143,0.0101,0.000381,0.0993,0.75,91.997,238773,4
2005-08-06,25,Holiday,Green Day,5ynxx6zC4dgzsMHLYQ04Dc,False,27,19,18,0.29,0.827,8,-3.451,1,0.0362,0.000659,2.55e-06,0.301,0.45,167.086,493400,4
2005-08-06,26,Inside Your Heaven,Carrie Underwood,5ynxx6zC4dgzsMHLYQ04Dc,False,17,1,6,0.38,0.596,7,-3.469,1,0.0315,0.123,1.46e-06,0.132,0.16,134.443,243267,4
2005-08-06,27,Lonely No More,Rob Thomas,5ynxx6zC4dgzsMHLYQ04Dc,False,24,6,25,0.551,0.896,9,-3.152,0,0.109,0.033,0,0.0899,0.858,171.79,226640,4
2005-08-06,28,As Good As I Once Was,Toby Keith,5ynxx6zC4dgzsMHLYQ04Dc,False,30,28,10,0.68,0.87,5,-4.461,1,0.0393,0.266,0,0.109,0.646,119.075,227840,4
2005-08-06,29,Give Me That,Webbie Featuring Bun B,5ynxx6zC4dgzsMHLYQ04Dc,False,33,29,14,0.62,0.782,8,-6.034,1,0.363,0.00687,0,0.319,0.54,156.109,267520,4
2005-08-06,30,These Words,Natasha Bedingfield,5ynxx6zC4dgzsMHLYQ04Dc,False,48,30,6,0.734,0.635,5,-7.03,1,0.0816,0.0322,0,0.0808,0.931,96.99,216360,4
2005-08-06,31,"Sugar, We're Goin' Down",Fall Out Boy,5ynxx6zC4dgzsMHLYQ04Dc,False,55,31,6,0.494,0.842,7,-4.784,1,0.0843,0.00579,0,0.122,0.574,162.011,229093,4
2005-08-06,32,Since U Been Gone,Kelly Clarkson,5ynxx6zC4dgzsMHLYQ04Dc,False,29,2,34,0.662,0.741,0,-5.406,1,0.0334,0.00165,0.0303,0.114,0.404,131.0,188960,4
2005-08-06,33,Mr. Brightside,The Killers,5ynxx6zC4dgzsMHLYQ04Dc,False,32,10,26,0.356,0.924,1,-3.74,1,0.0808,0.00101,0,0.0953,0.232,148.017,222587,4
2005-08-06,34,Let Me Go,3 Doors Down,5ynxx6zC4dgzsMHLYQ04Dc,False,31,14,27,0.48,0.863,1,-4.914,0,0.0385,0.0181,0,0.111,0.491,91.972,243053,4
2005-08-06,35,Cool,Gwen Stefani,5ynxx6zC4dgzsMHLYQ04Dc,False,50,35,4,0.709,0.721,2,-3.52,1,0.0281,0.0322,0.000309,0.355,0.801,112.019,189333,4
2005-08-06,36,Summer Nights,Lil Rob,5ynxx6zC4dgzsMHLYQ04Dc,False,46,36,7,0.472,0.672,10,-4.997,0,0.212,0.358,0,0.108,0.392,81.813,269160,4
2005-08-06,37,Mississippi Girl,Faith Hill,5ynxx6zC4dgzsMHLYQ04Dc,False,43,37,9,0.499,0.765,9,-4.148,1,0.0521,0.113,0,0.0509,0.665,83.916,232707,4
2005-08-06,38,Baby I'm Back,Baby Bash Featuring Akon,5ynxx6zC4dgzsMHLYQ04Dc,False,38,19,24,0.901,0.392,9,-4.414,0,0.105,0.0525,0,0.102,0.761,100.014,219187,4
2005-08-06,39,How To Deal,Frankie J,5ynxx6zC4dgzsMHLYQ04Dc,False,39,39,11,0.749,0.495,2,-8.456,1,0.0332,0.0584,0,0.201,0.645,126.12,230507,4
2005-08-06,40,Collide,Howie Day,5ynxx6zC4dgzsMHLYQ04Dc,False,34,20,26,0.636,0.625,11,-7.895,1,0.0277,0.222,5.35e-05,0.119,0.342,93.931,249120,4
2005-08-06,41,Something More,Sugarland,5ynxx6zC4dgzsMHLYQ04Dc,False,44,41,12,0.613,0.857,4,-4.46,1,0.0545,0.29,0,0.113,0.349,102.261,216733,4
2005-08-06,42,Chariot,Gavin DeGraw,5ynxx6zC4dgzsMHLYQ04Dc,False,35,30,17,0.281,0.779,7,-5.104,1,0.0514,0.0437,0,0.37,0.344,167.172,239173,4
2005-08-06,43,Diamonds From Sierra Leone,Kanye West,5ynxx6zC4dgzsMHLYQ04Dc,False,69,43,12,0.672,0.814,7,-3.768,1,0.27,0.258,0,0.164,0.379,97.043,233400,4
2005-08-06,44,Dreams,The Game,5ynxx6zC4dgzsMHLYQ04Dc,False,36,32,10,0.63,0.78,6,-5.353,1,0.221,0.00499,0,0.206,0.281,155.779,286453,4
2005-08-06,45,Make Her Feel Good,Teairra Mari,5ynxx6zC4dgzsMHLYQ04Dc,False,49,45,10,0.808,0.665,2,-9.376,1,0.178,0.0228,0.000481,0.192,0.549,90.518,226013,4
2005-08-06,46,Fast Cars And Freedom,Rascal Flatts,5ynxx6zC4dgzsMHLYQ04Dc,False,42,38,14,0.616,0.824,3,-4.842,0,0.03,0.0135,2.13e-05,0.108,0.623,117.954,262187,4
2005-08-06,47,Incomplete,Backstreet Boys,5ynxx6zC4dgzsMHLYQ04Dc,False,40,13,16,0.437,0.589,4,-4.834,1,0.0331,0.231,0,0.0768,0.165,133.631,239587,4
2005-08-06,48,So Seductive,Tony Yayo Featuring 50 Cent,5ynxx6zC4dgzsMHLYQ04Dc,False,52,48,7,0.586,0.881,8,-3.208,1,0.232,0.2,0,0.0676,0.647,96.651,210293,4
2005-08-06,49,Free Yourself,Fantasia,5ynxx6zC4dgzsMHLYQ04Dc,False,41,41,15,0.717,0.449,5,-9.688,0,0.0596,0.681,0,0.0902,0.611,108.802,257427,4
2005-08-06,50,Shake It Off,Mariah Carey,5ynxx6zC4dgzsMHLYQ04Dc,False,66,50,2,0.777,0.493,2,-6.516,1,0.126,0.181,0,0.108,0.82,134.086,232840,4
2005-08-06,51,La Tortura,Shakira Feat. Alejandro Sanz,5ynxx6zC4dgzsMHLYQ04Dc,False,51,51,14,0.74,0.783,0,-5.367,1,0.0427,0.0297,0.000308,0.123,0.812,100.011,212893,4
2005-08-06,52,Must Be Nice,Lyfe Jennings,5ynxx6zC4dgzsMHLYQ04Dc,False,53,52,9,0.446,0.401,1,-11.232,1,0.382,0.657,0,0.127,0.647,82.942,233440,4
2005-08-06,53,Inside Your Heaven,Bo Bice,5ynxx6zC4dgzsMHLYQ04Dc,False,26,2,5,0.513,0.606,1,-5.866,1,0.0274,0.347,1.33e-06,0.0879,0.201,134.955,252760,4
2005-08-06,54,Breathe (2 AM),Anna Nalick,5ynxx6zC4dgzsMHLYQ04Dc,False,57,54,15,0.386,0.452,2,-7.715,1,0.0278,0.417,0,0.0881,0.287,169.837,279827,3
2005-08-06,55,Play,David Banner,5ynxx6zC4dgzsMHLYQ04Dc,False,68,55,3,0.837,0.658,1,-8.013,0,0.126,0.000213,0.122,0.243,0.586,95.027,230133,4
2005-08-06,56,Untitled (How Can This Happen To Me?),Simple Plan,5ynxx6zC4dgzsMHLYQ04Dc,False,56,49,12,0.208,0.342,6,-8.702,1,0.0327,0.875,3e-06,0.0908,0.135,186.162,239813,4
2005-08-06,57,Badd,Ying Yang Twins Featuring Mike Jones & Mr. ColliPark,5ynxx6zC4dgzsMHLYQ04Dc,False,59,57,4,0.585,0.697,1,-6.126,0,0.357,0.0339,0,0.255,0.402,133.177,225187,5
2005-08-06,58,Making Memories Of Us,Keith Urban,5ynxx6zC4dgzsMHLYQ04Dc,False,54,34,16,0.687,0.454,4,-9.379,1,0.0255,0.614,0.000107,0.107,0.331,103.93,236000,4
2005-08-06,59,Don't Worry 'Bout A Thing,SHeDAISY,5ynxx6zC4dgzsMHLYQ04Dc,False,61,59,6,0.695,0.847,9,-2.118,1,0.061,0.105,0,0.102,0.68,98.003,215027,4
2005-08-06,60,Gotta Getcha,Jermaine Dupri,5ynxx6zC4dgzsMHLYQ04Dc,False,75,60,4,0.762,0.324,4,-7.447,0,0.329,0.0663,2.33e-06,0.095,0.482,209.819,170933,4
2005-08-06,61,Dem Boyz,Boyz N Da Hood,5ynxx6zC4dgzsMHLYQ04Dc,False,58,56,7,0.782,0.63,1,-5.683,1,0.162,0.00161,0,0.151,0.295,78.516,256800,4
2005-08-06,62,A Real Fine Place To Start,Sara Evans,5ynxx6zC4dgzsMHLYQ04Dc,False,63,62,5,0.585,0.789,8,-2.834,1,0.041,0.00143,0.00087,0.141,0.208,120.953,238733,4
2005-08-06,63,Like You,Bow Wow Featuring Ciara,3jEqrIfwKO0M8ALu3TGilF,True,0,63,1,0.714,0.6,6,-8.365,1,0.0876,0.0465,0,0.0646,0.504,82.017,205840,4
2005-08-06,64,Outta Control (Remix),50 Cent Feat. Mobb Deep,3jEqrIfwKO0M8ALu3TGilF,False,67,64,3,0.77,0.587,8,-5.99,0,0.265,0.0268,0,0.0621,0.574,92.009,247973,4
2005-08-06,65,Trapped In The Closet,R. Kelly,3jEqrIfwKO0M8ALu3TGilF,False,47,22,14,0.551,0.583,4,-6.473,1,0.159,0.539,0,0.365,0.419,107.424,992160,4
2005-08-06,66,B.Y.O.B.,System Of A Down,3jEqrIfwKO0M8ALu3TGilF,False,62,27,17,0.556,0.981,1,-2.688,0,0.128,0.00662,0,0.218,0.716,101.423,255467,4
2005-08-06,67,This Is How A Heart Breaks,Rob Thomas,3jEqrIfwKO0M8ALu3TGilF,False,70,67,4,0.605,0.913,0,-4.345,1,0.0376,0.00159,0,0.0813,0.665,139.941,230960,4
2005-08-06,68,Just The Girl,The Click Five,3jEqrIfwKO0M8ALu3TGilF,False,83,68,2,0.571,0.89,9,-1.6,1,0.0395,0.00509,0,0.0769,0.751,110.958,234147,4
2005-08-06,69,You'll Be There,George Strait,3jEqrIfwKO0M8ALu3TGilF,False,60,54,16,0.583,0.481,4,-8.822,1,0.0276,0.264,0,0.119,0.172,98.909,257493,4
2005-08-06,70,Play Something Country,Brooks & Dunn,3jEqrIfwKO0M8ALu3TGilF,False,71,70,6,0.685,0.909,0,-3.797,1,0.032,0.0782,1.25e-06,0.369,0.864,115.043,195587,4
2005-08-06,71,And Then What,Young Jeezy Featuring Mannie Fresh,3jEqrIfwKO0M8ALu3TGilF,False,76,71,3,0.753,0.728,0,-5.439,1,0.228,0.00773,0,0.0653,0.751,170.021,245480,4
2005-08-06,72,Tell Me,Bobby Valentino,3jEqrIfwKO0M8ALu3TGilF,False,72,72,4,0.652,0.798,4,-5.303,0,0.0512,0.44,0.00233,0.298,0.531,95.038,260067,4
2005-08-06,73,Pickin' Wildflowers,Keith Anderson,3jEqrIfwKO0M8ALu3TGilF,False,64,64,10,0.561,0.716,8,-3.341,1,0.0291,0.0353,0,0.122,0.667,152.089,185920,4
2005-08-06,74,Helena (So Long & Goodnight),My Chemical Romance,3jEqrIfwKO0M8ALu3TGilF,False,80,74,5,0.356,0.96,4,-3.487,1,0.104,0.0142,0,0.209,0.0857,125.921,204733,4
2005-08-06,75,Gold Digger,Kanye West Featuring Jamie Foxx,3jEqrIfwKO0M8ALu3TGilF,False,92,75,2,0.629,0.696,1,-5.572,0,0.348,0.0195,0,0.0554,0.623,93.034,207627,4
2005-08-06,76,Do You Want Fries With That,Tim McGraw,3jEqrIfwKO0M8ALu3TGilF,False,81,76,4,0.604,0.802,7,-3.995,1,0.0317,0.214,0,0.111,0.671,135.999,239760,4
2005-08-06,77,Playa's Only,R. Kelly Featuring The Game,3jEqrIfwKO0M8ALu3TGilF,False,65,65,5,0.818,0.735,1,-5.95,1,0.076,0.116,0,0.285,0.502,98.386,232027,4
2005-08-06,78,Alcohol,Brad Paisley,3jEqrIfwKO0M8ALu3TGilF,False,74,74,6,0.552,0.754,11,-5.888,1,0.0302,0.373,3.02e-05,0.208,0.595,141.671,290933,3
2005-08-06,79,The Hand That Feeds,Nine Inch Nails,3jEqrIfwKO0M8ALu3TGilF,False,77,31,18,0.587,0.99,0,-4.496,1,0.0783,0.0172,0.000668,0.104,0.486,127.992,211680,4
2005-08-06,80,Right Here,Staind,3jEqrIfwKO0M8ALu3TGilF,False,85,77,7,0.492,0.646,10,-5.334,0,0.0303,0.00136,2.21e-05,0.121,0.214,112.228,253933,4
2005-08-06,81,Help Somebody,Van Zant,3jEqrIfwKO0M8ALu3TGilF,False,87,81,4,0.499,0.659,7,-5.727,1,0.0323,0.00117,7.35e-06,0.128,0.411,158.112,253453,4
2005-08-06,82,Be My Escape,Relient K,3jEqrIfwKO0M8ALu3TGilF,False,88,82,2,0.554,0.864,9,-5.062,1,0.0394,0.00605,0,0.132,0.299,112.523,240453,4
2005-08-06,83,Go!,Common,3jEqrIfwKO0M8ALu3TGilF,False,86,79,5,0.838,0.763,10,-11.132,0,0.227,0.0915,1.37e-05,0.123,0.544,104.958,224160,4
2005-08-06,84,I Can't Stop Loving You,Kem,3jEqrIfwKO0M8ALu3TGilF,False,89,84,11,0.704,0.296,3,-9.76,0,0.0445,0.723,3.07e-06,0.124,0.123,141.203,323920,4
2005-08-06,85,Goodbye Time,Blake Shelton,3jEqrIfwKO0M8ALu3TGilF,False,78,73,9,0.51,0.348,2,-7.849,1,0.0261,0.295,2.47e-05,0.242,0.159,77.041,201733,4
2005-08-06,86,Energy,Natalie Featuring Baby Bash,3jEqrIfwKO0M8ALu3TGilF,False,73,66,8,0.549,0.729,1,-5.062,0,0.0382,0.505,0,0.104,0.548,166.082,208773,4
2005-08-06,87,Dirty Little Secret,The All-American Rejects,5lDriBxJd22IhOH9zTcFrV,True,0,87,1,0.465,0.954,10,-4.251,1,0.044,0.000346,5.38e-06,0.573,0.458,143.85,193653,4
2005-08-06,88,Your Body,Pretty Ricky,5y4TDQdYzlT4eoQIPOgNDz,True,0,88,1,0.838,0.594,4,-5.695,0,0.113,0.176,0,0.0867,0.507,90.038,240040,4
2005-08-06,89,Keg In The Closet,Kenny Chesney,5y4TDQdYzlT4eoQIPOgNDz,False,79,64,10,0.654,0.901,1,-6.401,1,0.0477,0.00446,4.68e-06,0.057,0.73,138.879,212427,4
2005-08-06,90,Somebody's Hero,Jamie O'Neal,5y4TDQdYzlT4eoQIPOgNDz,False,99,90,2,0.493,0.735,1,-6.012,1,0.0432,0.0771,0,0.107,0.626,164.059,221425,4
2005-08-06,91,I'm A King,P$C Featuring T.I. & Lil Scrappy,5h21AlYy4mgHfQp9jUAUGi,True,0,91,1,0.73,0.483,0,-8.959,1,0.327,0.0428,0,0.103,0.535,168.049,212800,4
2005-08-06,92,Charlie Last Name: Wilson,Charlie Wilson,6UZqMYYQQThvV55IQPvscO,True,0,92,1,0.653,0.529,7,-6.481,1,0.201,0.439,0,0.194,0.609,67.03,215867,4
2005-08-06,93,Welcome To Jamrock,"Damian ""Jr. Gong"" Marley",6UZqMYYQQThvV55IQPvscO,False,96,93,2,0.836,0.661,7,-6.502,0,0.338,0.0208,0,0.449,0.753,76.71,213200,4
2005-08-06,94,Lot Of Leavin' Left To Do,Dierks Bentley,6UZqMYYQQThvV55IQPvscO,False,91,47,19,0.578,0.878,11,-3.434,1,0.0287,0.00112,0.0146,0.6,0.693,118.029,272627,4
2005-08-06,95,ASAP,T.I.,6UZqMYYQQThvV55IQPvscO,False,82,75,8,0.79,0.645,9,-5.426,1,0.317,0.335,0,0.405,0.583,158.13,284413,4
2005-08-06,96,Something To Be Proud Of,Montgomery Gentry,4D8uIY6Wzj7dJDaw0dW0UF,True,0,96,1,0.645,0.693,0,-6.481,1,0.0344,0.0811,1.22e-05,0.175,0.553,97.555,256600,4
2005-08-06,97,Georgia Rain,Trisha Yearwood,6qdKKHh8r7N8nRYih2g7Pm,True,0,97,1,0.518,0.438,10,-5.716,1,0.0234,0.605,7.77e-05,0.19,0.144,99.176,311360,4
2005-08-06,98,Wake Me Up When September Ends,Green Day,3ZffCQKLFLUvYM59XKLbVm,True,0,98,1,0.546,0.814,7,-5.146,1,0.0314,0.023,0,0.0972,0.146,104.98,285653,4
2005-08-06,99,Remedy,Seether,3ZffCQKLFLUvYM59XKLbVm,False,100,99,2,0.55,0.952,8,-4.664,1,0.0924,0.000193,0.000666,0.0614,0.391,127.804,207213,4
2005-08-06,100,Redneck Yacht Club,Craig Morgan,4etE2X6t7GmyiuYLIdI8H5,True,0,100,1,0.49,0.817,8,-5.405,1,0.0355,0.455,0,0.0885,0.808,168.115,230373,4
