date,position,title,artist,spotify_id,is_new,last_pos,peak_pos,weeks,danceability,energy,key,loudness,mode,speechiness,acousticness,instrumentalness,liveness,valence,tempo,duration_ms,time_signature
2008-12-13,1,Single Ladies (Put A Ring On It),Beyonce,4dJ5dViPmuNPxOnxbwY1dr,False,2,1,7,0.426,0.584,1,-5.293,1,0.296,0.0383,0,0.188,0.272,193.437,193213,4
2008-12-13,2,Live Your Life,T.I. Featuring Rihanna,4dJ5dViPmuNPxOnxbwY1dr,False,1,1,10,0.375,0.862,11,-3.363,0,0.255,0.071,0,0.211,0.478,159.841,338853,4
2008-12-13,3,If I Were A Boy,Beyonce,4dJ5dViPmuNPxOnxbwY1dr,False,3,3,8,0.632,0.518,6,-6.126,1,0.0313,0.107,0,0.354,0.427,90.007,249147,4
2008-12-13,4,Whatever You Like,T.I.,4dJ5dViPmuNPxOnxbwY1dr,False,4,1,17,0.68,0.687,9,-6.162,0,0.0709,0.0161,0,0.261,0.467,150.053,249533,4
2008-12-13,5,Just Dance,Lady Gaga Featuring Colby O'Donis,4dJ5dViPmuNPxOnxbwY1dr,False,7,5,17,0.813,0.74,1,-4.668,0,0.0327,0.0318,1.43e-05,0.166,0.699,118.976,244055,4
2008-12-13,6,Hot N Cold,Katy Perry,4dJ5dViPmuNPxOnxbwY1dr,False,5,3,18,0.706,0.841,7,-3.956,1,0.0418,7.95e-05,0,0.0688,0.861,132.032,220227,4
2008-12-13,7,Miss Independent,Ne-Yo,4dJ5dViPmuNPxOnxbwY1dr,False,9,7,15,0.673,0.683,1,-5.693,1,0.115,0.522,0,0.235,0.713,171.86,232000,4
2008-12-13,8,So What,P!nk,4dJ5dViPmuNPxOnxbwY1dr,False,8,1,15,0.534,0.87,11,-3.078,0,0.0425,0.000329,0,0.241,0.462,126.019,215160,4
2008-12-13,9,Womanizer,Britney Spears,4dJ5dViPmuNPxOnxbwY1dr,False,12,1,9,0.724,0.695,11,-5.226,1,0.0622,0.073,0,0.0889,0.235,139.0,224400,4
2008-12-13,10,I'm Yours,Jason Mraz,4dJ5dViPmuNPxOnxbwY1dr,False,13,6,33,0.686,0.457,11,-8.322,1,0.0468,0.595,0,0.105,0.718,150.953,242187,4
2008-12-13,11,Right Now (Na Na Na),Akon,4dJ5dViPmuNPxOnxbwY1dr,False,10,8,10,0.826,0.853,8,-4.219,0,0.172,0.289,0,0.35,0.567,137.996,244680,4
2008-12-13,12,Love Story,Taylor Swift,4dJ5dViPmuNPxOnxbwY1dr,False,14,5,12,0.626,0.79,2,-4.302,1,0.0311,0.135,3.97e-06,0.0989,0.416,119.082,235767,4
2008-12-13,13,Love Lockdown,Kanye West,4dJ5dViPmuNPxOnxbwY1dr,False,6,3,11,0.76,0.524,1,-7.67,0,0.0323,0.0542,0.5,0.112,0.112,119.603,270307,4
2008-12-13,14,Let It Rock,Kevin Rudolf Featuring Lil Wayne,4dJ5dViPmuNPxOnxbwY1dr,False,11,5,14,0.607,0.783,7,-4.41,1,0.0397,0.000683,0,0.0678,0.434,113.172,231173,4
2008-12-13,15,You Found Me,The Fray,4dJ5dViPmuNPxOnxbwY1dr,False,28,15,2,0.338,0.803,8,-5.412,0,0.0413,0.0187,0,0.136,0.4,151.994,241853,4
2008-12-13,16,Gotta Be Somebody,Nickelback,4dJ5dViPmuNPxOnxbwY1dr,False,19,10,9,0.536,0.89,0,-5.222,1,0.0601,0.000354,0.00165,0.133,0.205,115.998,252653,4
2008-12-13,17,Mrs. Officer,Lil Wayne Featuring Bobby Valentino & Kidd Kidd,4dJ5dViPmuNPxOnxbwY1dr,False,16,16,15,0.92,0.553,6,-5.068,1,0.191,0.236,0,0.0767,0.947,112.022,286907,5
2008-12-13,18,Disturbia,Rihanna,4dJ5dViPmuNPxOnxbwY1dr,False,17,1,24,0.707,0.813,11,-4.515,0,0.0571,0.0863,0,0.168,0.722,124.921,238627,4
2008-12-13,19,Heartless,Kanye West,4dJ5dViPmuNPxOnxbwY1dr,False,21,4,4,0.79,0.647,10,-5.983,0,0.136,0.0515,0,0.248,0.654,87.999,211000,4
2008-12-13,20,Can't Believe It,T-Pain Featuring Lil Wayne,4dJ5dViPmuNPxOnxbwY1dr,False,15,7,18,0.648,0.516,10,-8.869,0,0.049,0.00179,0,0.0772,0.0756,89.828,273827,4
2008-12-13,21,See You In My Nightmares,Kanye West Featuring Lil Wayne,5zuoz1NBnpoHK6g5sbEH8F,True,0,21,1,0.676,0.432,7,-8.035,0,0.0339,0.0626,0,0.103,0.156,124.597,258120,4
2008-12-13,22,Better In Time,Leona Lewis,5zuoz1NBnpoHK6g5sbEH8F,False,18,11,21,0.584,0.7,6,-4.251,1,0.0506,0.512,2.43e-05,0.13,0.549,163.953,234173,4
2008-12-13,23,Chicken Fried,Zac Brown Band,5zuoz1NBnpoHK6g5sbEH8F,False,20,20,11,0.566,0.713,6,-4.25,1,0.0417,0.645,0,0.114,0.807,169.864,238147,4
2008-12-13,24,Addicted,Saving Abel,5zuoz1NBnpoHK6g5sbEH8F,False,22,20,25,0.512,0.864,7,-4.146,1,0.0338,0.000821,0,0.0982,0.527,138.018,222827,4
2008-12-13,26,Green Light,John Legend Featuring Andre 3000,,False,24,24,13,0.622,0.882,9,-5.59,0,0.119,0.0912,0,0.216,0.762,77.506,284187,4
2008-12-13,27,Crush,David Archuleta,,False,23,2,16,0.57,0.664,0,-4.718,0,0.0322,0.00836,1.2e-05,0.0719,0.487,162.084,213520,4
2008-12-13,28,Rehab,Rihanna,,False,34,28,4,0.583,0.792,1,-5.894,1,0.0533,0.00321,4.92e-05,0.315,0.397,80.055,294720,4
2008-12-13,29,Viva La Vida,Coldplay,,False,27,1,30,0.486,0.617,5,-7.115,0,0.0287,0.0954,3.23e-06,0.109,0.417,138.015,242373,4
2008-12-13,30,Chopped 'N' Skrewed,T-Pain Featuring Ludacris,,False,30,30,7,0.558,0.604,7,-7.892,0,0.0529,0.0181,0,0.503,0.323,120.159,261227,4
2008-12-13,31,Closer,Ne-Yo,,False,29,7,33,0.711,0.753,4,-6.461,0,0.0766,0.028,2.96e-05,0.152,0.588,126.051,234360,4
2008-12-13,32,Pop Champagne,Jim Jones & Ron Browz Featuring Juelz Santana,,False,33,32,7,0.61,0.431,0,-6.73,1,0.294,0.03,0,0.099,0.463,136.878,215973,3
2008-12-13,33,Spotlight,Jennifer Hudson,,False,25,24,19,0.707,0.724,11,-3.887,0,0.051,0.0448,0,0.072,0.659,108.984,250107,4
2008-12-13,34,Decode,Paramore,,False,45,34,4,0.277,0.949,10,-4.072,0,0.0919,0.00155,0.000112,0.765,0.232,164.102,264205,4
2008-12-13,35,Bust Your Windows,Jazmine Sullivan,,False,31,31,8,0.683,0.664,5,-4.233,0,0.0332,0.538,0,0.0671,0.866,106.991,266307,4
2008-12-13,36,Shattered (Turn The Car Around),O.A.R.,,False,37,36,17,0.571,0.784,11,-6.396,1,0.0352,0.0175,0,0.19,0.462,105.973,255493,4
2008-12-13,37,Swagga Like Us,Jay-Z & T.I. Featuring Kanye West & Lil Wayne,,False,32,5,12,0.579,0.809,4,-5.031,1,0.206,0.00154,0,0.564,0.258,88.99,329680,4
2008-12-13,38,Keeps Gettin' Better,Christina Aguilera,,False,26,7,9,0.645,0.697,5,-4.733,0,0.0285,0.0739,0.000842,0.575,0.25,130.001,181947,4
2008-12-13,39,Forever,Chris Brown,,False,40,2,32,0.672,0.82,11,-4.456,1,0.0459,0.0368,0.000188,0.184,0.438,120.005,278573,4
2008-12-13,40,Fall For You,Secondhand Serenade,,False,35,21,25,0.387,0.442,0,-7.086,1,0.0352,0.19,0,0.0788,0.382,169.481,185600,4
2008-12-13,41,T-Shirt,Shontelle,,False,43,36,13,0.679,0.657,6,-6.222,1,0.0423,0.0219,0,0.295,0.363,86.984,234760,4
2008-12-13,42,Roll With Me,Montgomery Gentry,,False,41,41,12,0.552,0.648,2,-6.71,1,0.0273,0.0533,0.00015,0.144,0.407,142.159,233933,4
2008-12-13,43,Love Remains The Same,Gavin Rossdale,,False,42,27,26,0.406,0.632,4,-5.115,1,0.0344,0.236,0,0.18,0.109,149.258,249440,4
2008-12-13,44,Just A Dream,Carrie Underwood,,False,36,29,17,0.526,0.781,7,-3.673,1,0.0369,0.0613,0,0.121,0.358,142.06,284707,4
2008-12-13,45,Paper Planes,M.I.A.,,False,39,4,20,0.447,0.848,2,-6.175,1,0.222,0.033,7.46e-05,0.65,0.485,172.253,205200,4
2008-12-13,46,Already Gone,Sugarland,,False,48,46,10,0.48,0.596,1,-5.844,1,0.03,0.214,1.06e-05,0.151,0.332,154.769,275867,3
2008-12-13,47,White Horse,Taylor Swift,,False,56,13,3,0.578,0.34,0,-8.027,1,0.0264,0.305,0,0.104,0.223,92.702,234427,4
2008-12-13,48,Got Money,Lil Wayne Featuring T-Pain,,False,49,10,27,0.694,0.661,7,-4.847,1,0.118,0.00188,0,0.676,0.702,82.48,244627,4
2008-12-13,49,Human,The Killers,,False,63,32,9,0.557,0.8,10,-8.477,1,0.0601,0.00132,0.0012,0.0906,0.582,135.47,245373,4
2008-12-13,50,Gives You Hell,The All-American Rejects,,False,53,50,3,0.718,0.691,4,-6.44,1,0.0387,0.0159,0,0.0627,0.552,100.008,213107,4
2008-12-13,51,Let It Go,Tim McGraw,,False,47,47,12,0.477,0.86,1,-4.16,1,0.032,0.322,0,0.313,0.473,159.27,225027,4
2008-12-13,52,My Life,The Game Featuring Lil Wayne,,False,46,21,17,0.673,0.766,11,-5.018,1,0.349,0.0724,0,0.0563,0.382,148.113,320893,4
2008-12-13,53,Sober,P!nk,733ncRLzZQT5UtSPg1QmPc,True,0,53,1,0.612,0.797,6,-4.896,1,0.0315,0.0626,0,0.187,0.373,90.95,251533,4
2008-12-13,54,Right Here (Departed),Brandy,733ncRLzZQT5UtSPg1QmPc,False,54,52,12,0.568,0.682,8,-5.781,1,0.0439,0.256,0,0.231,0.366,92.99,217947,4
2008-12-13,55,Krazy,Pitbull Featuring Lil Jon,733ncRLzZQT5UtSPg1QmPc,False,50,30,10,0.871,0.883,11,-5.075,0,0.105,0.0155,0,0.14,0.581,125.037,231507,4
2008-12-13,56,Swing,Savage Featuring Soulja Boy Tell'em,733ncRLzZQT5UtSPg1QmPc,False,51,45,18,0.885,0.474,1,-8.133,0,0.25,0.0209,0,0.0895,0.794,150.072,217893,4
2008-12-13,57,Here,Rascal Flatts,733ncRLzZQT5UtSPg1QmPc,False,55,55,9,0.458,0.585,2,-5.574,1,0.0342,0.324,0,0.231,0.196,145.977,245373,4
2008-12-13,58,Trading Places,Usher,733ncRLzZQT5UtSPg1QmPc,False,61,58,5,0.696,0.643,0,-5.218,1,0.0447,0.000153,1.03e-05,0.156,0.332,146.005,268240,4
2008-12-13,59,She Wouldn't Be Gone,Blake Shelton,733ncRLzZQT5UtSPg1QmPc,False,62,59,6,0.51,0.683,0,-4.338,1,0.0302,0.166,0,0.0795,0.211,159.918,215613,4
2008-12-13,60,Light On,David Cook,733ncRLzZQT5UtSPg1QmPc,False,91,17,8,0.446,0.834,9,-4.014,0,0.0341,0.0794,0,0.114,0.363,132.034,228827,4
2008-12-13,61,Start A Band,Brad Paisley Duet With Keith Urban,733ncRLzZQT5UtSPg1QmPc,False,59,55,7,0.719,0.629,5,-11.132,1,0.0297,0.00919,0,0.13,0.766,123.006,214709,4
2008-12-13,62,Untouched,The Veronicas,0KlahhzNb98zyN83Vwae0l,True,0,62,1,0.557,0.783,6,-4.893,0,0.234,0.0171,0.0172,0.151,0.442,177.008,255360,4
2008-12-13,63,I Don't Care,Fall Out Boy,0KlahhzNb98zyN83Vwae0l,False,70,21,12,0.55,0.938,11,-3.556,0,0.0522,0.00171,2.18e-05,0.555,0.433,133.99,214493,4
2008-12-13,64,Get Up,50 Cent,0KlahhzNb98zyN83Vwae0l,False,58,44,7,0.707,0.885,11,-2.635,0,0.174,0.0303,0,0.311,0.405,92.435,195680,4
2008-12-13,66,I'm So Paid,Akon Featuring Lil Wayne & Young Jeezy,,False,84,40,7,0.471,0.865,6,-4.179,1,0.325,0.118,0,0.0994,0.516,92.037,263640,4
2008-12-13,67,In Color,Jamey Johnson,,False,67,67,9,0.544,0.404,3,-8.751,1,0.0354,0.391,3.98e-06,0.157,0.251,129.518,290680,4
2008-12-13,68,"You're Gonna Go Far, Kid",The Offspring,,False,69,68,8,0.55,0.917,0,-3.159,1,0.0638,0.00428,0,0.197,0.601,126.115,177827,4
2008-12-13,69,Sweet Thing,Keith Urban,,False,60,43,3,0.621,0.888,8,-6.199,1,0.0443,0.19,1.7e-05,0.151,0.651,102.986,228187,4
2008-12-13,70,Come On Get Higher,Matt Nathanson,,False,74,63,14,0.672,0.623,9,-5.699,1,0.0297,0.241,0,0.0848,0.617,92.018,215173,4
2008-12-13,71,Feel That Fire,Dierks Bentley,,False,71,71,8,0.412,0.833,1,-3.865,1,0.0352,0.371,1.28e-05,0.208,0.669,179.846,201507,4
2008-12-13,72,Sex On Fire,Kings Of Leon,,False,65,56,6,0.542,0.905,9,-5.653,1,0.054,0.00172,0.0104,0.136,0.374,153.398,203347,4
2008-12-13,73,Country Boy,Alan Jackson,,False,77,73,5,0.73,0.684,9,-10.803,1,0.0351,0.259,1.53e-06,0.111,0.564,139.037,246080,4
2008-12-13,74,Lookin' For A Good Time,Lady Antebellum,,False,72,68,8,0.665,0.936,7,-2.97,1,0.0544,0.0146,0,0.125,0.848,122.003,187320,4
2008-12-13,75,Don't,Billy Currington,,False,76,75,6,0.571,0.826,1,-4.475,1,0.0362,0.0446,0,0.343,0.713,90.966,189000,4
2008-12-13,76,Everybody Wants To Go To Heaven,Kenny Chesney With The Wailers,,False,66,41,16,0.705,0.693,11,-7.153,1,0.155,0.374,1.21e-05,0.65,0.555,137.741,252987,4
2008-12-13,77,So Fly,Slim Featuring Yung Joc,,False,73,49,14,0.784,0.559,2,-4.862,1,0.0846,0.0021,0,0.412,0.698,90.994,212453,4
2008-12-13,78,Love Remembers,Craig Morgan,,False,78,73,7,0.39,0.715,0,-3.448,1,0.0342,0.311,0,0.212,0.379,153.655,235773,4
2008-12-13,79,I Hate This Part,The Pussycat Dolls,5qMQYoVEwbIIcl753qaX1m,True,0,79,1,0.757,0.607,5,-4.335,1,0.0309,0.0723,0,0.305,0.454,111.579,218960,4
2008-12-13,80,Cowgirls Don't Cry,Brooks & Dunn Featuring Reba McEntire,5qMQYoVEwbIIcl753qaX1m,False,79,79,3,0.655,0.668,9,-5.251,1,0.0302,0.0626,2.78e-06,0.179,0.619,114.881,219813,4
2008-12-13,81,Need U Bad,Jazmine Sullivan,5qMQYoVEwbIIcl753qaX1m,False,64,37,20,0.529,0.659,7,-5.318,1,0.0629,0.0232,0,0.114,0.36,138.196,257427,4
2008-12-13,82,Chinese Democracy,Guns N' Roses,5qMQYoVEwbIIcl753qaX1m,False,75,34,3,0.474,0.8,2,-10.472,1,0.0775,0.000769,0.0309,0.131,0.156,133.94,283213,4
2008-12-13,83,IfULeave,Musiq Soulchild Featuring Mary J. Blige,5qMQYoVEwbIIcl753qaX1m,False,94,83,2,0.467,0.752,11,-3.244,1,0.232,0.208,0,0.164,0.728,122.775,252440,4
2008-12-13,84,What About Now,Daughtry,5qMQYoVEwbIIcl753qaX1m,False,81,18,17,0.387,0.862,9,-2.219,0,0.0457,0.107,0,0.103,0.337,161.984,251627,4
2008-12-13,85,Playa Cardz Right,Keyshia Cole Featuring 2Pac,5qMQYoVEwbIIcl753qaX1m,False,83,83,3,0.626,0.59,0,-5.547,0,0.0366,0.0392,0,0.254,0.192,86.078,291240,4
2008-12-13,86,God Love Her,Toby Keith,5qMQYoVEwbIIcl753qaX1m,False,89,86,2,0.551,0.919,10,-3.895,1,0.0529,0.133,8.36e-05,0.0637,0.432,125.025,216627,4
2008-12-13,87,Lost!,Coldplay With Jay-Z,5qMQYoVEwbIIcl753qaX1m,False,0,87,3,0.257,0.805,7,-7.025,1,0.0559,0.0081,0.494,0.357,0.39,175.251,256909,4
2008-12-13,88,Put It On Ya,Plies Featuring Chris J,5qMQYoVEwbIIcl753qaX1m,False,92,88,2,0.759,0.583,1,-8.503,1,0.0864,0.00286,0,0.0445,0.904,76.023,257413,4
2008-12-13,89,Amazing,Kanye West Featuring Young Jeezy,0m3Ze0cy8qBHSsV2exAfCw,True,0,89,1,0.588,0.554,8,-8.406,1,0.0545,0.216,0.118,0.0619,0.496,146.133,238333,4
2008-12-13,90,I Don't Care,Apocalyptica Featuring Adam Gontier,0m3Ze0cy8qBHSsV2exAfCw,False,87,87,7,0.274,0.792,2,-4.388,0,0.0413,0.00833,0,0.131,0.092,179.067,237347,4
2008-12-13,91,Lovebug,Jonas Brothers,0m3Ze0cy8qBHSsV2exAfCw,False,98,57,12,0.597,0.499,4,-6.216,1,0.0581,0.126,0,0.214,0.521,79.071,220693,4
2008-12-13,93,Broken,Lifehouse,,False,95,92,6,0.534,0.708,11,-5.732,1,0.0402,0.089,0,0.192,0.488,130.639,286480,4
2008-12-13,94,Leave Out All The Rest,Linkin Park,,False,0,94,2,0.509,0.629,0,-6.434,1,0.0335,0.209,1.99e-06,0.369,0.237,80.012,209307,4
2008-12-13,95,I'd Come For You,Nickelback,,False,44,44,2,0.489,0.748,2,-5.488,1,0.0311,0.033,0,0.144,0.385,147.998,262627,4
2008-12-13,96,Do You Believe Me Now,Jimmy Wayne,,False,86,36,20,0.503,0.827,4,-4.046,1,0.0553,0.0723,1.15e-06,0.126,0.376,161.834,204387,4
2008-12-13,97,All Summer Long,The Rock Heroes,,False,93,29,11,0.606,0.885,7,-4.377,1,0.0336,0.00825,0,0.0634,0.855,102.992,296347,4
2008-12-13,98,Second Chance,Shinedown,0CwYG1UnRmOx8Q1EzElCIL,True,0,98,1,0.46,0.796,0,-4.501,0,0.0333,0.00107,0,0.106,0.182,100.011,222067,4
2008-12-13,99,Anything Goes,Randy Houser,0CwYG1UnRmOx8Q1EzElCIL,False,100,99,2,0.477,0.638,0,-4.77,1,0.0355,0.54,0.000115,0.101,0.28,139.885,184173,4
2008-12-13,100,Bad Girlfriend,Theory Of A Deadman,0CwYG1UnRmOx8Q1EzElCIL,False,0,75,9,0.504,0.957,0,-2.657,1,0.0529,0.00298,0,0.187,0.676,135.013,205627,4
