date,position,title,artist,spotify_id,is_new,last_pos,peak_pos,weeks,danceability,energy,key,loudness,mode,speechiness,acousticness,instrumentalness,liveness,valence,tempo,duration_ms,time_signature
2013-04-20,1,When I Was Your Man,Bruno Mars,5ubHAQtKuFfiG4FXfLP804,False,2,1,16,0.612,0.28,0,-8.648,1,0.0434,0.932,0,0.088,0.387,72.795,213827,4
2013-04-20,2,Thrift Shop,Macklemore & Ryan Lewis Featuring Wanz,5ubHAQtKuFfiG4FXfLP804,False,1,1,27,0.781,0.526,6,-6.986,0,0.293,0.0633,0,0.0457,0.665,94.993,235613,4
2013-04-20,3,Just Give Me A Reason,P!nk Featuring Nate Ruess,5ubHAQtKuFfiG4FXfLP804,False,5,3,8,0.778,0.547,2,-7.273,1,0.0489,0.346,0.000302,0.132,0.441,95.002,242733,4
2013-04-20,4,Stay,Rihanna Featuring Mikky Ekko,5ubHAQtKuFfiG4FXfLP804,False,6,3,9,0.621,0.31,9,-10.164,0,0.0283,0.945,6.12e-05,0.117,0.125,111.893,240707,4
2013-04-20,5,Suit & Tie,Justin Timberlake Featuring JAY Z,5ubHAQtKuFfiG4FXfLP804,False,3,3,13,0.795,0.596,11,-3.799,0,0.219,0.103,0,0.164,0.357,101.985,326280,4
2013-04-20,6,Harlem Shake,Baauer,5ubHAQtKuFfiG4FXfLP804,False,4,1,8,0.452,0.794,0,-5.151,1,0.0483,0.0111,0.00182,0.416,0.282,137.825,196664,4
2013-04-20,7,Can't Hold Us,Macklemore & Ryan Lewis Featuring Ray Dalton,5ubHAQtKuFfiG4FXfLP804,False,15,7,9,0.641,0.922,2,-4.457,1,0.0786,0.0291,0,0.0862,0.847,146.078,258343,4
2013-04-20,8,Cruise,Florida Georgia Line Featuring Nelly,5ubHAQtKuFfiG4FXfLP804,False,0,8,27,0.457,0.948,10,-3.364,1,0.0354,0.0191,0,0.0536,0.878,148.0,208960,4
2013-04-20,9,Started From The Bottom,Drake,5ubHAQtKuFfiG4FXfLP804,False,8,6,9,0.793,0.524,8,-7.827,1,0.156,0.0319,0,0.156,0.579,86.325,174133,4
2013-04-20,10,Feel This Moment,Pitbull Featuring Christina Aguilera,5ubHAQtKuFfiG4FXfLP804,False,9,8,11,0.673,0.758,7,-3.632,1,0.158,0.039,0,0.341,0.542,135.956,229507,4
2013-04-20,11,Radioactive,Imagine Dragons,5ubHAQtKuFfiG4FXfLP804,False,7,7,32,0.448,0.784,9,-3.686,1,0.0627,0.106,0.000108,0.668,0.236,136.245,186813,4
2013-04-20,12,Mirrors,Justin Timberlake,5ubHAQtKuFfiG4FXfLP804,False,11,11,8,0.574,0.512,5,-6.664,0,0.0503,0.234,0,0.0946,0.512,76.899,484147,4
2013-04-20,13,Love Me,Lil Wayne Featuring Drake & Future,5ubHAQtKuFfiG4FXfLP804,False,14,9,12,0.674,0.608,8,-6.628,0,0.0334,0.0119,0,0.103,0.464,124.952,253440,4
2013-04-20,14,Daylight,Maroon 5,5ubHAQtKuFfiG4FXfLP804,False,13,7,18,0.657,0.679,2,-5.511,1,0.0269,0.00246,0,0.211,0.331,120.007,225307,4
2013-04-20,15,Heart Attack,Demi Lovato,5ubHAQtKuFfiG4FXfLP804,False,17,12,6,0.504,0.785,8,-4.802,1,0.104,0.0738,0,0.239,0.502,173.968,210840,4
2013-04-20,16,I Knew You Were Trouble.,Taylor Swift,5ubHAQtKuFfiG4FXfLP804,False,12,2,25,0.622,0.469,3,-6.798,0,0.0363,0.00454,2.25e-06,0.0398,0.679,77.019,217973,4
2013-04-20,17,I Love It,Icona Pop Featuring Charli XCX,5ubHAQtKuFfiG4FXfLP804,False,24,17,10,0.711,0.906,8,-2.671,1,0.0284,0.00952,1.64e-05,0.153,0.824,125.916,157153,4
2013-04-20,18,Scream & Shout,will.i.am & Britney Spears,5ubHAQtKuFfiG4FXfLP804,False,16,3,19,0.772,0.685,5,-6.849,1,0.0696,0.019,8.96e-05,0.131,0.501,130.033,283400,4
2013-04-20,19,Locked Out Of Heaven,Bruno Mars,5ubHAQtKuFfiG4FXfLP804,False,19,1,27,0.726,0.698,5,-4.165,1,0.0431,0.049,0,0.309,0.867,143.994,233478,4
2013-04-20,20,Ho Hey,The Lumineers,5ubHAQtKuFfiG4FXfLP804,False,23,3,44,0.685,0.466,0,-9.074,1,0.0304,0.794,2.06e-06,0.0915,0.353,79.936,163133,4
2013-04-20,21,Sweet Nothing,Calvin Harris Featuring Florence Welch,5ubHAQtKuFfiG4FXfLP804,False,18,10,22,0.573,0.929,8,-3.942,0,0.109,0.197,0.000112,0.0567,0.582,127.934,212560,4
2013-04-20,22,The Way,Ariana Grande Featuring Mac Miller,5ubHAQtKuFfiG4FXfLP804,False,10,10,2,0.645,0.877,5,-3.208,0,0.113,0.294,0,0.0759,0.861,82.324,227027,4
2013-04-20,23,Carry On,fun.,5ubHAQtKuFfiG4FXfLP804,False,22,20,14,0.388,0.694,5,-5.769,1,0.0735,0.118,0.000293,0.082,0.365,145.434,278373,5
2013-04-20,24,Wagon Wheel,Darius Rucker,5ubHAQtKuFfiG4FXfLP804,False,30,24,9,0.537,0.66,9,-7.174,1,0.0296,0.455,0,0.135,0.574,148.096,298373,4
2013-04-20,25,I Will Wait,Mumford & Sons,5ubHAQtKuFfiG4FXfLP804,False,26,12,35,0.48,0.756,1,-5.399,1,0.0333,0.00993,0.00704,0.312,0.447,131.127,276720,4
2013-04-20,26,Don't You Worry Child,Swedish House Mafia Featuring John Martin,5ubHAQtKuFfiG4FXfLP804,False,25,6,29,0.612,0.84,11,-3.145,0,0.0509,0.112,0,0.116,0.438,129.042,212862,4
2013-04-20,27,My Songs Know What You Did In The Dark (Light Em Up),Fall Out Boy,5ubHAQtKuFfiG4FXfLP804,False,27,26,9,0.558,0.924,9,-4.341,0,0.064,0.0271,3.32e-06,0.537,0.567,151.99,186827,4
2013-04-20,28,F**kin Problems,"A$AP Rocky Featuring Drake, 2 Chainz & Kendrick Lamar",5ubHAQtKuFfiG4FXfLP804,False,21,8,23,0.853,0.693,1,-6.87,1,0.275,0.0239,0,0.11,0.662,95.967,233787,4
2013-04-20,29,Sure Be Cool If You Did,Blake Shelton,5ubHAQtKuFfiG4FXfLP804,False,34,24,13,0.576,0.726,11,-4.625,1,0.035,0.255,0,0.108,0.582,136.802,215720,4
2013-04-20,30,Pour It Up,Rihanna,5ubHAQtKuFfiG4FXfLP804,False,20,19,14,0.785,0.478,2,-8.735,1,0.0419,0.0254,0,0.0901,0.39,134.002,161200,4
2013-04-20,31,Bad,Wale Featuring Tiara Thomas Or Rihanna,5ubHAQtKuFfiG4FXfLP804,False,31,31,8,0.807,0.702,6,-6.594,0,0.0748,0.307,0,0.111,0.447,114.038,238827,4
2013-04-20,32,Troublemaker,Olly Murs Featuring Flo Rida,5ubHAQtKuFfiG4FXfLP804,False,29,29,12,0.762,0.863,0,-3.689,0,0.0561,0.015,0,0.125,0.965,106.012,185587,4
2013-04-20,33,It's Time,Imagine Dragons,5ubHAQtKuFfiG4FXfLP804,False,28,15,44,0.656,0.884,2,-4.748,1,0.0372,0.0162,0,0.145,0.86,105.009,237987,4
2013-04-20,34,22,Taylor Swift,5ubHAQtKuFfiG4FXfLP804,False,33,26,6,0.658,0.729,7,-6.561,1,0.0378,0.00215,0.0013,0.0752,0.668,104.007,230133,4
2013-04-20,35,Mama's Broken Heart,Miranda Lambert,5ubHAQtKuFfiG4FXfLP804,False,38,35,11,0.768,0.809,4,-4.204,0,0.0616,0.278,0,0.139,0.748,111.989,177773,4
2013-04-20,36,Downtown,Lady Antebellum,5ubHAQtKuFfiG4FXfLP804,False,36,35,9,0.532,0.825,9,-5.287,1,0.0468,0.18,0,0.296,0.96,169.961,195867,4
2013-04-20,37,Little Talks,Of Monsters And Men,5ubHAQtKuFfiG4FXfLP804,False,32,20,46,0.457,0.757,1,-5.177,1,0.032,0.0206,0,0.146,0.417,102.961,266600,4
2013-04-20,38,Bugatti,Ace Hood Featuring Future & Rick Ross,5ubHAQtKuFfiG4FXfLP804,False,35,35,8,0.6,0.592,1,-4.947,1,0.0545,0.0191,0,0.0955,0.0663,130.205,269267,4
2013-04-20,39,Get Your Shine On,Florida Georgia Line,5ubHAQtKuFfiG4FXfLP804,False,42,39,11,0.497,0.927,0,-4.52,1,0.0371,0.00286,1.26e-06,0.413,0.607,96.991,222013,4
2013-04-20,40,Alive,Krewella,5ubHAQtKuFfiG4FXfLP804,False,45,40,8,0.663,0.822,9,-2.909,1,0.0557,0.00413,0.00318,0.234,0.567,128.002,290760,4
2013-04-20,41,Catch My Breath,Kelly Clarkson,5ubHAQtKuFfiG4FXfLP804,False,37,19,24,0.692,0.908,9,-5.364,1,0.0677,0.0251,0,0.0933,0.513,124.042,250387,4
2013-04-20,42,Highway Don't Care,Tim McGraw With Taylor Swift,5ubHAQtKuFfiG4FXfLP804,False,56,42,6,0.477,0.791,2,-5.348,1,0.0396,0.0259,0,0.0841,0.505,157.83,279067,4
2013-04-20,43,Power Trip,J. Cole Featuring Miguel,5ubHAQtKuFfiG4FXfLP804,False,48,43,8,0.667,0.608,1,-7.054,1,0.216,0.324,0.000198,0.426,0.475,99.992,241160,4
2013-04-20,44,Sail,AWOLNATION,5ubHAQtKuFfiG4FXfLP804,False,40,30,31,0.825,0.435,1,-9.582,1,0.0568,0.452,0.609,0.0953,0.243,119.038,259102,4
2013-04-20,45,Madness,Muse,5ubHAQtKuFfiG4FXfLP804,False,46,45,29,0.502,0.417,10,-7.665,1,0.0718,0.127,0.00419,0.106,0.218,180.301,281040,4
2013-04-20,46,Poetic Justice,Kendrick Lamar Featuring Drake,5ubHAQtKuFfiG4FXfLP804,False,41,26,24,0.779,0.572,6,-9.985,0,0.378,0.157,0,0.246,0.647,135.956,300160,4
2013-04-20,47,Try,P!nk,5ubHAQtKuFfiG4FXfLP804,False,43,9,24,0.673,0.629,2,-7.072,1,0.0299,0.00141,0,0.0944,0.551,103.998,247907,4
2013-04-20,48,Gangnam Style,PSY,5ubHAQtKuFfiG4FXfLP804,False,44,2,31,0.727,0.937,11,-2.871,0,0.286,0.00417,0,0.091,0.749,132.067,219493,4
2013-04-20,49,One More Night,Maroon 5,5ubHAQtKuFfiG4FXfLP804,False,49,1,42,0.718,0.82,5,-3.453,0,0.0323,0.0444,0,0.0846,0.613,92.998,219467,4
2013-04-20,50,I Drive Your Truck,Lee Brice,5ubHAQtKuFfiG4FXfLP804,False,47,47,14,0.51,0.649,11,-6.215,1,0.0348,0.0978,0.00206,0.119,0.118,141.963,234840,4
2013-04-20,51,If I Didn't Have You,Thompson Square,5ubHAQtKuFfiG4FXfLP804,False,51,51,14,0.549,0.805,6,-3.431,1,0.0277,0.0628,5.26e-06,0.343,0.53,147.91,202907,4
2013-04-20,52,Fine China,Chris Brown,0yz2J4wsXFCjMjpJ6A74yV,True,0,52,1,0.654,0.731,10,-4.767,0,0.0568,0.0419,0,0.122,0.59,104.002,213200,4
2013-04-20,53,DONE.,The Band Perry,0yz2J4wsXFCjMjpJ6A74yV,False,94,53,4,0.65,0.89,1,-2.995,1,0.0366,0.322,0,0.0543,0.757,100.053,205267,4
2013-04-20,54,Pirate Flag,Kenny Chesney,0yz2J4wsXFCjMjpJ6A74yV,False,53,53,9,0.559,0.795,7,-6.255,1,0.052,0.0787,4.83e-06,0.102,0.553,160.039,225427,4
2013-04-20,55,Boys 'round Here,Blake Shelton Featuring Pistol Annies & Friends,0yz2J4wsXFCjMjpJ6A74yV,False,67,55,2,0.611,0.688,2,-6.369,1,0.0529,0.251,2.35e-06,0.248,0.649,169.895,288760,4
2013-04-20,56,Next To Me,Emeli Sande,0yz2J4wsXFCjMjpJ6A74yV,False,57,56,7,0.674,0.81,7,-5.117,0,0.0378,0.0923,4.74e-05,0.11,0.391,94.995,196867,4
2013-04-20,57,Rich As F**k,Lil Wayne Featuring 2 Chainz,0yz2J4wsXFCjMjpJ6A74yV,False,74,57,3,0.595,0.359,8,-13.488,1,0.453,0.289,0,0.15,0.886,131.969,229198,4
2013-04-20,58,1994,Jason Aldean,0yz2J4wsXFCjMjpJ6A74yV,False,63,58,4,0.598,0.777,11,-6.676,0,0.0396,0.183,0,0.111,0.821,159.942,242680,4
2013-04-20,59,Give It All We Got Tonight,George Strait,0yz2J4wsXFCjMjpJ6A74yV,False,65,59,14,0.577,0.649,7,-7.031,1,0.027,0.253,5.03e-06,0.0798,0.339,130.313,251333,4
2013-04-20,60,Pom Poms,Jonas Brothers,4ZtnkM504iN0eeCLfGew2W,True,0,60,1,0.677,0.977,1,-2.198,0,0.0902,0.0663,0,0.281,0.902,148.006,198053,4
2013-04-20,61,R.I.P.,Young Jeezy Featuring 2 Chainz,4ZtnkM504iN0eeCLfGew2W,False,58,58,9,0.825,0.489,11,-9.32,1,0.263,0.0215,0,0.111,0.438,96.99,199973,4
2013-04-20,62,Somebody's Heartbreak,Hunter Hayes,4ZtnkM504iN0eeCLfGew2W,False,54,54,20,0.595,0.623,10,-5.975,1,0.0314,0.0496,0,0.109,0.645,149.974,227747,4
2013-04-20,63,Loveeeeeee Song,Rihanna Featuring Future,4ZtnkM504iN0eeCLfGew2W,False,59,55,10,0.71,0.598,5,-7.598,0,0.0319,0.508,0,0.0971,0.501,119.981,256320,4
2013-04-20,64,"Gone, Gone, Gone",Phillip Phillips,4ZtnkM504iN0eeCLfGew2W,False,64,59,5,0.664,0.642,6,-5.961,1,0.038,0.129,0,0.114,0.501,118.002,209693,4
2013-04-20,65,#thatPOWER,will.i.am Featuring Justin Bieber,4ZtnkM504iN0eeCLfGew2W,False,60,42,3,0.797,0.608,6,-6.096,0,0.0584,0.00112,7.66e-05,0.0748,0.402,127.999,279507,4
2013-04-20,66,Like Jesus Does,Eric Church,4ZtnkM504iN0eeCLfGew2W,False,72,66,7,0.576,0.355,1,-8.388,1,0.033,0.439,4.55e-05,0.13,0.299,137.232,198733,4
2013-04-20,67,All Gold Everything,Trinidad James,4ZtnkM504iN0eeCLfGew2W,False,55,36,17,0.516,0.755,0,-8.868,0,0.351,0.0258,0,0.329,0.633,99.764,187907,4
2013-04-20,68,Love And War,Tamar Braxton,4ZtnkM504iN0eeCLfGew2W,False,68,57,11,0.27,0.58,8,-5.717,0,0.039,0.469,0,0.343,0.242,179.919,241920,3
2013-04-20,69,Beat This Summer,Brad Paisley,4ZtnkM504iN0eeCLfGew2W,False,92,69,4,0.563,0.722,6,-5.252,1,0.0407,0.313,0,0.393,0.801,150.039,281453,4
2013-04-20,70,Two Black Cadillacs,Carrie Underwood,4ZtnkM504iN0eeCLfGew2W,False,61,41,17,0.555,0.854,5,-4.468,0,0.0609,0.0223,3.95e-06,0.0672,0.448,119.991,297947,4
2013-04-20,71,I Can Take It From There,Chris Young,4ZtnkM504iN0eeCLfGew2W,False,70,70,9,0.686,0.816,3,-5.953,1,0.0318,0.155,0,0.252,0.871,113.939,158293,4
2013-04-20,72,Battle Scars,Lupe Fiasco & Guy Sebastian,4ZtnkM504iN0eeCLfGew2W,False,71,71,15,0.517,0.811,5,-4.526,0,0.286,0.186,0,0.105,0.494,168.269,250320,4
2013-04-20,73,We Still In This B****,B.o.B Featuring T.I. & Juicy J,4ZtnkM504iN0eeCLfGew2W,False,73,73,8,0.693,0.733,1,-5.126,1,0.139,0.013,0,0.0924,0.497,140.01,247987,4
2013-04-20,74,Levitate,Hadouken!,4ZtnkM504iN0eeCLfGew2W,False,69,69,6,0.548,0.832,4,-3.72,0,0.0655,0.00628,0,0.261,0.192,133.031,285267,4
2013-04-20,75,"Bitch, Don't Kill My Vibe",Kendrick Lamar,4ZtnkM504iN0eeCLfGew2W,False,78,75,7,0.587,0.698,1,-8.948,1,0.0943,0.0152,0,0.442,0.0985,133.954,310720,4
2013-04-20,76,If I Lose Myself,OneRepublic,4ZtnkM504iN0eeCLfGew2W,False,89,74,3,0.523,0.782,2,-4.846,1,0.041,0.219,1.03e-05,0.133,0.164,125.998,214813,4
2013-04-20,77,Clarity,Zedd Featuring Foxes,4ZtnkM504iN0eeCLfGew2W,False,83,77,3,0.509,0.781,8,-3.48,1,0.072,0.0398,0,0.0749,0.176,128.0,271427,4
2013-04-20,78,Kiss You,One Direction,4ZtnkM504iN0eeCLfGew2W,False,62,46,15,0.637,0.93,4,-2.632,1,0.0511,0.0177,0,0.452,0.886,90.014,182867,4
2013-04-20,79,Kisses Down Low,Kelly Rowland,4ZtnkM504iN0eeCLfGew2W,False,79,72,5,0.632,0.723,5,-9.323,0,0.0682,0.0166,3.74e-05,0.104,0.243,137.958,254867,4
2013-04-20,80,All Around The World,Justin Bieber Featuring Ludacris,4ZtnkM504iN0eeCLfGew2W,False,86,22,6,0.689,0.816,3,-3.951,0,0.178,0.0188,2.42e-06,0.181,0.776,127.972,244547,4
2013-04-20,81,Cups (Pitch Perfect's When I'm Gone),Anna Kendrick,4ZtnkM504iN0eeCLfGew2W,False,81,64,15,0.878,0.455,0,-8.845,1,0.077,0.0462,0.00484,0.0353,0.79,129.953,128013,4
2013-04-20,82,Karate Chop (Remix),Future Featuring Lil Wayne,4ZtnkM504iN0eeCLfGew2W,False,82,82,5,0.755,0.576,11,-5.427,1,0.155,0.00326,0,0.147,0.555,134.877,276373,4
2013-04-20,83,High School,Nicki Minaj Featuring Lil Wayne,6bzwoiUt0s1KDOedyy4OtQ,True,0,83,1,0.531,0.683,1,-4.093,0,0.333,0.135,0.00265,0.22,0.212,84.817,218747,4
2013-04-20,84,More Than Miles,Brantley Gilbert,6bzwoiUt0s1KDOedyy4OtQ,False,91,84,6,0.47,0.778,5,-5.992,1,0.037,0.0295,0.000225,0.354,0.448,152.005,252867,4
2013-04-20,85,One Of Those Nights,Tim McGraw,6bzwoiUt0s1KDOedyy4OtQ,False,75,32,19,0.525,0.776,7,-5.598,1,0.0321,0.0114,0,0.117,0.413,127.046,236520,4
2013-04-20,86,Neva End,Future,6bzwoiUt0s1KDOedyy4OtQ,False,76,52,18,0.59,0.561,2,-7.613,1,0.058,0.00911,0,0.0981,0.15,134.936,262307,4
2013-04-20,87,Anywhere With You,Jake Owen,6bzwoiUt0s1KDOedyy4OtQ,False,95,87,3,0.475,0.936,5,-2.545,1,0.0413,0.0418,0,0.0873,0.598,151.988,209587,4
2013-04-20,88,Hey Pretty Girl,Kip Moore,6bzwoiUt0s1KDOedyy4OtQ,False,88,88,3,0.291,0.4,2,-10.615,1,0.0306,0.145,1.86e-05,0.259,0.0935,83.112,215920,1
2013-04-20,89,Wild For The Night,A$AP Rocky Featuring Skrillex,6bzwoiUt0s1KDOedyy4OtQ,False,96,82,4,0.757,0.848,2,-4.234,1,0.335,0.0481,0,0.121,0.686,139.995,212640,4
2013-04-20,90,Show Out,Juicy J Featuring Big Sean & Young Jeezy,6bzwoiUt0s1KDOedyy4OtQ,False,90,75,5,0.839,0.665,1,-5.72,1,0.232,0.144,0,0.132,0.583,130.046,269160,4
2013-04-20,91,Molly,"Tyga Featuring Cedric Gervais, Wiz Khalifa & Mally Mall",6bzwoiUt0s1KDOedyy4OtQ,False,85,66,3,0.831,0.783,5,-6.719,1,0.0527,0.079,1.27e-06,0.35,0.771,140.046,218440,4
2013-04-20,92,Changed,Rascal Flatts,6bzwoiUt0s1KDOedyy4OtQ,False,97,73,7,0.442,0.556,4,-6.925,1,0.0345,0.0751,7.59e-06,0.0984,0.26,140.563,262227,4
2013-04-20,93,C'mon,Ke$ha,6bzwoiUt0s1KDOedyy4OtQ,False,77,27,16,0.558,0.781,1,-5.448,0,0.0963,0.00657,0.00144,0.102,0.286,126.025,214307,4
2013-04-20,94,Whiskey,Jana Kramer,6bzwoiUt0s1KDOedyy4OtQ,False,0,94,2,0.528,0.773,0,-3.395,1,0.0331,0.0533,1.5e-05,0.34,0.48,143.816,215907,4
2013-04-20,95,Lego House,Ed Sheeran,6bzwoiUt0s1KDOedyy4OtQ,False,98,95,2,0.592,0.637,11,-8.48,1,0.0992,0.562,0,0.13,0.565,159.701,185093,4
2013-04-20,96,Wop,J. Dash,6bzwoiUt0s1KDOedyy4OtQ,False,52,52,3,0.836,0.817,7,-5.672,1,0.0677,0.00968,0,0.114,0.647,112.007,230627,4
2013-04-20,97,Freaks,French Montana Featuring Nicki Minaj,6bzwoiUt0s1KDOedyy4OtQ,False,99,77,4,0.771,0.895,9,-4.805,1,0.253,0.0499,0,0.571,0.771,96.576,181920,4
2013-04-20,98,Wings,Little Mix,3180WDzph4WrS4sLSNcGfa,True,0,98,1,0.742,0.878,9,-3.127,0,0.128,0.000758,8.88e-05,0.286,0.564,114.965,221720,4
2013-04-20,99,One Way Or Another (Teenage Kicks),One Direction,3180WDzph4WrS4sLSNcGfa,False,84,13,8,0.489,0.867,4,-3.121,0,0.071,0.025,0,0.586,0.409,162.131,157293,4
2013-04-20,100,Same Love,Macklemore & Ryan Lewis Featuring Mary Lambert,3180WDzph4WrS4sLSNcGfa,False,93,89,4,0.688,0.473,8,-9.059,1,0.167,0.716,4.46e-05,0.104,0.299,84.958,318525,4
