date,position,title,artist,spotify_id,is_new,last_pos,peak_pos,weeks,danceability,energy,key,loudness,mode,speechiness,acousticness,instrumentalness,liveness,valence,tempo,duration_ms,time_signature
2014-05-24,1,All Of Me,John Legend,1XTbAGjlbdQ74ADCA7sE02,False,1,1,31,0.422,0.264,8,-7.064,1,0.0322,0.922,0,0.132,0.331,119.93,269560,4
2014-05-24,2,Happy,Pharrell Williams,1XTbAGjlbdQ74ADCA7sE02,False,2,1,19,0.647,0.822,5,-4.662,0,0.183,0.219,0,0.0908,0.962,160.019,232720,4
2014-05-24,3,Fancy,Iggy Azalea Featuring Charli XCX,1XTbAGjlbdQ74ADCA7sE02,False,4,3,10,0.912,0.716,10,-4.141,0,0.0697,0.0904,0,0.0491,0.377,94.981,199938,4
2014-05-24,4,Problem,Ariana Grande Featuring Iggy Azalea,1XTbAGjlbdQ74ADCA7sE02,False,3,3,2,0.66,0.805,1,-5.352,0,0.153,0.0192,8.83e-06,0.159,0.625,103.008,193920,4
2014-05-24,5,Dark Horse,Katy Perry Featuring Juicy J,1XTbAGjlbdQ74ADCA7sE02,False,5,1,34,0.645,0.585,6,-6.122,1,0.0513,0.00314,0,0.165,0.353,131.931,215672,4
2014-05-24,6,Turn Down For What,DJ Snake & Lil Jon,1XTbAGjlbdQ74ADCA7sE02,False,7,5,20,0.818,0.799,1,-4.1,0,0.156,0.00107,0.128,0.057,0.0815,100.014,213733,4
2014-05-24,7,Talk Dirty,Jason Derulo Featuring 2 Chainz,1XTbAGjlbdQ74ADCA7sE02,False,6,3,21,0.76,0.652,6,-7.321,1,0.232,0.0348,0,0.307,0.759,100.315,177685,4
2014-05-24,8,Not A Bad Thing,Justin Timberlake,1XTbAGjlbdQ74ADCA7sE02,False,8,8,11,0.308,0.563,0,-9.169,1,0.0719,0.527,4.58e-06,0.134,0.109,85.901,688453,4
2014-05-24,9,Let It Go,Idina Menzel,1XTbAGjlbdQ74ADCA7sE02,False,9,5,24,0.543,0.485,8,-6.85,1,0.0305,0.558,0,0.12,0.371,136.961,223840,4
2014-05-24,10,Ain't It Fun,Paramore,1XTbAGjlbdQ74ADCA7sE02,False,13,10,11,0.61,0.893,9,-3.681,1,0.0921,0.154,4.41e-05,0.021,0.673,104.031,296520,4
2014-05-24,11,Pompeii,Bastille,1XTbAGjlbdQ74ADCA7sE02,False,10,5,39,0.679,0.715,9,-6.383,1,0.0407,0.0755,0,0.271,0.571,127.435,214148,4
2014-05-24,12,Loyal,Chris Brown Featuring Lil Wayne & French Montana Or Too $hort Or Tyga,1XTbAGjlbdQ74ADCA7sE02,False,11,9,17,0.841,0.522,10,-5.963,0,0.049,0.0168,1.37e-06,0.188,0.616,99.059,264947,4
2014-05-24,13,Best Day Of My Life,American Authors,1XTbAGjlbdQ74ADCA7sE02,False,12,11,26,0.673,0.902,2,-2.392,1,0.0346,0.0591,0.000262,0.0558,0.538,100.012,194240,4
2014-05-24,14,Summer,Calvin Harris,1XTbAGjlbdQ74ADCA7sE02,False,18,14,8,0.596,0.856,4,-3.556,0,0.0346,0.0211,0.0178,0.141,0.743,127.949,222533,4
2014-05-24,15,Sing,Ed Sheeran,1XTbAGjlbdQ74ADCA7sE02,False,15,14,5,0.818,0.67,8,-4.451,0,0.0472,0.304,1.22e-06,0.0601,0.939,119.988,235382,4
2014-05-24,16,Me And My Broken Heart,Rixton,1XTbAGjlbdQ74ADCA7sE02,False,14,14,7,0.545,0.783,5,-4.261,0,0.0345,0.00489,0,0.132,0.551,174.084,193733,4
2014-05-24,17,Counting Stars,OneRepublic,1XTbAGjlbdQ74ADCA7sE02,False,16,2,47,0.664,0.705,1,-4.972,0,0.0382,0.0654,0,0.115,0.477,122.017,257840,4
2014-05-24,18,Am I Wrong,Nico & Vinz,1XTbAGjlbdQ74ADCA7sE02,False,26,18,4,0.729,0.675,8,-6.003,1,0.0312,0.175,1.58e-06,0.55,0.779,119.968,245867,4
2014-05-24,19,Play It Again,Luke Bryan,1XTbAGjlbdQ74ADCA7sE02,False,17,14,9,0.506,0.886,11,-3.225,1,0.0655,0.0916,0,0.0734,0.595,143.935,226867,4
2014-05-24,20,La La La,Naughty Boy Featuring Sam Smith,1XTbAGjlbdQ74ADCA7sE02,False,21,19,12,0.772,0.65,6,-5.202,0,0.0306,0.107,1.13e-06,0.0905,0.262,125.082,222200,4
2014-05-24,21,Team,Lorde,1XTbAGjlbdQ74ADCA7sE02,False,19,6,33,0.69,0.578,6,-7.436,1,0.0929,0.167,0,0.305,0.416,99.961,193059,4
2014-05-24,22,Love Never Felt So Good,Michael Jackson & Justin Timberlake,1XTbAGjlbdQ74ADCA7sE02,False,20,20,2,0.775,0.719,7,-6.212,0,0.0435,0.132,1.79e-06,0.0662,0.712,117.513,246027,4
2014-05-24,24,Wiggle,Jason Derulo Featuring Snoop Dogg,,False,68,24,2,0.697,0.621,9,-6.886,0,0.25,0.0802,0,0.162,0.721,81.946,193296,4
2014-05-24,25,Birthday,Katy Perry,,False,29,25,5,0.719,0.674,11,-5.122,1,0.0681,0.0879,3.75e-06,0.112,0.843,125.98,215042,4
2014-05-24,26,Classic,MKTO,,False,28,26,13,0.72,0.791,1,-4.689,1,0.124,0.0384,0,0.157,0.756,102.071,175427,4
2014-05-24,27,Na Na,Trey Songz,,False,27,22,16,0.67,0.476,9,-6.253,0,0.0406,0.328,0,0.104,0.235,96.975,231907,4
2014-05-24,28,Timber,Pitbull Featuring Ke$ha,,False,25,1,31,0.581,0.963,11,-4.087,1,0.0981,0.0295,0,0.139,0.788,129.992,204160,4
2014-05-24,29,Bottoms Up,Brantley Gilbert,,False,22,20,21,0.474,0.857,7,-5.734,1,0.0435,0.113,0,0.134,0.545,170.006,220200,4
2014-05-24,30,Wild Wild Love,Pitbull Featuring G.R.L.,,False,30,30,11,0.66,0.685,2,-6.658,1,0.0477,0.0165,0,0.442,0.32,119.991,203160,4
2014-05-24,31,Show Me,Kid Ink Featuring Chris Brown,,False,34,13,27,0.711,0.508,7,-7.299,1,0.0494,0.0354,0,0.141,0.665,98.098,217800,4
2014-05-24,32,Partition,Beyonce,,False,33,23,18,0.412,0.441,11,-11.523,0,0.291,0.0296,0.0726,0.306,0.174,185.571,319467,4
2014-05-24,33,The Man,Aloe Blacc,,False,32,8,20,0.308,0.769,11,-7.256,0,0.065,0.0331,0,0.214,0.488,81.853,254880,4
2014-05-24,34,Latch,Disclosure Featuring Sam Smith,,False,52,34,8,0.729,0.735,1,-5.455,1,0.0919,0.0178,0.000193,0.089,0.544,121.986,255867,4
2014-05-24,35,Let Her Go,Passenger,,False,31,5,41,0.479,0.545,7,-7.346,1,0.0688,0.365,0,0.0963,0.243,74.897,252733,4
2014-05-24,36,Wake Me Up!,Avicii,,False,35,4,46,0.532,0.783,2,-5.697,1,0.0523,0.0038,0.0012,0.161,0.643,124.08,247427,4
2014-05-24,37,She Looks So Perfect,5 Seconds Of Summer,,False,45,37,6,0.494,0.951,9,-4.237,1,0.132,0.000569,0,0.327,0.441,160.025,202496,4
2014-05-24,38,Story Of My Life,One Direction,,False,36,6,28,0.6,0.663,3,-5.802,1,0.0477,0.225,0,0.119,0.286,121.07,245493,4
2014-05-24,39,Rude,MAGIC!,,False,62,39,3,0.774,0.756,1,-4.995,1,0.0389,0.0423,0,0.305,0.931,144.032,224840,4
2014-05-24,40,Demons,Imagine Dragons,,False,39,6,55,0.505,0.71,3,-3.015,1,0.0321,0.19,0.00025,0.329,0.428,89.938,175200,4
2014-05-24,41,Get Me Some Of That,Thomas Rhett,,False,44,41,18,0.549,0.866,6,-5.306,1,0.0476,0.0733,0,0.25,0.767,87.964,187400,4
2014-05-24,42,Human,Christina Perri,,False,38,31,14,0.439,0.489,8,-6.286,1,0.0368,0.132,0.000643,0.114,0.253,143.808,250707,4
2014-05-24,43,A Sky Full Of Stars,Coldplay,,False,24,24,2,0.545,0.675,6,-6.474,1,0.0279,0.00617,0.00197,0.209,0.162,124.97,267867,4
2014-05-24,44,Burn,Ellie Goulding,,False,42,13,36,0.395,0.775,1,-4.802,1,0.0526,0.298,0,0.105,0.273,116.073,231212,5
2014-05-24,45,Hey Brother,Avicii,,False,37,16,23,0.545,0.78,7,-4.867,0,0.0436,0.0309,4.64e-05,0.0828,0.458,125.014,255093,4
2014-05-24,46,The Worst,Jhene Aiko,,False,47,43,14,0.539,0.414,1,-9.156,0,0.0601,0.253,1.3e-06,0.143,0.123,94.895,254493,4
2014-05-24,47,Animals,Martin Garrix,,False,40,21,34,0.675,0.868,1,-6.36,1,0.0392,0.00107,0.715,0.374,0.0376,128.007,304229,4
2014-05-24,48,Rewind,Rascal Flatts,,False,53,44,17,0.549,0.698,3,-6.679,1,0.0347,0.0222,0,0.202,0.719,164.049,203507,4
2014-05-24,49,The Monster,Eminem Featuring Rihanna,,False,46,1,28,0.781,0.853,1,-3.68,0,0.0715,0.0525,0,0.12,0.624,110.049,250189,4
2014-05-24,50,Move That Doh,"Future Featuring Pharrell, Pusha T & Casino",,False,54,46,9,0.876,0.63,2,-4.992,1,0.135,0.0841,0,0.0838,0.316,131.033,340413,4
2014-05-24,51,Give Me Back My Hometown,Eric Church,,False,43,36,18,0.621,0.676,1,-7.808,1,0.0303,0.506,0.0675,0.0825,0.482,104.008,252493,4
2014-05-24,52,Trophies,Young Money Featuring Drake,,False,55,50,10,0.746,0.687,1,-7.475,1,0.382,0.155,0,0.137,0.283,143.931,188320,4
2014-05-24,53,Magic,Coldplay,,False,56,24,10,0.738,0.482,6,-8.917,0,0.0402,0.0266,0.621,0.106,0.352,93.457,285014,4
2014-05-24,54,Automatic,Miranda Lambert,,False,58,41,12,0.591,0.703,10,-6.211,1,0.0256,0.0435,2.34e-06,0.145,0.402,95.993,247827,4
2014-05-24,55,Beachin',Jake Owen,,False,61,55,7,0.527,0.902,6,-5.352,1,0.0601,0.344,4.63e-05,0.0669,0.709,181.964,191040,4
2014-05-24,56,Cop Car,Keith Urban,,False,57,41,15,0.538,0.664,1,-6.318,1,0.0392,0.193,0,0.0918,0.366,154.033,256747,4
2014-05-24,57,My Eyes,Blake Shelton Featuring Gwen Sebastian,,False,97,57,2,0.453,0.587,4,-7.584,1,0.0406,0.475,0,0.109,0.625,145.334,190213,4
2014-05-24,58,Red Lights,Tiesto,,False,64,58,9,0.654,0.83,10,-4.801,1,0.0366,0.000629,1.13e-06,0.121,0.548,124.989,262200,4
2014-05-24,59,Sleeping With A Friend,Neon Trees,,False,59,51,11,0.582,0.882,2,-4.256,1,0.0355,0.00189,1.03e-05,0.32,0.507,107.034,228840,4
2014-05-24,60,Beat Of The Music,Brett Eldredge,,False,63,57,14,0.629,0.808,9,-4.125,1,0.0269,0.00898,9.06e-06,0.0751,0.773,110.001,179293,4
2014-05-24,61,Neon Lights,Demi Lovato,,False,48,36,20,0.631,0.819,9,-4.24,1,0.122,0.0767,0,0.1,0.733,125.928,233173,4
2014-05-24,62,Come With Me Now,KONGOS,,False,67,62,6,0.654,0.726,10,-3.803,0,0.0401,0.0311,6.35e-05,0.0618,0.728,103.987,211960,4
2014-05-24,63,Mmm Yeah,Austin Mahone Featuring Pitbull,,False,50,49,12,0.712,0.922,6,-3.902,0,0.0411,0.00266,1.9e-06,0.268,0.976,125.984,231625,4
2014-05-24,64,Who Do You Love?,YG Featuring Drake,,False,65,54,9,0.676,0.415,9,-9.752,1,0.508,0.0281,0,0.0915,0.146,193.206,233507,4
2014-05-24,65,Drink To That All Night,Jerrod Niemann,,False,60,34,19,0.639,0.846,9,-6.184,0,0.0439,0.0325,0,0.116,0.475,115.965,224813,4
2014-05-24,66,Lettin' The Night Roll,Justin Moore,,False,73,65,12,0.542,0.859,2,-5.137,1,0.0424,0.0873,0,0.145,0.637,140.9,203120,4
2014-05-24,67,I Don't Dance,Lee Brice,,False,72,67,4,0.587,0.559,1,-7.742,1,0.0321,0.399,6.69e-06,0.0992,0.19,92.036,221173,4
2014-05-24,68,Empire,Shakira,,False,66,58,7,0.541,0.628,0,-4.682,0,0.0603,0.733,0,0.056,0.364,80.027,239333,4
2014-05-24,69,Stay With Me,Sam Smith,,False,78,67,5,0.418,0.42,0,-6.444,1,0.0414,0.588,6.39e-05,0.11,0.184,84.094,172724,4
2014-05-24,70,Good Kisser,Usher,3CX3WMBg6lzWk72bYL29vP,True,0,70,1,0.64,0.782,5,-4.177,0,0.189,0.379,0,0.109,0.825,97.516,249626,4
2014-05-24,71,I Can't Make You Love Me,Josh Kaufman,0QDfwssgneF3kVgBo13lRr,True,0,71,1,0.32,0.351,5,-7.465,0,0.027,0.633,0,0.169,0.166,84.843,186369,5
2014-05-24,72,Whiskey In My Water,Tyler Farr,0QDfwssgneF3kVgBo13lRr,False,76,72,7,0.526,0.872,7,-5.079,1,0.0428,0.245,0,0.243,0.583,153.929,188147,4
2014-05-24,73,Stoner,Young Thug,0QDfwssgneF3kVgBo13lRr,False,70,47,13,0.876,0.675,3,-3.28,0,0.146,0.421,1.16e-06,0.0667,0.606,135.959,240000,4
2014-05-24,74,The Walker,Fitz And The Tantrums,0QDfwssgneF3kVgBo13lRr,False,71,67,11,0.77,0.801,9,-4.182,0,0.0336,0.00375,0.00281,0.0515,0.725,130.76,233133,4
2014-05-24,75,Chandelier,Sia,2s1sdSqGcKxpPr5lCl7jAV,True,0,75,1,0.399,0.787,1,-2.88,1,0.0499,0.0197,6.07e-05,0.0685,0.572,117.089,216120,5
2014-05-24,76,Who I Am With You,Chris Young,2s1sdSqGcKxpPr5lCl7jAV,False,80,76,3,0.466,0.702,0,-4.308,1,0.032,0.0983,1.29e-05,0.242,0.47,150.309,191573,4
2014-05-24,77,Invisible,Hunter Hayes,2s1sdSqGcKxpPr5lCl7jAV,False,86,44,12,0.38,0.568,1,-5.713,1,0.0436,0.327,0,0.0822,0.259,155.956,276400,4
2014-05-24,78,Can't Remember To Forget You,Shakira Featuring Rihanna,2s1sdSqGcKxpPr5lCl7jAV,False,75,15,17,0.694,0.81,11,-3.556,0,0.0661,0.122,0,0.141,0.824,137.968,206867,4
2014-05-24,79,How To Love,Christina Grimmie,6xVIlqDFInhEEgBDV02kp3,True,0,79,1,0.439,0.626,10,-5.205,1,0.037,0.328,5.36e-06,0.0991,0.254,140.125,171819,4
2014-05-24,80,Cut Her Off,KCamp Featuring 2 Chainz,6xVIlqDFInhEEgBDV02kp3,False,85,80,5,0.769,0.611,8,-2.85,1,0.039,0.098,0,0.221,0.0901,144.037,243333,4
2014-05-24,81,I Choose You,Sara Bareilles,7jJH8F3PHlNvxfqEAAfFDl,True,0,81,1,0.731,0.572,6,-7.889,0,0.0445,0.105,0.00012,0.133,0.947,154.038,218573,4
2014-05-24,82,Come Get It Bae,Pharrell Williams,24MSdaNRlLgjp8xYeJeXwZ,True,0,82,1,0.934,0.798,0,-5.665,1,0.0849,0.266,4.54e-05,0.0962,0.895,120.162,201933,4
2014-05-24,83,Fever,The Black Keys,24MSdaNRlLgjp8xYeJeXwZ,False,0,77,2,0.609,0.674,9,-6.506,0,0.0355,0.00378,0.000302,0.129,0.743,127.541,246307,4
2014-05-24,84,Bailando,Enrique Iglesias Featuring Descemer Bueno & Gente de Zona,32lm3769IRfcnrQV11LO4E,False,81,81,2,0.723,0.777,7,-3.503,1,0.108,0.0426,3.68e-06,0.0451,0.961,91.017,243413,4
2014-05-24,85,We Dem Boyz,Wiz Khalifa,32lm3769IRfcnrQV11LO4E,False,90,85,4,0.717,0.862,8,-4.736,1,0.054,0.00689,0,0.321,0.52,130.021,224933,4
2014-05-24,86,Work,Iggy Azalea,32lm3769IRfcnrQV11LO4E,False,88,86,2,0.699,0.804,7,-4.898,1,0.144,0.0631,0,0.414,0.491,140.012,223197,4
2014-05-24,87,Yeah,Joe Nichols,32lm3769IRfcnrQV11LO4E,False,94,87,3,0.404,0.845,11,-4.647,1,0.049,0.00637,1.34e-05,0.357,0.591,165.703,231027,4
2014-05-24,88,River Bank,Brad Paisley,0U6uTxVPeoXFcxlXMIWgAR,True,0,88,1,0.639,0.875,7,-5.793,1,0.0372,0.0929,0,0.296,0.892,117.028,179800,4
2014-05-24,89,2 On,Tinashe Featuring ScHoolboy Q,3jVtllWS5CFFWLQng8sKsr,True,0,89,1,0.742,0.595,9,-7.51,1,0.107,0.15,0,0.111,0.431,101.013,227000,4
2014-05-24,90,17 Again,Brantley Gilbert,7qgsIONiXn49hfU4OfgBSJ,True,0,90,1,0.43,0.871,1,-4.89,1,0.035,0.011,8.71e-06,0.374,0.7,173.928,239773,4
2014-05-24,91,We Are Tonight,Billy Currington,7qgsIONiXn49hfU4OfgBSJ,False,92,91,3,0.559,0.812,11,-5.347,1,0.0371,0.0323,0,0.195,0.472,127.911,232107,4
2014-05-24,92,Part II (On The Run),Jay Z Featuring Beyonce,7qgsIONiXn49hfU4OfgBSJ,False,82,77,13,0.6,0.636,8,-5.732,1,0.0939,0.279,0,0.451,0.351,86.997,333747,4
2014-05-24,93,Keep Them Kisses Comin',Craig Campbell,7qgsIONiXn49hfU4OfgBSJ,False,99,93,2,0.704,0.767,6,-5.708,1,0.0398,0.0524,0.000469,0.361,0.889,120.035,159827,4
2014-05-24,94,Or Nah,Ty Dolla $ign Featuring Wiz Khalifa & DJ Mustard,7qgsIONiXn49hfU4OfgBSJ,False,77,73,8,0.805,0.33,1,-8.712,0,0.1,0.22,0,0.105,0.211,121.97,242983,4
2014-05-24,95,#SELFIE,The Chainsmokers,7qgsIONiXn49hfU4OfgBSJ,False,79,16,11,0.789,0.916,0,-3.262,1,0.249,0.0135,8.09e-06,0.077,0.658,127.956,183750,4
2014-05-24,96,Man Of The Year,ScHoolboy Q,7qgsIONiXn49hfU4OfgBSJ,False,84,62,13,0.749,0.865,3,-5.228,1,0.0413,0.00536,0,0.198,0.371,111.914,216013,4
2014-05-24,97,Girls Chase Boys,Ingrid Michaelson,7qgsIONiXn49hfU4OfgBSJ,False,95,82,5,0.518,0.828,8,-5.725,1,0.04,0.03,1.33e-05,0.0456,0.69,84.835,221413,4
2014-05-24,98,Raging Fire,Phillip Phillips,7qgsIONiXn49hfU4OfgBSJ,False,93,58,4,0.557,0.833,7,-4.671,1,0.073,0.00867,0,0.0621,0.449,125.909,234693,4
2014-05-24,99,You & I,One Direction,7qgsIONiXn49hfU4OfgBSJ,False,96,68,4,0.574,0.329,1,-6.829,1,0.0274,0.22,0,0.0986,0.356,130.993,237933,4
2014-05-24,100,Doin' What She Likes,Blake Shelton,7qgsIONiXn49hfU4OfgBSJ,False,83,35,17,0.581,0.767,10,-6.28,1,0.0406,0.157,0,0.278,0.832,152.011,222613,4
