date,position,title,artist,spotify_id,is_new,last_pos,peak_pos,weeks,danceability,energy,key,loudness,mode,speechiness,acousticness,instrumentalness,liveness,valence,tempo,duration_ms,time_signature
1998-05-16,1,Too Close,Next,5rSYbDj0iOntehwhonDS1a,False,1,1,14,0.847,0.402,7,-9.952,1,0.0641,0.0118,0,0.283,0.752,99.693,259440,4
1998-05-16,2,My All,Mariah Carey,5rSYbDj0iOntehwhonDS1a,False,2,2,2,0.607,0.317,7,-10.244,0,0.029,0.732,4.53e-05,0.086,0.111,108.122,230933,4
1998-05-16,3,You're Still The One,Shania Twain,5rSYbDj0iOntehwhonDS1a,False,3,2,14,0.585,0.494,3,-8.751,1,0.0353,0.363,0,0.0886,0.634,133.822,212200,4
1998-05-16,4,Everybody [Backstreet's Back],Backstreet Boys,5rSYbDj0iOntehwhonDS1a,False,4,4,5,0.735,0.873,10,-3.493,0,0.0402,0.025,3.27e-06,0.265,0.586,108.021,224960,4
1998-05-16,5,Body Bumpin' Yippie-Yi-Yo,Public Announcement,5rSYbDj0iOntehwhonDS1a,False,6,5,13,0.782,0.363,2,-7.744,1,0.0441,0.0472,0,0.149,0.27,121.986,273667,4
1998-05-16,6,It's All About Me,Mya & Sisqo,5rSYbDj0iOntehwhonDS1a,False,11,6,10,0.812,0.5,2,-6.842,1,0.084,0.209,0,0.174,0.521,137.041,264933,4
1998-05-16,7,Truly Madly Deeply,Savage Garden,5rSYbDj0iOntehwhonDS1a,False,5,1,24,0.555,0.698,0,-8.874,1,0.0287,0.403,0,0.0851,0.816,168.12,277267,4
1998-05-16,8,The Arms Of The One Who Loves You,Xscape,5rSYbDj0iOntehwhonDS1a,False,15,8,3,0.657,0.456,0,-8.917,1,0.0345,0.311,0,0.0922,0.182,115.4,260427,4
1998-05-16,9,All My Life,K-Ci & JoJo,5rSYbDj0iOntehwhonDS1a,False,8,1,8,0.629,0.511,1,-8.651,1,0.0326,0.114,3.91e-06,0.0588,0.181,128.038,331240,4
1998-05-16,10,Let's Ride,Montell Jordan Feat. Master P & Silkk The Shocker,5rSYbDj0iOntehwhonDS1a,False,7,2,11,0.59,0.538,1,-5.949,1,0.247,0.0272,0,0.17,0.578,121.929,294600,4
1998-05-16,11,Frozen,Madonna,5rSYbDj0iOntehwhonDS1a,False,9,2,9,0.602,0.616,1,-10.917,1,0.0353,0.662,0.0153,0.149,0.31,108.017,367333,4
1998-05-16,12,Turn It Up [Remix]/Fire It Up,Busta Rhymes,5rSYbDj0iOntehwhonDS1a,False,10,10,2,0.817,0.84,2,-8.598,1,0.0922,0.00506,0.00034,0.288,0.89,104.295,237907,4
1998-05-16,13,I Want You Back,'N Sync,5rSYbDj0iOntehwhonDS1a,False,14,13,11,0.758,0.93,8,-3.22,0,0.0425,0.0503,0.000226,0.325,0.853,112.042,202107,4
1998-05-16,14,Sex And Candy,Marcy Playground,5rSYbDj0iOntehwhonDS1a,False,12,8,6,0.55,0.702,11,-5.693,0,0.0281,0.046,1.4e-06,0.119,0.515,159.968,172486,4
1998-05-16,15,Romeo And Juliet,Sylk-E. Fyne Featuring Chill,5rSYbDj0iOntehwhonDS1a,False,13,6,14,0.801,0.424,10,-8.153,1,0.051,0.218,2.78e-05,0.127,0.91,75.967,310750,4
1998-05-16,16,Make Em' Say Uhh!,"Master P Feat. Fiend, Silkk The Shocker, Mia X & Mystikal",5rSYbDj0iOntehwhonDS1a,False,22,16,16,0.711,0.729,6,-5.432,0,0.49,0.00513,0,0.0615,0.488,169.845,302507,4
1998-05-16,18,"No, No, No",Destiny's Child,,False,16,3,25,0.67,0.582,1,-3.574,1,0.224,0.3,0,0.0845,0.675,181.841,207467,4
1998-05-16,19,Gettin' Jiggy Wit It,Will Smith,,False,23,1,12,0.881,0.874,6,-4.505,1,0.139,0.0175,1.14e-06,0.154,0.858,107.891,227933,4
1998-05-16,20,Victory,Puff Daddy & The Family Featuring The Notorious B.I.G. & Busta Rh,,False,19,19,9,0.609,0.731,9,-6.846,1,0.322,0.397,0,0.664,0.685,91.778,296267,4
1998-05-16,21,Nice & Slow,Usher,,False,17,1,17,0.819,0.299,5,-11.964,0,0.122,0.153,0,0.3,0.515,121.913,227907,4
1998-05-16,22,Together Again,Janet,,False,25,1,22,0.873,0.593,7,-8.942,1,0.103,0.078,0.00697,0.104,0.495,123.091,301200,4
1998-05-16,23,What You Want,Mase Featuring Total,,False,24,6,16,0.838,0.72,10,-6.593,0,0.384,0.0312,1.11e-05,0.422,0.845,93.76,242947,4
1998-05-16,24,My Heart Will Go On,Celine Dion,,False,21,1,12,0.428,0.276,4,-11.729,1,0.0312,0.732,5.33e-06,0.117,0.0382,99.195,280000,1
1998-05-16,25,How's It Going To Be,Third Eye Blind,,False,26,9,24,0.562,0.593,5,-9.362,1,0.0263,0.00327,0.00139,0.0967,0.574,80.289,253413,4
1998-05-16,26,Gone Till November,Wyclef Jean,,False,18,7,15,0.677,0.503,4,-9.027,1,0.0867,0.0888,1.48e-05,0.182,0.417,85.926,207467,4
1998-05-16,27,Looking Through Your Eyes,LeAnn Rimes,,False,34,27,5,0.487,0.271,10,-11.566,1,0.0283,0.618,0,0.16,0.194,80.126,245467,4
1998-05-16,28,Deja Vu [Uptown Baby],Lord Tariq & Peter Gunz,,False,27,9,23,0.861,0.622,1,-7.493,1,0.379,0.0816,0,0.123,0.664,96.911,284800,4
1998-05-16,29,I Got The Hook Up!,Master P Featuring Sons Of Funk,,False,32,29,6,0.706,0.632,1,-7.017,1,0.192,0.026,0,0.362,0.277,148.015,182938,4
1998-05-16,30,Raise The Roof,Luke Featuring No Good But So Good,,False,30,30,8,0.737,0.892,2,-5.607,1,0.358,0.0436,0,0.0798,0.662,173.786,310827,4
1998-05-16,31,How Do I Live,LeAnn Rimes,,False,28,2,48,0.577,0.462,2,-7.989,1,0.0279,0.128,0,0.0822,0.258,128.303,266973,4
1998-05-16,32,I Don't Want To Wait,Paula Cole,,False,29,11,29,0.41,0.468,11,-8.177,1,0.0553,0.298,1.19e-05,0.0426,0.475,177.508,320027,4
1998-05-16,33,Second Round K.O.,Canibus,,False,31,28,6,0.74,0.537,7,-11.337,1,0.457,0.0159,0,0.564,0.686,94.025,277533,4
1998-05-16,34,A Rose Is Still A Rose,Aretha Franklin,,False,33,26,10,0.631,0.793,8,-7.551,0,0.251,0.212,0,0.0441,0.826,175.814,266667,4
1998-05-16,35,This Kiss,Faith Hill,,False,42,35,9,0.398,0.804,11,-5.559,1,0.0451,0.175,0,0.181,0.709,186.752,194307,4
1998-05-16,36,Kiss The Rain,Billie Myers,,False,35,15,28,0.455,0.682,9,-6.996,1,0.041,0.00142,4.96e-05,0.162,0.283,177.997,270160,4
1998-05-16,37,You Make Me Wanna...,Usher,,False,40,2,39,0.761,0.639,5,-7.577,0,0.0539,0.0359,0,0.0945,0.922,164.088,219120,4
1998-05-16,38,Imagination,Tamia,,False,38,38,9,0.895,0.495,9,-7.186,0,0.178,0.0998,6.28e-05,0.0583,0.593,99.233,213973,4
1998-05-16,39,Clock Strikes,Timbaland & Magoo,,False,37,37,3,0.787,0.714,6,-8.63,0,0.131,0.0641,0.436,0.273,0.81,165.465,291120,4
1998-05-16,40,Bitter Sweet Symphony,The Verve,,False,36,12,8,0.356,0.917,9,-6.006,1,0.0479,0.0335,0,0.406,0.518,171.176,357267,4
1998-05-16,41,Get At Me Dog,DMX Featuring Sheek Of The Lox,,False,44,41,12,0.596,0.623,1,-8.444,1,0.496,0.0399,0,0.729,0.476,97.002,243240,4
1998-05-16,42,Say It,Voices Of Theory,,False,50,42,7,0.381,0.415,0,-10.298,1,0.0691,0.675,0,0.0795,0.257,61.908,269467,3
1998-05-16,43,Cheers 2 U,Playa,,False,46,43,8,0.728,0.334,0,-11.11,1,0.0725,0.177,1.31e-06,0.103,0.478,127.053,311427,4
1998-05-16,44,Who Am I,Beenie Man,,False,47,44,10,0.628,0.753,11,-8.778,1,0.468,0.211,0,0.12,0.559,86.194,196000,4
1998-05-16,45,Do For Love,2Pac Featuring Eric Williams,,False,39,21,9,0.874,0.63,1,-3.585,1,0.298,0.0578,0.00479,0.0582,0.717,95.0,281600,4
1998-05-16,46,I Don't Ever Want To See You Again,Uncle Sam,,False,43,6,28,0.607,0.497,11,-7.017,1,0.0374,0.38,0,0.0681,0.407,125.951,345133,3
1998-05-16,48,Candle In The Wind 1997/Something About The Way You Look Tonight,Elton John,,False,45,1,32,0.48,0.628,6,-7.643,1,0.0262,0.174,3.28e-05,0.0753,0.541,143.412,240547,4
1998-05-16,49,They Don't Know,Jon B,,False,51,29,16,0.699,0.388,6,-10.722,1,0.0531,0.588,1.98e-06,0.0658,0.566,125.858,274667,4
1998-05-16,50,I'm Alright,Jo Dee Messina,,False,48,43,10,0.676,0.733,0,-7.745,1,0.0294,0.191,0,0.192,0.591,98.234,199040,3
1998-05-16,51,This Is How We Party,S.O.A.P.,,False,53,51,5,0.758,0.911,6,-4.192,0,0.0409,0.0467,0.00252,0.687,0.911,109.974,198067,4
1998-05-16,52,The Mummers' Dance,Loreena McKennitt,,False,49,18,11,0.548,0.456,0,-11.53,0,0.0289,0.425,0.116,0.0892,0.294,120.274,367440,4
1998-05-16,53,Push It,Garbage,,False,52,52,2,0.564,0.909,0,-6.471,1,0.0311,0.00034,0.11,0.0746,0.892,123.895,242533,4
1998-05-16,54,Gitty Up,Salt-N-Pepa,,False,56,50,8,0.884,0.553,11,-6.514,1,0.071,0.0284,6.3e-06,0.0859,0.884,104.931,240600,4
1998-05-16,55,Recover Your Soul,Elton John,,False,60,55,5,0.725,0.653,7,-9.365,1,0.0238,0.134,0.00675,0.272,0.582,103.003,318040,4
1998-05-16,57,Are You Jimmy Ray?,Jimmy Ray,,False,55,13,13,0.75,0.914,10,-5.707,0,0.0704,0.13,2.33e-05,0.392,0.672,99.083,201200,4
1998-05-16,58,Rain,SWV,,False,57,25,8,0.643,0.486,4,-10.443,0,0.0278,0.337,3.86e-06,0.702,0.146,138.151,264507,3
1998-05-16,59,Too Much,Spice Girls,,False,61,9,14,0.333,0.631,2,-4.992,1,0.0461,0.484,0,0.332,0.342,80.14,271933,4
1998-05-16,60,Strawberries,Smooth,,False,63,49,13,0.717,0.41,7,-6.332,1,0.0638,0.193,0.000142,0.167,0.609,81.254,339800,4
1998-05-16,61,My Heart Will Go On,Deja Vu,,False,58,58,10,0.588,0.941,0,-5.254,0,0.0459,0.0573,0.002,0.0301,0.918,131.995,442851,4
1998-05-16,62,I Just Want To Dance With You,George Strait,,False,66,62,4,0.715,0.469,0,-8.674,1,0.0279,0.439,8.69e-05,0.104,0.502,113.991,210867,4
1998-05-16,63,Just Be Straight With Me,"Silkk The Shocker Featuring Master P, Destiny's Child, O'Dell, Mo",,False,65,57,9,0.77,0.513,2,-10.7,1,0.099,0.193,0,0.315,0.48,92.89,261933,4
1998-05-16,64,Out Of My Bones,Randy Travis,,False,71,64,4,0.522,0.732,3,-5.773,1,0.0277,0.427,0,0.134,0.587,144.962,164773,4
1998-05-16,65,The Unforgiven II,Metallica,,False,64,59,7,0.49,0.884,8,-4.533,0,0.0428,0.000514,0.00177,0.27,0.254,132.978,396440,4
1998-05-16,66,I'm From The Country,Tracy Byrd,,False,75,66,7,0.687,0.898,2,-3.93,1,0.042,0.206,0,0.284,0.952,129.542,213973,4
1998-05-16,67,Then What?,Clay Walker,,False,68,65,15,0.564,0.806,4,-8.227,1,0.063,0.169,0,0.0663,0.633,176.405,183707,4
1998-05-16,68,Love Me Good,Michael W. Smith,,False,73,61,4,0.652,0.931,7,-8.01,1,0.0612,0.000654,2.13e-05,0.0697,0.578,110.253,281200,4
1998-05-16,69,The City Is Mine,Jay-Z Featuring BLACKstreet,,False,69,52,16,0.888,0.702,0,-4.059,0,0.209,0.00358,0,0.0358,0.754,97.954,242573,4
1998-05-16,70,Still Po' Pimpin',Do Or Die Featuring Johnny P & Twista,,False,62,62,8,0.748,0.526,8,-10.896,0,0.065,0.292,0,0.0471,0.771,136.028,240000,4
1998-05-16,71,Do Your Thing,7 Mile,,False,76,71,4,0.7,0.216,3,-8.921,0,0.0402,0.0193,0.836,0.0577,0.416,59.994,291107,4
1998-05-16,72,Burn,Militia,,False,72,52,19,0.508,0.889,10,-4.551,1,0.0371,0.00774,0,0.0929,0.728,94.979,156453,4
1998-05-16,73,A Promise I Make,Dakota Moon,,False,74,69,9,0.711,0.481,0,-8.135,0,0.0242,0.273,0,0.0952,0.392,90.118,267280,4
1998-05-16,75,Bring It On,Keith Washington,,False,70,63,11,0.792,0.302,9,-8.273,0,0.0397,0.236,0,0.182,0.396,117.614,270347,4
1998-05-16,76,Moan & Groan,Mark Morrison,,False,79,76,5,0.68,0.394,6,-11.833,0,0.0391,0.114,0.00145,0.0938,0.375,141.504,330200,4
1998-05-16,77,One Of These Days,Tim McGraw,,False,82,77,3,0.478,0.267,3,-12.184,1,0.0305,0.88,0.00017,0.197,0.289,71.334,281960,4
1998-05-16,78,Blue On Black,The Kenny Wayne Shepherd Band,,False,78,78,3,0.472,0.525,7,-16.084,1,0.0407,0.00117,0.0027,0.304,0.524,156.059,325279,4
1998-05-16,79,Let's Forget About It,Lisa Loeb,,False,83,79,3,0.687,0.789,0,-5.038,1,0.0308,0.488,5.9e-05,0.115,0.634,100.092,165867,4
1998-05-16,80,I Do [Cherish You],Mark Wills,,False,94,80,2,0.586,0.477,6,-8.136,1,0.0243,0.593,0,0.0935,0.308,82.991,199707,4
1998-05-16,81,Light In Your Eyes,Blessid Union Of Souls,,False,81,48,14,0.471,0.454,11,-9.118,1,0.0309,0.546,0,0.114,0.36,170.995,256200,3
1998-05-16,82,I Know Where It's At,All Saints,,False,77,36,16,0.684,0.738,6,-7.07,1,0.0528,0.022,3.72e-06,0.154,0.711,97.472,293733,4
1998-05-16,83,Come Over To My Place,Davina,,False,86,83,5,0.764,0.314,2,-8.568,1,0.053,0.0522,0.000551,0.0818,0.332,83.969,236076,4
1998-05-16,84,That's Why I'm Here,Kenny Chesney,,False,97,84,2,0.648,0.285,4,-11.986,1,0.0343,0.498,3.59e-06,0.222,0.212,137.033,243440,4
1998-05-16,85,There's Your Trouble,Dixie Chicks,69m9WDPBvemwujQwdONslk,True,0,85,1,0.737,0.869,2,-5.433,1,0.0267,0.481,0,0.308,0.898,126.628,193065,4
1998-05-16,86,In A Dream,Rockell,69m9WDPBvemwujQwdONslk,False,90,80,17,0.785,0.688,9,-7.348,0,0.0385,0.019,0.3,0.136,0.835,132.279,241693,4
1998-05-16,87,If I Never Stop Loving You,David Kersh,69m9WDPBvemwujQwdONslk,False,87,67,14,0.705,0.608,1,-5.521,1,0.025,0.527,1.29e-05,0.127,0.731,106.71,215613,4
1998-05-16,89,Life In Mono,Mono,,False,92,70,14,0.448,0.918,4,-3.768,0,0.0386,0.0116,0.581,0.333,0.397,169.886,223450,4
1998-05-16,91,Sweet Honesty,M:G,,False,98,91,3,0.705,0.691,2,-6.382,1,0.0375,0.0204,5.37e-05,0.0508,0.665,129.982,232893,4
1998-05-16,92,Pink,Aerosmith,,False,85,27,12,0.432,0.751,0,-5.124,1,0.0423,0.0134,4.58e-06,0.126,0.776,171.85,235360,4
1998-05-16,93,Off The Hook,Jody Watley,,False,88,73,13,0.794,0.481,11,-12.059,1,0.0854,0.0269,0,0.197,0.588,101.751,242733,4
1998-05-16,94,Father,LL Cool J,,False,95,18,16,0.754,0.519,7,-10.928,0,0.241,0.0486,0.074,0.158,0.608,98.825,284667,4
1998-05-16,95,I Don't Wanna Go On,Innerlude,37vgFln0hkTGcphuNjlKhi,True,0,95,1,0.635,0.541,11,-8.564,1,0.0385,0.0676,0,0.0579,0.318,117.978,277812,4
1998-05-16,96,Dangerous,Busta Rhymes,37vgFln0hkTGcphuNjlKhi,False,99,9,19,0.913,0.6,11,-8.446,0,0.202,0.0096,0,0.117,0.764,103.268,217640,4
1998-05-16,97,Sweet Surrender,Sarah McLachlan,37vgFln0hkTGcphuNjlKhi,False,91,28,14,0.627,0.467,9,-9.81,1,0.0321,0.00286,0,0.11,0.61,113.01,240613,4
1998-05-16,98,It's Up To You,The Tuesdays,37vgFln0hkTGcphuNjlKhi,False,84,55,9,0.472,0.723,7,-5.666,1,0.0352,0.00931,2.62e-06,0.217,0.206,123.575,268693,4
1998-05-16,99,All My Love,Queen Pen Featuring Eric Williams,37vgFln0hkTGcphuNjlKhi,False,80,28,15,0.831,0.747,1,-4.808,1,0.186,0.0326,0,0.208,0.811,102.844,204200,4
1998-05-16,100,Out Of Sight (YO),Rufus Blaq,37vgFln0hkTGcphuNjlKhi,False,100,97,3,0.795,0.762,10,-6.544,0,0.373,0.324,0,0.209,0.852,96.269,189801,4
