date,position,title,artist,spotify_id,is_new,last_pos,peak_pos,weeks,danceability,energy,key,loudness,mode,speechiness,acousticness,instrumentalness,liveness,valence,tempo,duration_ms,time_signature
1992-07-25,1,Baby Got Back,Sir Mix-A-Lot,6GKaYgABRoeO8ZofVq7zS2,False,1,1,16,0.926,0.669,1,-11.271,1,0.301,0.0051,0,0.0887,0.642,128.462,262827,4
1992-07-25,2,This Used To Be My Playground,Madonna,6GKaYgABRoeO8ZofVq7zS2,False,7,2,4,0.499,0.308,7,-11.692,0,0.0264,0.754,0.000928,0.125,0.0708,75.91,310267,4
1992-07-25,3,Baby-Baby-Baby,TLC,6GKaYgABRoeO8ZofVq7zS2,False,5,3,8,0.679,0.597,11,-8.601,0,0.0439,0.0913,0.000673,0.0487,0.9,184.174,315040,4
1992-07-25,4,Achy Breaky Heart,Billy Ray Cyrus,6GKaYgABRoeO8ZofVq7zS2,False,4,4,12,0.8,0.563,9,-10.209,1,0.0303,0.051,0,0.0797,0.961,121.808,203373,4
1992-07-25,5,I'll Be There,Mariah Carey,6GKaYgABRoeO8ZofVq7zS2,False,2,1,9,0.404,0.511,5,-9.427,1,0.0315,0.716,0,0.871,0.279,82.025,264160,4
1992-07-25,6,Just Another Day,Jon Secada,6GKaYgABRoeO8ZofVq7zS2,False,10,6,15,0.717,0.642,1,-10.727,1,0.0287,0.0194,0.000249,0.043,0.732,105.894,327427,4
1992-07-25,7,Life Is A Highway,Tom Cochrane,6GKaYgABRoeO8ZofVq7zS2,False,11,7,11,0.683,0.751,5,-10.184,1,0.0346,0.0681,8.36e-06,0.248,0.841,103.036,266560,4
1992-07-25,8,Under The Bridge,Red Hot Chili Peppers,6GKaYgABRoeO8ZofVq7zS2,False,3,2,17,0.559,0.345,4,-13.496,1,0.0459,0.0576,0.000105,0.141,0.458,84.581,264307,4
1992-07-25,9,Wishing On A Star,The Cover Girls,6GKaYgABRoeO8ZofVq7zS2,False,9,9,9,0.353,0.544,5,-10.812,0,0.0331,0.581,9.95e-05,0.0835,0.48,88.898,281200,4
1992-07-25,10,If You Asked Me To,Celine Dion,6GKaYgABRoeO8ZofVq7zS2,False,8,4,14,0.46,0.437,7,-10.587,1,0.0304,0.128,0,0.025,0.227,172.382,234360,4
1992-07-25,11,November Rain,Guns N' Roses,6GKaYgABRoeO8ZofVq7zS2,False,17,11,5,0.294,0.641,11,-9.316,1,0.0291,0.0163,0.22,0.112,0.226,79.759,536067,4
1992-07-25,12,Too Funky,George Michael,6GKaYgABRoeO8ZofVq7zS2,False,13,12,7,0.659,0.893,1,-8.324,1,0.076,0.0211,0.308,0.72,0.756,98.262,224933,4
1992-07-25,13,Tennessee,Arrested Development,6GKaYgABRoeO8ZofVq7zS2,False,6,6,16,0.822,0.661,1,-10.234,0,0.164,0.0241,3.95e-06,0.315,0.67,99.883,272707,4
1992-07-25,14,Warm It Up,Kris Kross,6GKaYgABRoeO8ZofVq7zS2,False,16,14,8,0.865,0.778,1,-10.05,1,0.249,0.0411,0,0.303,0.763,103.008,248333,4
1992-07-25,15,The Best Things In Life Are Free,Luther Vandross And Janet Jackson With BBD And Ralph Tresvant,6GKaYgABRoeO8ZofVq7zS2,False,14,10,9,0.852,0.863,6,-9.241,0,0.136,0.197,0,0.143,0.496,120.953,297907,4
1992-07-25,16,Giving Him Something He Can Feel,En Vogue,6GKaYgABRoeO8ZofVq7zS2,False,21,16,8,0.496,0.298,9,-10.175,0,0.0405,0.306,1.72e-06,0.0875,0.705,203.824,235707,3
1992-07-25,17,Damn I Wish I Was Your Lover,Sophie B. Hawkins,6GKaYgABRoeO8ZofVq7zS2,False,12,5,15,0.546,0.781,11,-9.439,0,0.0506,0.22,1.51e-05,0.363,0.539,95.032,323267,4
1992-07-25,18,Come & Talk To Me,Jodeci,6GKaYgABRoeO8ZofVq7zS2,False,18,16,17,0.609,0.57,7,-14.773,1,0.0912,0.223,0,0.366,0.84,172.095,276267,4
1992-07-25,19,Friday I'm In Love,The Cure,6GKaYgABRoeO8ZofVq7zS2,False,19,19,7,0.526,0.762,0,-12.437,0,0.0342,0.000972,0.000116,0.338,0.505,136.203,214400,4
1992-07-25,20,My Lovin' (You're Never Gonna Get It),En Vogue,6GKaYgABRoeO8ZofVq7zS2,False,20,2,19,0.767,0.839,8,-5.519,1,0.0613,0.0318,9.31e-06,0.111,0.461,98.055,281613,4
1992-07-25,21,Keep On Walkin',CeCe Peniston,6GKaYgABRoeO8ZofVq7zS2,False,22,21,10,0.766,0.712,6,-12.111,1,0.0427,0.00291,0.0201,0.226,0.655,104.974,270838,4
1992-07-25,22,Jump,Kris Kross,6GKaYgABRoeO8ZofVq7zS2,False,15,1,17,0.749,0.745,2,-10.625,1,0.164,0.000501,0.00403,0.333,0.481,101.972,195107,4
1992-07-25,23,Take This Heart,Richard Marx,6GKaYgABRoeO8ZofVq7zS2,False,27,23,7,0.612,0.694,0,-8.277,1,0.026,0.00142,0.0012,0.0749,0.551,115.53,250667,4
1992-07-25,24,Move This,Technotronic Featuring Ya Kid K,6GKaYgABRoeO8ZofVq7zS2,False,26,24,7,0.782,0.96,10,-4.047,1,0.0347,0.0637,0,0.0788,0.979,120.682,296986,4
1992-07-25,25,Hold On My Heart,Genesis,6GKaYgABRoeO8ZofVq7zS2,False,23,12,13,0.465,0.365,5,-12.633,0,0.0295,0.618,0.0113,0.0747,0.265,171.904,276373,4
1992-07-25,26,The One,Elton John,6GKaYgABRoeO8ZofVq7zS2,False,30,26,5,0.426,0.647,10,-8.228,1,0.0279,0.0163,0.00118,0.106,0.311,75.944,353160,4
1992-07-25,27,Just For Tonight,Vanessa Williams,6GKaYgABRoeO8ZofVq7zS2,False,28,26,10,0.57,0.352,9,-15.484,1,0.0311,0.324,0,0.0969,0.318,141.969,268600,4
1992-07-25,28,They Want EFX,Das EFX,6GKaYgABRoeO8ZofVq7zS2,False,25,25,12,0.755,0.459,5,-12.84,0,0.358,0.115,0,0.0851,0.597,98.454,221400,4
1992-07-25,29,Good Stuff,The B-52s,6GKaYgABRoeO8ZofVq7zS2,False,29,29,6,0.754,0.78,1,-5.801,0,0.0299,0.0038,0.00226,0.0595,0.923,120.143,355093,4
1992-07-25,30,Slow Motion,Color Me Badd,6GKaYgABRoeO8ZofVq7zS2,False,24,18,12,0.783,0.885,6,-7.747,0,0.0648,0.00525,0.752,0.0435,0.941,92.042,265667,4
1992-07-25,31,Jam,Michael Jackson,6GKaYgABRoeO8ZofVq7zS2,False,35,31,3,0.884,0.96,2,-4.613,1,0.0721,0.0487,0.0227,0.271,0.617,116.273,338173,4
1992-07-25,32,"End Of The Road (From ""Boomerang"")",Boyz II Men,6GKaYgABRoeO8ZofVq7zS2,False,53,32,2,0.64,0.427,5,-9.29,0,0.0241,0.0664,0,0.0579,0.529,149.703,351467,3
1992-07-25,33,Stay,Shakespear's Sister,6GKaYgABRoeO8ZofVq7zS2,False,50,33,4,0.494,0.658,8,-5.84,1,0.0487,0.674,4.11e-05,0.0907,0.19,96.73,229000,4
1992-07-25,34,I Will Remember You,Amy Grant,6GKaYgABRoeO8ZofVq7zS2,False,32,20,14,0.513,0.658,0,-6.432,1,0.0277,0.0329,9.3e-05,0.0805,0.336,177.625,300560,4
1992-07-25,35,All I Want,Toad The Wet Sprocket,6GKaYgABRoeO8ZofVq7zS2,False,43,35,5,0.6,0.811,5,-7.693,1,0.0788,0.0558,6.82e-06,0.109,0.622,124.303,196116,4
1992-07-25,36,Make Love Like A Man,Def Leppard,6GKaYgABRoeO8ZofVq7zS2,False,36,36,5,0.389,0.916,2,-6.481,1,0.0513,0.0408,0,0.28,0.582,205.733,255624,4
1992-07-25,37,Live And Learn,Joe Public,6GKaYgABRoeO8ZofVq7zS2,False,31,4,20,0.744,0.894,11,-9.448,0,0.0711,0.0794,0,0.139,0.683,106.637,262333,4
1992-07-25,38,Why,Annie Lennox,6GKaYgABRoeO8ZofVq7zS2,False,34,34,11,0.531,0.471,0,-9.267,1,0.0236,0.28,6.22e-05,0.133,0.119,90.941,293838,4
1992-07-25,39,Jump Around,House Of Pain,6GKaYgABRoeO8ZofVq7zS2,False,49,39,5,0.854,0.71,4,-6.32,0,0.0793,0.0113,8.72e-05,0.166,0.818,106.894,214947,4
1992-07-25,40,Everybody's Free (To Feel Good),Rozalla,6GKaYgABRoeO8ZofVq7zS2,False,42,40,5,0.561,0.914,8,-4.415,0,0.047,0.0345,0.000155,0.0978,0.406,130.06,191637,4
1992-07-25,41,"You Remind Me (From ""Strictly Business"")",Mary J. Blige,6GKaYgABRoeO8ZofVq7zS2,False,46,41,6,0.656,0.768,11,-4.949,0,0.0593,0.259,4.16e-06,0.0944,0.507,95.067,258093,4
1992-07-25,42,Do It To Me,Lionel Richie,6GKaYgABRoeO8ZofVq7zS2,False,33,21,13,0.696,0.515,0,-10.286,1,0.028,0.197,0.000115,0.462,0.501,91.48,270507,4
1992-07-25,43,Save The Best For Last,Vanessa Williams,6GKaYgABRoeO8ZofVq7zS2,False,37,1,26,0.528,0.234,3,-15.784,1,0.0283,0.641,0,0.183,0.191,95.911,218733,4
1992-07-25,44,Tears In Heaven,Eric Clapton,6GKaYgABRoeO8ZofVq7zS2,False,38,2,25,0.695,0.336,9,-12.999,1,0.0313,0.8,0.00264,0.701,0.422,79.109,280000,4
1992-07-25,45,Honey Love,R. Kelly & Public Announcement,6GKaYgABRoeO8ZofVq7zS2,False,39,39,10,0.693,0.65,4,-4.204,1,0.0441,0.109,0,0.167,0.452,71.034,243973,4
1992-07-25,46,"Mr. Loverman (From ""Deep Cover"")",Shabba Ranks,6GKaYgABRoeO8ZofVq7zS2,False,45,45,7,0.732,0.653,7,-9.143,1,0.159,0.0118,5.77e-05,0.116,0.669,172.948,336467,4
1992-07-25,47,Sometimes I Rhyme Slow,Nice & Smooth,6GKaYgABRoeO8ZofVq7zS2,False,47,44,12,0.797,0.563,6,-14.138,0,0.123,0.119,0.323,0.0969,0.687,108.369,172267,4
1992-07-25,48,Even Better Than The Real Thing,U2,6GKaYgABRoeO8ZofVq7zS2,False,52,48,3,0.505,0.759,7,-6.871,1,0.0303,0.00112,0.000365,0.168,0.65,128.63,221373,4
1992-07-25,49,Just Take My Heart,Mr. Big,6GKaYgABRoeO8ZofVq7zS2,False,40,16,16,0.508,0.362,0,-9.369,1,0.0349,0.483,0,0.0996,0.207,168.586,265307,4
1992-07-25,50,Back To The Hotel,N2Deep,6GKaYgABRoeO8ZofVq7zS2,False,61,50,3,0.69,0.38,9,-12.845,1,0.0609,0.000168,0.000533,0.136,0.305,201.697,304280,4
1992-07-25,51,Please Don't Go,K.W.S.,6GKaYgABRoeO8ZofVq7zS2,False,59,51,6,0.725,0.954,8,-7.234,1,0.0375,0.0437,0.0857,0.132,0.594,120.248,373600,4
1992-07-25,52,Slowly,Stacy Earl,6GKaYgABRoeO8ZofVq7zS2,False,58,52,6,0.539,0.407,8,-13.017,1,0.0264,0.639,6.95e-05,0.0613,0.264,80.156,286667,4
1992-07-25,53,You Won't See Me Cry,Wilson Phillips,6GKaYgABRoeO8ZofVq7zS2,False,41,20,12,0.47,0.442,9,-11.142,1,0.0266,0.582,1.79e-06,0.0899,0.129,76.765,233533,4
1992-07-25,54,One,U2,6GKaYgABRoeO8ZofVq7zS2,False,51,10,20,0.392,0.534,0,-8.793,1,0.0369,0.245,0.00104,0.155,0.325,181.305,276187,4
1992-07-25,55,Thought I'd Died And Gone To Heaven,Bryan Adams,6GKaYgABRoeO8ZofVq7zS2,False,55,13,20,0.44,0.738,4,-8.193,1,0.0295,0.0657,0,0.0988,0.535,174.376,348400,4
1992-07-25,56,In The Closet,Michael Jackson,6GKaYgABRoeO8ZofVq7zS2,False,44,6,14,0.877,0.781,11,-3.775,0,0.0691,0.117,0.000746,0.149,0.606,110.494,390573,4
1992-07-25,57,Twilight Zone,2 Unlimited,6GKaYgABRoeO8ZofVq7zS2,False,60,57,7,0.709,0.907,6,-12.405,1,0.0452,0.0631,0.00186,0.138,0.746,127.9,246675,4
1992-07-25,58,They Reminisce Over You (T.R.O.Y.),Pete Rock & C.L. Smooth,6GKaYgABRoeO8ZofVq7zS2,False,63,58,5,0.761,0.683,2,-10.889,1,0.164,0.141,0,0.342,0.671,101.787,286693,4
1992-07-25,59,Scenario,A Tribe Called Quest,6GKaYgABRoeO8ZofVq7zS2,False,57,57,8,0.795,0.6,2,-14.004,1,0.341,0.112,0.000171,0.111,0.633,101.78,250133,4
1992-07-25,60,Remedy,The Black Crowes,6GKaYgABRoeO8ZofVq7zS2,False,54,48,7,0.411,0.978,10,-3.801,0,0.0532,0.00138,3.97e-06,0.0782,0.353,160.478,322640,4
1992-07-25,61,I Miss You,Joe Public,6GKaYgABRoeO8ZofVq7zS2,False,70,61,4,0.64,0.492,5,-10.494,0,0.0319,0.0306,0,0.227,0.324,74.703,284827,4
1992-07-25,62,"I Wanna Love You (From ""Class Act"")",Jade,6GKaYgABRoeO8ZofVq7zS2,False,79,62,3,0.731,0.707,0,-9.79,0,0.0769,0.0596,0.00654,0.264,0.838,200.306,271400,4
1992-07-25,63,Restless Heart,Peter Cetera,6GKaYgABRoeO8ZofVq7zS2,False,78,63,3,0.558,0.915,2,-8.501,1,0.0444,0.116,8.5e-06,0.313,0.758,184.78,249107,4
1992-07-25,64,The Way I Feel,Tag,6GKaYgABRoeO8ZofVq7zS2,False,76,64,4,0.59,0.661,9,-11.361,0,0.0304,0.0401,6.95e-05,0.0464,0.406,93.104,249067,4
1992-07-25,65,Helluva,Brotherhood Creed,6GKaYgABRoeO8ZofVq7zS2,False,64,53,15,0.804,0.864,6,-7.148,1,0.125,0.0658,0,0.0609,0.765,105.414,249827,4
1992-07-25,66,Sexy MF,Prince And The N.P.G.,4JUgmt3hxaO5gLXq4puZKK,True,0,66,1,0.77,0.744,2,-8.133,1,0.0938,0.169,0.00224,0.0537,0.547,106.147,326093,4
1992-07-25,67,Everything About You,Ugly Kid Joe,4JUgmt3hxaO5gLXq4puZKK,False,62,9,17,0.501,0.803,1,-8.449,1,0.0547,0.00881,1.78e-06,0.107,0.738,122.458,255160,4
1992-07-25,68,James Brown Is Dead,L.A. Style,4JUgmt3hxaO5gLXq4puZKK,False,68,59,15,0.599,0.976,0,-7.649,0,0.0859,0.0013,0.787,0.383,0.501,130.724,344400,4
1992-07-25,69,"Money Can't Buy You Love (From ""Mo' Money"")",Ralph Tresvant,4JUgmt3hxaO5gLXq4puZKK,False,82,69,2,0.68,0.654,5,-11.977,0,0.0489,0.0274,0.84,0.0771,0.85,103.964,369152,4
1992-07-25,70,Tequila,A.L.T. And The Lost Civilization,4JUgmt3hxaO5gLXq4puZKK,False,80,70,3,0.782,0.704,10,-10.342,0,0.158,0.00603,1.23e-05,0.944,0.599,93.517,243800,4
1992-07-25,71,Strawberry Letter 23,Tevin Campbell,4JUgmt3hxaO5gLXq4puZKK,False,56,53,8,0.812,0.834,6,-7.722,1,0.0375,0.0663,0.000443,0.115,0.817,106.425,196880,4
1992-07-25,72,Please Don't Go,Boyz II Men,4JUgmt3hxaO5gLXq4puZKK,False,75,49,17,0.644,0.663,6,-12.847,0,0.0454,0.197,0,0.302,0.743,135.622,263960,4
1992-07-25,73,Jus Lyke Compton,DJ Quik,24M44x9vVlOlXipjJJcAY7,True,0,73,1,0.805,0.566,7,-12.604,1,0.177,0.055,0,0.582,0.658,94.65,251373,4
1992-07-25,74,Silent Prayer,Shanice,24M44x9vVlOlXipjJJcAY7,False,72,31,14,0.466,0.405,9,-13.259,0,0.0365,0.136,0,0.102,0.159,141.758,303867,3
1992-07-25,77,Brainstorming,M.C. Brains,,False,69,69,4,0.151,0.044,2,-20.621,1,0.0434,0.921,0.674,0.0816,0.0386,136.865,100955,3
1992-07-25,78,We Are The Champions,Queen,,False,87,4,30,0.268,0.459,7,-6.948,0,0.0346,0.378,0,0.119,0.172,64.223,179200,4
1992-07-25,79,Maria,TKA,,False,73,44,17,0.658,0.887,6,-8.444,0,0.0638,0.0263,0.329,0.07,0.538,118.098,417120,4
1992-07-25,80,Strobelite Honey,Black Sheep,,False,92,80,4,0.888,0.753,8,-13.766,0,0.275,0.176,1.66e-05,0.116,0.747,115.15,185560,4
1992-07-25,81,Victim Of The Ghetto,The College Boyz,,False,77,68,10,0.673,0.649,1,-9.695,1,0.212,0.0282,0,0.0969,0.693,178.108,293440,4
1992-07-25,82,Crossover,EPMD,5JKSty49E9iv1Tj6lfx68n,True,0,82,1,0.614,0.621,6,-10.43,0,0.362,0.0308,0.000316,0.145,0.643,202.813,228760,4
1992-07-25,83,Reach For The Sky,Firehouse,5JKSty49E9iv1Tj6lfx68n,False,84,83,4,0.562,0.891,1,-8.283,1,0.0361,1.21e-05,0.0588,0.0858,0.524,132.569,286733,4
1992-07-25,84,Why Me Baby?,Keith Sweat,5JKSty49E9iv1Tj6lfx68n,False,74,44,16,0.718,0.524,5,-10.215,0,0.0282,0.0161,6.1e-06,0.195,0.345,132.782,327973,4
1992-07-25,85,T.L.C.,Linear,5JKSty49E9iv1Tj6lfx68n,False,65,30,12,0.252,0.821,4,-6.916,1,0.0346,0.000372,0.635,0.204,0.452,86.312,190773,4
1992-07-25,86,Let's Get Rocked,Def Leppard,5JKSty49E9iv1Tj6lfx68n,False,83,15,16,0.564,0.888,5,-6.763,1,0.0325,0.0109,6.68e-05,0.177,0.526,91.989,295957,4
1992-07-25,87,All You've Got,RTZ,5JKSty49E9iv1Tj6lfx68n,False,67,56,8,0.684,0.655,9,-10.417,1,0.0335,0.215,0,0.0676,0.682,110.33,244267,4
1992-07-25,88,Another Minute,Cause And Effect,5JKSty49E9iv1Tj6lfx68n,False,97,88,2,0.633,0.9,11,-10.731,0,0.0345,0.0641,0.000134,0.264,0.961,125.922,215440,4
1992-07-25,89,Boot Scootin' Boogie,Brooks & Dunn,7Fq9RwQxSn3kW85PrDUf0M,True,0,89,1,0.656,0.817,11,-4.296,0,0.0435,0.22,0,0.304,0.862,130.448,198227,4
1992-07-25,90,Not The Only One,Bonnie Raitt,7Fq9RwQxSn3kW85PrDUf0M,False,91,34,15,0.726,0.731,5,-7.264,1,0.0383,0.411,7.18e-05,0.084,0.513,115.905,250533,4
1992-07-25,91,Wherever I May Roam,Metallica,7Fq9RwQxSn3kW85PrDUf0M,False,95,91,2,0.554,0.816,11,-7.871,1,0.0353,0.000526,0.000711,0.0988,0.362,131.409,404240,4
1992-07-25,92,Forever In Your Eyes,Mint Condition,7Fq9RwQxSn3kW85PrDUf0M,False,85,81,6,0.604,0.493,7,-11.134,1,0.0387,0.159,1.94e-06,0.719,0.408,139.678,312693,4
1992-07-25,93,So What'cha Want,Beastie Boys,7Fq9RwQxSn3kW85PrDUf0M,False,93,93,4,0.7,0.942,5,-7.355,0,0.237,0.0469,2.93e-05,0.0666,0.766,171.37,216941,4
1992-07-25,94,57 Channels (And Nothin' On),Bruce Springsteen,7Fq9RwQxSn3kW85PrDUf0M,False,81,68,6,0.894,0.316,7,-18.975,1,0.0978,0.608,0.0153,0.111,0.64,132.061,145467,4
1992-07-25,95,Closer To Me,The Outfield,7Fq9RwQxSn3kW85PrDUf0M,False,66,43,11,0.675,0.61,9,-12.398,1,0.0355,0.152,0.00135,0.124,0.821,120.98,197333,4
1992-07-25,96,Give It Away,Red Hot Chili Peppers,7Fq9RwQxSn3kW85PrDUf0M,False,0,76,7,0.666,0.936,7,-9.919,1,0.0476,0.00244,0.086,0.153,0.776,91.577,282907,4
1992-07-25,97,Who's Got Your Love,Nyasia,7Fq9RwQxSn3kW85PrDUf0M,False,99,95,3,0.721,0.923,1,-8.19,1,0.0881,0.0498,0.000224,0.286,0.882,122.865,294800,4
1992-07-25,98,Fall In Love Again,Eddie Money,7Fq9RwQxSn3kW85PrDUf0M,False,86,54,11,0.596,0.521,4,-8.357,1,0.0298,0.605,5.48e-06,0.0981,0.519,146.951,262333,4
1992-07-25,99,I've Got Mine,Glenn Frey,3wEEbdzItMD8VgTOfPbzTF,True,0,99,1,0.654,0.747,9,-9.62,0,0.0253,0.0101,0.189,0.0585,0.919,116.047,335893,4
1992-07-25,100,Take Me In Your Arms,Lil Suzy,3wEEbdzItMD8VgTOfPbzTF,False,98,94,4,0.774,0.754,7,-5.147,1,0.0488,0.272,9.05e-05,0.115,0.838,125.973,232933,4
