date,position,title,artist,spotify_id,is_new,last_pos,peak_pos,weeks,danceability,energy,key,loudness,mode,speechiness,acousticness,instrumentalness,liveness,valence,tempo,duration_ms,time_signature
1997-03-08,1,Wannabe,Spice Girls,,False,1,1,7,0.768,0.864,11,-6.145,1,0.0324,0.101,0,0.162,0.891,110.008,173027,4
1997-03-08,3,Un-Break My Heart,Toni Braxton,,False,2,1,20,0.625,0.426,2,-8.392,0,0.0271,0.413,0,0.116,0.112,110.018,270333,4
1997-03-08,5,"I Believe I Can Fly (From ""Space Jam"")",R. Kelly,,False,4,2,13,0.572,0.538,7,-5.241,1,0.0279,0.151,0,0.0754,0.0584,120.455,284800,4
1997-03-08,6,In My Bed,Dru Hill,,False,7,6,9,0.828,0.654,10,-7.674,0,0.226,0.106,0,0.0689,0.817,95.254,242360,4
1997-03-08,7,Don't Let Go (Love),En Vogue,,False,6,2,18,0.618,0.688,5,-5.867,0,0.0477,0.409,6.32e-06,0.3,0.561,78.311,291880,4
1997-03-08,8,Every Time I Close My Eyes,Babyface,,False,10,8,6,0.654,0.417,5,-7.699,1,0.025,0.0624,0,0.0963,0.279,143.676,296267,4
1997-03-08,9,"Don't Cry For Me Argentina (From ""Evita"")",Madonna,,False,8,8,3,0.217,0.146,11,-13.9,1,0.0373,0.901,4.49e-06,0.222,0.0847,75.922,331467,4
1997-03-08,10,Nobody,Keith Sweat Featuring Athena Cage,,False,9,3,23,0.699,0.492,9,-9.449,0,0.0318,0.484,0,0.0482,0.388,117.907,264773,4
1997-03-08,11,"I Believe In You And Me (From ""The Preacher's Wife"")",Whitney Houston,,False,11,4,11,0.434,0.268,1,-11.52,0,0.0355,0.785,0,0.0881,0.121,119.804,241960,4
1997-03-08,12,Get It Together,702,,False,17,12,4,0.791,0.186,10,-11.367,1,0.0333,0.625,2.67e-06,0.0574,0.317,114.061,291400,4
1997-03-08,13,Cold Rock A Party,MC Lyte,,False,13,11,15,0.896,0.744,11,-5.239,0,0.246,0.192,1.19e-06,0.108,0.744,92.91,247307,4
1997-03-08,14,Ooh Aah... Just A Little Bit,Gina G,,False,14,12,15,0.647,0.942,1,-7.101,1,0.0341,0.626,0.168,0.0411,0.937,130.978,203120,4
1997-03-08,15,On & On,Erykah Badu,,False,15,12,7,0.762,0.403,11,-10.423,0,0.158,0.0396,0.0113,0.256,0.346,80.476,226133,4
1997-03-08,16,Hard To Say I'm Sorry,Az Yet Featuring Peter Cetera,,False,21,16,3,0.537,0.413,5,-9.949,0,0.0366,0.604,0,0.16,0.22,127.77,195693,4
1997-03-08,17,No Diggity,BLACKstreet (Featuring Dr. Dre),,False,16,1,22,0.849,0.379,1,-10.546,0,0.0614,0.139,0.0917,0.0448,0.44,89.007,267053,4
1997-03-08,18,Barely Breathing,Duncan Sheik,,False,19,18,15,0.482,0.807,0,-6.976,1,0.0457,0.0281,0,0.177,0.516,187.918,254547,4
1997-03-08,19,Da' Dip,Freak Nasty,,False,24,19,10,0.953,0.428,8,-17.199,1,0.298,0.0079,0.0302,0.224,0.723,131.737,237000,4
1997-03-08,20,Discotheque,U2,,False,12,10,3,0.581,0.825,4,-9.689,0,0.0373,0.000859,0.095,0.11,0.663,120.362,318667,4
1997-03-08,22,I'm Still In Love With You,New Edition,,False,18,7,18,0.741,0.519,8,-4.683,0,0.0351,0.426,0,0.318,0.418,134.294,279667,4
1997-03-08,23,I Want You,Savage Garden,,False,31,23,2,0.628,0.871,7,-6.44,1,0.0363,0.0077,1.64e-06,0.392,0.615,106.101,232067,4
1997-03-08,24,Please Don't Go,No Mercy,,False,28,24,5,0.715,0.838,7,-10.541,0,0.0341,0.169,3.67e-05,0.395,0.962,124.625,240093,4
1997-03-08,25,I Like It,The Blackout Allstars,,False,25,25,14,0.71,0.927,5,-6.433,0,0.0447,3.69e-05,0.203,0.651,0.616,128.069,291027,4
1997-03-08,26,What's On Tonight,Montell Jordan,,False,33,26,4,0.826,0.447,5,-11.535,1,0.0442,0.33,3.2e-06,0.126,0.434,111.806,276653,4
1997-03-08,28,Where Do You Go,No Mercy,,False,23,5,36,0.734,0.828,10,-11.018,0,0.0318,0.0346,0.118,0.071,0.964,127.06,272093,4
1997-03-08,30,Return Of The Mack,Mark Morrison,,False,42,30,2,0.715,0.833,2,-5.379,1,0.108,0.00631,0,0.164,0.612,95.487,213093,4
1997-03-08,31,Mouth,Merril Bainbridge,,False,20,4,27,0.695,0.499,1,-9.201,1,0.218,0.702,5.85e-05,0.154,0.78,175.896,205733,4
1997-03-08,32,Firestarter,The Prodigy,,False,32,32,8,0.545,0.948,11,-5.098,1,0.0779,0.00335,0.364,0.226,0.355,141.507,279800,4
1997-03-08,33,When You Love A Woman,Journey,,False,26,12,20,0.513,0.514,1,-5.819,1,0.0274,0.255,0,0.258,0.216,132.157,246987,4
1997-03-08,34,What They Do,The Roots,,False,34,34,9,0.885,0.414,0,-10.539,1,0.168,0.341,0.000289,0.0891,0.683,92.727,357200,4
1997-03-08,35,If It Makes You Happy,Sheryl Crow,,False,27,10,25,0.543,0.681,7,-7.091,1,0.0289,0.0482,8.43e-05,0.104,0.292,95.415,323400,4
1997-03-08,36,I Love You Always Forever,Donna Lewis,,False,30,2,38,0.744,0.453,5,-11.977,1,0.0348,0.627,0.421,0.0898,0.122,103.773,239960,4
1997-03-08,37,"Watch Me Do My Thing (From ""All That"")",Immature Featuring Smooth And Ed From Good Burger,,False,38,32,6,0.697,0.853,8,-6.264,1,0.0528,0.00189,1.37e-06,0.243,0.765,93.799,231533,4
1997-03-08,38,Let Me Clear My Throat,DJ Kool,,False,51,38,6,0.697,0.901,7,-7.154,1,0.259,0.169,0,0.356,0.535,103.145,290160,4
1997-03-08,39,Change The World,Eric Clapton,,False,39,5,34,0.721,0.558,9,-8.8,1,0.0246,0.492,0.00563,0.113,0.542,96.887,234867,4
1997-03-08,40,This Is Your Night,Amber,,False,40,24,39,0.674,0.908,9,-3.262,0,0.0325,0.0714,0.000104,0.121,0.861,127.99,238160,4
1997-03-08,41,Say... If You Feel Alright,Crystal Waters,,False,54,41,3,0.757,0.843,1,-7.222,1,0.0332,0.0424,0.377,0.0742,0.717,113.21,236133,4
1997-03-08,42,Whateva Man,Redman,,False,44,42,6,0.581,0.712,6,-7.803,0,0.476,0.27,0,0.895,0.709,172.573,188547,4
1997-03-08,43,Naked Eye,Luscious Jackson,,False,46,43,12,0.737,0.657,4,-10.962,0,0.0284,0.0863,0.0339,0.0953,0.76,131.022,280693,4
1997-03-08,44,Twisted,Keith Sweat,,False,47,2,38,0.615,0.514,11,-9.759,1,0.0466,0.393,0,0.248,0.822,175.849,260667,4
1997-03-08,45,It's All Coming Back To Me Now,Celine Dion,,False,35,2,30,0.384,0.438,0,-9.149,1,0.0362,0.753,0,0.101,0.287,87.903,456867,4
1997-03-08,46,No Time,Lil' Kim Featuring Puff Daddy,,False,41,18,18,0.627,0.814,5,-5.863,0,0.304,0.256,1.15e-06,0.285,0.799,90.42,300667,4
1997-03-08,47,"Last Night (From ""The Nutty Professor"")",Az Yet,,False,45,9,29,0.555,0.543,3,-8.874,0,0.0272,0.428,0,0.105,0.359,164.021,269027,4
1997-03-08,49,Pony,Ginuwine,,False,43,6,27,0.749,0.605,8,-9.359,0,0.086,0.00186,0.0381,0.115,0.966,142.024,251733,4
1997-03-08,50,Luchini aka (This Is It),Camp Lo,,False,50,50,10,0.721,0.949,6,-5.685,1,0.278,0.0495,0,0.327,0.835,83.028,240093,4
1997-03-08,51,Just Another Day,John Mellencamp,,False,53,51,3,0.715,0.738,0,-5.674,1,0.0325,0.096,0.000136,0.0978,0.896,144.145,207893,4
1997-03-08,52,"I Finally Found Someone (From ""The Mirror Has Two Faces"")",Barbra Streisand & Bryan Adams,,False,36,8,16,0.562,0.224,6,-15.069,1,0.0289,0.674,0,0.127,0.0707,139.009,221973,4
1997-03-08,53,Falling In Love (Is Hard On The Knees),Aerosmith,,False,62,53,2,0.612,0.861,7,-4.571,0,0.0293,0.0144,0,0.119,0.888,116.663,205800,4
1997-03-08,54,Desperately Wanting,Better Than Ezra,,False,58,48,12,0.494,0.913,0,-5.289,1,0.0378,0.000165,0.00898,0.247,0.478,99.92,277493,4
1997-03-08,55,"Let It Go (From ""Set It Off"")",Ray J,0WSjtXsydoRDW4yS5WyiM2,True,0,55,1,0.626,0.922,9,-2.037,1,0.0714,0.00789,0.000598,0.277,0.554,139.987,184811,4
1997-03-08,56,It's Your Body,Johnny Gill Featuring Roger Troutman,0WSjtXsydoRDW4yS5WyiM2,False,52,43,13,0.647,0.536,0,-10.733,1,0.045,0.524,0,0.0798,0.316,125.222,333867,4
1997-03-08,57,Do G's Get To Go To Heaven?,Richie Rich,0WSjtXsydoRDW4yS5WyiM2,False,79,57,2,0.673,0.427,2,-10.131,1,0.248,0.602,0.000663,0.096,0.444,84.127,359493,4
1997-03-08,58,Cupid,112,0WSjtXsydoRDW4yS5WyiM2,False,76,58,2,0.685,0.38,8,-11.219,1,0.112,0.373,0,0.0371,0.87,175.562,252267,4
1997-03-08,59,The Theme (It's Party Time),Tracey Lee,0WSjtXsydoRDW4yS5WyiM2,False,63,59,4,0.75,0.658,6,-8.658,0,0.305,0.0108,0,0.125,0.427,99.113,272800,4
1997-03-08,60,"You Must Love Me (From ""Evita"")",Madonna,0WSjtXsydoRDW4yS5WyiM2,False,49,18,17,0.357,0.161,10,-14.789,1,0.0436,0.926,3.47e-05,0.146,0.267,88.746,170840,4
1997-03-08,61,"Nothin' But The Cavi Hit (From ""Rhyme & Reason"")",Mack 10 & Tha Dogg Pound,0WSjtXsydoRDW4yS5WyiM2,False,57,38,13,0.852,0.741,1,-5.435,0,0.134,0.0247,0.00106,0.0974,0.535,97.894,241360,4
1997-03-08,62,Thirty-Three,The Smashing Pumpkins,0WSjtXsydoRDW4yS5WyiM2,False,55,39,15,0.607,0.333,6,-12.717,1,0.0324,0.000968,0.4,0.151,0.0802,126.619,250293,4
1997-03-08,63,Talk To Me,Wild Orchid,0WSjtXsydoRDW4yS5WyiM2,False,81,63,2,0.726,0.829,8,-5.042,1,0.04,0.0389,4.49e-05,0.33,0.778,119.634,288800,4
1997-03-08,64,"It's Alright, It's Ok",Leah Andreone,0WSjtXsydoRDW4yS5WyiM2,False,67,64,7,0.734,0.67,0,-5.838,0,0.0321,0.0113,1.25e-06,0.224,0.656,110.022,265133,4
1997-03-08,65,The Freshmen,The Verve Pipe,0WSjtXsydoRDW4yS5WyiM2,False,69,65,3,0.571,0.505,1,-9.312,0,0.0238,0.0757,1.04e-05,0.109,0.276,99.562,269467,4
1997-03-08,66,"Space Jam (From ""Space Jam"")",Quad City DJ's,0WSjtXsydoRDW4yS5WyiM2,False,61,37,12,0.798,0.952,11,-4.78,0,0.0401,0.064,0.000513,0.287,0.843,132.031,304960,4
1997-03-08,67,"Fly Like An Eagle (From ""Space Jam"")",Seal,0WSjtXsydoRDW4yS5WyiM2,False,59,10,12,0.623,0.836,7,-4.729,1,0.0595,0.00697,3.41e-06,0.0687,0.631,97.14,254773,4
1997-03-08,68,I'm Not Giving You Up,Gloria Estefan,0WSjtXsydoRDW4yS5WyiM2,False,60,40,14,0.753,0.488,10,-8.259,0,0.0247,0.769,0,0.0851,0.607,97.943,258893,4
1997-03-08,69,Barrel Of A Gun,Depeche Mode,0WSjtXsydoRDW4yS5WyiM2,False,56,47,3,0.522,0.949,4,-5.216,1,0.073,0.0221,0.00286,0.0615,0.707,165.872,336293,4
1997-03-08,70,Tears,The Isley Brothers,0WSjtXsydoRDW4yS5WyiM2,False,65,55,9,0.532,0.516,1,-9.847,1,0.103,0.755,0.00019,0.328,0.545,150.372,285600,4
1997-03-08,71,I Always Feel Like (Somebody's Watching Me),Tru Featuring Ice Cream Man (Master P),0WSjtXsydoRDW4yS5WyiM2,False,71,71,5,0.832,0.456,6,-10.108,0,0.193,0.00201,0.00351,0.366,0.285,93.585,306480,4
1997-03-08,72,Gangstas Make The World Go Round,Westside Connection,2vytyWClpsahqcL6NibSE3,True,0,72,1,0.754,0.575,9,-8.22,1,0.366,0.0977,0,0.474,0.561,180.389,272834,4
1997-03-08,73,If We Fall In Love Tonight,Rod Stewart,2vytyWClpsahqcL6NibSE3,False,66,54,17,0.51,0.44,2,-11.015,1,0.0293,0.125,0,0.0994,0.135,74.8,281200,4
1997-03-08,74,Get Up,Lost Boyz,2vytyWClpsahqcL6NibSE3,False,70,60,10,0.813,0.572,9,-6.469,1,0.162,0.0266,0,0.0372,0.655,94.825,243760,4
1997-03-08,75,Don't Stop Movin',Livin' Joy,2vytyWClpsahqcL6NibSE3,False,77,70,7,0.703,0.723,2,-10.816,0,0.0445,0.0287,0.00337,0.297,0.867,129.992,215227,4
1997-03-08,76,This Is For The Lover In You,"Babyface Featuring LL Cool J, Howard Hewett, Jody Watley & Jeffrey Daniels",2vytyWClpsahqcL6NibSE3,False,64,6,20,0.887,0.416,1,-7.346,1,0.0518,0.0295,1.06e-05,0.066,0.761,94.013,239733,4
1997-03-08,77,Knocks Me Off My Feet,Donell Jones,2vytyWClpsahqcL6NibSE3,False,78,49,19,0.469,0.594,7,-8.209,1,0.0403,0.0663,0,0.0806,0.485,167.223,222760,4
1997-03-08,78,We Danced Anyway,Deana Carter,2vytyWClpsahqcL6NibSE3,False,72,72,5,0.629,0.721,6,-3.722,1,0.0277,0.502,0,0.307,0.651,94.054,202533,4
1997-03-08,79,I'm Not Feeling You,Yvette Michele,2vytyWClpsahqcL6NibSE3,False,80,73,3,0.796,0.638,7,-3.923,1,0.11,0.00356,0.000209,0.0811,0.583,96.507,205600,4
1997-03-08,80,Come See Me,112,2vytyWClpsahqcL6NibSE3,False,68,33,18,0.701,0.378,5,-9.259,0,0.0664,0.0263,0,0.0649,0.604,83.796,265760,4
1997-03-08,81,It's All About U,SWV,2vytyWClpsahqcL6NibSE3,False,74,61,8,0.838,0.401,0,-9.808,1,0.0506,0.111,0.00811,0.0478,0.74,93.49,224800,4
1997-03-08,82,Here's Your Sign (Get The Picture),Bill Engvall With Special Guest Travis Tritt,2vytyWClpsahqcL6NibSE3,False,82,82,3,0.586,0.936,7,-6.605,1,0.549,0.337,0,0.928,0.732,178.068,220173,4
1997-03-08,83,Call Me,Le Click,6HfxbPl1fj8SQO1LlHrntC,True,0,83,1,0.674,0.849,1,-11.271,0,0.029,0.0126,1.37e-05,0.357,0.791,136.033,225400,4
1997-03-08,84,ATLiens,OutKast,6HfxbPl1fj8SQO1LlHrntC,False,86,35,15,0.918,0.734,11,-2.832,0,0.269,0.0296,8.01e-06,0.191,0.608,97.044,230693,4
1997-03-08,85,Never Leave Me Alone,Nate Dogg Featuring Snoop Doggy Dogg,6HfxbPl1fj8SQO1LlHrntC,False,73,33,18,0.821,0.549,8,-3.591,1,0.0371,0.0437,0,0.0737,0.963,100.023,360507,4
1997-03-08,86,Without Love,Donna Lewis,6HfxbPl1fj8SQO1LlHrntC,False,75,41,13,0.66,0.604,5,-8.318,1,0.0323,0.00646,0.0104,0.0907,0.779,91.671,222440,4
1997-03-08,87,Take Your Time,Tre,6HfxbPl1fj8SQO1LlHrntC,False,87,87,4,0.774,0.415,6,-9.97,0,0.0341,0.0298,0.432,0.137,0.0579,111.99,191262,4
1997-03-08,88,It's In Your Eyes,Phil Collins,6HfxbPl1fj8SQO1LlHrntC,False,85,79,4,0.707,0.741,5,-6.423,1,0.0261,0.0837,8.46e-05,0.229,0.658,121.774,182960,4
1997-03-08,89,Colour Of Love,Amber,6HfxbPl1fj8SQO1LlHrntC,False,83,74,8,0.642,0.754,1,-7.649,1,0.0272,0.116,0.0375,0.0601,0.736,127.025,212693,4
1997-03-08,90,King Nothing,Metallica,6HfxbPl1fj8SQO1LlHrntC,False,90,90,2,0.528,0.909,8,-5.712,1,0.0381,7.77e-05,0.00959,0.0891,0.349,112.083,328133,4
1997-03-08,91,Hero Of The Day,Metallica,6HfxbPl1fj8SQO1LlHrntC,False,91,60,18,0.351,0.9,8,-7.146,1,0.0357,0.000107,0.0262,0.11,0.777,116.023,261693,4
1997-03-08,92,Fired Up!,Funky Green Dogs,6HfxbPl1fj8SQO1LlHrntC,False,98,92,5,0.878,0.912,0,-7.716,1,0.0458,0.0601,0.00268,0.0707,0.966,122.953,485160,4
1997-03-08,93,Between You And Me,dc Talk,6HfxbPl1fj8SQO1LlHrntC,False,84,29,17,0.554,0.912,9,-4.315,0,0.0376,0.14,0.0421,0.064,0.515,99.712,298760,4
1997-03-08,94,"Ain't Nobody (From ""Beavis And Butt-Head Do America"")",LL Cool J,6HfxbPl1fj8SQO1LlHrntC,False,89,46,11,0.788,0.746,10,-6.405,0,0.185,0.0723,3.43e-06,0.279,0.519,99.873,277440,4
1997-03-08,95,Havana,Kenny G,3h94vp5QyqopAwVolKhM5l,True,0,95,1,0.403,0.328,0,-12.372,0,0.033,0.807,0.785,0.228,0.291,113.075,440400,4
1997-03-08,96,I Fell In Love,Rockell,3h94vp5QyqopAwVolKhM5l,False,92,61,18,0.825,0.858,9,-7.586,1,0.08,0.0102,0.0373,0.0543,0.92,135.027,273093,4
1997-03-08,97,Friends,John Michael Montgomery,3h94vp5QyqopAwVolKhM5l,False,88,69,11,0.62,0.401,9,-10.279,1,0.0288,0.23,0,0.0745,0.238,143.961,234000,4
1997-03-08,98,Without Your Love,Angelina,3h94vp5QyqopAwVolKhM5l,False,97,92,4,0.732,0.891,3,-7.476,0,0.0298,0.0678,0.446,0.089,0.943,134.034,231760,4
1997-03-08,99,I'll Be,Foxy Brown Featuring Jay-Z,3h94vp5QyqopAwVolKhM5l,False,95,78,4,0.855,0.614,11,-8.984,0,0.41,0.015,0,0.307,0.495,105.986,178600,4
