date,position,title,artist,spotify_id,is_new,last_pos,peak_pos,weeks,danceability,energy,key,loudness,mode,speechiness,acousticness,instrumentalness,liveness,valence,tempo,duration_ms,time_signature
2013-09-07,1,Blurred Lines,Robin Thicke Featuring T.I. + Pharrell,3adeqciqrsp6PQqR0hGDC7,False,1,1,19,0.853,0.599,7,-4.756,1,0.0411,0.00334,7.93e-06,0.0759,0.843,119.993,263827,4
2013-09-07,2,Roar,Katy Perry,3adeqciqrsp6PQqR0hGDC7,False,2,2,3,0.554,0.772,7,-4.821,0,0.0418,0.00487,6.6e-06,0.354,0.455,179.984,223546,4
2013-09-07,3,We Can't Stop,Miley Cyrus,3adeqciqrsp6PQqR0hGDC7,False,3,2,12,0.613,0.622,1,-5.794,0,0.0334,0.00882,0,0.37,0.484,80.003,231240,4
2013-09-07,4,Applause,Lady Gaga,3adeqciqrsp6PQqR0hGDC7,False,6,4,2,0.669,0.78,7,-4.287,0,0.053,0.0265,1.63e-06,0.143,0.738,139.945,212333,4
2013-09-07,5,Radioactive,Imagine Dragons,3adeqciqrsp6PQqR0hGDC7,False,4,3,52,0.448,0.784,9,-3.686,1,0.0627,0.106,0.000108,0.668,0.236,136.245,186813,4
2013-09-07,6,Holy Grail,Jay Z Featuring Justin Timberlake,3adeqciqrsp6PQqR0hGDC7,False,5,5,7,0.676,0.534,2,-6.901,0,0.0831,0.0594,8.59e-06,0.256,0.156,145.082,338413,4
2013-09-07,7,Wake Me Up!,Avicii,3adeqciqrsp6PQqR0hGDC7,False,11,7,9,0.532,0.783,2,-5.697,1,0.0523,0.0038,0.0012,0.161,0.643,124.08,247427,4
2013-09-07,8,Safe And Sound,Capital Cities,3adeqciqrsp6PQqR0hGDC7,False,10,8,17,0.655,0.819,0,-4.852,1,0.0316,0.000176,0.00374,0.104,0.766,117.956,192790,5
2013-09-07,9,Summertime Sadness,Lana Del Rey & Cedric Gervais,3adeqciqrsp6PQqR0hGDC7,False,15,9,7,0.572,0.81,1,-5.791,0,0.0558,0.0157,6.53e-06,0.13,0.11,126.052,214912,4
2013-09-07,10,Get Lucky,Daft Punk Featuring Pharrell Williams,3adeqciqrsp6PQqR0hGDC7,False,7,2,19,0.794,0.811,6,-8.966,0,0.038,0.0426,1.07e-06,0.101,0.862,116.047,248413,4
2013-09-07,11,Treasure,Bruno Mars,3adeqciqrsp6PQqR0hGDC7,False,8,5,15,0.874,0.692,5,-5.28,0,0.0431,0.0412,7.24e-05,0.324,0.937,116.017,178560,4
2013-09-07,12,Royals,Lorde,3adeqciqrsp6PQqR0hGDC7,False,17,12,8,0.674,0.428,7,-9.504,1,0.122,0.121,0,0.132,0.337,84.878,190185,4
2013-09-07,13,Clarity,Zedd Featuring Foxes,3adeqciqrsp6PQqR0hGDC7,False,12,8,23,0.509,0.781,8,-3.48,1,0.072,0.0398,0,0.0749,0.176,128.0,271427,4
2013-09-07,14,Cups (Pitch Perfect's When I'm Gone),Anna Kendrick,3adeqciqrsp6PQqR0hGDC7,False,9,6,35,0.878,0.455,0,-8.845,1,0.077,0.0462,0.00484,0.0353,0.79,129.953,128013,4
2013-09-07,15,Same Love,Macklemore & Ryan Lewis Featuring Mary Lambert,3adeqciqrsp6PQqR0hGDC7,False,14,11,24,0.688,0.473,8,-9.059,1,0.167,0.716,4.46e-05,0.104,0.299,84.958,318525,4
2013-09-07,16,Love Somebody,Maroon 5,3adeqciqrsp6PQqR0hGDC7,False,13,10,14,0.675,0.792,1,-6.303,1,0.0368,0.145,0,0.12,0.395,120.016,229813,4
2013-09-07,17,"Hold On, We're Going Home",Drake Featuring Majid Jordan,3adeqciqrsp6PQqR0hGDC7,False,24,17,3,0.777,0.414,6,-7.44,0,0.0946,0.00421,2.73e-05,0.0724,0.287,100.002,227880,4
2013-09-07,18,Best Song Ever,One Direction,3adeqciqrsp6PQqR0hGDC7,False,21,2,5,0.652,0.877,1,-2.986,1,0.0465,0.0227,0,0.0789,0.486,118.491,200107,4
2013-09-07,19,That's My Kind Of Night,Luke Bryan,3adeqciqrsp6PQqR0hGDC7,False,16,16,2,0.661,0.751,7,-2.909,1,0.0481,0.0571,0,0.105,0.875,109.995,190187,4
2013-09-07,20,Can't Hold Us,Macklemore & Ryan Lewis Featuring Ray Dalton,3adeqciqrsp6PQqR0hGDC7,False,18,1,29,0.641,0.922,2,-4.457,1,0.0786,0.0291,0,0.0862,0.847,146.078,258343,4
2013-09-07,21,Mirrors,Justin Timberlake,3adeqciqrsp6PQqR0hGDC7,False,20,2,28,0.574,0.512,5,-6.664,0,0.0503,0.234,0,0.0946,0.512,76.899,484147,4
2013-09-07,22,I Need Your Love,Calvin Harris Featuring Ellie Goulding,3adeqciqrsp6PQqR0hGDC7,False,23,16,19,0.695,0.869,8,-5.066,1,0.0483,0.41,0,0.237,0.58,124.989,234507,4
2013-09-07,23,Cruise,Florida Georgia Line Featuring Nelly,3adeqciqrsp6PQqR0hGDC7,False,19,4,47,0.457,0.948,10,-3.364,1,0.0354,0.0191,0,0.0536,0.878,148.0,208960,4
2013-09-07,24,"Gone, Gone, Gone",Phillip Phillips,3adeqciqrsp6PQqR0hGDC7,False,26,24,25,0.664,0.642,6,-5.961,1,0.038,0.129,0,0.114,0.501,118.002,209693,4
2013-09-07,25,Sail,AWOLNATION,3adeqciqrsp6PQqR0hGDC7,False,29,25,51,0.825,0.435,1,-9.582,1,0.0568,0.452,0.609,0.0953,0.243,119.038,259102,4
2013-09-07,26,The Way,Ariana Grande Featuring Mac Miller,3adeqciqrsp6PQqR0hGDC7,False,27,9,22,0.645,0.877,5,-3.208,0,0.113,0.294,0,0.0759,0.861,82.324,227027,4
2013-09-07,27,Just Give Me A Reason,P!nk Featuring Nate Ruess,3adeqciqrsp6PQqR0hGDC7,False,28,1,28,0.778,0.547,2,-7.273,1,0.0489,0.346,0.000302,0.132,0.441,95.002,242733,4
2013-09-07,28,The Other Side,Jason Derulo,3adeqciqrsp6PQqR0hGDC7,False,25,18,19,0.561,0.836,9,-3.939,1,0.1,0.0525,0,0.136,0.517,127.923,226987,4
2013-09-07,29,Gas Pedal,Sage The Gemini Featuring IamSu!,3adeqciqrsp6PQqR0hGDC7,False,35,29,5,0.843,0.538,1,-8.028,1,0.0833,0.0273,0,0.124,0.428,97.49,208160,4
2013-09-07,30,Round Here,Florida Georgia Line,3adeqciqrsp6PQqR0hGDC7,False,36,30,11,0.523,0.954,1,-3.051,1,0.0374,0.00385,1.65e-06,0.243,0.901,141.982,215120,4
2013-09-07,31,Brave,Sara Bareilles,3adeqciqrsp6PQqR0hGDC7,False,46,31,11,0.551,0.836,10,-3.838,0,0.0524,0.00502,2.1e-05,0.0425,0.758,185.063,220573,4
2013-09-07,32,Come & Get It,Selena Gomez,3adeqciqrsp6PQqR0hGDC7,False,31,6,20,0.552,0.783,7,-4.138,0,0.0504,0.00887,0.00026,0.0954,0.575,79.984,231413,4
2013-09-07,33,Night Train,Jason Aldean,3adeqciqrsp6PQqR0hGDC7,False,42,33,8,0.496,0.708,5,-5.175,1,0.0293,0.0512,1.06e-06,0.182,0.502,158.121,232307,4
2013-09-07,34,Don't Ya,Brett Eldredge,3adeqciqrsp6PQqR0hGDC7,False,32,30,14,0.537,0.693,9,-5.256,1,0.0847,0.0566,0,0.146,0.581,176.004,181210,4
2013-09-07,35,Little Bit Of Everything,Keith Urban,3adeqciqrsp6PQqR0hGDC7,False,33,33,14,0.619,0.882,8,-5.99,1,0.0912,0.239,0,0.033,0.897,159.98,205707,4
2013-09-07,36,It Goes Like This,Thomas Rhett,3adeqciqrsp6PQqR0hGDC7,False,40,36,11,0.543,0.837,11,-6.448,1,0.0608,0.117,0,0.0872,0.506,168.056,186080,4
2013-09-07,37,See You Again,Carrie Underwood,3adeqciqrsp6PQqR0hGDC7,False,34,34,17,0.514,0.742,8,-2.525,1,0.0258,0.27,1.7e-06,0.085,0.47,101.0,246453,4
2013-09-07,38,Crash My Party,Luke Bryan,3adeqciqrsp6PQqR0hGDC7,False,22,18,20,0.526,0.816,7,-4.009,1,0.0421,0.0285,0,0.22,0.414,144.032,234760,4
2013-09-07,39,Stay,Rihanna Featuring Mikky Ekko,3adeqciqrsp6PQqR0hGDC7,False,44,3,29,0.621,0.31,9,-10.164,0,0.0283,0.945,6.12e-05,0.117,0.125,111.893,240707,4
2013-09-07,40,Thrift Shop,Macklemore & Ryan Lewis Featuring Wanz,3adeqciqrsp6PQqR0hGDC7,False,39,1,47,0.781,0.526,6,-6.986,0,0.293,0.0633,0,0.0457,0.665,94.993,235613,4
2013-09-07,41,I Want Crazy,Hunter Hayes,3adeqciqrsp6PQqR0hGDC7,False,30,19,20,0.562,0.878,8,-4.806,1,0.0387,0.0539,0,0.112,0.558,103.029,236865,4
2013-09-07,42,Power Trip,J. Cole Featuring Miguel,3adeqciqrsp6PQqR0hGDC7,False,38,19,28,0.667,0.608,1,-7.054,1,0.216,0.324,0.000198,0.426,0.475,99.992,241160,4
2013-09-07,43,Redneck Crazy,Tyler Farr,3adeqciqrsp6PQqR0hGDC7,False,47,42,13,0.487,0.667,7,-4.216,0,0.0309,0.153,0,0.161,0.463,145.854,216040,4
2013-09-07,44,Take Back The Night,Justin Timberlake,3adeqciqrsp6PQqR0hGDC7,False,43,33,7,0.588,0.664,7,-5.18,1,0.159,0.043,4.3e-05,0.639,0.333,106.502,353160,4
2013-09-07,45,Runnin' Outta Moonlight,Randy Houser,3adeqciqrsp6PQqR0hGDC7,False,37,24,16,0.526,0.801,2,-3.717,1,0.0393,0.0354,3.17e-06,0.0637,0.769,172.024,193773,4
2013-09-07,46,Body Party,Ciara,3adeqciqrsp6PQqR0hGDC7,False,41,22,18,0.577,0.576,2,-6.299,1,0.0563,0.0143,0,0.602,0.12,133.973,234040,4
2013-09-07,47,Crooked Smile,J. Cole Featuring TLC,3adeqciqrsp6PQqR0hGDC7,False,50,47,10,0.606,0.784,7,-6.293,1,0.268,0.435,0,0.689,0.48,80.985,278573,4
2013-09-07,48,Beware,Big Sean Featuring Lil Wayne & Jhene Aiko,3adeqciqrsp6PQqR0hGDC7,False,59,48,5,0.7,0.554,1,-5.909,1,0.187,0.219,1.36e-06,0.419,0.0633,97.127,235187,4
2013-09-07,49,Still Into You,Paramore,3adeqciqrsp6PQqR0hGDC7,False,45,45,7,0.602,0.923,5,-3.763,1,0.044,0.0098,0,0.0561,0.765,136.01,216013,4
2013-09-07,50,Wrecking Ball,Miley Cyrus,2vwlzO0Qp8kfEtzTsCXfyE,True,0,50,1,0.53,0.422,5,-6.262,1,0.0342,0.407,0,0.107,0.349,119.964,221360,4
2013-09-07,51,Everything Has Changed,Taylor Swift Featuring Ed Sheeran,2vwlzO0Qp8kfEtzTsCXfyE,False,56,41,8,0.624,0.458,6,-6.755,1,0.0287,0.36,3.89e-06,0.303,0.436,80.017,243933,4
2013-09-07,52,Love More,Chris Brown Featuring Nicki Minaj,2vwlzO0Qp8kfEtzTsCXfyE,False,73,52,5,0.882,0.621,1,-6.652,1,0.0461,0.000463,0.00055,0.0784,0.487,104.954,189707,4
2013-09-07,53,All Over The Road,Easton Corbin,2vwlzO0Qp8kfEtzTsCXfyE,False,54,52,16,0.491,0.841,5,-3.579,1,0.0421,0.0471,0,0.0886,0.721,199.851,163067,4
2013-09-07,54,Counting Stars,OneRepublic,2vwlzO0Qp8kfEtzTsCXfyE,False,57,32,10,0.664,0.705,1,-4.972,0,0.0382,0.0654,0,0.115,0.477,122.017,257840,4
2013-09-07,55,U.O.E.N.O.,Rocko Featuring Future & Rick Ross,2vwlzO0Qp8kfEtzTsCXfyE,False,53,20,20,0.422,0.641,10,-4.947,0,0.323,0.422,0,0.317,0.654,187.027,260276,3
2013-09-07,56,Hey Girl,Billy Currington,2vwlzO0Qp8kfEtzTsCXfyE,False,55,53,14,0.548,0.673,1,-5.29,1,0.0268,0.0158,0,0.0794,0.652,81.947,200533,4
2013-09-07,57,Type Of Way,Rich Homie Quan,2vwlzO0Qp8kfEtzTsCXfyE,False,63,57,6,0.854,0.75,6,-5.273,0,0.29,0.0606,0,0.0968,0.814,134.919,256000,4
2013-09-07,58,Don't Drop That Thun Thun!,The FiNATTiCZ,2vwlzO0Qp8kfEtzTsCXfyE,False,52,35,7,0.926,0.334,4,-9.942,0,0.507,0.0721,0,0.0794,0.39,97.984,210200,4
2013-09-07,59,True Love,P!nk Featuring Lily Allen,2vwlzO0Qp8kfEtzTsCXfyE,False,60,59,4,0.457,0.823,9,-4.76,1,0.311,0.00144,0,0.108,0.578,192.205,230733,4
2013-09-07,60,Mine Would Be You,Blake Shelton,2vwlzO0Qp8kfEtzTsCXfyE,False,65,60,4,0.572,0.529,0,-6.897,1,0.0282,0.146,0,0.335,0.321,139.876,239507,4
2013-09-07,61,Turn The Night Up,Enrique Iglesias,2vwlzO0Qp8kfEtzTsCXfyE,False,72,61,4,0.78,0.74,0,-5.31,1,0.042,0.00554,1.33e-05,0.0979,0.214,128.002,197733,4
2013-09-07,62,Let Her Go,Passenger,2vwlzO0Qp8kfEtzTsCXfyE,False,74,62,4,0.479,0.545,7,-7.346,1,0.0688,0.365,0,0.0963,0.243,74.897,252733,4
2013-09-07,63,Point At You,Justin Moore,2vwlzO0Qp8kfEtzTsCXfyE,False,62,62,13,0.626,0.805,7,-5.81,1,0.0449,0.0126,0,0.156,0.882,116.03,180720,4
2013-09-07,64,Southern Girl,Tim McGraw,2vwlzO0Qp8kfEtzTsCXfyE,False,64,64,5,0.731,0.772,7,-4.559,1,0.0258,0.0407,0,0.449,0.928,110.04,255480,4
2013-09-07,65,Tapout,"Rich Gang Featuring Lil Wayne, Birdman, Future, Mack Maine, Nicki Minaj",2vwlzO0Qp8kfEtzTsCXfyE,False,58,44,16,0.762,0.577,8,-5.229,1,0.175,0.0309,0,0.108,0.287,142.055,284587,4
2013-09-07,66,Red Nose,Sage The Gemini,2vwlzO0Qp8kfEtzTsCXfyE,False,61,54,6,0.681,0.473,11,-5.733,0,0.449,0.414,0,0.0794,0.766,194.826,193200,4
2013-09-07,67,Feds Watching,2 Chainz Featuring Pharrell,2vwlzO0Qp8kfEtzTsCXfyE,False,70,67,8,0.79,0.875,7,-6.55,1,0.091,0.0476,0,0.312,0.759,139.985,247013,4
2013-09-07,68,Parking Lot Party,Lee Brice,2vwlzO0Qp8kfEtzTsCXfyE,False,67,67,9,0.54,0.86,1,-5.763,1,0.081,0.00646,0,0.629,0.856,171.72,207893,4
2013-09-07,69,Beneath Your Beautiful,Labrinth Featuring Emeli Sande,2vwlzO0Qp8kfEtzTsCXfyE,False,66,34,11,0.558,0.522,2,-5.857,1,0.036,0.228,0,0.104,0.228,83.977,271813,4
2013-09-07,70,Aw Naw,Chris Young,2vwlzO0Qp8kfEtzTsCXfyE,False,71,70,6,0.652,0.859,2,-3.746,1,0.0358,0.0639,0,0.0777,0.491,109.971,188707,4
2013-09-07,71,HeadBand,B.o.B Featuring 2 Chainz,2vwlzO0Qp8kfEtzTsCXfyE,False,68,64,11,0.919,0.506,1,-7.14,1,0.304,0.132,0,0.0771,0.273,97.465,220240,4
2013-09-07,72,Sweater Weather,The Neighbourhood,2vwlzO0Qp8kfEtzTsCXfyE,False,75,72,11,0.612,0.807,10,-2.81,1,0.0336,0.0495,0.0177,0.101,0.398,124.053,240400,4
2013-09-07,73,Ain't Worried About Nothin,French Montana,2vwlzO0Qp8kfEtzTsCXfyE,False,69,63,10,0.688,0.904,1,-2.234,1,0.106,0.0229,0,0.0909,0.71,127.887,212427,4
2013-09-07,74,How Many Drinks?,Miguel,2vwlzO0Qp8kfEtzTsCXfyE,False,76,69,19,0.379,0.608,0,-7.011,0,0.134,0.00311,0.000614,0.248,0.241,81.822,272987,4
2013-09-07,75,Tom Ford,JAY-Z,2vwlzO0Qp8kfEtzTsCXfyE,False,77,39,7,0.863,0.705,8,-6.202,1,0.31,0.05,2.21e-05,0.524,0.599,145.099,189013,4
2013-09-07,76,Miss Movin' On,Fifth Harmony,2vwlzO0Qp8kfEtzTsCXfyE,False,78,76,4,0.466,0.842,6,-2.937,1,0.0513,0.0332,9.12e-06,0.349,0.418,75.0,193733,4
2013-09-07,77,Replay,Zendaya,7d1CFwrBmH34gmS0Hkbfbt,True,0,77,1,0.688,0.723,6,-6.682,0,0.121,0.0416,0.0002,0.302,0.618,140.023,209187,4
2013-09-07,78,Darte Un Beso,Prince Royce,6cJLfIqwh0tCKRjYM3WpZ5,True,0,78,1,0.757,0.711,1,-4.643,0,0.0349,0.36,0,0.121,0.817,139.962,206933,4
2013-09-07,79,Bruises,Train Featuring Ashley Monroe,6cJLfIqwh0tCKRjYM3WpZ5,False,97,79,2,0.63,0.791,2,-4.497,1,0.0279,0.0131,6.83e-06,0.232,0.491,102.963,231787,4
2013-09-07,80,Young And Beautiful,Lana Del Rey,6cJLfIqwh0tCKRjYM3WpZ5,False,88,22,16,0.324,0.416,11,-8.92,0,0.0368,0.262,3.69e-05,0.11,0.151,113.986,236053,4
2013-09-07,81,Goodbye Town,Lady Antebellum,6cJLfIqwh0tCKRjYM3WpZ5,False,82,81,9,0.678,0.72,4,-6.034,1,0.027,0.165,5.73e-06,0.114,0.538,95.027,288800,4
2013-09-07,82,Acapella,Karmin,6cJLfIqwh0tCKRjYM3WpZ5,False,80,72,7,0.667,0.619,2,-4.933,1,0.151,0.126,0,0.101,0.427,169.865,198907,4
2013-09-07,83,Give It 2 U,Robin Thicke Featuring Kendrick Lamar,5zDQlhcJ5KOoXeSMGwiuJY,True,0,83,1,0.672,0.827,6,-3.829,0,0.0693,0.101,0,0.16,0.58,127.076,229667,4
2013-09-07,84,Almost Is Never Enough,Ariana Grande & Nathan Sykes,442j8VxaB60dWf9cBFuX5w,True,0,84,1,0.324,0.327,2,-7.494,1,0.0409,0.825,0,0.101,0.334,81.328,327773,4
2013-09-07,85,Wildfire,John Mayer,442j8VxaB60dWf9cBFuX5w,False,98,85,3,0.719,0.665,8,-8.589,1,0.0331,0.15,0.00092,0.144,0.763,96.999,253493,4
2013-09-07,86,Red,Taylor Swift,442j8VxaB60dWf9cBFuX5w,False,85,6,8,0.602,0.896,1,-4.267,0,0.0437,0.0773,8.87e-05,0.091,0.641,124.978,220827,4
2013-09-07,87,Pompeii,Bastille,442j8VxaB60dWf9cBFuX5w,False,95,87,2,0.679,0.715,9,-6.383,1,0.0407,0.0755,0,0.271,0.571,127.435,214148,4
2013-09-07,88,No New Friends (SFTB Remix),"DJ Khaled Featuring Drake, Rick Ross & Lil Wayne",442j8VxaB60dWf9cBFuX5w,False,79,37,18,0.703,0.681,2,-6.356,1,0.133,0.00589,0,0.449,0.245,124.928,308333,4
2013-09-07,89,Hail To The King,Avenged Sevenfold,442j8VxaB60dWf9cBFuX5w,False,0,83,2,0.58,0.916,3,-4.358,0,0.0387,0.000297,0.0259,0.126,0.683,118.004,305907,4
2013-09-07,90,When I See This Bar,Kenny Chesney,442j8VxaB60dWf9cBFuX5w,False,89,89,5,0.712,0.726,7,-7.346,1,0.0248,0.0284,4.48e-05,0.104,0.558,111.069,362813,4
2013-09-07,91,Wop,J. Dash,442j8VxaB60dWf9cBFuX5w,False,83,51,12,0.836,0.817,7,-5.672,1,0.0677,0.00968,0,0.114,0.647,112.007,230627,4
2013-09-07,92,F*ckwithmeyouknowigotit,Jay Z Featuring Rick Ross,442j8VxaB60dWf9cBFuX5w,False,91,64,7,0.611,0.464,10,-8.068,0,0.294,0.0171,0.214,0.0794,0.274,127.766,243413,4
2013-09-07,93,Easy,Sheryl Crow,442j8VxaB60dWf9cBFuX5w,False,84,84,5,0.522,0.571,9,-5.567,1,0.0245,0.0256,1.14e-06,0.0757,0.608,169.994,253360,4
2013-09-07,94,Slow Down,Selena Gomez,442j8VxaB60dWf9cBFuX5w,False,0,66,3,0.722,0.821,1,-3.856,0,0.165,0.073,0,0.631,0.721,127.944,210293,4
2013-09-07,95,#Beautiful,Mariah Carey Featuring Miguel,442j8VxaB60dWf9cBFuX5w,False,86,15,16,0.677,0.749,4,-5.405,1,0.0391,0.346,0,0.347,0.469,107.042,199867,4
2013-09-07,96,Helluva Night,Ludacris,0flKDWZq11997Fb2ptkQvu,True,0,96,1,0.736,0.522,2,-8.02,1,0.116,0.0299,0,0.108,0.369,97.547,200387,4
2013-09-07,97,Crazy Kids,Ke$ha Featuring will.i.am Or Juicy J,0flKDWZq11997Fb2ptkQvu,False,81,40,13,0.742,0.706,0,-4.6,0,0.0433,0.0141,0.00568,0.133,0.478,128.03,230747,4
2013-09-07,98,LoveHate Thing,Wale Featuring Sam Dew,0flKDWZq11997Fb2ptkQvu,False,93,89,8,0.736,0.691,8,-6.118,1,0.169,0.0771,0,0.0422,0.18,99.954,267400,4
2013-09-07,99,Beat It,Sean Kingston Featuring Chris Brown & Wiz Khalifa,0flKDWZq11997Fb2ptkQvu,False,92,52,18,0.477,0.637,1,-5.386,1,0.109,0.00487,0,0.284,0.555,198.12,253453,4
2013-09-07,100,American Girl,Bonnie McKee,0vvG0VEN6l2fbIEUtq3mQD,True,0,100,1,0.66,0.816,0,-4.332,0,0.0344,0.00976,1.87e-05,0.59,0.66,127.97,224107,4
