date,position,title,artist,spotify_id,is_new,last_pos,peak_pos,weeks,danceability,energy,key,loudness,mode,speechiness,acousticness,instrumentalness,liveness,valence,tempo,duration_ms,time_signature
2016-03-26,1,Work,Rihanna Featuring Drake,4ly1QBXEwYoDmje9rmEgC4,False,1,1,7,0.725,0.534,11,-6.238,1,0.0946,0.0752,0,0.0919,0.558,91.974,219320,4
2016-03-26,2,Love Yourself,Justin Bieber,4ly1QBXEwYoDmje9rmEgC4,False,2,1,17,0.759,0.401,4,-8.999,1,0.259,0.86,0,0.299,0.576,100.126,232627,4
2016-03-26,3,Stressed Out,twenty one pilots,4ly1QBXEwYoDmje9rmEgC4,False,3,2,25,0.734,0.637,4,-5.677,0,0.141,0.0462,2.29e-05,0.0602,0.648,169.977,202333,4
2016-03-26,4,My House,Flo Rida,4ly1QBXEwYoDmje9rmEgC4,False,4,4,18,0.688,0.702,7,-4.792,0,0.0499,0.0215,0,0.128,0.74,94.006,192191,4
2016-03-26,5,7 Years,Lukas Graham,4ly1QBXEwYoDmje9rmEgC4,False,9,5,8,0.765,0.473,10,-5.829,1,0.0514,0.287,0,0.391,0.34,119.992,237300,4
2016-03-26,6,Pillowtalk,Zayn,4ly1QBXEwYoDmje9rmEgC4,False,6,1,6,0.584,0.7,11,-4.275,1,0.0456,0.117,0,0.0939,0.438,124.944,202747,4
2016-03-26,7,"Me, Myself & I",G-Eazy x Bebe Rexha,4ly1QBXEwYoDmje9rmEgC4,False,7,7,19,0.756,0.674,0,-6.518,0,0.0959,0.0184,0,0.158,0.389,111.995,251467,4
2016-03-26,8,Sorry,Justin Bieber,4ly1QBXEwYoDmje9rmEgC4,False,5,1,20,0.679,0.748,0,-3.624,0,0.0385,0.0878,0,0.299,0.438,100.035,200787,4
2016-03-26,9,Cake By The Ocean,DNCE,4ly1QBXEwYoDmje9rmEgC4,False,10,9,21,0.774,0.753,4,-5.446,0,0.0517,0.152,0,0.0371,0.896,119.002,219147,4
2016-03-26,10,I Took A Pill In Ibiza,Mike Posner,4ly1QBXEwYoDmje9rmEgC4,False,14,10,8,0.664,0.714,7,-6.645,0,0.111,0.0353,8.42e-06,0.0843,0.71,101.969,197933,4
2016-03-26,11,No,Meghan Trainor,0l0CvurVUrr2w3Jj1hOVFc,True,0,11,1,0.557,0.803,1,-3.599,0,0.213,0.0124,1.61e-06,0.737,0.657,92.134,213507,4
2016-03-26,12,Hello,Adele,0l0CvurVUrr2w3Jj1hOVFc,False,11,1,20,0.578,0.43,5,-6.134,0,0.0305,0.33,0,0.0854,0.288,78.991,295502,4
2016-03-26,13,Hands To Myself,Selena Gomez,0l0CvurVUrr2w3Jj1hOVFc,False,15,7,14,0.811,0.507,5,-7.161,0,0.117,0.0146,2.14e-06,0.342,0.438,111.016,200680,4
2016-03-26,14,Roses,The Chainsmokers Featuring Rozes,0l0CvurVUrr2w3Jj1hOVFc,False,13,6,21,0.713,0.802,4,-7.055,1,0.0561,0.0435,0.00377,0.309,0.343,100.001,226739,4
2016-03-26,15,One Call Away,Charlie Puth,0l0CvurVUrr2w3Jj1hOVFc,False,16,12,15,0.667,0.613,1,-5.353,1,0.0344,0.403,0,0.115,0.47,91.024,194453,4
2016-03-26,16,Work From Home,Fifth Harmony Featuring Ty Dolla $ign,0l0CvurVUrr2w3Jj1hOVFc,False,12,12,2,0.803,0.585,8,-5.861,1,0.0432,0.103,3.94e-06,0.0644,0.593,105.017,214480,4
2016-03-26,17,Stitches,Shawn Mendes,0l0CvurVUrr2w3Jj1hOVFc,False,17,4,42,0.736,0.74,10,-6.662,0,0.0912,0.0174,0,0.0481,0.737,74.99,206879,4
2016-03-26,18,Down In The DM,Yo Gotti Featuring Nicki Minaj,0l0CvurVUrr2w3Jj1hOVFc,False,18,13,15,0.776,0.662,1,-7.016,0,0.0489,0.00157,2.1e-05,0.0887,0.324,152.927,182733,4
2016-03-26,19,Don't,Bryson Tiller,0l0CvurVUrr2w3Jj1hOVFc,False,19,13,24,0.765,0.356,11,-5.556,0,0.195,0.223,0,0.0963,0.189,96.991,198293,4
2016-03-26,20,Piece By Piece,Kelly Clarkson,0l0CvurVUrr2w3Jj1hOVFc,False,8,8,2,0.561,0.245,1,-6.372,1,0.0344,0.904,0,0.0933,0.402,109.558,212280,4
2016-03-26,21,2 Phones,Kevin Gates,0l0CvurVUrr2w3Jj1hOVFc,False,25,21,10,0.895,0.681,7,-5.267,0,0.358,0.157,0,0.189,0.554,121.918,240000,4
2016-03-26,22,Never Forget You,Zara Larsson & MNEK,0l0CvurVUrr2w3Jj1hOVFc,False,34,22,4,0.583,0.732,11,-5.728,0,0.0457,0.00312,9.86e-06,0.269,0.276,145.992,213428,4
2016-03-26,23,Jumpman,Drake & Future,0l0CvurVUrr2w3Jj1hOVFc,False,22,12,25,0.852,0.553,1,-7.286,1,0.187,0.0559,0,0.332,0.656,142.079,205879,4
2016-03-26,24,The Hills,The Weeknd,0l0CvurVUrr2w3Jj1hOVFc,False,21,1,42,0.585,0.564,0,-7.063,0,0.0515,0.0671,0,0.135,0.137,113.003,242253,4
2016-03-26,25,Back To Sleep,Chris Brown,0l0CvurVUrr2w3Jj1hOVFc,False,20,20,13,0.647,0.646,9,-5.483,0,0.243,0.0424,0,0.0888,0.721,92.981,201253,4
2016-03-26,26,Exchange,Bryson Tiller,0l0CvurVUrr2w3Jj1hOVFc,False,36,26,20,0.525,0.433,6,-10.598,1,0.185,0.107,0,0.135,0.276,160.108,194613,4
2016-03-26,27,Hotline Bling,Drake,0l0CvurVUrr2w3Jj1hOVFc,False,24,2,32,0.891,0.628,2,-7.863,1,0.0551,0.00258,0.00019,0.0504,0.552,134.966,267067,4
2016-03-26,28,When We Were Young,Adele,0l0CvurVUrr2w3Jj1hOVFc,False,23,14,16,0.376,0.595,3,-5.936,1,0.0496,0.303,0,0.095,0.265,144.361,290900,4
2016-03-26,29,Summer Sixteen,Drake,0l0CvurVUrr2w3Jj1hOVFc,False,30,6,6,0.594,0.46,1,-7.607,1,0.382,0.00354,2.71e-05,0.147,0.0541,146.274,202451,4
2016-03-26,30,Say It,Tory Lanez,0l0CvurVUrr2w3Jj1hOVFc,False,32,23,21,0.546,0.529,11,-10.511,0,0.0583,0.0862,6.5e-06,0.124,0.247,107.331,237787,4
2016-03-26,31,Middle,DJ Snake Featuring Bipolar Sunshine,0l0CvurVUrr2w3Jj1hOVFc,False,50,31,8,0.583,0.695,9,-5.336,1,0.0423,0.0141,0,0.0527,0.224,104.879,220573,4
2016-03-26,32,Here,Alessia Cara,0l0CvurVUrr2w3Jj1hOVFc,False,33,5,32,0.376,0.821,0,-3.974,1,0.104,0.0785,0,0.0823,0.331,120.462,199453,4
2016-03-26,33,Oui,Jeremih,0l0CvurVUrr2w3Jj1hOVFc,False,27,27,10,0.418,0.724,5,-3.724,1,0.0964,0.213,0,0.112,0.604,78.521,238320,5
2016-03-26,34,What Do You Mean?,Justin Bieber,0l0CvurVUrr2w3Jj1hOVFc,False,29,1,28,0.832,0.631,5,-6.19,0,0.0736,0.585,0.000892,0.0838,0.836,125.038,208543,4
2016-03-26,35,Same Old Love,Selena Gomez,0l0CvurVUrr2w3Jj1hOVFc,False,26,5,26,0.672,0.593,11,-4.01,0,0.0304,0.0223,0,0.214,0.438,98.02,229080,4
2016-03-26,36,In The Night,The Weeknd,0l0CvurVUrr2w3Jj1hOVFc,False,28,12,18,0.505,0.68,7,-4.993,1,0.0714,0.0796,0,0.0465,0.539,168.022,235653,3
2016-03-26,37,Hide Away,Daya,0l0CvurVUrr2w3Jj1hOVFc,False,31,23,25,0.885,0.8,11,-4.714,0,0.0846,0.23,1.99e-06,0.0734,0.464,95.018,192376,4
2016-03-26,38,You Should Be Here,Cole Swindell,0l0CvurVUrr2w3Jj1hOVFc,False,43,38,13,0.489,0.641,7,-4.455,1,0.0282,0.0592,0,0.0857,0.303,136.095,190173,4
2016-03-26,39,679,Fetty Wap Featuring Remy Boyz,0l0CvurVUrr2w3Jj1hOVFc,False,35,4,37,0.618,0.717,7,-5.738,1,0.318,0.00256,0,0.625,0.603,190.05,196693,4
2016-03-26,40,Ex's & Oh's,Elle King,0l0CvurVUrr2w3Jj1hOVFc,False,40,10,36,0.612,0.921,7,-2.879,1,0.0848,0.0183,0,0.0576,0.453,139.986,202173,4
2016-03-26,41,Die A Happy Man,Thomas Rhett,0l0CvurVUrr2w3Jj1hOVFc,False,38,21,25,0.595,0.389,2,-9.245,1,0.0349,0.418,1.39e-06,0.116,0.4,166.052,227427,4
2016-03-26,42,Like I'm Gonna Lose You,Meghan Trainor Featuring John Legend,0l0CvurVUrr2w3Jj1hOVFc,False,37,8,36,0.63,0.53,0,-7.259,1,0.0434,0.4,0,0.177,0.417,108.038,225053,3
2016-03-26,43,Low Life,Future Featuring The Weeknd,0l0CvurVUrr2w3Jj1hOVFc,False,56,43,5,0.722,0.331,8,-7.789,1,0.0725,0.337,0.283,0.146,0.102,143.974,313547,4
2016-03-26,44,Sugar,Robin Schulz Featuring Francesco Yates,0l0CvurVUrr2w3Jj1hOVFc,False,45,44,10,0.636,0.815,5,-5.098,0,0.0581,0.0185,0,0.163,0.636,123.063,219043,4
2016-03-26,45,Can't Feel My Face,The Weeknd,0l0CvurVUrr2w3Jj1hOVFc,False,39,1,40,0.709,0.777,9,-5.526,0,0.0444,0.122,0,0.0883,0.6,107.943,213525,4
2016-03-26,46,White Iverson,Post Malone,0l0CvurVUrr2w3Jj1hOVFc,False,44,14,27,0.675,0.562,7,-7.678,1,0.0352,0.233,0,0.0816,0.309,130.098,256533,4
2016-03-26,47,Stand By You,Rachel Platten,0l0CvurVUrr2w3Jj1hOVFc,False,42,37,17,0.506,0.897,9,-4.632,1,0.26,0.146,0.000451,0.0868,0.525,188.03,219000,4
2016-03-26,48,Heartbeat,Carrie Underwood,0l0CvurVUrr2w3Jj1hOVFc,False,46,42,10,0.54,0.766,1,-4.478,1,0.05,0.606,0,0.0903,0.435,139.999,209920,4
2016-03-26,49,Drunk On Your Love,Brett Eldredge,0l0CvurVUrr2w3Jj1hOVFc,False,54,49,9,0.443,0.831,11,-5.606,1,0.0616,0.414,0,0.204,0.588,182.064,173960,4
2016-03-26,50,Let It Go,James Bay,0l0CvurVUrr2w3Jj1hOVFc,False,52,35,12,0.546,0.311,1,-10.396,1,0.0288,0.818,1.65e-05,0.107,0.246,147.464,260533,4
2016-03-26,51,My Church,Maren Morris,0l0CvurVUrr2w3Jj1hOVFc,False,55,51,7,0.517,0.743,9,-4.336,1,0.0363,0.243,3.36e-06,0.107,0.664,76.979,197931,4
2016-03-26,52,Something In The Way You Move,Ellie Goulding,0l0CvurVUrr2w3Jj1hOVFc,False,53,43,7,0.658,0.814,1,-6.156,0,0.0492,0.0401,0,0.114,0.318,109.023,227423,4
2016-03-26,53,Adventure Of A Lifetime,Coldplay,0l0CvurVUrr2w3Jj1hOVFc,False,41,13,18,0.638,0.924,7,-3.887,1,0.036,0.00205,0.000175,0.149,0.53,111.995,263787,4
2016-03-26,54,Came Here To Forget,Blake Shelton,1N7qGCKRRnvjoy8MGyHgpS,True,0,54,1,0.613,0.667,1,-6.874,0,0.029,0.356,1.29e-05,0.111,0.481,130.023,220413,4
2016-03-26,55,Beautiful Drug,Zac Brown Band,1N7qGCKRRnvjoy8MGyHgpS,False,57,55,16,0.619,0.852,8,-5.243,0,0.0808,0.0539,2.82e-06,0.124,0.339,125.943,191600,4
2016-03-26,56,Best Friend,Young Thug,1N7qGCKRRnvjoy8MGyHgpS,False,51,45,16,0.959,0.598,8,-5.534,1,0.0713,0.0358,0,0.358,0.408,127.029,213000,4
2016-03-26,57,Humble And Kind,Tim McGraw,1N7qGCKRRnvjoy8MGyHgpS,False,67,57,5,0.355,0.48,11,-7.31,1,0.0282,0.679,2.28e-06,0.12,0.137,100.956,259267,3
2016-03-26,58,Youth,Troye Sivan,1N7qGCKRRnvjoy8MGyHgpS,False,58,58,6,0.628,0.737,7,-4.437,1,0.041,0.0625,0,0.0777,0.592,91.507,185194,4
2016-03-26,59,Really Really,Kevin Gates,1N7qGCKRRnvjoy8MGyHgpS,False,64,59,12,0.762,0.666,0,-6.055,1,0.0916,0.00427,0,0.127,0.278,118.97,232093,4
2016-03-26,60,Confession,Florida Georgia Line,1N7qGCKRRnvjoy8MGyHgpS,False,62,60,11,0.549,0.878,1,-5.066,1,0.0358,0.106,6.07e-05,0.176,0.44,104.98,190640,4
2016-03-26,61,Somewhere On A Beach,Dierks Bentley,1N7qGCKRRnvjoy8MGyHgpS,False,68,61,6,0.569,0.638,7,-6.557,1,0.0291,0.000547,0,0.0848,0.438,144.042,197120,4
2016-03-26,62,Snapback,Old Dominion,1N7qGCKRRnvjoy8MGyHgpS,False,70,62,7,0.687,0.793,5,-3.577,1,0.0333,0.302,3.46e-06,0.1,0.673,100.993,206507,4
2016-03-26,63,Don't Let Me Down,The Chainsmokers Featuring Daya,1N7qGCKRRnvjoy8MGyHgpS,False,76,63,4,0.532,0.869,11,-5.094,1,0.172,0.157,0.00508,0.136,0.422,159.803,208373,4
2016-03-26,64,Think Of You,Chris Young Duet With Cassadee Pope,1N7qGCKRRnvjoy8MGyHgpS,False,69,64,4,0.632,0.323,10,-14.042,0,0.951,0.811,0,0.102,0.769,171.053,46253,4
2016-03-26,65,Backroad Song,Granger Smith,1N7qGCKRRnvjoy8MGyHgpS,False,71,49,14,0.488,0.833,11,-6.571,1,0.0437,0.0352,0.0172,0.34,0.751,174.006,236787,4
2016-03-26,66,Try Everything,Shakira,1N3dZ7TTWO6VcD4Y3hHYLZ,True,0,66,1,0.705,0.609,1,-4.897,1,0.0307,0.0257,0,0.0846,0.476,115.474,196853,4
2016-03-26,67,I Like The Sound Of That,Rascal Flatts,1N3dZ7TTWO6VcD4Y3hHYLZ,False,72,67,7,0.611,0.8,0,-5.61,1,0.0377,0.257,0,0.194,0.527,89.974,209280,4
2016-03-26,68,Needed Me,Rihanna,1N3dZ7TTWO6VcD4Y3hHYLZ,False,66,64,6,0.671,0.314,5,-8.091,0,0.244,0.11,0,0.0825,0.296,110.898,191600,4
2016-03-26,69,Wild Things,Alessia Cara,1N3dZ7TTWO6VcD4Y3hHYLZ,False,80,69,3,0.534,0.391,1,-5.18,0,0.068,0.769,0,0.297,0.764,101.867,191480,4
2016-03-26,70,Home Alone Tonight,Luke Bryan Featuring Karen Fairchild,1N3dZ7TTWO6VcD4Y3hHYLZ,False,63,38,16,0.501,0.966,8,-1.177,1,0.112,0.0796,0,0.0903,0.497,161.881,190773,4
2016-03-26,71,I Know What You Did Last Summer,Shawn Mendes & Camila Cabello,1N3dZ7TTWO6VcD4Y3hHYLZ,False,61,20,17,0.687,0.761,9,-4.582,0,0.0876,0.102,0,0.147,0.743,113.939,223853,4
2016-03-26,72,Panda,Desiigner,1N3dZ7TTWO6VcD4Y3hHYLZ,False,94,72,3,0.685,0.731,10,-5.503,0,0.414,0.0292,0,0.369,0.266,145.245,247867,4
2016-03-26,73,New Romantics,Taylor Swift,1N3dZ7TTWO6VcD4Y3hHYLZ,False,0,71,2,0.633,0.889,5,-5.87,1,0.0715,0.00463,0.000458,0.0658,0.584,121.956,230467,4
2016-03-26,74,Jimmy Choo,Fetty Wap,1N3dZ7TTWO6VcD4Y3hHYLZ,False,73,65,5,0.893,0.646,11,-5.073,0,0.1,0.112,0,0.104,0.468,132.97,176855,4
2016-03-26,75,We Went,Randy Houser,1N3dZ7TTWO6VcD4Y3hHYLZ,False,60,60,12,0.646,0.882,4,-3.77,0,0.0371,0.097,0,0.311,0.544,101.997,179360,4
2016-03-26,76,The Sound Of Silence,Disturbed,1N3dZ7TTWO6VcD4Y3hHYLZ,False,81,76,3,0.322,0.28,6,-9.367,0,0.0281,0.468,1.1e-06,0.102,0.175,85.794,248467,4
2016-03-26,77,Acquainted,The Weeknd,1N3dZ7TTWO6VcD4Y3hHYLZ,False,75,60,11,0.386,0.486,7,-9.845,0,0.051,0.437,0,0.0889,0.237,105.79,348883,4
2016-03-26,78,Nobody To Blame,Chris Stapleton,1N3dZ7TTWO6VcD4Y3hHYLZ,False,74,70,10,0.534,0.666,9,-9.471,1,0.0335,0.0143,0.0615,0.113,0.59,87.401,244147,4
2016-03-26,79,Untitled 02 l 06.23.2014.,Kendrick Lamar,3I0FBDc1c1BLNtXWKVjmFg,True,0,79,1,0.667,0.508,5,-10.337,1,0.451,0.341,0,0.644,0.093,89.436,258827,3
2016-03-26,80,Cut It,O.T. Genasis Featuring Young Dolph,3I0FBDc1c1BLNtXWKVjmFg,False,85,80,3,0.875,0.673,7,-4.184,1,0.0932,0.135,0,0.292,0.231,130.0,222600,4
2016-03-26,81,Break On Me.,Keith Urban,3I0FBDc1c1BLNtXWKVjmFg,False,65,54,11,0.618,0.764,8,-7.086,1,0.0299,0.379,0.000211,0.108,0.447,87.012,208360,4
2016-03-26,82,Might Be,DJ Luke Nasty,3I0FBDc1c1BLNtXWKVjmFg,False,78,78,4,0.448,0.782,9,-6.766,0,0.458,0.378,0,0.114,0.694,74.037,210704,4
2016-03-26,83,American Country Love Song,Jake Owen,0O1x2tRm8ZpfDbcpOWZp7z,True,0,83,1,0.529,0.891,8,-4.36,1,0.043,0.0457,0,0.0942,0.329,104.031,199747,4
2016-03-26,84,T-Shirt,Thomas Rhett,0O1x2tRm8ZpfDbcpOWZp7z,False,92,84,2,0.634,0.862,2,-5.337,1,0.0376,0.0287,0,0.0217,0.767,95.989,227693,4
2016-03-26,85,Promise,Kid Ink Featuring Fetty Wap,0O1x2tRm8ZpfDbcpOWZp7z,False,83,82,4,0.797,0.469,8,-8.112,1,0.0646,0.0599,0,0.0753,0.481,103.057,224240,4
2016-03-26,86,Little Bit Of You,Chase Bryant,0O1x2tRm8ZpfDbcpOWZp7z,False,82,82,5,0.612,0.865,1,-4.277,1,0.0424,0.0639,0,0.0801,0.643,121.972,186240,4
2016-03-26,87,Lost Boy,Ruth B,0O1x2tRm8ZpfDbcpOWZp7z,False,86,75,3,0.71,0.0565,7,-15.099,1,0.0534,0.965,0,0.0889,0.348,123.994,275280,4
2016-03-26,88,Mind Reader,Dustin Lynch,0O1x2tRm8ZpfDbcpOWZp7z,False,84,84,3,0.394,0.8,4,-4.17,0,0.0413,0.0266,0,0.184,0.525,162.053,185413,4
2016-03-26,89,Company,Justin Bieber,0O1x2tRm8ZpfDbcpOWZp7z,False,0,53,5,0.59,0.797,4,-4.901,0,0.0614,0.132,0,0.0846,0.425,94.948,208120,4
2016-03-26,90,Untitled 07 l Levitate,Kendrick Lamar,6QvxTX9zvo4u7XhP9vOP3n,True,0,90,1,0.79,0.47,1,-8.594,1,0.223,0.49,0,0.0884,0.53,126.992,146467,4
2016-03-26,91,Watch Out,2 Chainz,6QvxTX9zvo4u7XhP9vOP3n,False,98,64,11,0.899,0.504,8,-6.758,0,0.5,0.826,0,0.052,0.537,129.89,207813,4
2016-03-26,92,Cheap Thrills,Sia Featuring Sean Paul,6QvxTX9zvo4u7XhP9vOP3n,False,91,81,4,0.628,0.698,6,-5.608,0,0.105,0.0472,0.00143,0.0907,0.732,89.976,211667,4
2016-03-26,93,That Don't Sound Like You,Lee Brice,6QvxTX9zvo4u7XhP9vOP3n,False,88,88,4,0.543,0.589,4,-9.496,1,0.0421,0.0236,2.99e-05,0.0798,0.255,129.813,210573,4
2016-03-26,94,Might Not,Belly Featuring The Weeknd,6QvxTX9zvo4u7XhP9vOP3n,False,96,94,3,0.792,0.563,1,-4.836,1,0.0787,0.318,0,0.13,0.321,134.022,224213,4
2016-03-26,95,Saved,Ty Dolla $ign Featuring E-40,6QvxTX9zvo4u7XhP9vOP3n,False,90,90,3,0.77,0.69,1,-5.565,1,0.136,0.265,0,0.128,0.732,103.035,178507,4
2016-03-26,96,Something New,Zendaya Featuring Chris Brown,1z15fhSgN6U2k4gqA1Zu4j,True,0,96,1,0.469,0.773,0,-4.741,1,0.196,0.104,0,0.0753,0.308,204.103,212907,4
2016-03-26,97,Get Ugly,Jason Derulo,1z15fhSgN6U2k4gqA1Zu4j,False,77,52,12,0.75,0.683,9,-4.829,0,0.12,0.0462,1.32e-06,0.297,0.539,111.066,200492,4
2016-03-26,98,Head Over Boots,Jon Pardi,1z15fhSgN6U2k4gqA1Zu4j,False,97,97,2,0.563,0.688,7,-4.474,1,0.0262,0.0763,0,0.0863,0.622,108.008,202347,4
2016-03-26,99,Sorry Not Sorry,Bryson Tiller,1z15fhSgN6U2k4gqA1Zu4j,False,93,67,13,0.681,0.608,1,-6.093,1,0.207,0.0477,0,0.225,0.262,97.934,200760,4
2016-03-26,100,Gotta Lotta,2 Chainz Featuring Lil Wayne,1gpSrGUfU3F9TOzPlEyLxH,True,0,100,1,0.512,0.599,7,-7.29,0,0.0831,0.00278,0,0.0803,0.146,109.345,214720,5
