date,position,title,artist,spotify_id,is_new,last_pos,peak_pos,weeks,danceability,energy,key,loudness,mode,speechiness,acousticness,instrumentalness,liveness,valence,tempo,duration_ms,time_signature
2015-06-13,1,See You Again,Wiz Khalifa Featuring Charlie Puth,1owHFKK6bWtYYf5V8bD1JR,False,2,1,12,0.689,0.481,10,-7.503,1,0.0815,0.369,1.03e-06,0.0649,0.283,80.025,229526,4
2015-06-13,2,Bad Blood,Taylor Swift Featuring Kendrick Lamar,1owHFKK6bWtYYf5V8bD1JR,False,1,1,5,0.652,0.802,7,-6.114,1,0.181,0.0871,6.45e-06,0.148,0.295,170.157,211933,4
2015-06-13,3,Trap Queen,Fetty Wap,1owHFKK6bWtYYf5V8bD1JR,False,3,2,19,0.746,0.873,7,-3.803,1,0.128,0.0244,0,0.354,0.817,148.075,222093,4
2015-06-13,4,Shut Up And Dance,WALK THE MOON,1owHFKK6bWtYYf5V8bD1JR,False,4,4,29,0.578,0.866,1,-3.804,1,0.0619,0.00701,0,0.257,0.619,128.038,199080,4
2015-06-13,5,Uptown Funk!,Mark Ronson Featuring Bruno Mars,1owHFKK6bWtYYf5V8bD1JR,False,6,1,29,0.856,0.609,0,-7.223,1,0.0824,0.00801,8.15e-05,0.0344,0.928,114.988,269667,4
2015-06-13,6,Earned It (Fifty Shades Of Grey),The Weeknd,1owHFKK6bWtYYf5V8bD1JR,False,5,3,23,0.658,0.282,2,-8.282,0,0.0353,0.433,0,0.0741,0.39,119.757,277724,3
2015-06-13,7,Want To Want Me,Jason Derulo,1owHFKK6bWtYYf5V8bD1JR,False,7,6,12,0.775,0.68,0,-5.508,0,0.0629,0.00906,0,0.109,0.656,114.025,207719,4
2015-06-13,8,Hey Mama,"David Guetta Featuring Nicki Minaj, Bebe Rexha & Afrojack",1owHFKK6bWtYYf5V8bD1JR,False,8,8,10,0.596,0.73,9,-4.091,1,0.151,0.24,0,0.325,0.525,85.979,192560,4
2015-06-13,9,Sugar,Maroon 5,1owHFKK6bWtYYf5V8bD1JR,False,9,2,20,0.729,0.786,1,-6.348,1,0.0337,0.0747,0,0.0878,0.87,120.068,234000,4
2015-06-13,10,Nasty Freestyle,T-Wayne,1owHFKK6bWtYYf5V8bD1JR,False,10,9,7,0.779,0.472,11,-7.116,1,0.218,0.0577,0,0.114,0.412,135.051,142212,4
2015-06-13,11,"Honey, I'm Good.",Andy Grammer,1owHFKK6bWtYYf5V8bD1JR,False,12,11,14,0.752,0.775,9,-7.289,1,0.0546,0.0324,0,0.351,0.595,122.014,199263,4
2015-06-13,12,Talking Body,Tove Lo,1owHFKK6bWtYYf5V8bD1JR,False,13,12,18,0.736,0.761,4,-5.449,0,0.0338,0.0966,0,0.0823,0.114,119.999,238427,4
2015-06-13,13,Love Me Like You Do,Ellie Goulding,1owHFKK6bWtYYf5V8bD1JR,False,11,3,21,0.287,0.597,5,-6.641,0,0.0419,0.273,0,0.105,0.31,189.788,253520,4
2015-06-13,14,Post To Be,Omarion Featuring Chris Brown & Jhene Aiko,1owHFKK6bWtYYf5V8bD1JR,False,15,13,21,0.733,0.676,10,-5.655,0,0.0432,0.0697,0,0.208,0.701,97.448,226581,4
2015-06-13,15,You Know You Like It,DJ Snake & AlunaGeorge,1owHFKK6bWtYYf5V8bD1JR,False,18,15,10,0.407,0.725,5,-5.346,0,0.188,0.0141,2.46e-06,0.306,0.247,196.093,247267,4
2015-06-13,16,Cheerleader,OMI,1owHFKK6bWtYYf5V8bD1JR,False,27,16,6,0.78,0.68,4,-6.081,1,0.0305,0.141,1.2e-05,0.138,0.594,118.026,180560,4
2015-06-13,17,Where Are U Now,Skrillex & Diplo With Justin Bieber,1owHFKK6bWtYYf5V8bD1JR,False,20,17,13,0.432,0.781,4,-4.038,0,0.0567,0.041,4.21e-06,0.0789,0.197,139.432,250286,4
2015-06-13,18,Worth It,Fifth Harmony Featuring Kid Ink,1owHFKK6bWtYYf5V8bD1JR,False,17,17,15,0.884,0.765,8,-3.865,1,0.0882,0.063,7.04e-06,0.118,0.594,99.987,224573,4
2015-06-13,19,Watch Me,Silento,1owHFKK6bWtYYf5V8bD1JR,False,25,19,14,0.821,0.759,8,-8.541,1,0.121,0.247,0,0.321,0.962,140.01,185143,4
2015-06-13,20,The Hills,The Weeknd,7fBv7CLKzipRk6EC6TWHOB,True,0,20,1,0.585,0.564,0,-7.063,0,0.0515,0.0671,0,0.135,0.137,113.003,242253,4
2015-06-13,21,Dear Future Husband,Meghan Trainor,7fBv7CLKzipRk6EC6TWHOB,False,14,14,20,0.655,0.782,1,-4.789,1,0.185,0.375,0,0.317,0.832,79.427,184227,4
2015-06-13,22,Thinking Out Loud,Ed Sheeran,7fBv7CLKzipRk6EC6TWHOB,False,16,2,34,0.781,0.445,2,-6.061,1,0.0295,0.474,0,0.184,0.591,78.998,281560,4
2015-06-13,23,Somebody,Natalie La Rose Featuring Jeremih,7fBv7CLKzipRk6EC6TWHOB,False,19,10,19,0.83,0.52,0,-8.714,1,0.0376,0.000792,1.25e-05,0.0656,0.735,104.99,189907,4
2015-06-13,24,Lean On,Major Lazer & DJ Snake Featuring MO,7fBv7CLKzipRk6EC6TWHOB,False,33,24,8,0.723,0.809,7,-3.081,0,0.0625,0.00346,0.00123,0.565,0.274,98.007,176561,4
2015-06-13,25,Girl Crush,Little Big Town,7fBv7CLKzipRk6EC6TWHOB,False,22,18,15,0.5,0.225,0,-10.22,1,0.0302,0.842,0,0.112,0.355,173.788,193320,3
2015-06-13,26,B**** Better Have My Money,Rihanna,7fBv7CLKzipRk6EC6TWHOB,False,24,17,10,0.781,0.728,1,-4.981,1,0.0621,0.0509,1.94e-06,0.257,0.395,102.99,219306,4
2015-06-13,27,Style,Taylor Swift,7fBv7CLKzipRk6EC6TWHOB,False,23,6,25,0.598,0.786,2,-5.572,1,0.0382,0.00256,0.00143,0.117,0.456,95.021,231000,4
2015-06-13,28,G.D.F.R.,Flo Rida Featuring Sage The Gemini & Lookas,7fBv7CLKzipRk6EC6TWHOB,False,21,8,29,0.656,0.863,0,-3.238,0,0.0412,0.037,0,0.0989,0.536,129.847,213480,4
2015-06-13,29,Slow Motion,Trey Songz,7fBv7CLKzipRk6EC6TWHOB,False,29,26,16,0.733,0.408,7,-7.834,0,0.0388,0.679,3.92e-05,0.11,0.291,94.947,197854,4
2015-06-13,30,This Summer's Gonna Hurt...,Maroon 5,7fBv7CLKzipRk6EC6TWHOB,False,31,30,3,0.365,0.286,4,-16.553,0,0.0465,0.966,0.88,0.198,0.103,100.988,219830,4
2015-06-13,31,Flex (Ooh Ooh Ooh),Rich Homie Quan,7fBv7CLKzipRk6EC6TWHOB,False,44,31,6,0.726,0.607,2,-7.68,1,0.0498,0.0389,0,0.19,0.891,81.997,176744,4
2015-06-13,32,Budapest,George Ezra,7fBv7CLKzipRk6EC6TWHOB,False,35,32,18,0.717,0.455,5,-8.303,1,0.0276,0.0846,0,0.11,0.389,127.812,200733,4
2015-06-13,33,Chains,Nick Jonas,7fBv7CLKzipRk6EC6TWHOB,False,28,13,18,0.589,0.611,0,-5.881,0,0.0459,0.0151,0,0.0757,0.121,76.006,203107,4
2015-06-13,34,Elastic Heart,Sia,7fBv7CLKzipRk6EC6TWHOB,False,36,17,21,0.421,0.791,9,-4.998,1,0.0496,0.0117,1.48e-05,0.146,0.499,130.075,257200,4
2015-06-13,35,Blank Space,Taylor Swift,7fBv7CLKzipRk6EC6TWHOB,False,32,1,31,0.752,0.678,5,-5.421,1,0.0646,0.085,1.64e-06,0.13,0.583,96.009,231827,4
2015-06-13,36,Fight Song,Rachel Platten,7fBv7CLKzipRk6EC6TWHOB,False,30,28,7,0.564,0.714,7,-4.987,1,0.129,0.0549,0,0.155,0.33,175.924,204013,4
2015-06-13,37,Take Your Time,Sam Hunt,7fBv7CLKzipRk6EC6TWHOB,False,41,20,22,0.558,0.719,11,-5.603,1,0.0419,0.101,0,0.212,0.483,158.031,243707,4
2015-06-13,38,The Night Is Still Young,Nicki Minaj,7fBv7CLKzipRk6EC6TWHOB,False,51,38,4,0.656,0.692,1,-6.145,0,0.0563,0.00212,0.00305,0.128,0.693,128.016,227560,4
2015-06-13,39,Shake It Off,Taylor Swift,7fBv7CLKzipRk6EC6TWHOB,False,34,1,41,0.648,0.785,7,-5.414,1,0.165,0.0561,0,0.148,0.943,160.02,219200,4
2015-06-13,40,Sangria,Blake Shelton,7fBv7CLKzipRk6EC6TWHOB,False,43,40,7,0.646,0.724,9,-6.96,1,0.0265,0.017,1.39e-06,0.153,0.54,115.984,233480,4
2015-06-13,41,Kick The Dust Up,Luke Bryan,7fBv7CLKzipRk6EC6TWHOB,False,26,26,2,0.597,0.86,1,-2.315,1,0.0461,0.196,0,0.087,0.818,172.064,190587,4
2015-06-13,42,Bright,Echosmith,7fBv7CLKzipRk6EC6TWHOB,False,50,42,11,0.646,0.431,6,-8.517,1,0.0262,0.637,6.99e-06,0.113,0.292,90.034,220627,4
2015-06-13,43,Blessings,Big Sean Featuring Drake,7fBv7CLKzipRk6EC6TWHOB,False,45,28,17,0.79,0.621,1,-7.634,1,0.275,0.333,0,0.122,0.15,118.895,252040,4
2015-06-13,44,Sippin' On Fire,Florida Georgia Line,7fBv7CLKzipRk6EC6TWHOB,False,49,40,12,0.476,0.92,10,-3.223,1,0.0329,0.00485,1.15e-05,0.355,0.694,142.952,193640,4
2015-06-13,45,Pretty Girls,Britney Spears & Iggy Azalea,7fBv7CLKzipRk6EC6TWHOB,False,38,29,4,0.834,0.831,7,-6.061,0,0.0745,0.00799,0,0.217,0.788,103.009,163960,4
2015-06-13,46,One Last Time,Ariana Grande,7fBv7CLKzipRk6EC6TWHOB,False,40,13,16,0.628,0.593,8,-5.036,1,0.0323,0.093,1.65e-06,0.096,0.104,125.026,197267,4
2015-06-13,47,Time Of Our Lives,Pitbull & Ne-Yo,7fBv7CLKzipRk6EC6TWHOB,False,46,9,25,0.72,0.802,1,-5.797,1,0.0582,0.0921,0,0.694,0.723,124.043,229360,4
2015-06-13,48,Smoke,A Thousand Horses,7fBv7CLKzipRk6EC6TWHOB,False,53,47,14,0.433,0.776,7,-5.53,1,0.029,0.0349,0.00023,0.387,0.424,149.641,219080,4
2015-06-13,49,All About That Bass,Meghan Trainor,7fBv7CLKzipRk6EC6TWHOB,False,47,1,47,0.807,0.887,9,-3.726,1,0.0503,0.0573,2.87e-06,0.124,0.961,134.052,187920,4
2015-06-13,50,Don't It,Billy Currington,7fBv7CLKzipRk6EC6TWHOB,False,52,44,13,0.571,0.826,1,-4.475,1,0.0362,0.0446,0,0.343,0.713,90.966,189000,4
2015-06-13,51,Be Real,Kid Ink Featuring DeJ Loaf,7fBv7CLKzipRk6EC6TWHOB,False,57,51,7,0.762,0.611,9,-5.462,0,0.0876,0.122,0.000315,0.141,0.386,99.934,206760,4
2015-06-13,52,Photograph,Ed Sheeran,7fBv7CLKzipRk6EC6TWHOB,False,58,52,3,0.614,0.379,4,-10.48,1,0.0476,0.607,0.000464,0.0986,0.201,107.989,258987,4
2015-06-13,53,Fun,Pitbull Featuring Chris Brown,7fBv7CLKzipRk6EC6TWHOB,False,54,53,3,0.793,0.774,0,-3.667,0,0.0478,0.156,0,0.193,0.547,113.967,202307,4
2015-06-13,54,Nasty,Bandit Gang Marco Featuring Dro,7fBv7CLKzipRk6EC6TWHOB,False,42,41,6,0.883,0.486,11,-8.175,1,0.271,0.0164,0,0.461,0.462,134.985,189884,4
2015-06-13,55,Commas,Future,7fBv7CLKzipRk6EC6TWHOB,False,61,55,9,0.878,0.561,11,-5.978,0,0.218,0.0357,0.000237,0.133,0.332,139.962,236748,4
2015-06-13,56,Uma Thurman,Fall Out Boy,7fBv7CLKzipRk6EC6TWHOB,False,70,56,8,0.623,0.962,4,-2.616,0,0.0895,0.103,0.000174,0.264,0.676,149.963,211573,4
2015-06-13,57,Love Me Like You Mean It,Kelsea Ballerini,7fBv7CLKzipRk6EC6TWHOB,False,62,57,9,0.645,0.84,4,-5.894,1,0.0518,0.0452,0,0.327,0.805,151.94,200027,4
2015-06-13,58,Wild Child,Kenny Chesney With Grace Potter,7fBv7CLKzipRk6EC6TWHOB,False,64,58,11,0.586,0.633,3,-7.688,1,0.0318,0.475,4.29e-06,0.164,0.445,148.984,189800,4
2015-06-13,59,Little Toy Guns,Carrie Underwood,7fBv7CLKzipRk6EC6TWHOB,False,65,59,11,0.434,0.868,7,-1.208,1,0.0603,0.00407,1.98e-06,0.0919,0.204,161.886,210760,4
2015-06-13,60,Truffle Butter,Nicki Minaj Featuring Drake & Lil Wayne,7fBv7CLKzipRk6EC6TWHOB,False,55,14,19,0.887,0.673,10,-6.846,0,0.0503,0.0743,4.06e-05,0.124,0.491,105.113,219227,4
2015-06-13,61,Flashlight,Jessie J,7fBv7CLKzipRk6EC6TWHOB,False,68,61,2,0.379,0.618,5,-7.065,1,0.0586,0.337,5.1e-06,0.102,0.4,147.53,209560,4
2015-06-13,62,L$D,A$AP Rocky,4S7YHmlWwfwArgd8LfSPud,True,0,62,1,0.598,0.252,2,-15.086,1,0.0644,0.194,0.133,0.0992,0.0352,120.064,238307,4
2015-06-13,63,Lay Me Down,Sam Smith,4S7YHmlWwfwArgd8LfSPud,False,56,8,17,0.468,0.19,4,-11.138,1,0.0373,0.919,0,0.107,0.326,125.319,219536,4
2015-06-13,64,Love You Like That,Canaan Smith,4S7YHmlWwfwArgd8LfSPud,False,72,64,10,0.559,0.766,11,-5.056,1,0.0295,0.0107,6.98e-05,0.194,0.723,145.26,203053,4
2015-06-13,65,Baby Be My Love Song,Easton Corbin,4S7YHmlWwfwArgd8LfSPud,False,81,65,8,0.488,0.713,0,-6.148,1,0.0472,0.0569,0,0.305,0.483,167.973,199747,4
2015-06-13,66,I Need Your Love,"Shaggy Featuring Mohombi, Faydee, Costi",4S7YHmlWwfwArgd8LfSPud,False,73,66,4,0.529,0.794,5,-3.903,1,0.164,0.122,0,0.117,0.543,119.956,216667,3
2015-06-13,67,Homegrown,Zac Brown Band,4S7YHmlWwfwArgd8LfSPud,False,67,35,20,0.711,0.801,6,-3.742,1,0.029,0.0244,0.000113,0.135,0.956,105.006,205000,4
2015-06-13,69,One Hell Of An Amen,Brantley Gilbert,,False,77,69,5,0.548,0.665,1,-5.622,1,0.0281,0.0139,2.72e-06,0.0769,0.549,138.055,221467,4
2015-06-13,70,Wet Dreamz,J. Cole,,False,76,70,8,0.517,0.705,6,-8.205,0,0.364,0.0751,0,0.128,0.584,175.906,239320,4
2015-06-13,71,The Matrimony,Wale Featuring Usher,,False,78,71,9,0.416,0.712,5,-6.671,0,0.384,0.438,0,0.0642,0.581,78.015,395951,4
2015-06-13,72,Heartbeat Song,Kelly Clarkson,,False,71,21,20,0.49,0.798,6,-3.66,1,0.0489,0.0137,0,0.0627,0.479,149.109,198733,4
2015-06-13,73,Like A Wrecking Ball,Eric Church,,False,75,73,10,0.693,0.335,0,-10.863,1,0.0395,0.338,0.000552,0.118,0.623,136.071,198907,4
2015-06-13,74,Tonight Looks Good On You,Jason Aldean,,False,94,53,6,0.481,0.75,6,-5.593,0,0.0537,0.219,1.2e-06,0.0958,0.523,169.958,231667,4
2015-06-13,75,FourFiveSeconds,Rihanna & Kanye West & Paul McCartney,,False,66,4,19,0.582,0.272,2,-5.662,1,0.0501,0.875,0,0.13,0.354,205.846,188238,4
2015-06-13,76,Crash And Burn,Thomas Rhett,,False,91,76,3,0.69,0.781,5,-5.101,0,0.0305,0.0873,2.28e-06,0.164,0.841,130.02,190733,4
2015-06-13,77,I Really Like You,Carly Rae Jepsen,,False,80,39,13,0.62,0.805,5,-5.538,1,0.0417,0.00564,9.15e-05,0.285,0.586,122.062,204764,4
2015-06-13,78,Classic Man,Jidenna Featuring Roman GianArthur,,False,74,74,4,0.79,0.585,8,-6.058,1,0.0348,0.185,0,0.292,0.585,94.072,226000,4
2015-06-13,79,All Day,"Kanye West Featuring Theophilus London, Allan Kingdom & Paul McCartney",,False,60,15,13,0.861,0.651,9,-4.718,0,0.111,0.0739,0,0.211,0.421,122.985,310907,4
2015-06-13,80,Electric Body,A$AP Rocky Featuring ScHoolboy Q,6br4Pc0BzU6dTD5fEmks2i,True,0,80,1,0.898,0.598,2,-7.164,1,0.0467,0.49,0.0014,0.0646,0.528,119.966,255253,4
2015-06-13,81,How Many Times,"DJ Khaled Featuring Chris Brown, Lil Wayne & Big Sean",6br4Pc0BzU6dTD5fEmks2i,False,89,74,3,0.798,0.704,10,-4.317,0,0.199,0.0937,0,0.308,0.867,116.016,263980,4
2015-06-13,82,Know Yourself,Drake,6br4Pc0BzU6dTD5fEmks2i,False,79,53,15,0.72,0.412,11,-8.687,0,0.223,0.196,0,0.342,0.179,114.408,275840,4
2015-06-13,83,Crushin' It,Brad Paisley,6br4Pc0BzU6dTD5fEmks2i,False,96,83,5,0.595,0.823,2,-5.864,1,0.0483,0.0385,1.35e-06,0.0984,0.745,108.99,220147,4
2015-06-13,84,El Perdon (Forgiveness),Nicky Jam & Enrique Iglesias,6br4Pc0BzU6dTD5fEmks2i,False,87,66,10,0.628,0.69,8,-5.828,1,0.0511,0.446,0,0.112,0.662,179.911,205907,4
2015-06-13,85,I Want You To Know,Zedd Featuring Selena Gomez,6br4Pc0BzU6dTD5fEmks2i,False,69,17,14,0.58,0.846,9,-2.876,0,0.0573,0.00537,6.62e-06,0.145,0.366,129.998,240000,4
2015-06-13,86,Energy,Drake,6br4Pc0BzU6dTD5fEmks2i,False,82,26,16,0.747,0.571,11,-7.916,1,0.478,0.38,0,0.534,0.553,172.104,181933,4
2015-06-13,87,Believe,Mumford & Sons,6br4Pc0BzU6dTD5fEmks2i,False,83,31,12,0.359,0.621,11,-7.482,0,0.0443,0.0253,0.0586,0.223,0.422,113.699,221040,4
2015-06-13,88,I Bet,Ciara,6br4Pc0BzU6dTD5fEmks2i,False,86,43,14,0.743,0.618,8,-7.227,1,0.0732,0.076,0,0.0731,0.285,129.034,287933,4
2015-06-13,89,Stitches,Shawn Mendes,2xgsTUo2gugA7ycsgUQWCo,True,0,89,1,0.736,0.74,10,-6.662,0,0.0912,0.0174,0,0.0481,0.737,74.99,206879,4
2015-06-13,90,Loving You Easy,Zac Brown Band,69XcvSymPaTke2Qb6f3W6P,True,0,90,1,0.721,0.596,1,-3.985,1,0.0275,0.0137,3.53e-06,0.0671,0.359,98.995,155653,4
2015-06-13,91,Young & Crazy,Frankie Ballard,6ll39ALTlddWWQZLjSFlwM,True,0,91,1,0.61,0.876,0,-4.244,1,0.0394,0.0247,0,0.31,0.783,115.05,180347,4
2015-06-13,92,Buy Me A Boat,Chris Janson,2WKLUgklz0VDX5bKTZ3eYD,True,0,92,1,0.574,0.745,2,-6.663,1,0.0507,0.319,0,0.11,0.693,154.042,179078,4
2015-06-13,93,You Changed Me,Jamie Foxx Featuring Chris Brown,6za48riBTylMJHsf4AJPxK,True,0,93,1,0.696,0.65,11,-6.578,0,0.252,0.123,0,0.21,0.531,137.967,242267,4
2015-06-13,94,Kiss You In The Morning,Michael Ray,6jRcSR1kOPWJYisvkFfjUV,True,0,94,1,0.557,0.909,11,-3.405,1,0.0423,0.00769,0,0.317,0.857,152.13,181400,4
2015-06-13,95,Planez,Jeremih Featuring J. Cole,08zJpaUQVi9FrKv2e32Bah,True,0,95,1,0.688,0.556,6,-7.738,1,0.264,0.7,1.87e-06,0.108,0.416,129.336,240320,4
2015-06-13,96,I Don't Get Tired (#IDGT),Kevin Gates Featuring August Alsina,08zJpaUQVi9FrKv2e32Bah,False,100,90,6,0.492,0.698,1,-5.606,1,0.171,0.0524,0,0.428,0.288,139.953,209707,4
2015-06-13,97,Renegades,X Ambassadors,08zJpaUQVi9FrKv2e32Bah,False,98,69,7,0.526,0.862,2,-6.003,1,0.0905,0.0144,0.0597,0.229,0.528,90.052,195200,4
2015-06-13,98,King Kunta,Kendrick Lamar,08zJpaUQVi9FrKv2e32Bah,False,90,58,11,0.884,0.657,6,-4.569,0,0.0977,0.00589,0,0.154,0.489,107.059,234693,4
2015-06-13,99,Raise 'Em Up,Keith Urban Featuring Eric Church,08zJpaUQVi9FrKv2e32Bah,False,84,56,14,0.609,0.788,4,-7.855,1,0.0416,0.645,3.72e-05,0.174,0.54,108.053,184947,4
2015-06-13,100,Flicka Da Wrist,Chedda Da Connect,08zJpaUQVi9FrKv2e32Bah,False,0,94,3,0.951,0.483,6,-5.592,1,0.3,0.0681,1.67e-06,0.0727,0.595,125.049,222733,4
