date,position,title,artist,spotify_id,is_new,last_pos,peak_pos,weeks,danceability,energy,key,loudness,mode,speechiness,acousticness,instrumentalness,liveness,valence,tempo,duration_ms,time_signature
2001-09-15,1,I'm Real,Jennifer Lopez Featuring Ja Rule,,False,1,1,11,0.708,0.587,11,-7.93,0,0.151,0.273,0,0.0718,0.554,83.46,262133,4
2001-09-15,2,Fallin',Alicia Keys,,False,2,1,14,0.653,0.609,11,-7.519,0,0.037,0.263,0.00101,0.233,0.482,95.982,210200,3
2001-09-15,3,Where The Party At,Jagged Edge With Nelly,,False,6,3,16,0.808,0.593,7,-8.097,1,0.0912,0.0951,0,0.154,0.861,97.105,254987,4
2001-09-15,4,Someone To Call My Lover,Janet,,False,3,3,13,0.738,0.914,2,-4.203,1,0.0434,0.144,0.00099,0.182,0.935,127.885,272360,4
2001-09-15,5,Hit 'Em Up Style (Oops!),Blu Cantrell,,False,4,2,20,0.667,0.773,5,-4.983,0,0.0586,0.201,0,0.404,0.667,89.976,250707,4
2001-09-15,6,U Remind Me,Usher,,False,7,1,14,0.657,0.629,6,-4.938,1,0.0782,0.194,0,0.254,0.726,93.985,266893,4
2001-09-15,7,Let Me Blow Ya Mind,Eve Featuring Gwen Stefani,,False,5,2,21,0.908,0.557,8,-4.243,0,0.107,0.242,0,0.0709,0.897,90.032,230133,4
2001-09-15,8,It's Been Awhile,Staind,,False,8,7,23,0.509,0.774,6,-4.054,1,0.0338,0.00189,0.000549,0.143,0.0824,116.529,264707,4
2001-09-15,9,Drops Of Jupiter (Tell Me),Train,,False,9,5,27,0.468,0.64,0,-5.862,1,0.0275,0.154,0,0.154,0.499,79.297,259933,4
2001-09-15,10,Hanging By A Moment,Lifehouse,,False,10,2,32,0.541,0.864,1,-4.915,1,0.0357,0.00118,0,0.0896,0.435,124.557,216067,4
2001-09-15,11,You Rock My World,Michael Jackson,,False,34,11,2,0.854,0.673,4,-3.132,0,0.185,0.038,0.000227,0.255,0.955,95.0,337733,4
2001-09-15,12,Family Affair,Mary J. Blige,,False,18,12,8,0.911,0.551,8,-3.75,0,0.0449,0.132,4.12e-05,0.0863,0.969,92.887,265867,4
2001-09-15,13,Izzo (H.O.V.A.),JAY-Z,,False,14,13,8,0.618,0.844,1,-4.051,0,0.342,0.0178,0.000126,0.0634,0.697,84.411,240627,4
2001-09-15,14,Peaches & Cream,112,,False,12,4,23,0.677,0.52,4,-6.255,0,0.334,0.00277,0,0.0532,0.768,203.862,193093,4
2001-09-15,15,Because I Got High,Afroman,,False,13,13,5,0.802,0.341,7,-8.56,1,0.488,0.169,0,0.0783,0.849,166.01,197760,4
2001-09-15,16,One Minute Man,"Missy ""Misdemeanor"" Elliott",,False,16,16,10,0.911,0.589,9,-12.47,1,0.217,0.057,1.57e-05,0.145,0.544,93.884,237653,4
2001-09-15,17,Fill Me In,Craig David,,False,17,15,15,0.683,0.748,8,-6.981,1,0.0366,0.373,0.00881,0.06,0.828,132.486,257200,4
2001-09-15,18,When It's Over,Sugar Ray,,False,15,13,16,0.675,0.775,4,-5.772,1,0.0522,0.0387,0,0.383,0.933,99.945,217853,4
2001-09-15,19,All Or Nothing,O-Town,,False,11,3,15,0.641,0.453,0,-4.98,1,0.0281,0.262,0,0.284,0.216,126.872,248867,4
2001-09-15,20,Drive,Incubus,,False,20,9,31,0.645,0.792,4,-7.34,0,0.036,0.0562,0.0121,0.119,0.666,90.565,232453,4
2001-09-15,21,Austin,Blake Shelton,,False,21,18,17,0.605,0.609,7,-7.063,1,0.0278,0.188,0,0.0982,0.275,119.914,230333,4
2001-09-15,22,Differences,Ginuwine,,False,25,22,8,0.562,0.594,3,-4.578,0,0.0558,0.318,0,0.311,0.423,62.876,265533,4
2001-09-15,23,I'm A Thug,Trick Daddy,,False,23,23,9,0.933,0.562,11,-5.963,1,0.122,0.0275,0,0.102,0.587,139.981,254400,4
2001-09-15,24,The Space Between,Dave Matthews Band,,False,22,22,18,0.406,0.73,9,-6.278,1,0.0315,0.0471,0,0.229,0.207,170.032,242000,4
2001-09-15,25,I'm A Believer,Smash Mouth,,False,27,25,9,0.559,0.972,6,-3.524,1,0.0639,0.0198,6.47e-06,0.393,0.919,82.336,183400,4
2001-09-15,26,Contagious,The Isley Brothers Featuring Ronald Isley,,False,19,19,10,0.709,0.449,4,-7.251,0,0.04,0.24,0,0.134,0.204,113.023,346467,4
2001-09-15,27,I'm Just Talkin' About Tonight,Toby Keith,,False,28,27,14,0.672,0.864,7,-3.669,1,0.0453,0.286,0,0.144,0.812,123.903,165133,4
2001-09-15,28,What Would You Do?,City High,,False,26,8,26,0.733,0.794,7,-6.909,1,0.223,0.259,0,0.483,0.832,95.877,175560,4
2001-09-15,29,Area Codes,Ludacris Featuring Nate Dogg,,False,24,24,10,0.86,0.688,9,-7.203,0,0.434,0.399,0,0.67,0.622,100.934,303027,4
2001-09-15,30,Only Time,Enya,,False,32,30,10,0.418,0.249,3,-13.744,1,0.0301,0.841,0.661,0.112,0.213,82.803,218547,4
2001-09-15,31,What I Really Meant To Say,Cyndi Thomson,,False,36,31,16,0.503,0.671,1,-5.717,1,0.0284,0.093,3.37e-05,0.176,0.381,140.115,200093,4
2001-09-15,32,Follow Me,Uncle Kracker,,False,29,5,28,0.817,0.585,5,-4.688,1,0.0301,0.439,0,0.147,0.916,105.014,218440,4
2001-09-15,33,Start The Commotion,The Wiseguys,,False,31,31,7,0.689,0.978,1,-4.184,0,0.0487,0.000347,0.719,0.298,0.957,119.898,225360,4
2001-09-15,34,I Wanna Be Bad,Willa Ford,,False,30,22,15,0.647,0.818,9,-3.47,0,0.0647,0.234,1.89e-05,0.216,0.816,180.019,183560,4
2001-09-15,35,Bad Boy For Life,"P. Diddy, Black Rob & Mark Curry",,False,33,33,8,0.669,0.829,1,-3.801,1,0.49,0.179,0,0.241,0.61,118.934,253067,4
2001-09-15,36,Can't Deny It,Fabolous Featuring Nate Dogg,,False,50,36,9,0.916,0.821,4,-4.118,0,0.15,0.0528,0,0.0635,0.592,90.04,306440,4
2001-09-15,37,Where The Blacktop Ends,Keith Urban,,False,35,35,14,0.496,0.94,2,-3.332,1,0.0373,0.289,0,0.251,0.95,158.967,186293,4
2001-09-15,38,Angry All The Time,Tim McGraw,,False,46,38,5,0.545,0.498,2,-7.286,1,0.0266,0.195,0,0.169,0.363,127.604,270107,4
2001-09-15,39,Turn Off The Light,Nelly Furtado,,False,42,39,5,0.587,0.679,2,-6.26,1,0.0927,0.0839,0.000316,0.413,0.65,180.184,276107,4
2001-09-15,40,Livin' It Up,Ja Rule Featuring Case,,False,61,40,3,0.874,0.768,6,-4.086,1,0.311,0.0554,0,0.041,0.636,106.095,257067,4
2001-09-15,41,Be Like That,3 Doors Down,,False,48,41,8,0.487,0.702,7,-6.043,1,0.0238,0.00528,4.97e-06,0.129,0.306,95.982,265907,4
2001-09-15,42,Only In America,Brooks & Dunn,,False,44,42,9,0.512,0.886,4,-5.906,1,0.0402,0.0661,0.00165,0.863,0.693,137.763,268613,4
2001-09-15,43,Everywhere,Michelle Branch,,False,52,43,3,0.523,0.828,1,-4.696,1,0.0762,0.0136,0.000255,0.165,0.476,96.952,214827,4
2001-09-15,44,Thank You,Dido,,False,43,3,36,0.722,0.595,1,-9.928,0,0.0415,0.284,0.000538,0.0694,0.738,79.98,217827,4
2001-09-15,45,Rock The Boat,Aaliyah,,False,57,45,2,0.691,0.695,8,-8.684,0,0.114,0.0468,0.000861,0.249,0.554,105.577,120015,4
2001-09-15,46,I Would've Loved You Anyway,Trisha Yearwood,,False,45,45,7,0.36,0.418,6,-7.301,1,0.0284,0.477,8.92e-06,0.101,0.33,137.803,221893,4
2001-09-15,47,Every Other Time,LFO,,False,47,47,4,0.689,0.922,11,-4.56,1,0.0372,0.0143,0,0.335,0.72,103.975,247867,4
2001-09-15,48,I'm Already There,Lonestar,,False,41,24,20,0.377,0.395,3,-8.622,1,0.0332,0.61,0,0.295,0.221,133.296,253373,4
2001-09-15,49,Where I Come From,Alan Jackson,,False,56,49,4,0.726,0.631,11,-8.136,0,0.0334,0.22,0,0.193,0.746,124.711,239240,4
2001-09-15,50,Bootylicious,Destiny's Child,,False,37,1,15,0.84,0.835,1,-4.386,0,0.275,0.00281,1.11e-06,0.152,0.637,103.376,207907,4
2001-09-15,51,Here's To The Night,Eve 6,,False,38,30,15,0.583,0.652,7,-6.255,1,0.0244,0.0405,0.000378,0.0781,0.352,97.469,249840,4
2001-09-15,52,Smooth Criminal,Alien Ant Farm,,False,58,52,4,0.653,0.964,9,-4.261,0,0.0582,0.00316,0.00512,0.144,0.87,126.928,209267,4
2001-09-15,53,Flavor Of The Weak,American Hi-Fi,,False,49,41,13,0.39,0.967,10,-1.946,1,0.0644,0.000758,1.74e-05,0.302,0.488,151.944,188840,4
2001-09-15,54,I Do!!,Toya,,False,55,32,16,0.781,0.583,6,-7.83,0,0.0628,0.0859,0.00216,0.058,0.91,156.264,213493,4
2001-09-15,55,Ugly,Bubba Sparxxx,,False,88,55,3,0.755,0.836,6,-5.742,1,0.166,0.32,3.03e-05,0.199,0.696,90.847,265227,4
2001-09-15,56,When I Think About Angels,Jamie O'Neal,,False,51,35,15,0.507,0.843,11,-3.421,1,0.108,0.274,0,0.295,0.504,193.708,182613,4
2001-09-15,57,Feelin' On Yo Booty,R. Kelly,,False,53,53,4,0.737,0.258,10,-7.784,1,0.0528,0.259,2.71e-06,0.101,0.83,61.028,245867,4
2001-09-15,58,Six-Pack Summer,Phil Vassar,,False,62,58,6,0.725,0.733,0,-6.66,1,0.0242,0.508,0,0.173,0.843,100.311,219827,4
2001-09-15,59,Superman (It's Not Easy),Five For Fighting,,False,60,59,3,0.382,0.416,0,-9.303,1,0.0302,0.0733,0,0.0719,0.125,102.089,221693,4
2001-09-15,60,Raise Up,Petey Pablo,,False,78,60,6,0.735,0.844,1,-5.215,1,0.167,0.142,0,0.319,0.742,156.069,286427,4
2001-09-15,61,Irresistible,Jessica Simpson,,False,54,15,18,0.659,0.966,8,-2.783,0,0.0538,0.0279,8.25e-05,0.0489,0.687,93.008,193600,4
2001-09-15,62,Purple Hills,D12,,False,40,19,13,0.762,0.714,1,-4.999,1,0.211,0.0182,0,0.353,0.696,125.28,303667,4
2001-09-15,63,Clint Eastwood,Gorillaz,,False,65,63,4,0.663,0.694,10,-8.627,0,0.172,0.0249,0,0.0698,0.524,167.964,340920,4
2001-09-15,64,How You Remind Me,Nickelback,,False,75,64,2,0.446,0.764,10,-5.042,1,0.033,0.00135,0,0.099,0.543,172.094,223840,4
2001-09-15,66,Lifetime,Maxwell,,False,72,66,2,0.695,0.454,9,-7.267,1,0.0788,0.307,4.6e-06,0.0727,0.496,127.986,329413,4
2001-09-15,67,Just In Case,Jaheim,,False,64,52,12,0.78,0.572,0,-6.797,1,0.0951,0.0618,0,0.0495,0.695,100.999,263866,4
2001-09-15,68,Bad Day,Fuel,,False,69,64,8,0.291,0.735,9,-4.767,1,0.0415,0.000374,4.53e-06,0.0808,0.19,175.978,195467,4
2001-09-15,69,When God-Fearin' Women Get The Blues,Martina McBride,78Pl98qYK16Egcle5fMx0G,True,0,69,1,0.603,0.707,2,-6.215,1,0.0804,0.118,0,0.14,0.455,141.837,299400,4
2001-09-15,70,Schism,Tool,78Pl98qYK16Egcle5fMx0G,False,67,67,13,0.567,0.714,9,-8.512,0,0.0302,0.0012,0.417,0.186,0.191,107.441,403533,3
2001-09-15,71,There You'll Be,Faith Hill,78Pl98qYK16Egcle5fMx0G,False,71,10,17,0.325,0.532,8,-7.208,1,0.0308,0.496,0,0.134,0.162,129.021,220840,4
2001-09-15,72,On A Night Like This,Trick Pony,78Pl98qYK16Egcle5fMx0G,False,82,72,8,0.599,0.776,5,-5.292,1,0.0437,0.0443,0,0.0379,0.831,117.912,210427,4
2001-09-15,73,Dance With Me,112,6uRH1qMz30ZBwwUG0IYE5s,True,0,73,1,0.912,0.511,9,-6.365,1,0.203,0.0259,0,0.0442,0.611,101.628,231800,4
2001-09-15,74,Love Of My Life,Brian McKnight,0pCDds54QUooGedfpHUjtW,True,0,74,1,0.649,0.445,6,-7.13,1,0.029,0.134,7.42e-06,0.116,0.335,123.767,281867,4
2001-09-15,75,Set It Off,Juvenile,0pCDds54QUooGedfpHUjtW,False,74,66,6,0.695,0.595,1,-9.091,1,0.194,0.18,1.2e-05,0.087,0.746,168.136,257000,4
2001-09-15,76,Love Of A Woman,Travis Tritt,7dVINsv6faqqTUelZdvd5U,True,0,76,1,0.324,0.574,7,-5.647,1,0.0292,0.239,0,0.143,0.335,74.101,217533,4
2001-09-15,77,Fat Lip,Sum 41,7dVINsv6faqqTUelZdvd5U,False,66,66,3,0.402,0.914,9,-5.215,1,0.142,0.000579,0,0.065,0.626,196.505,178267,4
2001-09-15,78,I'll Fly With You (L'amour Toujours),Gigi D'Agostino,7dVINsv6faqqTUelZdvd5U,False,79,78,7,0.669,0.662,7,-6.649,1,0.0306,0.00788,0.109,0.477,0.591,135.007,331340,4
2001-09-15,79,What It Is,Violator Featuring Busta Rhymes,7dVINsv6faqqTUelZdvd5U,False,70,63,12,0.931,0.484,5,-7.735,0,0.221,0.218,1.54e-05,0.0705,0.664,100.967,218560,4
2001-09-15,80,More Than That,Backstreet Boys,7dVINsv6faqqTUelZdvd5U,False,76,27,17,0.58,0.729,4,-6.705,0,0.0287,0.0102,0,0.0805,0.483,80.061,224933,4
2001-09-15,81,I'm A Survivor,Reba,1mu88E3UAqW5HzCAXKb7CF,True,0,81,1,0.67,0.627,2,-5.47,1,0.0303,0.278,0,0.104,0.569,88.858,187120,4
2001-09-15,82,Music,Erick Sermon Featuring Marvin Gaye,1mu88E3UAqW5HzCAXKb7CF,False,68,22,16,0.897,0.466,10,-9.053,0,0.203,0.187,1.35e-06,0.0757,0.884,100.01,223133,4
2001-09-15,83,The Way,Jill Scott,1mu88E3UAqW5HzCAXKb7CF,False,63,60,11,0.717,0.402,1,-9.712,1,0.0316,0.0187,0.0113,0.0994,0.453,140.418,255733,4
2001-09-15,84,Downtime,Jo Dee Messina,1mu88E3UAqW5HzCAXKb7CF,False,59,46,14,0.566,0.887,6,-3.583,1,0.034,0.137,0,0.081,0.704,109.806,224400,4
2001-09-15,85,AM To PM,Christina Milian,1mu88E3UAqW5HzCAXKb7CF,False,92,85,4,0.872,0.868,10,-3.036,0,0.12,0.153,2.26e-05,0.843,0.822,105.005,231213,4
2001-09-15,86,This Is Me,Dream,1mu88E3UAqW5HzCAXKb7CF,False,86,39,19,0.662,0.926,8,-5.202,1,0.156,0.0632,3.28e-06,0.308,0.918,78.053,192493,4
2001-09-15,87,Crawling,Linkin Park,1mu88E3UAqW5HzCAXKb7CF,False,83,79,6,0.58,0.702,4,-5.565,1,0.0337,0.0466,3.2e-06,0.536,0.299,105.076,208960,4
2001-09-15,88,She's All I Got,Jimmy Cozier,1mu88E3UAqW5HzCAXKb7CF,False,80,26,14,0.768,0.522,1,-8.555,1,0.0604,0.343,2.12e-06,0.163,0.186,99.957,211133,4
2001-09-15,89,Loverboy,Mariah Carey Featuring Cameo,1mu88E3UAqW5HzCAXKb7CF,False,73,2,13,0.731,0.897,1,-2.845,1,0.113,0.195,0,0.391,0.832,103.001,270400,4
2001-09-15,90,Take You Out,Luther Vandross,1mu88E3UAqW5HzCAXKb7CF,False,81,26,9,0.752,0.575,8,-5.254,1,0.0549,0.077,0,0.125,0.569,86.004,206067,4
2001-09-15,91,My Projects,Coo Coo Cal,1mu88E3UAqW5HzCAXKb7CF,False,89,81,7,0.882,0.81,4,-5.957,0,0.22,0.0626,3.84e-06,0.102,0.79,95.328,225027,4
2001-09-15,92,Sandstorm,Darude,1mu88E3UAqW5HzCAXKb7CF,False,97,83,9,0.539,0.98,11,-8.18,0,0.0469,0.169,0.982,0.084,0.522,136.087,225373,4
2001-09-15,93,Laredo,Chris Cagle,1mu88E3UAqW5HzCAXKb7CF,False,84,60,11,0.47,0.794,1,-5.784,1,0.0438,0.16,0,0.0927,0.673,159.983,229573,4
2001-09-15,94,Girl Next Door,Musiq Soulchild Featuring Ayana,1mu88E3UAqW5HzCAXKb7CF,False,91,88,4,0.7,0.632,10,-7.911,0,0.259,0.107,1.11e-06,0.0911,0.772,77.918,286440,4
2001-09-15,95,Wait A Minute,Ray J Featuring Lil' Kim,1mu88E3UAqW5HzCAXKb7CF,False,87,30,17,0.892,0.698,7,-4.833,1,0.168,0.0738,0,0.172,0.728,100.031,230800,4
2001-09-15,96,Castles In The Sky,Ian Van Dahl Featuring Marsha,1mu88E3UAqW5HzCAXKb7CF,False,96,93,7,0.578,0.87,0,-6.422,0,0.0323,0.00268,0.412,0.0346,0.667,139.992,227133,4
2001-09-15,97,Can't Believe,Faith Evans Featuring Carl Thomas,1mu88E3UAqW5HzCAXKb7CF,False,93,56,20,0.779,0.495,7,-4.492,1,0.0498,0.0765,0,0.147,0.527,89.58,244107,4
2001-09-15,98,While You Loved Me,Rascal Flatts,1mu88E3UAqW5HzCAXKb7CF,False,85,60,12,0.504,0.596,5,-4.412,1,0.0279,0.239,0,0.0972,0.168,142.051,209933,4
2001-09-15,99,Mad Season,matchbox twenty,1mu88E3UAqW5HzCAXKb7CF,False,94,48,20,0.278,0.87,10,-5.368,1,0.0547,0.13,0,0.286,0.577,171.992,302107,4
2001-09-15,100,The Rock Show,Blink-182,1mu88E3UAqW5HzCAXKb7CF,False,90,71,8,0.41,0.959,9,-4.563,1,0.0869,0.000324,0,0.0766,0.83,193.155,171600,4
