date,position,title,artist,spotify_id,is_new,last_pos,peak_pos,weeks,danceability,energy,key,loudness,mode,speechiness,acousticness,instrumentalness,liveness,valence,tempo,duration_ms,time_signature
2012-10-20,1,One More Night,Maroon 5,4ClTOGZc8kcb8l58Vx5z5A,False,1,1,16,0.718,0.82,5,-3.453,0,0.0323,0.0444,0,0.0846,0.613,92.998,219467,4
2012-10-20,2,Gangnam Style,PSY,4ClTOGZc8kcb8l58Vx5z5A,False,2,2,5,0.727,0.937,11,-2.871,0,0.286,0.00417,0,0.091,0.749,132.067,219493,4
2012-10-20,3,Live While We're Young,One Direction,6Vh03bkEfXqekWp7Y1UBRb,True,0,3,1,0.663,0.857,2,-2.16,1,0.0544,0.0542,0,0.144,0.931,126.039,200213,4
2012-10-20,4,Some Nights,fun.,6Vh03bkEfXqekWp7Y1UBRb,False,3,3,33,0.672,0.738,0,-7.045,1,0.0506,0.0178,6.75e-05,0.0927,0.392,107.938,277040,4
2012-10-20,5,We Are Never Ever Getting Back Together,Taylor Swift,6Vh03bkEfXqekWp7Y1UBRb,False,4,1,9,0.628,0.676,7,-5.911,1,0.0916,0.00957,2.65e-05,0.121,0.75,85.984,193147,4
2012-10-20,6,Red,Taylor Swift,0cITLOYn1Sv4q27zZPqlNK,True,0,6,1,0.602,0.896,1,-4.267,0,0.0437,0.0773,8.87e-05,0.091,0.641,124.978,220827,4
2012-10-20,7,As Long As You Love Me,Justin Bieber Featuring Big Sean,0cITLOYn1Sv4q27zZPqlNK,False,6,6,16,0.571,0.873,0,-3.382,0,0.1,0.0811,0,0.361,0.613,139.691,229467,4
2012-10-20,8,Skyfall,Adele,6VObnIkLVruX4UVyxWhlqm,True,0,8,1,0.346,0.552,0,-6.864,0,0.0282,0.417,0,0.114,0.0789,75.881,286480,4
2012-10-20,9,Blow Me (One Last Kiss),P!nk,6VObnIkLVruX4UVyxWhlqm,False,5,5,14,0.597,0.919,7,-2.954,1,0.044,0.000145,0,0.282,0.73,113.987,255587,4
2012-10-20,10,Too Close,Alex Clare,6VObnIkLVruX4UVyxWhlqm,False,9,8,28,0.584,0.712,11,-4.311,0,0.0395,0.0112,1.05e-06,0.114,0.286,126.043,256560,4
2012-10-20,11,Good Time,Owl City & Carly Rae Jepsen,6VObnIkLVruX4UVyxWhlqm,False,10,8,15,0.56,0.872,3,-4.269,1,0.14,0.0239,6.98e-06,0.371,0.682,126.05,205933,4
2012-10-20,12,Whistle,Flo Rida,6VObnIkLVruX4UVyxWhlqm,False,8,1,21,0.747,0.937,0,-5.746,1,0.0453,0.0208,0,0.29,0.739,103.976,224653,4
2012-10-20,13,Everybody Talks,Neon Trees,6VObnIkLVruX4UVyxWhlqm,False,11,6,30,0.471,0.924,8,-3.906,1,0.0586,0.00301,0,0.313,0.725,154.961,177280,4
2012-10-20,14,Die Young,Ke$ha,6VObnIkLVruX4UVyxWhlqm,False,13,13,2,0.711,0.7,1,-4.805,0,0.046,0.00498,0.000125,0.215,0.801,128.001,211920,4
2012-10-20,15,Lights,Ellie Goulding,6VObnIkLVruX4UVyxWhlqm,False,12,2,42,0.681,0.802,8,-5.836,0,0.0347,0.0271,0.0496,0.127,0.791,120.053,212707,4
2012-10-20,16,Don't Wake Me Up,Chris Brown,6VObnIkLVruX4UVyxWhlqm,False,14,14,15,0.602,0.691,7,-5.197,0,0.051,0.0548,0,0.144,0.206,127.967,222307,4
2012-10-20,17,Let Me Love You (Until You Learn To Love Yourself),Ne-Yo,6VObnIkLVruX4UVyxWhlqm,False,25,17,10,0.669,0.723,5,-5.2,1,0.0346,0.213,0,0.523,0.269,124.925,252227,4
2012-10-20,18,Diamonds,Rihanna,6VObnIkLVruX4UVyxWhlqm,False,16,16,2,0.564,0.71,11,-4.92,0,0.0461,0.00125,0,0.109,0.393,91.972,225147,4
2012-10-20,19,Clique,"Kanye West, Jay-Z, Big Sean",6VObnIkLVruX4UVyxWhlqm,False,22,12,5,0.704,0.569,7,-4.998,0,0.247,0.0488,0,0.191,0.313,109.314,293533,5
2012-10-20,20,Call Me Maybe,Carly Rae Jepsen,6VObnIkLVruX4UVyxWhlqm,False,15,1,33,0.783,0.58,7,-6.548,1,0.0408,0.0114,2.28e-06,0.108,0.66,120.021,193400,4
2012-10-20,21,Wide Awake,Katy Perry,6VObnIkLVruX4UVyxWhlqm,False,17,2,20,0.514,0.683,5,-5.099,1,0.0367,0.0749,2.64e-06,0.392,0.575,159.814,220947,4
2012-10-20,22,Somebody That I Used To Know,Gotye Featuring Kimbra,6VObnIkLVruX4UVyxWhlqm,False,19,1,40,0.864,0.495,0,-7.036,1,0.037,0.591,0.000133,0.0992,0.72,129.062,244973,4
2012-10-20,23,Mercy,"Kanye West, Big Sean, Pusha T, 2 Chainz",6VObnIkLVruX4UVyxWhlqm,False,20,13,27,0.563,0.496,6,-9.381,0,0.406,0.0685,5.8e-05,0.173,0.426,139.993,329320,4
2012-10-20,24,Blown Away,Carrie Underwood,6VObnIkLVruX4UVyxWhlqm,False,29,24,14,0.531,0.843,9,-2.569,0,0.0429,0.0909,0,0.0283,0.392,136.991,240133,4
2012-10-20,25,Home,Phillip Phillips,6VObnIkLVruX4UVyxWhlqm,False,27,9,15,0.606,0.826,0,-6.04,1,0.0307,0.0256,1.56e-05,0.117,0.322,121.04,210173,4
2012-10-20,26,Pound The Alarm,Nicki Minaj,6VObnIkLVruX4UVyxWhlqm,False,18,15,11,0.728,0.858,9,-3.686,1,0.0609,0.0403,4.26e-06,0.0241,0.591,125.054,205640,4
2012-10-20,27,Adorn,Miguel,6VObnIkLVruX4UVyxWhlqm,False,31,27,10,0.625,0.576,11,-5.693,0,0.175,0.0543,4.07e-05,0.187,0.235,179.063,193147,4
2012-10-20,28,50 Ways To Say Goodbye,Train,6VObnIkLVruX4UVyxWhlqm,False,30,26,13,0.591,0.935,6,-2.664,1,0.0478,0.000284,0.000278,0.142,0.736,140.043,247947,4
2012-10-20,29,Payphone,Maroon 5 Featuring Wiz Khalifa,6VObnIkLVruX4UVyxWhlqm,False,21,2,25,0.739,0.756,4,-4.828,1,0.0394,0.0136,0,0.37,0.523,110.028,231387,4
2012-10-20,30,Give Your Heart A Break,Demi Lovato,6VObnIkLVruX4UVyxWhlqm,False,26,16,27,0.651,0.695,6,-3.218,1,0.0487,0.23,0,0.144,0.569,123.008,205347,4
2012-10-20,31,Wanted,Hunter Hayes,6VObnIkLVruX4UVyxWhlqm,False,23,16,24,0.421,0.476,0,-7.692,1,0.0298,0.268,0,0.0816,0.3,169.784,228840,4
2012-10-20,32,I Will Wait,Mumford & Sons,6VObnIkLVruX4UVyxWhlqm,False,57,23,9,0.48,0.756,1,-5.399,1,0.0333,0.00993,0.00704,0.312,0.447,131.127,276720,4
2012-10-20,33,Titanium,David Guetta Featuring Sia,6VObnIkLVruX4UVyxWhlqm,False,28,7,26,0.604,0.788,0,-3.673,0,0.103,0.0678,0.153,0.127,0.301,126.06,245040,4
2012-10-20,34,Locked Out Of Heaven,Bruno Mars,3w3y8KPTfNeOKPiqUTakBh,True,0,34,1,0.726,0.698,5,-4.165,1,0.0431,0.049,0,0.309,0.867,143.994,233478,4
2012-10-20,35,I Won't Give Up,Jason Mraz,3w3y8KPTfNeOKPiqUTakBh,False,32,8,40,0.585,0.303,4,-10.058,1,0.0398,0.694,0,0.115,0.142,136.703,240166,3
2012-10-20,36,Finally Found You,Enrique Iglesias Featuring Sammy Adams,3w3y8KPTfNeOKPiqUTakBh,False,24,24,4,0.622,0.881,6,-4.871,0,0.0956,0.0109,0,0.348,0.664,127.958,220813,4
2012-10-20,37,No Lie,2 Chainz Featuring Drake,3w3y8KPTfNeOKPiqUTakBh,False,33,24,22,0.634,0.665,6,-5.984,0,0.176,0.0172,0,0.365,0.611,131.108,237827,4
2012-10-20,38,Pop That,"French Montana Featuring Rick Ross, Drake, Lil Wayne",3w3y8KPTfNeOKPiqUTakBh,False,38,38,13,0.734,0.892,2,-1.856,1,0.125,0.0648,0,0.58,0.605,138.031,303533,4
2012-10-20,39,Take A Little Ride,Jason Aldean,3w3y8KPTfNeOKPiqUTakBh,False,35,12,12,0.472,0.866,2,-3.771,1,0.0413,0.044,0,0.213,0.775,163.867,187613,4
2012-10-20,40,Ho Hey,The Lumineers,3w3y8KPTfNeOKPiqUTakBh,False,36,32,18,0.685,0.466,0,-9.074,1,0.0304,0.794,2.06e-06,0.0915,0.353,79.936,163133,4
2012-10-20,41,It's Time,Imagine Dragons,3w3y8KPTfNeOKPiqUTakBh,False,40,33,18,0.656,0.884,2,-4.748,1,0.0372,0.0162,0,0.145,0.86,105.009,237987,4
2012-10-20,42,Where Have You Been,Rihanna,3w3y8KPTfNeOKPiqUTakBh,False,34,5,25,0.719,0.847,0,-6.34,0,0.0916,0.00201,0.0204,0.221,0.444,127.963,242680,4
2012-10-20,43,Cruise,Florida Georgia Line Featuring Nelly,3w3y8KPTfNeOKPiqUTakBh,False,45,43,8,0.457,0.948,10,-3.364,1,0.0354,0.0191,0,0.0536,0.878,148.0,208960,4
2012-10-20,44,What Makes You Beautiful,One Direction,3w3y8KPTfNeOKPiqUTakBh,False,37,4,34,0.726,0.787,4,-2.494,1,0.0737,0.009,0,0.0596,0.888,124.99,199987,4
2012-10-20,45,The A Team,Ed Sheeran,3w3y8KPTfNeOKPiqUTakBh,False,48,45,13,0.642,0.289,9,-9.918,1,0.0367,0.669,0,0.18,0.407,84.996,258373,4
2012-10-20,46,Cowboys And Angels,Dustin Lynch,3w3y8KPTfNeOKPiqUTakBh,False,43,40,21,0.355,0.55,10,-5.772,1,0.0285,0.245,3.2e-05,0.0979,0.26,73.842,227720,4
2012-10-20,47,Kiss Tomorrow Goodbye,Luke Bryan,3w3y8KPTfNeOKPiqUTakBh,False,52,47,7,0.571,0.937,5,-3.467,0,0.0365,0.0064,0,0.316,0.584,115.013,203133,4
2012-10-20,48,Girl On Fire,Alicia Keys Featuring Nicki Minaj,3w3y8KPTfNeOKPiqUTakBh,False,41,37,5,0.482,0.706,9,-5.762,1,0.0609,0.135,0.00106,0.105,0.144,92.494,224920,4
2012-10-20,49,We Are Young,fun. Featuring Janelle Monae,3w3y8KPTfNeOKPiqUTakBh,False,42,1,42,0.378,0.638,10,-5.576,1,0.075,0.02,7.66e-05,0.0849,0.735,184.086,250627,4
2012-10-20,50,2 Reasons,Trey Songz Featuring T.I.,3w3y8KPTfNeOKPiqUTakBh,False,49,43,14,0.734,0.746,11,-5.088,1,0.0762,0.00135,0,0.178,0.539,94.033,197627,4
2012-10-20,51,Hard To Love,Lee Brice,3w3y8KPTfNeOKPiqUTakBh,False,44,43,17,0.638,0.722,9,-6.177,1,0.0332,0.0119,0.00808,0.189,0.469,103.017,224293,4
2012-10-20,52,Begin Again,Taylor Swift,3w3y8KPTfNeOKPiqUTakBh,False,7,7,2,0.53,0.526,7,-8.349,1,0.0263,0.199,3.52e-06,0.232,0.323,79.025,237613,4
2012-10-20,53,Thinkin Bout You,Frank Ocean,3w3y8KPTfNeOKPiqUTakBh,False,47,39,13,0.721,0.339,0,-11.195,1,0.0532,0.409,0.00153,0.0973,0.2,129.83,200747,4
2012-10-20,54,Want U Back,Cher Lloyd,3w3y8KPTfNeOKPiqUTakBh,False,39,12,17,0.694,0.891,9,-2.94,1,0.0949,0.0562,0,0.561,0.563,97.939,214573,4
2012-10-20,55,Turn On The Lights,Future,3w3y8KPTfNeOKPiqUTakBh,False,51,51,9,0.596,0.574,6,-9.373,0,0.212,0.0409,0,0.147,0.439,131.075,248360,4
2012-10-20,56,Birthday Song,2 Chainz Featuring Kanye West,3w3y8KPTfNeOKPiqUTakBh,False,56,56,9,0.753,0.59,1,-2.623,1,0.0485,0.0591,0,0.15,0.161,140.002,306600,4
2012-10-20,57,I Can Only Imagine,David Guetta Featuring Chris Brown & Lil Wayne,3w3y8KPTfNeOKPiqUTakBh,False,55,44,9,0.669,0.939,9,-2.06,1,0.0427,0.0463,1.12e-06,0.335,0.264,127.947,209533,4
2012-10-20,58,Bandz A Make Her Dance,Juicy J Featuring Lil Wayne & 2 Chainz,3w3y8KPTfNeOKPiqUTakBh,False,58,58,4,0.871,0.743,2,-5.442,1,0.277,0.00212,0,0.141,0.576,130.977,278827,4
2012-10-20,59,Feel Again,OneRepublic,3w3y8KPTfNeOKPiqUTakBh,False,67,59,6,0.467,0.815,7,-7.929,0,0.0524,0.0198,1.23e-06,0.118,0.335,140.047,185080,4
2012-10-20,60,The One That Got Away,Jake Owen,3w3y8KPTfNeOKPiqUTakBh,False,61,60,9,0.576,0.865,0,-3.288,1,0.0407,0.0343,5.32e-05,0.252,0.535,119.913,194173,4
2012-10-20,61,Pontoon,Little Big Town,3w3y8KPTfNeOKPiqUTakBh,False,46,22,18,0.721,0.819,9,-5.715,1,0.0269,0.413,0,0.196,0.867,96.02,212320,4
2012-10-20,62,Your Body,Christina Aguilera,3w3y8KPTfNeOKPiqUTakBh,False,64,34,3,0.593,0.781,8,-5.291,0,0.0545,0.000724,0,0.225,0.565,103.025,239853,4
2012-10-20,63,Lovin' You Is Fun,Easton Corbin,3w3y8KPTfNeOKPiqUTakBh,False,59,59,14,0.703,0.83,8,-3.028,1,0.0327,0.32,0,0.364,0.597,109.958,199013,4
2012-10-20,64,Madness,Muse,3w3y8KPTfNeOKPiqUTakBh,False,69,64,7,0.502,0.417,10,-7.665,1,0.0718,0.127,0.00419,0.106,0.218,180.301,281040,4
2012-10-20,65,Come Wake Me Up,Rascal Flatts,3w3y8KPTfNeOKPiqUTakBh,False,63,59,11,0.454,0.605,4,-6.816,1,0.0314,0.255,0,0.109,0.18,155.861,263253,3
2012-10-20,66,Babel,Mumford & Sons,3w3y8KPTfNeOKPiqUTakBh,False,60,60,2,0.373,0.813,2,-6.13,1,0.0543,0.0253,0.000227,0.0826,0.647,80.465,208933,4
2012-10-20,67,Truck Yeah,Tim McGraw,3w3y8KPTfNeOKPiqUTakBh,False,65,57,14,0.615,0.92,7,-4.167,1,0.032,0.108,0,0.102,0.776,97.994,209013,4
2012-10-20,68,Fastest Girl In Town,Miranda Lambert,3w3y8KPTfNeOKPiqUTakBh,False,68,64,11,0.541,0.911,1,-3.6,0,0.0631,0.0205,0.00155,0.275,0.563,145.057,197600,4
2012-10-20,69,I Cry,Flo Rida,3w3y8KPTfNeOKPiqUTakBh,False,81,69,2,0.693,0.822,4,-5.441,0,0.0439,0.00616,1.79e-06,0.315,0.763,126.035,223800,4
2012-10-20,70,Hello,Karmin,3w3y8KPTfNeOKPiqUTakBh,False,62,62,6,0.658,0.919,5,-2.455,1,0.171,0.166,0,0.123,0.516,127.916,237547,4
2012-10-20,71,Swimming Pools (Drank),Kendrick Lamar,3w3y8KPTfNeOKPiqUTakBh,False,72,71,8,0.577,0.447,8,-5.892,1,0.277,0.00627,0.00022,0.0899,0.189,74.236,247800,4
2012-10-20,72,Put It Down,Brandy Featuring Chris Brown,3w3y8KPTfNeOKPiqUTakBh,False,70,70,8,0.761,0.413,0,-8.104,1,0.195,0.019,0,0.0829,0.595,141.056,246213,4
2012-10-20,73,Southern Comfort Zone,Brad Paisley,2lfmRyTLtsTCkLwMQcFSQk,True,0,73,1,0.431,0.876,4,-6.109,1,0.0658,0.0771,1.81e-05,0.0998,0.519,160.0,316987,4
2012-10-20,74,Just What I Am,Kid Cudi Featuring King Chip,20bJBbPapGQ4bqs0YcA9xY,True,0,74,1,0.654,0.95,1,-3.163,1,0.137,0.00223,0,0.406,0.351,140.009,228027,4
2012-10-20,75,She's So Mean,matchbox twenty,20bJBbPapGQ4bqs0YcA9xY,False,66,40,15,0.672,0.875,0,-3.728,1,0.0378,0.0136,0,0.279,0.676,118.014,232320,4
2012-10-20,76,Creepin',Eric Church,20bJBbPapGQ4bqs0YcA9xY,False,73,73,7,0.464,0.889,5,-5.042,1,0.0497,0.0389,0.0272,0.31,0.539,87.858,232720,4
2012-10-20,77,Beer Money,Kip Moore,20bJBbPapGQ4bqs0YcA9xY,False,88,77,3,0.745,0.805,2,-5.549,1,0.0307,0.0223,1.06e-06,0.13,0.765,126.065,218147,4
2012-10-20,78,Every Storm (Runs Out Of Rain),Gary Allan,6s3dgEQgen7G85NtYUTEbD,True,0,78,1,0.525,0.693,0,-6.972,1,0.0327,0.046,9.55e-06,0.247,0.363,107.012,225640,4
2012-10-20,79,Lemme See,Usher Featuring Rick Ross,6s3dgEQgen7G85NtYUTEbD,False,71,46,20,0.656,0.725,1,-4.067,1,0.0596,0.0262,0,0.0712,0.403,153.873,252827,4
2012-10-20,80,Numb,Usher,6s3dgEQgen7G85NtYUTEbD,False,82,80,3,0.577,0.687,8,-7.601,1,0.0471,0.0113,4.42e-06,0.112,0.291,124.956,225520,4
2012-10-20,81,Whispers In The Dark,Mumford & Sons,6s3dgEQgen7G85NtYUTEbD,False,86,81,2,0.385,0.73,2,-7.82,1,0.0409,0.00382,0.00278,0.123,0.36,134.659,195867,4
2012-10-20,82,No Worries,Lil Wayne Featuring Detail,6s3dgEQgen7G85NtYUTEbD,False,80,58,5,0.844,0.592,5,-5.486,1,0.199,0.085,0,0.0817,0.819,128.033,221000,4
2012-10-20,83,Dance For You,Beyonce,6s3dgEQgen7G85NtYUTEbD,False,78,78,5,0.616,0.78,2,-6.062,1,0.0623,0.0322,0,0.173,0.471,110.005,377467,4
2012-10-20,84,Holland Road,Mumford & Sons,6s3dgEQgen7G85NtYUTEbD,False,92,84,2,0.451,0.703,2,-6.406,1,0.0356,0.0887,9.49e-05,0.103,0.404,79.306,250840,4
2012-10-20,85,Amen,Meek Mill Featuring Drake,6s3dgEQgen7G85NtYUTEbD,False,76,57,16,0.503,0.795,10,-4.505,1,0.335,0.178,0,0.042,0.265,149.981,289707,4
2012-10-20,86,Dive In,Trey Songz,6s3dgEQgen7G85NtYUTEbD,False,77,77,6,0.587,0.648,0,-6.954,1,0.089,0.0279,0,0.962,0.37,119.888,252453,4
2012-10-20,87,Til My Last Day,Justin Moore,6s3dgEQgen7G85NtYUTEbD,False,83,83,4,0.577,0.761,9,-5.34,1,0.0358,0.0377,0,0.116,0.599,104.991,234027,4
2012-10-20,88,Ghosts That We Knew,Mumford & Sons,6s3dgEQgen7G85NtYUTEbD,False,94,88,2,0.44,0.276,0,-12.151,1,0.0407,0.552,0.00695,0.112,0.077,79.907,339720,4
2012-10-20,89,Did It For The Girl,Greg Bates,6s3dgEQgen7G85NtYUTEbD,False,96,89,3,0.658,0.728,5,-4.916,1,0.0237,0.0183,6.26e-06,0.306,0.682,101.969,191293,4
2012-10-20,90,Don't You Worry Child,Swedish House Mafia Featuring John Martin,6s3dgEQgen7G85NtYUTEbD,False,91,68,3,0.612,0.84,11,-3.145,0,0.0509,0.112,0,0.116,0.438,129.042,212862,4
2012-10-20,91,The Scientist,Glee Cast,68iMdxXn1timrxURm9dR8C,True,0,91,1,0.506,0.481,2,-6.098,1,0.0264,0.482,0,0.2,0.224,148.626,254413,4
2012-10-20,92,Shinin' On Me,Jerrod Niemann,68iMdxXn1timrxURm9dR8C,False,97,92,6,0.651,0.773,7,-6.97,1,0.0366,0.318,0,0.27,0.69,83.995,194573,4
2012-10-20,93,Over,Blake Shelton,68iMdxXn1timrxURm9dR8C,False,79,43,17,0.392,0.605,1,-6.204,1,0.0338,0.0274,1.75e-06,0.189,0.307,155.586,193147,4
2012-10-20,94,Lover's Eyes,Mumford & Sons,68iMdxXn1timrxURm9dR8C,False,85,85,2,0.267,0.337,2,-9.713,1,0.0339,0.0305,1.9e-05,0.097,0.274,77.945,321120,4
2012-10-20,95,Take A Walk,Passion Pit,68iMdxXn1timrxURm9dR8C,False,87,85,6,0.566,0.755,11,-5.526,1,0.0368,0.0338,0,0.315,0.445,101.006,264493,4
2012-10-20,96,Hall Of Fame,The Script Featuring will.i.am,68iMdxXn1timrxURm9dR8C,False,0,87,2,0.421,0.873,10,-4.343,1,0.0565,0.0653,0,0.123,0.63,84.803,202533,4
2012-10-20,97,Lover Of The Light,Mumford & Sons,48dghEx4vhyQQfFLwxPfHD,True,0,97,1,0.301,0.69,2,-6.853,1,0.0513,0.00776,0.000643,0.273,0.368,106.758,314893,4
2012-10-20,98,Radioactive,Imagine Dragons,48dghEx4vhyQQfFLwxPfHD,False,95,91,6,0.448,0.784,9,-3.686,1,0.0627,0.106,0.000108,0.668,0.236,136.245,186813,4
2012-10-20,99,My Moment,"DJ Drama Featuring 2 Chainz, Meek Mill & Jeremih",6JVroX8e45PFqUKuVkLgPs,True,0,99,1,0.456,0.76,1,-3.015,0,0.0988,0.0337,0,0.228,0.189,148.063,198920,4
2012-10-20,100,How Country Feels,Randy Houser,6aUhfNWYnMThF3TGtuYUUu,True,0,100,1,0.678,0.839,7,-3.617,1,0.0394,0.0379,0,0.0742,0.772,104.952,185907,4
