date,position,title,artist,spotify_id,is_new,last_pos,peak_pos,weeks,danceability,energy,key,loudness,mode,speechiness,acousticness,instrumentalness,liveness,valence,tempo,duration_ms,time_signature
1993-09-25,1,Dreamlover,Mariah Carey,7kozzDmfiSL3g3COR5m0ZB,False,1,1,8,0.701,0.705,5,-6.18,1,0.0357,0.18,0,0.141,0.71,100.669,232960,4
1993-09-25,2,Whoomp! (There It Is),Tag Team,7kozzDmfiSL3g3COR5m0ZB,False,2,2,18,0.8,0.639,4,-7.406,0,0.0439,0.00123,0,0.0803,0.45,129.443,226027,4
1993-09-25,3,Right Here (Human Nature)/Downtown,SWV,7kozzDmfiSL3g3COR5m0ZB,False,5,3,11,0.601,0.74,9,-5.043,0,0.0573,0.0299,0.332,0.0937,0.672,94.013,226800,4
1993-09-25,4,"Can't Help Falling In Love (From ""Sliver"")",UB40,7kozzDmfiSL3g3COR5m0ZB,False,3,1,20,0.56,0.671,2,-8.23,1,0.0326,0.412,7.67e-05,0.72,0.476,87.097,265597,4
1993-09-25,5,If,Janet Jackson,7kozzDmfiSL3g3COR5m0ZB,False,4,4,10,0.653,0.976,11,-5.173,0,0.0797,0.0374,0.00173,0.561,0.447,105.575,271640,4
1993-09-25,6,The River Of Dreams,Billy Joel,7kozzDmfiSL3g3COR5m0ZB,False,6,6,9,0.631,0.749,7,-8.15,1,0.0576,0.205,5.21e-06,0.0667,0.437,89.646,247627,4
1993-09-25,7,Will You Be There,Michael Jackson,7kozzDmfiSL3g3COR5m0ZB,False,8,7,11,0.348,0.432,8,-9.553,1,0.0388,0.819,0.0856,0.191,0.141,82.911,460000,4
1993-09-25,8,Runaway Train,Soul Asylum,7kozzDmfiSL3g3COR5m0ZB,False,7,5,16,0.613,0.72,0,-7.957,1,0.0425,0.0132,0,0.104,0.561,117.341,265867,4
1993-09-25,9,Lately,Jodeci,7kozzDmfiSL3g3COR5m0ZB,False,9,4,16,0.382,0.42,1,-7.851,1,0.0444,0.696,0,0.411,0.304,126.413,349000,4
1993-09-25,10,Baby I'm Yours,Shai,7kozzDmfiSL3g3COR5m0ZB,False,10,10,17,0.705,0.575,2,-9.518,1,0.0381,0.215,2.09e-05,0.12,0.596,143.8,274667,4
1993-09-25,11,Another Sad Love Song,Toni Braxton,7kozzDmfiSL3g3COR5m0ZB,False,14,11,13,0.78,0.71,2,-7.429,1,0.0479,0.0143,3.49e-05,0.0366,0.858,96.067,301560,4
1993-09-25,12,I Get Around,2Pac,7kozzDmfiSL3g3COR5m0ZB,False,12,12,13,0.846,0.416,10,-13.767,0,0.118,0.156,9.34e-06,0.238,0.645,96.188,259000,4
1993-09-25,13,Boom! Shake The Room,Jazzy Jeff & The Fresh Prince,7kozzDmfiSL3g3COR5m0ZB,False,17,13,8,0.792,0.964,1,-5.405,1,0.154,0.0698,0,0.302,0.621,99.771,226200,4
1993-09-25,14,Cryin',Aerosmith,7kozzDmfiSL3g3COR5m0ZB,False,18,14,9,0.445,0.858,9,-3.673,1,0.0327,0.0002,0.0108,0.367,0.489,105.88,308333,3
1993-09-25,15,One Last Cry,Brian McKnight,7kozzDmfiSL3g3COR5m0ZB,False,13,13,16,0.355,0.126,11,-13.801,1,0.0301,0.909,0.000337,0.131,0.102,109.769,295358,4
1993-09-25,16,Rain,Madonna,7kozzDmfiSL3g3COR5m0ZB,False,16,14,10,0.592,0.642,10,-9.38,1,0.026,0.0883,0.00134,0.131,0.16,92.419,328987,4
1993-09-25,17,I'm Gonna Be (500 Miles),The Proclaimers,7kozzDmfiSL3g3COR5m0ZB,False,15,3,16,0.851,0.551,4,-5.177,1,0.0396,0.151,0,0.0827,0.807,131.922,219467,4
1993-09-25,18,If I Had No Loot,Tony Toni Tone,7kozzDmfiSL3g3COR5m0ZB,False,11,7,16,0.873,0.721,11,-9.774,0,0.0448,0.113,0,0.27,0.81,106.725,241467,4
1993-09-25,19,Insane In The Brain,Cypress Hill,7kozzDmfiSL3g3COR5m0ZB,False,20,19,12,0.897,0.612,11,-10.489,1,0.211,0.0297,0.186,0.0894,0.767,102.305,208267,4
1993-09-25,20,"I Don't Wanna Fight (From ""What's Love Got To Do With It"")",Tina Turner,7kozzDmfiSL3g3COR5m0ZB,False,19,9,18,0.601,0.899,2,-4.084,1,0.0485,0.208,3.32e-06,0.141,0.665,92.051,265400,4
1993-09-25,21,Reason To Believe,Rod Stewart,7kozzDmfiSL3g3COR5m0ZB,False,32,21,7,0.38,0.625,7,-9.464,1,0.0405,0.603,0.00153,0.155,0.422,138.325,247880,4
1993-09-25,22,Sweat (A La La La La Long),Inner Circle,7kozzDmfiSL3g3COR5m0ZB,False,30,22,8,0.787,0.728,0,-7.705,1,0.218,0.0124,0,0.157,0.94,173.026,227067,4
1993-09-25,23,"When I Fall In Love (From ""Sleepless In Seattle"")",Celine Dion And Clive Griffin,7kozzDmfiSL3g3COR5m0ZB,False,29,23,11,0.19,0.241,8,-13.251,1,0.0322,0.577,0,0.0952,0.107,68.353,260827,4
1993-09-25,24,Alright,Kris Kross Featuring Supercat,7kozzDmfiSL3g3COR5m0ZB,False,21,19,9,0.803,0.582,10,-11.286,0,0.19,0.00432,4.26e-05,0.252,0.547,97.305,243333,4
1993-09-25,25,Break It Down Again,Tears For Fears,7kozzDmfiSL3g3COR5m0ZB,False,27,25,11,0.681,0.742,5,-7.0,1,0.0249,0.0134,0.422,0.121,0.486,109.001,271533,4
1993-09-25,26,"Soul To Squeeze (From ""Coneheads"")",Red Hot Chili Peppers,7kozzDmfiSL3g3COR5m0ZB,False,37,26,5,0.663,0.546,5,-5.234,1,0.0269,0.0322,0.000572,0.107,0.656,88.171,289533,4
1993-09-25,27,Weak,SWV,7kozzDmfiSL3g3COR5m0ZB,False,22,1,23,0.693,0.533,2,-10.954,0,0.0402,0.107,0,0.0695,0.568,127.661,291907,4
1993-09-25,28,Hey Mr. D.J.,Zhane,7kozzDmfiSL3g3COR5m0ZB,False,38,28,5,0.865,0.645,2,-6.939,1,0.071,0.0836,0.00117,0.109,0.89,101.313,255027,4
1993-09-25,29,"Whoot, There It Is",95 South,7kozzDmfiSL3g3COR5m0ZB,False,23,11,22,0.783,0.498,7,-14.387,1,0.0556,0.0157,0.245,0.456,0.519,132.952,276867,4
1993-09-25,30,"Two Steps Behind (From ""Last Action Hero"")",Def Leppard,7kozzDmfiSL3g3COR5m0ZB,False,49,30,3,0.456,0.419,2,-10.594,1,0.0247,0.117,0,0.178,0.425,146.148,256486,4
1993-09-25,31,Ooh Child,Dino,7kozzDmfiSL3g3COR5m0ZB,False,28,27,12,0.687,0.58,5,-12.159,1,0.0572,0.00304,0.677,0.368,0.896,96.105,246547,4
1993-09-25,32,Check Yo Self,Ice Cube Featuring Das EFX,7kozzDmfiSL3g3COR5m0ZB,False,24,20,9,0.934,0.735,1,-6.668,1,0.251,0.031,8.6e-06,0.107,0.768,101.368,273107,4
1993-09-25,33,Hey Jealousy,Gin Blossoms,7kozzDmfiSL3g3COR5m0ZB,False,33,33,10,0.471,0.797,6,-8.407,0,0.0389,0.000179,6.49e-06,0.299,0.497,152.903,236627,4
1993-09-25,34,Dazzey Duks,Duice,7kozzDmfiSL3g3COR5m0ZB,False,31,12,38,0.884,0.464,1,-12.876,1,0.222,0.000925,4.36e-06,0.0366,0.868,132.172,244867,4
1993-09-25,35,What's Up,4 Non Blondes,7kozzDmfiSL3g3COR5m0ZB,False,26,14,23,0.565,0.564,2,-10.044,1,0.0292,0.161,0,0.114,0.454,134.355,295533,4
1993-09-25,36,Show Me Love,Robin S.,7kozzDmfiSL3g3COR5m0ZB,False,34,5,26,0.811,0.833,5,-4.259,1,0.153,0.014,2.06e-05,0.0769,0.567,120.258,252107,4
1993-09-25,37,Very Special,"Big Daddy Kane Feat. Spinderella, L. Williams & K. Anderson",7kozzDmfiSL3g3COR5m0ZB,False,35,35,12,0.686,0.398,8,-13.361,0,0.143,0.241,0,0.0573,0.688,80.228,305013,4
1993-09-25,38,I'll Never Get Over You (Getting Over Me),Expose,7kozzDmfiSL3g3COR5m0ZB,False,36,8,27,0.323,0.311,8,-12.671,1,0.0312,0.643,0,0.349,0.146,166.943,230933,4
1993-09-25,39,Slam,Onyx,7kozzDmfiSL3g3COR5m0ZB,False,25,4,18,0.876,0.71,11,-12.908,1,0.347,0.0654,0.00312,0.918,0.724,98.305,218333,4
1993-09-25,40,Ruffneck,MC Lyte,7kozzDmfiSL3g3COR5m0ZB,False,39,39,11,0.709,0.902,1,-3.392,0,0.188,0.0364,0,0.0219,0.878,204.317,237267,4
1993-09-25,41,What Is Love,Haddaway,7kozzDmfiSL3g3COR5m0ZB,False,50,41,5,0.683,0.772,7,-7.907,0,0.0311,0.0222,0.0149,0.203,0.737,123.871,270373,4
1993-09-25,42,That's The Way Love Goes,Janet Jackson,7kozzDmfiSL3g3COR5m0ZB,False,41,1,22,0.703,0.7,5,-6.789,1,0.0693,0.302,0.471,0.0718,0.582,97.675,265107,4
1993-09-25,43,Hopelessly,Rick Astley,7kozzDmfiSL3g3COR5m0ZB,False,52,43,4,0.547,0.457,8,-9.872,1,0.0293,0.46,0,0.122,0.298,150.001,215133,4
1993-09-25,44,Creep,Radiohead,7kozzDmfiSL3g3COR5m0ZB,False,40,34,14,0.515,0.43,7,-9.935,1,0.0372,0.0097,0.000133,0.129,0.104,91.844,238640,4
1993-09-25,45,Fields Of Gold,Sting,7kozzDmfiSL3g3COR5m0ZB,False,43,23,17,0.651,0.339,2,-11.917,1,0.0246,0.372,0.0141,0.0739,0.32,103.996,222120,4
1993-09-25,46,Knockin' Da Boots,H-Town,7kozzDmfiSL3g3COR5m0ZB,False,42,3,25,0.726,0.501,1,-13.884,0,0.154,0.155,0,0.0893,0.582,128.099,330945,4
1993-09-25,47,Dre Day,Dr. Dre,7kozzDmfiSL3g3COR5m0ZB,False,44,8,20,0.75,0.706,7,-7.461,1,0.156,0.088,0,0.535,0.59,93.603,292187,4
1993-09-25,48,I'd Do Anything For Love (But I Won't Do That),Meat Loaf,7kozzDmfiSL3g3COR5m0ZB,False,68,48,2,0.419,0.672,2,-6.353,1,0.092,0.623,0,0.412,0.304,105.212,316467,4
1993-09-25,49,Come Undone,Duran Duran,7kozzDmfiSL3g3COR5m0ZB,False,48,7,24,0.542,0.793,8,-8.203,1,0.053,0.0423,3.95e-06,0.0814,0.708,173.931,256520,4
1993-09-25,50,Something In Your Eyes,Bell Biv DeVoe,7kozzDmfiSL3g3COR5m0ZB,False,53,50,6,0.796,0.623,6,-9.309,0,0.0328,0.0301,6.99e-05,0.0285,0.899,128.915,292533,4
1993-09-25,51,No Rain,Blind Melon,7kozzDmfiSL3g3COR5m0ZB,False,57,51,6,0.389,0.476,9,-9.342,1,0.0316,0.619,5.09e-05,0.255,0.566,148.117,217107,4
1993-09-25,52,Something's Goin' On,U.N.V.,7kozzDmfiSL3g3COR5m0ZB,False,46,29,17,0.666,0.423,7,-13.306,0,0.0443,0.0384,0,0.298,0.657,127.243,340349,4
1993-09-25,53,Sunday Morning,"Earth, Wind & Fire",7kozzDmfiSL3g3COR5m0ZB,False,60,53,5,0.613,0.783,8,-9.55,0,0.0353,0.00408,4.65e-06,0.0446,0.83,159.291,251867,4
1993-09-25,54,One Woman,Jade,7kozzDmfiSL3g3COR5m0ZB,False,47,22,17,0.662,0.605,1,-9.475,1,0.0566,0.0552,0,0.418,0.545,151.946,289467,4
1993-09-25,55,Better Than You,Lisa Keith,7kozzDmfiSL3g3COR5m0ZB,False,64,55,6,0.706,0.933,8,-4.442,1,0.0467,0.0339,0.000323,0.138,0.762,99.451,253667,4
1993-09-25,56,Love For Love,Robin S.,7kozzDmfiSL3g3COR5m0ZB,False,56,53,6,0.769,0.707,0,-8.862,1,0.0426,0.000301,0.0245,0.0478,0.93,117.954,255147,4
1993-09-25,57,I'm Free,Jon Secada,7kozzDmfiSL3g3COR5m0ZB,False,51,27,14,0.52,0.634,5,-8.768,1,0.0275,0.133,0,0.29,0.478,197.315,240867,4
1993-09-25,58,Chief Rocka,Lords Of The Underground,7kozzDmfiSL3g3COR5m0ZB,False,58,55,12,0.89,0.716,1,-9.673,1,0.296,0.174,0.000589,0.0657,0.656,99.987,247400,4
1993-09-25,59,Too Much Information,Duran Duran,7kozzDmfiSL3g3COR5m0ZB,False,62,59,4,0.566,0.965,10,-8.52,0,0.0342,0.00359,0.0572,0.0982,0.791,108.056,295960,4
1993-09-25,60,Pink Cashmere,Prince,7kozzDmfiSL3g3COR5m0ZB,False,88,60,2,0.731,0.435,1,-8.338,1,0.0466,0.568,8.97e-05,0.0901,0.862,167.142,374893,4
1993-09-25,61,Come Inside,Intro,7kozzDmfiSL3g3COR5m0ZB,False,63,61,4,0.735,0.447,4,-15.942,0,0.0609,0.0114,0,0.305,0.619,135.999,489733,4
1993-09-25,62,Everybody Hurts,R.E.M.,7kozzDmfiSL3g3COR5m0ZB,False,73,62,3,0.467,0.324,2,-10.451,1,0.0255,0.615,0.0248,0.118,0.166,94.301,320267,3
1993-09-25,63,Run To You,Whitney Houston,7kozzDmfiSL3g3COR5m0ZB,False,61,31,14,0.368,0.364,8,-10.21,1,0.0318,0.628,0,0.157,0.131,76.923,264333,4
1993-09-25,64,Mega Medley,Zapp & Roger,7kozzDmfiSL3g3COR5m0ZB,False,54,54,8,0.732,0.788,6,-7.09,1,0.15,0.197,9.09e-05,0.39,0.765,111.738,248600,4
1993-09-25,65,Just Kickin' It,Xscape,7kozzDmfiSL3g3COR5m0ZB,False,90,65,2,0.694,0.365,1,-12.294,0,0.0635,0.054,3.43e-05,0.401,0.693,80.904,204133,4
1993-09-25,66,Chattahoochee,Alan Jackson,7kozzDmfiSL3g3COR5m0ZB,False,59,46,12,0.606,0.706,0,-9.665,1,0.0379,0.362,0,0.16,0.819,174.533,148160,4
1993-09-25,67,What's Up Doc? (Can We Rock),Fu-Schnickens W/ Shaquille O'Neal,7kozzDmfiSL3g3COR5m0ZB,False,55,39,13,0.874,0.832,6,-7.427,1,0.175,0.0223,1.13e-06,0.197,0.832,108.654,232800,4
1993-09-25,68,All That She Wants,Ace Of Base,7kozzDmfiSL3g3COR5m0ZB,False,92,68,2,0.798,0.625,11,-9.689,1,0.0548,0.00547,7.98e-05,0.103,0.858,93.764,211213,4
1993-09-25,69,Come Baby Come,K7,7kozzDmfiSL3g3COR5m0ZB,False,71,69,4,0.832,0.726,11,-7.739,0,0.191,0.0283,0,0.0468,0.548,106.118,239733,4
1993-09-25,70,Believe,Lenny Kravitz,7kozzDmfiSL3g3COR5m0ZB,False,65,60,13,0.73,0.65,5,-8.142,0,0.0354,0.00243,0.0245,0.0445,0.748,120.038,280973,4
1993-09-25,73,Cry No More,II D Extreme,,False,67,48,20,0.675,0.472,3,-8.656,0,0.0305,0.208,0,0.0727,0.567,130.033,282881,4
1993-09-25,74,Don't Take Away My Heaven,Aaron Neville,,False,74,56,19,0.583,0.538,9,-12.471,1,0.0819,0.428,2.13e-05,0.0792,0.653,187.581,278467,4
1993-09-25,75,I'm In Luv,Joe,,False,75,75,5,0.736,0.822,11,-6.142,0,0.0317,0.023,0,0.0615,0.735,99.654,228027,4
1993-09-25,76,"Get It Up (From ""Poetic Justice"")",TLC,,False,70,42,13,0.751,0.874,7,-5.509,1,0.0348,0.0422,0.0139,0.0642,0.754,104.89,254667,4
1993-09-25,77,Delicate,Terence Trent D'Arby,,False,77,77,5,0.582,0.593,5,-7.913,0,0.0268,0.289,0.000129,0.278,0.532,113.171,256333,4
1993-09-25,78,Oh Carolina,Shaggy,,False,76,73,7,0.816,0.913,5,-5.042,0,0.0997,0.469,0,0.331,0.915,124.578,194213,4
1993-09-25,79,Breakadawn,De La Soul,,False,84,79,2,0.808,0.821,7,-10.768,1,0.074,0.181,0.000113,0.151,0.667,96.92,253378,4
1993-09-25,80,Can't Get Enough Of Your Love,Taylor Dayne,,False,72,20,17,0.691,0.837,9,-5.09,0,0.0353,0.0147,4.47e-05,0.162,0.64,108.175,265893,4
1993-09-25,81,Lick U Up,H-Town,,False,81,67,9,0.657,0.333,11,-14.956,0,0.0459,0.324,0,0.0674,0.39,135.883,334472,4
1993-09-25,82,What Might Have Been,Little Texas,,False,85,79,8,0.621,0.201,7,-15.112,1,0.0296,0.623,0,0.131,0.146,130.627,238800,4
1993-09-25,83,The Ways Of The Wind,P.M. Dawn,,False,80,54,10,0.736,0.5,7,-13.336,1,0.0408,0.32,0,0.107,0.493,109.95,271293,4
1993-09-25,84,Anniversary,Tony Toni Tone,6PViGgcsQhLPSkMxgoRWLl,True,0,84,1,0.711,0.505,8,-9.675,0,0.0343,0.0472,0,0.317,0.55,89.004,271200,4
1993-09-25,85,"Streiht Up Menace (From ""Menace II Society"")",MC Eiht,6PViGgcsQhLPSkMxgoRWLl,False,79,72,7,0.809,0.723,7,-5.532,1,0.117,0.0378,0.00816,0.222,0.668,85.952,277582,4
1993-09-25,86,Step It Up,Stereo MC's,6PViGgcsQhLPSkMxgoRWLl,False,78,58,12,0.722,0.829,9,-11.96,1,0.0442,0.015,0.0118,0.0769,0.871,117.841,301000,4
1993-09-25,87,Let Me Ride,Dr. Dre,1pjDKRg5WddCDSlG5PXcKy,True,0,87,1,0.731,0.818,7,-7.035,1,0.182,0.127,0.00636,0.233,0.862,92.29,261293,4
1993-09-25,88,Human Wheels,John Mellencamp,1pjDKRg5WddCDSlG5PXcKy,False,98,88,2,0.554,0.917,6,-4.692,0,0.0358,0.00428,0.000672,0.286,0.923,149.672,334173,4
1993-09-25,89,For The Cool In You,Babyface,1pjDKRg5WddCDSlG5PXcKy,False,86,81,7,0.668,0.77,6,-7.661,0,0.0447,0.142,0.515,0.0585,0.611,92.079,293733,4
1993-09-25,90,The Bonnie And Clyde Theme,Yo-Yo,1pjDKRg5WddCDSlG5PXcKy,False,95,72,9,0.569,0.478,6,-12.635,1,0.0315,0.807,0.0051,0.13,0.694,112.165,162093,4
1993-09-25,91,In The Heart Of A Woman,Billy Ray Cyrus,1pjDKRg5WddCDSlG5PXcKy,False,91,76,9,0.456,0.527,9,-11.008,1,0.0318,0.4,3.13e-06,0.276,0.476,90.732,239627,4
1993-09-25,92,By The Time This Night Is Over,Kenny G With Peabo Bryson,1pjDKRg5WddCDSlG5PXcKy,False,89,25,19,0.645,0.439,0,-12.43,0,0.037,0.0988,0,0.279,0.472,103.872,260773,4
1993-09-25,93,"It's For You (From ""The Meteor Man"")",Shanice,1pjDKRg5WddCDSlG5PXcKy,False,83,57,11,0.701,0.512,11,-10.152,0,0.315,0.0301,0,0.0879,0.54,74.988,297417,4
1993-09-25,94,Stay Forever,Joey Lawrence,1pjDKRg5WddCDSlG5PXcKy,False,82,52,11,0.613,0.645,4,-9.214,1,0.0331,0.0572,3.51e-06,0.0368,0.748,156.889,258867,4
1993-09-25,95,Even A Fool Can See,Peter Cetera,1pjDKRg5WddCDSlG5PXcKy,False,97,68,11,0.774,0.491,0,-11.6,0,0.0267,0.345,0.00987,0.326,0.685,119.565,271400,4
1993-09-25,96,"Indo Smoke (From ""Poetic Justice"")",Mista Grimm,63KcYWznO0w3J5wymiT9QK,True,0,96,1,0.785,0.556,0,-11.7,0,0.271,0.0288,0,0.482,0.601,98.836,322227,4
1993-09-25,97,Heaven Knows,Luther Vandross,63KcYWznO0w3J5wymiT9QK,False,94,94,2,0.769,0.809,2,-9.446,1,0.0347,0.227,0,0.143,0.767,107.11,300667,4
1993-09-25,98,World (The Price Of Love),New Order,63KcYWznO0w3J5wymiT9QK,False,100,92,3,0.603,0.955,1,-4.111,1,0.0458,0.0239,0.0451,0.119,0.787,123.922,270827,4
1993-09-25,99,ABC-123,Levert,63KcYWznO0w3J5wymiT9QK,False,96,46,17,0.746,0.437,5,-8.814,1,0.0284,0.183,0,0.0478,0.394,147.819,355933,3
1993-09-25,100,That's What Little Girls Are Made Of,Raven-Symone,63KcYWznO0w3J5wymiT9QK,False,93,68,8,0.833,0.599,11,-11.126,0,0.193,0.00209,0.0928,0.142,0.347,102.363,202333,4
