date,position,title,artist,spotify_id,is_new,last_pos,peak_pos,weeks,danceability,energy,key,loudness,mode,speechiness,acousticness,instrumentalness,liveness,valence,tempo,duration_ms,time_signature
2006-11-04,1,Money Maker,Ludacris Featuring Pharrell,0axUHkhMMY0YSC1jFBVWqv,False,1,1,11,0.551,0.598,1,-6.79,1,0.27,0.15,0,0.299,0.612,78.756,230613,4
2006-11-04,2,Smack That,Akon Featuring Eminem,0axUHkhMMY0YSC1jFBVWqv,False,4,2,5,0.939,0.742,5,-5.171,0,0.0467,0.321,0,0.107,0.924,118.978,212360,4
2006-11-04,3,Lips Of An Angel,Hinder,0axUHkhMMY0YSC1jFBVWqv,False,3,3,15,0.476,0.736,2,-5.38,1,0.0343,0.0217,1.08e-06,0.203,0.251,129.084,261853,4
2006-11-04,4,SexyBack,Justin Timberlake,0axUHkhMMY0YSC1jFBVWqv,False,2,1,16,0.967,0.583,7,-5.562,0,0.0789,0.0584,0,0.0519,0.964,117.0,242733,4
2006-11-04,5,My Love,Justin Timberlake Featuring T.I.,0axUHkhMMY0YSC1jFBVWqv,False,8,5,7,0.771,0.68,11,-5.881,0,0.224,0.277,1.18e-05,0.682,0.808,119.952,276160,4
2006-11-04,6,How To Save A Life,The Fray,0axUHkhMMY0YSC1jFBVWqv,False,5,3,28,0.64,0.743,10,-4.08,1,0.0379,0.269,0,0.101,0.361,122.035,262533,4
2006-11-04,7,Too Little Too Late,JoJo,0axUHkhMMY0YSC1jFBVWqv,False,7,3,10,0.394,0.821,6,-4.304,0,0.0404,0.00302,0.019,0.186,0.509,82.764,223533,4
2006-11-04,8,Chasing Cars,Snow Patrol,0axUHkhMMY0YSC1jFBVWqv,False,6,5,23,0.563,0.592,9,-4.571,1,0.0276,0.209,5.08e-05,0.132,0.136,104.016,267933,4
2006-11-04,9,Come To Me,Diddy Featuring Nicole Scherzinger,0axUHkhMMY0YSC1jFBVWqv,False,18,9,8,0.819,0.485,6,-6.45,0,0.0756,0.0176,0,0.658,0.386,96.998,276787,4
2006-11-04,10,Far Away,Nickelback,0axUHkhMMY0YSC1jFBVWqv,False,10,8,14,0.518,0.797,6,-5.153,1,0.0309,0.000681,0,0.107,0.293,132.918,238173,4
2006-11-04,11,Chain Hang Low,Jibbs,0axUHkhMMY0YSC1jFBVWqv,False,9,7,12,0.792,0.589,4,-6.869,0,0.262,0.0259,0.000128,0.114,0.778,157.147,207587,4
2006-11-04,12,Say Goodbye,Chris Brown,0axUHkhMMY0YSC1jFBVWqv,False,14,12,11,0.8,0.502,1,-6.062,1,0.0371,0.00167,0,0.0784,0.388,115.091,289760,4
2006-11-04,13,Show Stopper,Danity Kane,0axUHkhMMY0YSC1jFBVWqv,False,12,8,10,0.755,0.408,5,-10.33,0,0.187,0.0133,0,0.33,0.465,76.034,229240,4
2006-11-04,14,Call Me When You're Sober,Evanescence,0axUHkhMMY0YSC1jFBVWqv,False,13,10,10,0.45,0.883,7,-4.094,1,0.0524,0.00193,0,0.293,0.328,93.41,214707,4
2006-11-04,15,White & Nerdy,"""Weird Al"" Yankovic",0axUHkhMMY0YSC1jFBVWqv,False,11,9,4,0.791,0.613,1,-11.628,0,0.0763,0.0986,0,0.0765,0.896,143.017,170640,4
2006-11-04,16,Maneater,Nelly Furtado,0axUHkhMMY0YSC1jFBVWqv,False,16,16,6,0.792,0.77,6,-4.811,1,0.0392,0.0318,0.000194,0.122,0.732,132.793,258840,4
2006-11-04,17,London Bridge,Fergie,0axUHkhMMY0YSC1jFBVWqv,False,15,1,14,0.769,0.609,1,-5.894,1,0.357,0.216,0,0.166,0.633,90.951,241307,4
2006-11-04,18,Buttons,The Pussycat Dolls Featuring Snoop Dogg,0axUHkhMMY0YSC1jFBVWqv,False,19,3,24,0.57,0.821,2,-4.38,1,0.267,0.178,0,0.289,0.408,210.857,225560,4
2006-11-04,19,Fergalicious,Fergie,0axUHkhMMY0YSC1jFBVWqv,False,35,19,5,0.906,0.584,8,-7.72,0,0.316,0.0576,0,0.128,0.831,129.055,292373,4
2006-11-04,20,Get Up,Ciara Featuring Chamillionaire,0axUHkhMMY0YSC1jFBVWqv,False,20,7,13,0.964,0.595,1,-6.887,0,0.109,0.0248,5.14e-06,0.0405,0.629,128.593,261880,4
2006-11-04,21,Shortie Like Mine,Bow Wow Featuring Chris Brown & Johnta Austin,0axUHkhMMY0YSC1jFBVWqv,False,44,21,3,0.758,0.642,7,-8.128,0,0.221,0.0745,0,0.191,0.701,142.078,268067,4
2006-11-04,22,Crazy,Gnarls Barkley,0axUHkhMMY0YSC1jFBVWqv,False,23,2,25,0.835,0.741,8,-1.609,1,0.0339,0.0172,0.0577,0.0826,0.612,111.963,182066,4
2006-11-04,23,Waiting On The World To Change,John Mayer,0axUHkhMMY0YSC1jFBVWqv,False,26,20,15,0.577,0.756,2,-5.82,1,0.115,0.159,0.000232,0.249,0.663,176.75,201173,4
2006-11-04,24,Before He Cheats,Carrie Underwood,0axUHkhMMY0YSC1jFBVWqv,False,28,24,8,0.519,0.749,6,-3.318,0,0.0405,0.271,0,0.119,0.29,147.905,199947,4
2006-11-04,25,Ring The Alarm,Beyonce,0axUHkhMMY0YSC1jFBVWqv,False,21,11,7,0.458,0.751,2,-8.395,1,0.469,0.0299,0.000155,0.258,0.48,169.673,203347,4
2006-11-04,26,Pullin' Me Back,Chingy Featuring Tyrese,0axUHkhMMY0YSC1jFBVWqv,False,17,9,19,0.786,0.511,7,-6.66,1,0.286,0.0825,0,0.12,0.587,80.0,234133,4
2006-11-04,27,Over My Head (Cable Car),The Fray,0axUHkhMMY0YSC1jFBVWqv,False,25,8,37,0.592,0.729,8,-4.156,1,0.0448,0.022,0,0.0653,0.709,116.03,236267,4
2006-11-04,28,When You Were Young,The Killers,0axUHkhMMY0YSC1jFBVWqv,False,24,14,11,0.467,0.988,11,-3.313,1,0.112,0.000152,0.0484,0.28,0.321,130.433,220427,4
2006-11-04,29,I Know You See It,Yung Joc Featuring Brandy 'Ms. B.' Hambrick,0axUHkhMMY0YSC1jFBVWqv,False,22,17,17,0.744,0.368,1,-6.349,1,0.0524,0.0702,0,0.192,0.391,84.018,241307,4
2006-11-04,30,Sexy Love,Ne-Yo,0axUHkhMMY0YSC1jFBVWqv,False,27,7,20,0.686,0.599,8,-4.487,1,0.0512,0.311,6.41e-05,0.065,0.401,94.014,220853,4
2006-11-04,31,Walk It Out,Unk,0axUHkhMMY0YSC1jFBVWqv,False,43,31,7,0.794,0.777,1,-3.696,0,0.0813,0.0982,0,0.202,0.706,160.022,173040,4
2006-11-04,32,Stuntin' Like My Daddy,Birdman & Lil Wayne,0axUHkhMMY0YSC1jFBVWqv,False,51,32,8,0.71,0.881,5,-6.648,0,0.0398,0.00908,0,0.162,0.809,160.011,267293,4
2006-11-04,33,I Write Sins Not Tragedies,Panic! At The Disco,0axUHkhMMY0YSC1jFBVWqv,False,29,7,34,0.569,0.83,9,-4.106,0,0.14,0.0807,0,0.114,0.609,170.094,186635,4
2006-11-04,34,What Hurts The Most,Rascal Flatts,0axUHkhMMY0YSC1jFBVWqv,False,31,6,38,0.537,0.674,5,-5.134,0,0.0277,0.0088,0,0.265,0.33,136.002,214107,4
2006-11-04,35,My Little Girl,Tim McGraw,0axUHkhMMY0YSC1jFBVWqv,False,53,35,6,0.457,0.636,0,-3.41,1,0.0262,0.351,7.01e-06,0.111,0.238,144.686,218560,4
2006-11-04,36,I Loved Her First,Heartland,0axUHkhMMY0YSC1jFBVWqv,False,34,34,11,0.405,0.384,4,-6.508,1,0.0263,0.3,0,0.106,0.176,137.492,212880,3
2006-11-04,37,Gallery,Mario Vazquez,0axUHkhMMY0YSC1jFBVWqv,False,38,37,14,0.593,0.651,9,-6.904,0,0.135,0.0169,0,0.141,0.323,86.535,223613,4
2006-11-04,38,Hurt,Christina Aguilera,0axUHkhMMY0YSC1jFBVWqv,False,59,38,4,0.327,0.295,4,-6.907,0,0.0313,0.775,0,0.107,0.143,148.574,243373,4
2006-11-04,39,Promiscuous,Nelly Furtado Featuring Timbaland,0axUHkhMMY0YSC1jFBVWqv,False,30,1,25,0.795,0.978,10,-6.097,0,0.0459,0.046,8.29e-05,0.143,0.843,114.321,242200,4
2006-11-04,40,It Ends Tonight,The All-American Rejects,0axUHkhMMY0YSC1jFBVWqv,False,58,40,4,0.454,0.636,0,-4.731,1,0.0273,0.00228,0,0.154,0.313,87.89,244827,4
2006-11-04,41,I Wanna Love You,Akon Featuring Snoop Dogg,0axUHkhMMY0YSC1jFBVWqv,False,56,41,4,0.866,0.454,0,-9.383,1,0.0414,0.0373,1.49e-06,0.275,0.368,99.985,247067,4
2006-11-04,42,U And Dat,E-40 Featuring T-Pain & Kandi Girl,0axUHkhMMY0YSC1jFBVWqv,False,33,13,24,0.858,0.484,6,-7.448,0,0.277,0.0241,1.8e-06,0.123,0.329,99.992,202720,4
2006-11-04,43,My Wish,Rascal Flatts,0axUHkhMMY0YSC1jFBVWqv,False,41,41,7,0.548,0.769,4,-4.853,1,0.0312,0.0307,5.53e-06,0.0867,0.388,135.712,248280,4
2006-11-04,44,(When You Gonna) Give It Up To Me,Sean Paul Feat. Keyshia Cole,0axUHkhMMY0YSC1jFBVWqv,False,32,3,22,0.951,0.6,0,-4.675,0,0.0685,0.106,0,0.0712,0.822,125.04,218573,4
2006-11-04,45,Money In The Bank,Lil Scrappy Featuring Young Buck,0axUHkhMMY0YSC1jFBVWqv,False,55,45,6,0.88,0.693,1,-5.201,1,0.332,0.0599,0,0.248,0.767,75.603,233707,4
2006-11-04,46,Move Along,The All-American Rejects,0axUHkhMMY0YSC1jFBVWqv,False,42,15,39,0.518,0.916,3,-3.858,1,0.0454,0.000148,0,0.291,0.646,109.864,238880,4
2006-11-04,47,Want To,Sugarland,0axUHkhMMY0YSC1jFBVWqv,False,49,41,5,0.438,0.73,3,-3.78,1,0.0407,0.474,0,0.113,0.148,158.281,215293,4
2006-11-04,48,Every Mile A Memory,Dierks Bentley,0axUHkhMMY0YSC1jFBVWqv,False,60,48,11,0.452,0.703,2,-4.903,1,0.0356,0.0803,0.00131,0.162,0.392,177.915,232720,4
2006-11-04,49,Hate Me,Blue October,0axUHkhMMY0YSC1jFBVWqv,False,37,31,28,0.449,0.691,4,-5.65,0,0.0349,0.477,0,0.0966,0.201,93.267,380200,4
2006-11-04,50,You Save Me,Kenny Chesney,0axUHkhMMY0YSC1jFBVWqv,False,48,48,8,0.509,0.547,0,-6.132,1,0.0299,0.33,9.45e-05,0.358,0.282,125.889,235773,3
2006-11-04,51,S.E.X.,Lyfe Jennings,0axUHkhMMY0YSC1jFBVWqv,False,40,37,14,0.501,0.468,8,-8.494,0,0.0507,0.31,2.04e-06,0.0923,0.712,105.769,198373,4
2006-11-04,52,That Girl,Frankie J Featuring Mannie Fresh & Chamillionaire,0axUHkhMMY0YSC1jFBVWqv,False,61,43,11,0.662,0.745,6,-5.626,0,0.172,0.206,0,0.174,0.569,170.138,239293,4
2006-11-04,53,Ain't No Other Man,Christina Aguilera,0axUHkhMMY0YSC1jFBVWqv,False,39,6,20,0.862,0.742,7,-4.722,1,0.222,0.00376,0.00855,0.103,0.511,127.91,228907,4
2006-11-04,54,We Fly High,Jim Jones,0axUHkhMMY0YSC1jFBVWqv,False,63,54,3,0.506,0.799,1,-6.58,1,0.38,0.0791,0,0.0929,0.461,120.405,236080,5
2006-11-04,55,Would You Go With Me,Josh Turner,0axUHkhMMY0YSC1jFBVWqv,False,46,43,17,0.605,0.864,6,-5.365,1,0.0292,0.13,0.000827,0.113,0.736,122.918,228187,4
2006-11-04,56,Welcome To The Black Parade,My Chemical Romance,0axUHkhMMY0YSC1jFBVWqv,False,64,56,6,0.217,0.905,2,-4.103,1,0.0752,0.000289,0.00011,0.222,0.236,96.95,311107,4
2006-11-04,57,Once In A Lifetime,Keith Urban,0axUHkhMMY0YSC1jFBVWqv,False,52,52,8,0.616,0.837,0,-5.266,1,0.0472,0.0592,0.00994,0.482,0.62,132.013,353813,4
2006-11-04,58,Show Me What You Got,JAY-Z,0axUHkhMMY0YSC1jFBVWqv,False,72,58,3,0.431,0.957,10,-0.982,0,0.26,0.0261,0,0.261,0.419,105.468,223120,4
2006-11-04,59,Chicken Noodle Soup.,Webstar & Young B Featuring The Voice Of Harlem,0axUHkhMMY0YSC1jFBVWqv,False,57,45,7,0.648,0.69,7,-6.389,1,0.344,0.0835,0,0.564,0.644,94.84,223120,4
2006-11-04,60,Boston,Augustana,0axUHkhMMY0YSC1jFBVWqv,False,54,54,3,0.404,0.571,0,-5.069,1,0.0303,0.182,2.08e-05,0.129,0.29,147.01,245933,4
2006-11-04,61,Tim McGraw,Taylor Swift,0axUHkhMMY0YSC1jFBVWqv,False,65,61,7,0.58,0.491,0,-6.462,1,0.0251,0.575,0,0.121,0.425,76.009,232107,4
2006-11-04,62,Tell Me,Diddy Featuring Christina Aguilera,7aRNccA1RsVl7lD7steC5N,True,0,62,1,0.548,0.938,8,-4.97,1,0.279,0.235,0,0.531,0.334,98.868,246147,4
2006-11-04,63,Push It,Rick Ross,7aRNccA1RsVl7lD7steC5N,False,69,61,8,0.66,0.765,7,-7.121,1,0.245,0.227,0,0.376,0.771,151.073,208600,4
2006-11-04,64,Give It Away,George Strait,7aRNccA1RsVl7lD7steC5N,False,50,35,12,0.674,0.646,5,-5.876,1,0.027,0.486,8.37e-05,0.262,0.613,148.1,209320,4
2006-11-04,65,Everytime Tha Beat Drop,Monica Featuring Dem Franchize Boyz,7aRNccA1RsVl7lD7steC5N,False,62,48,12,0.762,0.644,7,-6.715,1,0.223,0.0522,0,0.0821,0.82,81.99,223293,4
2006-11-04,66,Love Me Or Hate Me (F**k You!!!!),Lady Sovereign,7aRNccA1RsVl7lD7steC5N,False,81,66,2,0.888,0.806,7,-4.717,1,0.0714,0.0145,0,0.0686,0.913,120.012,209827,4
2006-11-04,67,Take Me As I Am,Mary J. Blige,7aRNccA1RsVl7lD7steC5N,False,68,67,5,0.599,0.565,11,-4.663,0,0.0334,0.0663,0,0.207,0.576,82.251,237493,4
2006-11-04,68,Need A Boss,Shareefa Featuring Ludacris,7aRNccA1RsVl7lD7steC5N,False,66,66,13,0.684,0.797,0,-5.406,0,0.361,0.0457,3.72e-06,0.275,0.565,84.012,234813,4
2006-11-04,69,Suddenly I See,KT Tunstall,7aRNccA1RsVl7lD7steC5N,False,76,60,15,0.587,0.767,0,-5.713,1,0.0449,0.225,0,0.112,0.664,100.38,201707,4
2006-11-04,70,Tell Me Baby,Red Hot Chili Peppers,7aRNccA1RsVl7lD7steC5N,False,67,50,10,0.695,0.993,0,-3.114,1,0.0612,0.00177,0.00246,0.0814,0.281,107.951,247667,4
2006-11-04,71,The Riddle,Five For Fighting,7aRNccA1RsVl7lD7steC5N,False,70,40,14,0.59,0.562,10,-5.8,1,0.029,0.327,0,0.135,0.271,119.429,227027,4
2006-11-04,72,Right Where You Want Me,Jesse McCartney,7aRNccA1RsVl7lD7steC5N,False,71,33,7,0.575,0.818,10,-4.878,1,0.0266,0.0112,0,0.327,0.521,77.983,233760,4
2006-11-04,73,I Call It Love,Lionel Richie,7aRNccA1RsVl7lD7steC5N,False,75,62,14,0.681,0.753,8,-4.082,1,0.107,0.459,0,0.114,0.578,91.993,198427,4
2006-11-04,74,Through Glass,Stone Sour,7aRNccA1RsVl7lD7steC5N,False,79,71,12,0.545,0.753,3,-4.618,0,0.036,0.0417,0,0.389,0.434,105.754,282947,4
2006-11-04,75,Walk Away (Remember Me),Paula DeAnda Featuring The DEY,7aRNccA1RsVl7lD7steC5N,False,90,75,3,0.672,0.585,0,-5.797,1,0.0582,0.192,0,0.156,0.834,77.998,238160,4
2006-11-04,76,Put Your Records On,Corinne Bailey Rae,7aRNccA1RsVl7lD7steC5N,False,73,64,17,0.739,0.511,9,-7.844,1,0.0362,0.167,1.34e-06,0.133,0.542,96.038,215360,4
2006-11-04,77,She's Everything,Brad Paisley,7aRNccA1RsVl7lD7steC5N,False,86,77,3,0.355,0.478,0,-8.323,1,0.0335,0.569,2.9e-06,0.194,0.269,102.971,266920,4
2006-11-04,78,The Pick Of Destiny,Tenacious D,3pYKJaLiixRcDFfcNhxZKK,True,0,78,1,0.623,0.938,0,-4.161,1,0.123,0.00296,0.000852,0.48,0.308,112.022,165960,4
2006-11-04,79,Here It Goes Again,OK Go,3pYKJaLiixRcDFfcNhxZKK,False,80,38,8,0.537,0.882,0,-2.306,1,0.0403,0.000342,9.06e-05,0.12,0.81,145.729,179813,4
2006-11-04,80,It's Okay (One Blood),The Game Featuring Junior Reid,3pYKJaLiixRcDFfcNhxZKK,False,78,76,10,0.608,0.875,7,-5.642,1,0.231,0.000921,0,0.125,0.589,163.443,257600,4
2006-11-04,81,Unappreciated,Cherish,3pYKJaLiixRcDFfcNhxZKK,False,92,81,4,0.735,0.521,7,-6.696,0,0.0876,0.0888,0,0.065,0.374,77.01,235333,4
2006-11-04,82,The Kill (Bury Me),30 Seconds To Mars,3pYKJaLiixRcDFfcNhxZKK,False,87,65,14,0.179,0.912,4,-3.881,0,0.0791,0.0014,0.000294,0.582,0.289,182.99,231533,3
2006-11-04,83,Streetcorner Symphony,Rob Thomas,3pYKJaLiixRcDFfcNhxZKK,False,93,76,4,0.633,0.886,1,-3.892,1,0.0456,0.109,0,0.0438,0.753,81.811,247827,4
2006-11-04,84,Come Back To Me,Vanessa Hudgens,3pYKJaLiixRcDFfcNhxZKK,False,82,79,6,0.65,0.868,5,-3.988,1,0.084,0.000836,1.61e-05,0.245,0.71,87.961,166867,4
2006-11-04,85,Call On Me,Janet & Nelly,3pYKJaLiixRcDFfcNhxZKK,False,74,25,18,0.714,0.67,8,-6.053,0,0.0445,0.341,1.89e-06,0.0772,0.771,82.008,204267,4
2006-11-04,86,Rockstar,Nickelback,3pYKJaLiixRcDFfcNhxZKK,False,85,85,4,0.616,0.91,0,-3.004,1,0.0386,0.0459,0,0.343,0.693,144.072,252040,4
2006-11-04,87,Irreplaceable,Beyonce,6RX5iL93VZ5fKmyvNXvF1r,True,0,87,1,0.447,0.694,7,-4.637,0,0.382,0.0293,5.46e-06,0.167,0.509,175.868,227853,4
2006-11-04,88,Brand New Girlfriend,Steve Holy,6RX5iL93VZ5fKmyvNXvF1r,False,84,40,19,0.669,0.861,2,-3.547,1,0.0929,0.0273,0,0.0586,0.72,133.82,220187,4
2006-11-04,89,Mountains,Lonestar,6RX5iL93VZ5fKmyvNXvF1r,False,99,89,4,0.458,0.767,3,-4.3,1,0.0481,0.196,0,0.0564,0.347,162.063,234400,4
2006-11-04,90,Like Red On A Rose,Alan Jackson,6RX5iL93VZ5fKmyvNXvF1r,False,89,80,5,0.598,0.315,11,-9.83,1,0.0282,0.634,0.191,0.0825,0.172,96.684,213307,3
2006-11-04,91,The Diary Of Jane,Breaking Benjamin,6RX5iL93VZ5fKmyvNXvF1r,False,91,50,13,0.392,0.964,10,-4.441,0,0.0644,7.13e-05,0.0387,0.106,0.269,167.024,200547,4
2006-11-04,92,Nothing Left To Lose,Mat Kearney,6RX5iL93VZ5fKmyvNXvF1r,False,96,92,4,0.445,0.71,4,-6.819,1,0.0275,0.103,6.14e-05,0.169,0.468,148.011,263253,4
2006-11-04,93,Some People Change,Montgomery Gentry,6RX5iL93VZ5fKmyvNXvF1r,False,97,93,2,0.55,0.61,2,-6.358,1,0.0388,0.0456,0,0.11,0.357,168.186,201867,4
2006-11-04,94,Remember The Name,Fort Minor Featuring Styles Of Beyond,6RX5iL93VZ5fKmyvNXvF1r,False,88,66,6,0.688,0.835,8,-4.162,1,0.0911,0.0583,2.87e-06,0.0795,0.88,84.858,230493,4
2006-11-04,95,Amarillo Sky,Jason Aldean,6RX5iL93VZ5fKmyvNXvF1r,False,100,95,2,0.491,0.776,2,-3.887,1,0.0393,0.314,0,0.146,0.428,154.988,202547,4
2006-11-04,96,Love You,Jack Ingram,6RX5iL93VZ5fKmyvNXvF1r,False,98,96,2,0.587,0.885,8,-4.847,1,0.042,0.0606,1.22e-05,0.332,0.778,116.921,163733,4
2006-11-04,97,Long Way 2 Go,Cassie,4v5kAh2wWyCSuKuhMJK8u6,True,0,97,1,0.589,0.655,8,-8.138,1,0.0488,0.057,0.000353,0.372,0.675,105.272,220640,4
2006-11-04,98,Canadian Idiot,"""Weird Al"" Yankovic",4v5kAh2wWyCSuKuhMJK8u6,False,94,82,3,0.543,0.697,8,-9.211,1,0.0612,0.00206,1.82e-06,0.343,0.861,185.978,143040,4
2006-11-04,99,Tu Amor,RBD,2EnlBJQ6ZcndUmsI8ZrJjI,True,0,99,1,0.634,0.703,1,-4.462,1,0.0315,0.305,1.7e-06,0.112,0.584,88.004,280440,4
2006-11-04,100,Face Down,The Red Jumpsuit Apparatus,2EnlBJQ6ZcndUmsI8ZrJjI,False,0,76,13,0.545,0.932,7,-2.189,0,0.0399,0.000665,0,0.127,0.464,92.956,192000,4
