date,position,title,artist,spotify_id,is_new,last_pos,peak_pos,weeks,danceability,energy,key,loudness,mode,speechiness,acousticness,instrumentalness,liveness,valence,tempo,duration_ms,time_signature
2003-12-27,1,Hey Ya!,OutKast,6QwwsJC57SitPcWuyEpuwd,False,1,1,11,0.727,0.974,4,-2.261,0,0.0664,0.103,0.000532,0.174,0.965,79.526,235213,4
2003-12-27,2,The Way You Move,OutKast Featuring Sleepy Brown,6QwwsJC57SitPcWuyEpuwd,False,2,2,14,0.871,0.597,5,-4.932,0,0.0464,0.126,0.000113,0.0638,0.635,125.999,234000,4
2003-12-27,3,Milkshake,Kelis,6QwwsJC57SitPcWuyEpuwd,False,4,3,13,0.891,0.77,1,-6.124,1,0.0439,0.00862,0.0315,0.155,0.819,112.997,182627,4
2003-12-27,4,Stand Up,Ludacris Featuring Shawnna,6QwwsJC57SitPcWuyEpuwd,False,3,1,17,0.751,0.84,6,-4.855,1,0.349,0.367,0,0.0916,0.801,99.057,213760,4
2003-12-27,5,You Don't Know My Name,Alicia Keys,6QwwsJC57SitPcWuyEpuwd,False,9,5,7,0.263,0.663,9,-8.264,1,0.19,0.589,0.00451,0.342,0.25,167.271,366733,4
2003-12-27,6,Walked Outta Heaven,Jagged Edge,6QwwsJC57SitPcWuyEpuwd,False,6,6,17,0.67,0.616,10,-6.123,1,0.225,0.573,0,0.0535,0.523,120.129,270880,4
2003-12-27,7,Here Without You,3 Doors Down,6QwwsJC57SitPcWuyEpuwd,False,5,5,18,0.557,0.533,10,-6.817,0,0.0252,0.0492,0,0.205,0.233,143.994,238733,4
2003-12-27,8,Suga Suga,Baby Bash Featuring Frankie J,6QwwsJC57SitPcWuyEpuwd,False,7,7,19,0.662,0.748,5,-3.041,0,0.268,0.688,8.43e-06,0.0841,0.535,82.331,239027,4
2003-12-27,9,Holidae In,Chingy Featuring Ludacris & Snoop Dogg,6QwwsJC57SitPcWuyEpuwd,False,8,3,15,0.81,0.791,7,-5.909,1,0.181,0.0893,0,0.0838,0.948,153.067,314400,4
2003-12-27,10,Change Clothes,JAY-Z,6QwwsJC57SitPcWuyEpuwd,False,13,10,7,0.895,0.628,10,-3.79,1,0.0473,0.0412,0,0.059,0.34,104.009,258427,4
2003-12-27,11,Step In The Name Of Love,R. Kelly,6QwwsJC57SitPcWuyEpuwd,False,10,9,19,0.775,0.53,1,-6.564,0,0.119,0.2,0,0.231,0.775,94.985,432147,4
2003-12-27,12,Baby Boy,Beyonce Featuring Sean Paul,6QwwsJC57SitPcWuyEpuwd,False,11,1,20,0.655,0.488,1,-9.17,1,0.22,0.0825,1.16e-06,0.221,0.791,91.025,244827,4
2003-12-27,13,Damn!,YoungBloodZ Featuring Lil Jon,6QwwsJC57SitPcWuyEpuwd,False,12,4,21,0.772,0.724,6,-5.799,0,0.307,0.0149,0,0.355,0.518,84.038,298600,4
2003-12-27,14,It's My Life,No Doubt,6QwwsJC57SitPcWuyEpuwd,False,16,14,9,0.606,0.75,8,-4.535,0,0.0306,0.00264,0.000788,0.321,0.771,126.316,225867,4
2003-12-27,15,Get Low,Lil Jon & The East Side Boyz Featuring Ying Yang Twins,6QwwsJC57SitPcWuyEpuwd,False,14,2,35,0.521,0.625,1,-7.47,1,0.067,0.0301,0,0.121,0.136,101.019,334067,4
2003-12-27,16,Someday,Nickelback,6QwwsJC57SitPcWuyEpuwd,False,18,16,19,0.455,0.858,11,-5.659,0,0.0391,0.000616,0.000247,0.226,0.597,163.118,207467,4
2003-12-27,17,"Me, Myself And I",Beyonce,6QwwsJC57SitPcWuyEpuwd,False,22,17,7,0.75,0.458,1,-9.092,1,0.0803,0.226,3.25e-05,0.137,0.536,83.61,301133,4
2003-12-27,18,Slow Jamz,Twista Featuring Kanye West & Jamie Foxx,6QwwsJC57SitPcWuyEpuwd,False,26,18,4,0.559,0.733,2,-5.659,0,0.171,0.314,0,0.284,0.611,145.115,316053,4
2003-12-27,19,Read Your Mind,Avant,6QwwsJC57SitPcWuyEpuwd,False,20,19,13,0.755,0.381,8,-6.696,0,0.0711,0.291,5.13e-06,0.0974,0.695,73.108,263507,4
2003-12-27,20,Runnin (Dying To Live),Tupac Featuring The Notorious B.I.G.,6QwwsJC57SitPcWuyEpuwd,False,19,19,11,0.545,0.796,10,-2.762,0,0.406,0.0467,0.000287,0.165,0.629,166.122,231987,4
2003-12-27,21,Stunt 101,G Unit,6QwwsJC57SitPcWuyEpuwd,False,15,13,9,0.675,0.779,6,-1.439,0,0.402,0.161,0,0.0656,0.553,95.739,232227,4
2003-12-27,22,Why Don't You & I,Santana Featuring Alex Band Or Chad Kroeger,6QwwsJC57SitPcWuyEpuwd,False,21,8,23,0.495,0.894,10,-4.89,1,0.102,0.136,0,0.106,0.777,168.062,274360,4
2003-12-27,23,Wat Da Hook Gon Be,Murphy Lee Featuring Jermaine Dupri,6QwwsJC57SitPcWuyEpuwd,False,17,17,12,0.927,0.596,10,-7.058,0,0.301,0.0979,0,0.283,0.914,94.997,224667,4
2003-12-27,24,Perfect,Simple Plan,6QwwsJC57SitPcWuyEpuwd,False,24,24,9,0.494,0.672,3,-4.877,1,0.0405,0.0273,0,0.105,0.557,156.208,277027,4
2003-12-27,25,Headstrong,Trapt,6QwwsJC57SitPcWuyEpuwd,False,23,16,36,0.492,0.896,4,-5.819,0,0.117,0.000172,2.78e-06,0.189,0.534,184.981,285570,4
2003-12-27,26,White Flag,Dido,6QwwsJC57SitPcWuyEpuwd,False,28,26,15,0.509,0.538,5,-6.835,1,0.0379,0.306,5.03e-06,0.091,0.284,170.111,240600,4
2003-12-27,27,Numb,Linkin Park,6QwwsJC57SitPcWuyEpuwd,False,31,27,8,0.496,0.863,9,-4.153,1,0.0381,0.0046,0,0.639,0.243,110.018,185587,4
2003-12-27,28,So Far Away,Staind,6QwwsJC57SitPcWuyEpuwd,False,27,24,22,0.407,0.896,6,-2.935,1,0.063,0.012,0,0.196,0.156,138.697,243573,3
2003-12-27,29,There Goes My Life,Kenny Chesney,6QwwsJC57SitPcWuyEpuwd,False,34,29,8,0.577,0.483,4,-8.141,1,0.0324,0.0337,6.22e-06,0.3,0.218,135.77,302667,4
2003-12-27,30,The First Cut Is The Deepest,Sheryl Crow,6QwwsJC57SitPcWuyEpuwd,False,37,30,10,0.509,0.7,2,-5.372,1,0.033,0.0374,0,0.106,0.671,160.003,227400,4
2003-12-27,31,Bright Lights,matchbox twenty,6QwwsJC57SitPcWuyEpuwd,False,25,23,14,0.319,0.732,4,-4.475,1,0.0436,0.0134,0,0.658,0.2,80.195,234427,4
2003-12-27,32,Why Can't I?,Liz Phair,6QwwsJC57SitPcWuyEpuwd,False,32,32,15,0.487,0.759,11,-4.849,1,0.0405,0.0273,0,0.165,0.227,80.958,208360,4
2003-12-27,33,Gigolo,Nick Cannon Featuring R. Kelly,6QwwsJC57SitPcWuyEpuwd,False,41,33,7,0.896,0.552,4,-6.11,0,0.102,0.273,0,0.0662,0.657,93.001,237840,4
2003-12-27,34,Salt Shaker,Ying Yang Twins Featuring Lil Jon & The East Side Boyz,6QwwsJC57SitPcWuyEpuwd,False,45,34,7,0.884,0.697,11,-6.022,1,0.128,0.0509,0,0.094,0.322,101.965,252440,4
2003-12-27,35,Right Thurr,Chingy,6QwwsJC57SitPcWuyEpuwd,False,29,2,33,0.866,0.749,2,-3.977,1,0.253,0.15,0,0.0614,0.891,92.074,250747,4
2003-12-27,36,The Voice Within,Christina Aguilera,6QwwsJC57SitPcWuyEpuwd,False,40,36,5,0.484,0.439,2,-5.995,1,0.0336,0.556,0,0.251,0.157,69.945,304013,4
2003-12-27,37,Harder To Breathe,Maroon 5,6QwwsJC57SitPcWuyEpuwd,False,33,18,19,0.662,0.908,1,-4.764,0,0.0449,0.0506,0,0.0508,0.967,149.941,173693,4
2003-12-27,38,(There's Gotta Be) More To Life,Stacie Orrico,6QwwsJC57SitPcWuyEpuwd,False,30,30,15,0.58,0.922,1,-3.785,1,0.0957,0.0917,0,0.189,0.649,89.841,200387,4
2003-12-27,39,Through The Wire,Kanye West,6QwwsJC57SitPcWuyEpuwd,False,52,39,5,0.571,0.739,7,-6.11,1,0.247,0.00865,5.21e-06,0.158,0.66,83.089,221227,4
2003-12-27,40,Shake Ya Tailfeather,"Nelly, P. Diddy & Murphy Lee",6QwwsJC57SitPcWuyEpuwd,False,35,1,27,0.715,0.733,1,-7.068,1,0.262,0.134,0,0.157,0.897,87.665,295173,4
2003-12-27,41,I Love This Bar,Toby Keith,6QwwsJC57SitPcWuyEpuwd,False,36,26,17,0.608,0.825,2,-6.303,1,0.0419,0.024,0.00656,0.346,0.454,115.049,335333,4
2003-12-27,42,You Can't Take The Honky Tonk Out Of The Girl,Brooks & Dunn,6QwwsJC57SitPcWuyEpuwd,False,42,42,8,0.574,0.949,5,-2.799,1,0.0383,0.00881,3.82e-05,0.277,0.755,114.271,208933,4
2003-12-27,43,Invisible,Clay Aiken,6QwwsJC57SitPcWuyEpuwd,False,43,43,6,0.565,0.777,2,-5.516,0,0.037,0.152,0,0.35,0.593,110.092,243867,4
2003-12-27,44,Remember When,Alan Jackson,6QwwsJC57SitPcWuyEpuwd,False,47,44,3,0.558,0.314,2,-10.623,1,0.0295,0.709,0.000319,0.193,0.267,125.59,271280,4
2003-12-27,45,Breathe,Michelle Branch,6QwwsJC57SitPcWuyEpuwd,False,39,36,8,0.644,0.753,6,-4.296,1,0.0391,0.0279,0.00227,0.108,0.209,117.148,211773,4
2003-12-27,46,Cowboys Like Us,George Strait,6QwwsJC57SitPcWuyEpuwd,False,38,38,13,0.477,0.553,0,-6.094,1,0.0302,0.213,1.31e-06,0.201,0.299,128.416,219160,3
2003-12-27,47,Not Today,Mary J. Blige Featuring Eve,6QwwsJC57SitPcWuyEpuwd,False,49,47,3,0.907,0.628,10,-2.551,0,0.0796,0.448,1.32e-06,0.0423,0.902,94.027,253867,4
2003-12-27,48,Unwell,matchbox twenty,6QwwsJC57SitPcWuyEpuwd,False,46,5,41,0.442,0.793,9,-5.152,1,0.0347,0.0456,0,0.328,0.437,80.985,237267,4
2003-12-27,49,More & More,Joe,6QwwsJC57SitPcWuyEpuwd,False,55,48,6,0.7,0.508,5,-7.32,0,0.0577,0.189,0,0.0938,0.464,139.974,223693,4
2003-12-27,50,Rain On Me,Ashanti,6QwwsJC57SitPcWuyEpuwd,False,44,7,18,0.606,0.699,8,-3.103,0,0.0337,0.343,1.89e-06,0.0757,0.509,83.701,297960,4
2003-12-27,51,Fallen,Sarah McLachlan,6QwwsJC57SitPcWuyEpuwd,False,51,51,10,0.503,0.492,2,-7.607,0,0.0357,0.61,2.4e-05,0.0853,0.352,74.967,227000,4
2003-12-27,52,Gangsta Nation,Westside Connection Featuring Nate Dogg,6QwwsJC57SitPcWuyEpuwd,False,62,52,4,0.843,0.7,9,-3.249,0,0.26,0.127,0,0.876,0.675,95.05,293053,4
2003-12-27,53,Forthenight,Musiq,6QwwsJC57SitPcWuyEpuwd,False,54,53,8,0.698,0.678,3,-7.127,0,0.234,0.253,0,0.191,0.785,101.052,229467,4
2003-12-27,54,My Baby,Bow Wow Featuring Jagged Edge,6QwwsJC57SitPcWuyEpuwd,False,58,54,4,0.623,0.58,5,-9.464,0,0.439,0.172,0,0.563,0.51,85.9,303107,4
2003-12-27,55,(I Hate) Everything About You,Three Days Grace,6QwwsJC57SitPcWuyEpuwd,False,60,55,5,0.553,0.853,8,-3.668,1,0.0339,0.000684,0,0.126,0.506,122.023,231400,4
2003-12-27,56,Chicks Dig It,Chris Cagle,6QwwsJC57SitPcWuyEpuwd,False,53,53,9,0.596,0.921,7,-4.987,1,0.0504,0.0221,0,0.303,0.703,104.024,210560,4
2003-12-27,57,Fallen,Mya,6QwwsJC57SitPcWuyEpuwd,False,56,56,5,0.669,0.61,1,-8.217,1,0.0457,0.119,2.75e-05,0.53,0.428,94.439,214600,4
2003-12-27,58,F**k It (I Don't Want You Back),Eamon,6QwwsJC57SitPcWuyEpuwd,False,77,58,4,0.814,0.611,0,-6.154,0,0.0491,0.0781,0.000134,0.0406,0.533,68.493,225667,4
2003-12-27,59,Honesty (Write Me A List),Rodney Atkins,6QwwsJC57SitPcWuyEpuwd,False,64,59,13,0.576,0.496,6,-6.716,1,0.0264,0.0355,0,0.162,0.236,77.006,255387,4
2003-12-27,60,I Wanna Do It All,Terri Clark,6QwwsJC57SitPcWuyEpuwd,False,68,60,3,0.626,0.886,4,-4.787,1,0.034,0.0668,0,0.118,0.782,132.905,173333,4
2003-12-27,61,Watch The Wind Blow By,Tim McGraw,6QwwsJC57SitPcWuyEpuwd,False,71,61,3,0.517,0.608,10,-7.206,1,0.0265,0.0924,0,0.0707,0.506,62.65,276400,5
2003-12-27,62,She's Not Just A Pretty Face,Shania Twain,6QwwsJC57SitPcWuyEpuwd,False,67,62,4,0.565,0.878,9,-4.388,1,0.0385,0.0431,0,0.365,0.451,98.985,229027,4
2003-12-27,63,Clubbin,Marques Houston Featuring Joe Budden & Pied Piper,6QwwsJC57SitPcWuyEpuwd,False,70,39,17,0.575,0.496,4,-6.716,0,0.164,0.0945,0,0.0891,0.288,103.49,244227,3
2003-12-27,64,Hell Yeah,Montgomery Gentry,6QwwsJC57SitPcWuyEpuwd,False,48,45,9,0.372,0.872,0,-6.651,1,0.056,0.0185,0,0.368,0.65,173.525,289560,4
2003-12-27,65,With You,Jessica Simpson,7pNJ1T9TGbVbNHKaLhhPri,True,0,65,1,0.553,0.756,0,-4.583,1,0.108,0.0923,0,0.215,0.605,94.487,191827,4
2003-12-27,66,Drinkin' Bone,Tracy Byrd,7pNJ1T9TGbVbNHKaLhhPri,False,66,66,5,0.77,0.833,5,-4.536,1,0.028,0.0793,0,0.0819,0.964,109.928,131867,4
2003-12-27,67,Who Wouldn't Wanna Be Me,Keith Urban,7pNJ1T9TGbVbNHKaLhhPri,False,65,30,20,0.666,0.817,2,-6.072,1,0.0453,0.115,1.18e-05,0.0668,0.826,120.02,221120,4
2003-12-27,68,Pass That Dutch,Missy Elliott,7pNJ1T9TGbVbNHKaLhhPri,False,59,27,11,0.899,0.645,10,-11.621,0,0.271,0.0435,0.101,0.358,0.348,110.895,217200,4
2003-12-27,69,American Soldier,Toby Keith,0oVWPlnK5eAqnJCVB0FvpP,True,0,69,1,0.565,0.541,9,-8.426,1,0.0376,0.193,3.45e-06,0.0582,0.226,82.006,263333,4
2003-12-27,70,Stacy's Mom,Fountains Of Wayne,0oVWPlnK5eAqnJCVB0FvpP,False,50,21,12,0.774,0.75,11,-4.927,0,0.0412,0.00207,1.78e-05,0.0808,0.927,118.015,197987,4
2003-12-27,71,Hotel,Cassidy Featuring R. Kelly,0oVWPlnK5eAqnJCVB0FvpP,False,82,71,2,0.68,0.659,0,-6.855,1,0.211,0.118,0,0.107,0.411,91.259,247040,4
2003-12-27,72,Little Moments,Brad Paisley,0oVWPlnK5eAqnJCVB0FvpP,False,76,72,2,0.558,0.551,9,-6.333,1,0.0263,0.245,4.19e-06,0.231,0.347,78.374,221067,4
2003-12-27,73,Are You Gonna Be My Girl,Jet,0oVWPlnK5eAqnJCVB0FvpP,False,73,73,2,0.613,0.953,2,-3.435,1,0.0855,0.00148,0.000582,0.152,0.537,105.046,213800,4
2003-12-27,74,Hit That,The Offspring,0oVWPlnK5eAqnJCVB0FvpP,False,74,74,2,0.704,0.809,4,-3.045,1,0.0321,0.0233,0,0.0596,0.962,131.952,169413,4
2003-12-27,75,Walking In Memphis,Lonestar,0oVWPlnK5eAqnJCVB0FvpP,False,61,61,8,0.68,0.717,0,-5.184,1,0.0286,0.27,0,0.075,0.664,129.035,257733,4
2003-12-27,76,Away From Me,Puddle Of Mudd,0oVWPlnK5eAqnJCVB0FvpP,False,72,72,6,0.388,0.943,8,-2.927,1,0.104,0.000306,0,0.168,0.162,154.721,238467,4
2003-12-27,77,Wave On Wave,Pat Green,0oVWPlnK5eAqnJCVB0FvpP,False,63,39,18,0.671,0.755,2,-5.274,1,0.0252,0.178,2.64e-05,0.0675,0.362,103.552,244373,4
2003-12-27,78,I Melt,Rascal Flatts,0oVWPlnK5eAqnJCVB0FvpP,False,57,34,19,0.573,0.662,9,-4.461,1,0.0265,0.209,3.92e-05,0.323,0.256,140.046,234253,4
2003-12-27,79,Badaboom,B2K Featuring Fabolous,0oVWPlnK5eAqnJCVB0FvpP,False,91,79,2,0.812,0.626,4,-5.025,0,0.149,0.0238,0.000699,0.149,0.811,96.006,221067,4
2003-12-27,80,Still Frame,Trapt,0oVWPlnK5eAqnJCVB0FvpP,False,81,69,7,0.445,0.932,4,-4.739,1,0.316,0.000866,0,0.108,0.51,113.945,271093,4
2003-12-27,81,Me Against The Music,Britney Spears Featuring Madonna,0oVWPlnK5eAqnJCVB0FvpP,False,78,35,10,0.804,0.836,6,-6.635,0,0.089,0.32,0,0.213,0.85,120.046,223773,4
2003-12-27,82,Pop That Booty,"Marques Houston Featuring Jermaine ""JD"" Dupri",0oVWPlnK5eAqnJCVB0FvpP,False,85,82,3,0.839,0.625,9,-5.699,1,0.15,0.0752,0,0.26,0.731,95.511,246267,4
2003-12-27,83,Love You More,Ginuwine,0oVWPlnK5eAqnJCVB0FvpP,False,84,78,9,0.661,0.422,8,-6.918,0,0.0282,0.0887,2.39e-06,0.164,0.428,117.007,241373,4
2003-12-27,84,Knock Knock,Monica,0oVWPlnK5eAqnJCVB0FvpP,False,88,75,14,0.777,0.588,10,-8.651,1,0.373,0.414,4.79e-05,0.146,0.54,88.915,257653,4
2003-12-27,85,Heaven,Live,0oVWPlnK5eAqnJCVB0FvpP,False,89,59,18,0.612,0.357,7,-10.4,1,0.0303,0.849,3.23e-06,0.516,0.148,107.129,221000,4
2003-12-27,86,Another Postcard (Chimps),Barenaked Ladies,0oVWPlnK5eAqnJCVB0FvpP,False,86,82,11,0.621,0.747,1,-6.552,0,0.0782,0.00227,0.000234,0.0449,0.726,172.31,205267,4
2003-12-27,87,Tough Little Boys,Gary Allan,0oVWPlnK5eAqnJCVB0FvpP,False,79,32,19,0.548,0.402,2,-8.727,1,0.0247,0.698,0.000114,0.135,0.214,84.211,237333,4
2003-12-27,88,Show Me How To Live,Audioslave,0oVWPlnK5eAqnJCVB0FvpP,False,87,67,20,0.433,0.854,9,-3.868,1,0.0483,0.000336,0.000177,0.162,0.368,89.4,277840,4
2003-12-27,89,Weak And Powerless,A Perfect Circle,0oVWPlnK5eAqnJCVB0FvpP,False,83,61,14,0.483,0.841,1,-7.494,0,0.0523,0.000172,0.861,0.108,0.13,159.747,195133,3
2003-12-27,90,Bigger Than My Body,John Mayer,0oVWPlnK5eAqnJCVB0FvpP,False,80,33,18,0.607,0.936,4,-3.071,1,0.033,0.0121,0.0418,0.309,0.517,117.303,265960,4
2003-12-27,91,Long Black Train,Josh Turner,0oVWPlnK5eAqnJCVB0FvpP,False,94,91,3,0.537,0.699,10,-6.615,1,0.0399,0.237,2.27e-05,0.114,0.814,84.905,250627,4
2003-12-27,92,You,Ryan Duarte,14k9qyaFUPF7fm5o0fRwZD,True,0,92,1,0.805,0.773,3,-5.734,0,0.0278,0.12,0,0.0594,0.969,130.03,208427,4
2003-12-27,93,Clap Back,Ja Rule,14k9qyaFUPF7fm5o0fRwZD,False,75,44,10,0.632,0.786,9,-5.596,1,0.354,0.0415,1.2e-05,0.0527,0.699,94.499,296467,4
2003-12-27,94,Shake That Monkey,Too Short Featuring Lil Jon & The East Side Boyz,14k9qyaFUPF7fm5o0fRwZD,False,92,92,6,0.937,0.695,0,-6.932,1,0.134,0.000577,3.19e-05,0.295,0.457,99.997,278707,4
2003-12-27,95,Alone,Lasgo,6hVdYM1RKjPIYv17KJ6Cll,True,0,95,1,0.72,0.917,8,-4.717,1,0.0476,0.0821,0.00154,0.296,0.548,140.025,241040,4
2003-12-27,96,Neva Eva,Trillville,6hVdYM1RKjPIYv17KJ6Cll,False,99,96,2,0.777,0.81,7,-4.968,1,0.0462,0.0192,0,0.0861,0.787,78.021,276320,4
2003-12-27,97,Gangsta Girl,Big Tymers Featuring R. Kelly,2C4RRPsDsjghWolIaodRh4,True,0,97,1,0.839,0.612,8,-8.777,1,0.179,0.484,0,0.0839,0.891,152.0,258947,4
2003-12-27,98,I Can't Take You Anywhere,Scotty Emerick With Toby Keith,2C4RRPsDsjghWolIaodRh4,False,93,91,6,0.762,0.622,5,-9.91,1,0.0272,0.21,0.306,0.0469,0.867,109.02,208147,4
2003-12-27,99,So Yesterday,Hilary Duff,2C4RRPsDsjghWolIaodRh4,False,95,42,20,0.552,0.802,0,-3.799,1,0.0615,0.215,0,0.275,0.776,78.21,215333,4
2003-12-27,100,One More Chance,Michael Jackson,2C4RRPsDsjghWolIaodRh4,False,98,83,4,0.476,0.596,7,-4.234,1,0.0705,0.108,0,0.138,0.549,80.74,229000,4
