date,position,title,artist,spotify_id,is_new,last_pos,peak_pos,weeks,danceability,energy,key,loudness,mode,speechiness,acousticness,instrumentalness,liveness,valence,tempo,duration_ms,time_signature
2007-02-03,1,Irreplaceable,Beyonce,4KTtYhxFtFL7mBwnjkKfLm,False,1,1,14,0.447,0.694,7,-4.637,0,0.382,0.0293,5.46e-06,0.167,0.509,175.868,227853,4
2007-02-03,2,"This Ain't A Scene, It's An Arms Race",Fall Out Boy,1oagRT7LfpVlNJN6FSZDGp,True,0,2,1,0.435,0.887,9,-4.07,1,0.0636,0.000747,0,0.0327,0.408,199.935,212040,4
2007-02-03,3,Say It Right,Nelly Furtado,1oagRT7LfpVlNJN6FSZDGp,False,4,3,11,0.871,0.869,1,-6.308,1,0.139,0.0409,0.00111,0.053,0.834,116.95,223080,4
2007-02-03,4,I Wanna Love You,Akon Featuring Snoop Dogg,1oagRT7LfpVlNJN6FSZDGp,False,2,1,17,0.866,0.454,0,-9.383,1,0.0414,0.0373,1.49e-06,0.275,0.368,99.985,247067,4
2007-02-03,5,We Fly High,Jim Jones,1oagRT7LfpVlNJN6FSZDGp,False,6,5,16,0.506,0.799,1,-6.58,1,0.38,0.0791,0,0.0929,0.461,120.405,236080,5
2007-02-03,6,It's Not Over,Daughtry,1oagRT7LfpVlNJN6FSZDGp,False,21,6,9,0.428,0.919,10,-3.245,0,0.0618,0.0503,0,0.245,0.294,145.927,214831,4
2007-02-03,7,Fergalicious,Fergie,1oagRT7LfpVlNJN6FSZDGp,False,3,2,18,0.906,0.584,8,-7.72,0,0.316,0.0576,0,0.128,0.831,129.055,292373,4
2007-02-03,8,Smack That,Akon Featuring Eminem,1oagRT7LfpVlNJN6FSZDGp,False,5,2,18,0.939,0.742,5,-5.171,0,0.0467,0.321,0,0.107,0.924,118.978,212360,4
2007-02-03,9,How To Save A Life,The Fray,1oagRT7LfpVlNJN6FSZDGp,False,7,3,41,0.64,0.743,10,-4.08,1,0.0379,0.269,0,0.101,0.361,122.035,262533,4
2007-02-03,10,Welcome To The Black Parade,My Chemical Romance,1oagRT7LfpVlNJN6FSZDGp,False,9,9,19,0.217,0.905,2,-4.103,1,0.0752,0.000289,0.00011,0.222,0.236,96.95,311107,4
2007-02-03,11,Runaway Love,Ludacris Featuring Mary J. Blige,1oagRT7LfpVlNJN6FSZDGp,False,13,11,10,0.405,0.721,1,-6.97,1,0.283,0.329,0,0.252,0.815,92.854,280680,4
2007-02-03,12,My Love,Justin Timberlake Featuring T.I.,1oagRT7LfpVlNJN6FSZDGp,False,8,1,20,0.771,0.68,11,-5.881,0,0.224,0.277,1.18e-05,0.682,0.808,119.952,276160,4
2007-02-03,13,What Goes Around...Comes Around,Justin Timberlake,1oagRT7LfpVlNJN6FSZDGp,False,12,12,7,0.687,0.723,7,-4.751,1,0.0709,0.122,0.00102,0.573,0.432,76.0,448573,4
2007-02-03,14,Push It To The Limit,Corbin Bleu,3K01q0jtSNHeqx5gs97HH2,True,0,14,1,0.815,0.906,5,-3.194,0,0.0561,0.0116,2.06e-06,0.0691,0.783,125.974,196960,4
2007-02-03,15,It Ends Tonight,The All-American Rejects,3K01q0jtSNHeqx5gs97HH2,False,10,8,17,0.454,0.636,0,-4.731,1,0.0273,0.00228,0,0.154,0.313,87.89,244827,4
2007-02-03,16,Walk It Out,Unk,3K01q0jtSNHeqx5gs97HH2,False,15,13,20,0.794,0.777,1,-3.696,0,0.0813,0.0982,0,0.202,0.706,160.022,173040,4
2007-02-03,17,You,Lloyd Featuring Lil Wayne,3K01q0jtSNHeqx5gs97HH2,False,18,17,11,0.412,0.876,5,-6.008,0,0.47,0.102,0,0.297,0.703,130.159,273133,5
2007-02-03,18,Shortie Like Mine,Bow Wow Featuring Chris Brown & Johnta Austin,3K01q0jtSNHeqx5gs97HH2,False,11,9,16,0.758,0.642,7,-8.128,0,0.221,0.0745,0,0.191,0.701,142.078,268067,4
2007-02-03,19,The Sweet Escape,Gwen Stefani Featuring Akon,3K01q0jtSNHeqx5gs97HH2,False,31,19,6,0.756,0.77,1,-3.502,1,0.0343,0.191,0,0.178,0.73,119.961,246467,4
2007-02-03,20,Make It Rain,Fat Joe Featuring Lil Wayne,3K01q0jtSNHeqx5gs97HH2,False,19,19,12,0.744,0.697,11,-5.063,0,0.197,0.0106,0,0.0842,0.767,149.28,247413,4
2007-02-03,21,Lips Of An Angel,Hinder,3K01q0jtSNHeqx5gs97HH2,False,14,3,28,0.476,0.736,2,-5.38,1,0.0343,0.0217,1.08e-06,0.203,0.251,129.084,261853,4
2007-02-03,22,Promise,Ciara,3K01q0jtSNHeqx5gs97HH2,False,17,11,11,0.697,0.629,9,-5.757,1,0.0425,0.409,3.8e-06,0.0819,0.439,123.279,267413,4
2007-02-03,23,Suddenly I See,KT Tunstall,3K01q0jtSNHeqx5gs97HH2,False,35,23,25,0.587,0.767,0,-5.713,1,0.0449,0.225,0,0.112,0.664,100.38,201707,4
2007-02-03,24,Walk Away (Remember Me),Paula DeAnda Featuring The DEY,3K01q0jtSNHeqx5gs97HH2,False,20,18,16,0.672,0.585,0,-5.797,1,0.0582,0.192,0,0.156,0.834,77.998,238160,4
2007-02-03,25,Waiting On The World To Change,John Mayer,3K01q0jtSNHeqx5gs97HH2,False,23,15,28,0.577,0.756,2,-5.82,1,0.115,0.159,0.000232,0.249,0.663,176.75,201173,4
2007-02-03,26,Keep Holding On,Avril Lavigne,3K01q0jtSNHeqx5gs97HH2,False,22,17,8,0.274,0.786,7,-2.354,1,0.0333,0.0374,0,0.143,0.146,161.061,239907,3
2007-02-03,27,Ice Box,Omarion,3K01q0jtSNHeqx5gs97HH2,False,30,27,8,0.775,0.731,8,-5.446,1,0.134,0.189,0,0.129,0.821,131.105,256427,4
2007-02-03,28,SexyBack,Justin Timberlake,3K01q0jtSNHeqx5gs97HH2,False,16,1,29,0.967,0.583,7,-5.562,0,0.0789,0.0584,0,0.0519,0.964,117.0,242733,4
2007-02-03,29,Chasing Cars,Snow Patrol,3K01q0jtSNHeqx5gs97HH2,False,24,5,36,0.563,0.592,9,-4.571,1,0.0276,0.209,5.08e-05,0.132,0.136,104.016,267933,4
2007-02-03,30,That's That,Snoop Dogg Featuring R. Kelly,3K01q0jtSNHeqx5gs97HH2,False,25,20,10,0.866,0.619,9,-4.774,0,0.19,0.0202,0,0.0371,0.733,82.05,257813,4
2007-02-03,31,Before He Cheats,Carrie Underwood,3K01q0jtSNHeqx5gs97HH2,False,26,16,21,0.519,0.749,6,-3.318,0,0.0405,0.271,0,0.119,0.29,147.905,199947,4
2007-02-03,32,Here (In Your Arms),Hellogoodbye,3K01q0jtSNHeqx5gs97HH2,False,38,32,12,0.701,0.608,5,-6.819,1,0.0374,0.206,0.0041,0.273,0.794,126.044,240547,4
2007-02-03,33,Snow ((Hey Oh)),Red Hot Chili Peppers,3K01q0jtSNHeqx5gs97HH2,False,33,31,10,0.427,0.9,11,-3.674,1,0.0499,0.116,1.75e-05,0.119,0.599,104.655,334667,4
2007-02-03,34,Far Away,Nickelback,3K01q0jtSNHeqx5gs97HH2,False,28,8,27,0.518,0.797,6,-5.153,1,0.0309,0.000681,0,0.107,0.293,132.918,238173,4
2007-02-03,35,Boston,Augustana,3K01q0jtSNHeqx5gs97HH2,False,37,35,16,0.404,0.571,0,-5.069,1,0.0303,0.182,2.08e-05,0.129,0.29,147.01,245933,4
2007-02-03,36,Wait A Minute,The Pussycat Dolls Featuring Timbaland,3K01q0jtSNHeqx5gs97HH2,False,32,28,11,0.867,0.854,8,-5.211,1,0.0478,0.0496,2.73e-05,0.323,0.972,136.446,221947,4
2007-02-03,37,Money Maker,Ludacris Featuring Pharrell,3K01q0jtSNHeqx5gs97HH2,False,27,1,24,0.551,0.598,1,-6.79,1,0.27,0.15,0,0.299,0.612,78.756,230613,4
2007-02-03,38,Watching You,Rodney Atkins,3K01q0jtSNHeqx5gs97HH2,False,39,38,12,0.625,0.848,2,-4.008,1,0.0314,0.105,0,0.23,0.716,137.993,235427,4
2007-02-03,39,Hurt,Christina Aguilera,3K01q0jtSNHeqx5gs97HH2,False,29,19,17,0.327,0.295,4,-6.907,0,0.0313,0.775,0,0.107,0.143,148.574,243373,4
2007-02-03,40,Through Glass,Stone Sour,3K01q0jtSNHeqx5gs97HH2,False,41,39,25,0.545,0.753,3,-4.618,0,0.036,0.0417,0,0.389,0.434,105.754,282947,4
2007-02-03,41,She's Everything,Brad Paisley,3K01q0jtSNHeqx5gs97HH2,False,42,35,16,0.355,0.478,0,-8.323,1,0.0335,0.569,2.9e-06,0.194,0.269,102.971,266920,4
2007-02-03,42,I Luv It,Young Jeezy,3K01q0jtSNHeqx5gs97HH2,False,34,14,10,0.641,0.765,9,-6.626,1,0.0383,0.000975,0,0.387,0.19,91.009,240613,4
2007-02-03,43,Tim McGraw,Taylor Swift,3K01q0jtSNHeqx5gs97HH2,False,40,40,20,0.58,0.491,0,-6.462,1,0.0251,0.575,0,0.121,0.425,76.009,232107,4
2007-02-03,44,What Hurts The Most,Rascal Flatts,3K01q0jtSNHeqx5gs97HH2,False,43,6,51,0.537,0.674,5,-5.134,0,0.0277,0.0088,0,0.265,0.33,136.002,214107,4
2007-02-03,45,Wind It Up,Gwen Stefani,3K01q0jtSNHeqx5gs97HH2,False,36,6,12,0.959,0.906,8,-6.902,1,0.0546,0.327,0.000319,0.337,0.944,119.998,190427,4
2007-02-03,46,Face Down,The Red Jumpsuit Apparatus,3K01q0jtSNHeqx5gs97HH2,False,52,46,24,0.545,0.932,7,-2.189,0,0.0399,0.000665,0,0.127,0.464,92.956,192000,4
2007-02-03,47,Stupid Boy,Keith Urban,3K01q0jtSNHeqx5gs97HH2,False,53,47,7,0.5,0.609,3,-7.215,1,0.0326,0.0822,0.000255,0.341,0.562,145.884,376387,4
2007-02-03,48,Top Back,T.I.,3K01q0jtSNHeqx5gs97HH2,False,50,48,7,0.597,0.678,2,-5.743,1,0.3,0.0103,0,0.381,0.659,160.074,282413,4
2007-02-03,49,Cupid's Chokehold/Breakfast In America,Gym Class Heroes Featuring Patrick Stump,3K01q0jtSNHeqx5gs97HH2,False,83,49,3,0.72,0.744,1,-6.938,0,0.12,0.237,0,0.255,0.619,78.953,243773,4
2007-02-03,50,If Everyone Cared,Nickelback,44w63XqGr3sATAzOnOySgF,True,0,50,1,0.519,0.85,6,-4.678,0,0.0354,0.000246,0.014,0.279,0.211,132.022,218013,4
2007-02-03,51,My Wish,Rascal Flatts,44w63XqGr3sATAzOnOySgF,False,49,28,20,0.548,0.769,4,-4.853,1,0.0312,0.0307,5.53e-06,0.0867,0.388,135.712,248280,4
2007-02-03,52,Poppin',Chris Brown Featuring Jay Biz,44w63XqGr3sATAzOnOySgF,False,54,52,8,0.767,0.419,9,-3.011,0,0.0369,0.00895,0,0.0521,0.547,122.963,265333,4
2007-02-03,53,Into The Ocean,Blue October,44w63XqGr3sATAzOnOySgF,False,55,53,7,0.758,0.606,0,-6.444,1,0.0325,0.282,0,0.144,0.361,107.95,239947,4
2007-02-03,54,Jump To The Rhythm,Jordan Pruitt,44w63XqGr3sATAzOnOySgF,False,69,54,2,0.763,0.905,0,-3.156,1,0.0335,0.0519,0,0.0468,0.76,107.966,227013,4
2007-02-03,55,Tell Me,Diddy Featuring Christina Aguilera,44w63XqGr3sATAzOnOySgF,False,51,47,14,0.548,0.938,8,-4.97,1,0.279,0.235,0,0.531,0.334,98.868,246147,4
2007-02-03,56,Money In The Bank,Lil Scrappy Featuring Young Buck,44w63XqGr3sATAzOnOySgF,False,46,28,19,0.88,0.693,1,-5.201,1,0.332,0.0599,0,0.248,0.767,75.603,233707,4
2007-02-03,57,Lost Without U,Robin Thicke,44w63XqGr3sATAzOnOySgF,False,67,57,6,0.664,0.351,0,-12.136,1,0.118,0.226,2.38e-06,0.106,0.816,113.204,254147,5
2007-02-03,58,Fidelity,Regina Spektor,44w63XqGr3sATAzOnOySgF,False,0,58,4,0.923,0.518,5,-6.008,1,0.0492,0.52,0.000142,0.104,0.682,93.023,226680,4
2007-02-03,59,White & Nerdy,"""Weird Al"" Yankovic",44w63XqGr3sATAzOnOySgF,False,48,9,17,0.791,0.613,1,-11.628,0,0.0763,0.0986,0,0.0765,0.896,143.017,170640,4
2007-02-03,60,Break It Off,Rihanna & Sean Paul,44w63XqGr3sATAzOnOySgF,False,65,54,8,0.897,0.738,10,-5.314,0,0.228,0.0166,0,0.0573,0.798,133.966,213373,4
2007-02-03,61,Listen,Beyonce,44w63XqGr3sATAzOnOySgF,False,68,61,5,0.432,0.637,11,-3.905,1,0.0475,0.416,0,0.113,0.187,122.394,219547,4
2007-02-03,62,Pain,Three Days Grace,44w63XqGr3sATAzOnOySgF,False,56,56,8,0.416,0.741,7,-4.001,1,0.0335,0.00804,0,0.273,0.286,160.515,202973,4
2007-02-03,63,Amarillo Sky,Jason Aldean,44w63XqGr3sATAzOnOySgF,False,59,59,15,0.491,0.776,2,-3.887,1,0.0393,0.314,0,0.146,0.428,154.988,202547,4
2007-02-03,64,Red High Heels,Kellie Pickler,44w63XqGr3sATAzOnOySgF,False,66,64,8,0.626,0.842,5,-3.74,1,0.0337,0.13,0,0.0734,0.54,115.72,222853,4
2007-02-03,65,Rockstar,Nickelback,44w63XqGr3sATAzOnOySgF,False,57,54,17,0.616,0.91,0,-3.004,1,0.0386,0.0459,0,0.343,0.693,144.072,252040,4
2007-02-03,66,It Just Comes Natural,George Strait,44w63XqGr3sATAzOnOySgF,False,63,58,12,0.405,0.775,10,-2.907,1,0.0335,0.358,0,0.211,0.422,200.389,176427,4
2007-02-03,67,The Way I Live,Baby Boy Da Prince Featuring Lil Boosie,44w63XqGr3sATAzOnOySgF,False,73,67,6,0.88,0.438,0,-7.562,1,0.248,0.0147,0,0.0907,0.714,90.02,324907,4
2007-02-03,68,Maneater,Nelly Furtado,44w63XqGr3sATAzOnOySgF,False,64,16,19,0.792,0.77,6,-4.811,1,0.0392,0.0318,0.000194,0.122,0.732,132.793,258840,4
2007-02-03,69,Nothing Left To Lose,Mat Kearney,44w63XqGr3sATAzOnOySgF,False,86,69,13,0.445,0.71,4,-6.819,1,0.0275,0.103,6.14e-05,0.169,0.468,148.011,263253,4
2007-02-03,70,Zoom,Lil' Boosie Featuring Yung Joc,44w63XqGr3sATAzOnOySgF,False,61,61,8,0.779,0.616,11,-8.852,0,0.15,0.00265,8.27e-05,0.339,0.171,160.919,285040,4
2007-02-03,71,Want To,Sugarland,44w63XqGr3sATAzOnOySgF,False,60,32,18,0.438,0.73,3,-3.78,1,0.0407,0.474,0,0.113,0.148,158.281,215293,4
2007-02-03,72,On The Hotline,Pretty Ricky,44w63XqGr3sATAzOnOySgF,False,76,72,4,0.704,0.854,10,-5.477,0,0.183,0.0185,0,0.148,0.688,92.988,242587,4
2007-02-03,73,And I Am Telling You I'm Not Going,Jennifer Hudson,44w63XqGr3sATAzOnOySgF,False,81,73,4,0.464,0.735,5,-5.202,0,0.0861,0.187,0,0.161,0.339,122.714,305373,4
2007-02-03,74,Alyssa Lies,Jason Michael Carroll,44w63XqGr3sATAzOnOySgF,False,72,69,4,0.496,0.602,7,-5.29,1,0.0265,0.334,0.00356,0.147,0.398,75.519,259573,4
2007-02-03,75,Ladies Love Country Boys,Trace Adkins,44w63XqGr3sATAzOnOySgF,False,74,74,7,0.661,0.959,7,-4.439,1,0.0408,0.0539,1.74e-05,0.381,0.96,116.284,221413,4
2007-02-03,76,Throw Some D's,Rich Boy Featuring Polow Da Don,44w63XqGr3sATAzOnOySgF,False,75,73,7,0.697,0.86,11,-5.181,1,0.43,0.0368,0,0.0721,0.433,160.895,263920,4
2007-02-03,77,Glamorous,Fergie Featuring Ludacris,44w63XqGr3sATAzOnOySgF,False,98,77,2,0.81,0.755,0,-6.408,1,0.201,0.288,0,0.0857,0.623,130.99,246573,4
2007-02-03,78,My Little Girl,Tim McGraw,44w63XqGr3sATAzOnOySgF,False,62,35,19,0.457,0.636,0,-3.41,1,0.0262,0.351,7.01e-06,0.111,0.238,144.686,218560,4
2007-02-03,79,Don't Matter,Akon,7I6DceMT3utDOHjcYCbrr4,True,0,79,1,0.798,0.443,2,-6.062,1,0.0403,0.244,0,0.326,0.354,125.232,293053,4
2007-02-03,80,Streetcorner Symphony,Rob Thomas,7I6DceMT3utDOHjcYCbrr4,False,79,64,17,0.633,0.886,1,-3.892,1,0.0456,0.109,0,0.0438,0.753,81.811,247827,4
2007-02-03,81,If We Were A Movie,Hannah Montana,7I6DceMT3utDOHjcYCbrr4,False,78,47,8,0.608,0.867,4,-4.683,1,0.0307,0.00528,0,0.0643,0.866,94.008,183293,4
2007-02-03,82,King Kong,Jibbs Featuring Chamillionaire,7I6DceMT3utDOHjcYCbrr4,False,87,82,4,0.774,0.778,1,-5.066,1,0.246,0.0207,0,0.237,0.514,77.992,275267,4
2007-02-03,83,Lost One,Jay-Z Featuring Chrisette Michele,7I6DceMT3utDOHjcYCbrr4,False,70,58,7,0.806,0.686,8,-2.754,0,0.154,0.248,0,0.0613,0.632,84.011,224227,4
2007-02-03,84,Little Bit Of Life,Craig Morgan,7I6DceMT3utDOHjcYCbrr4,False,90,84,6,0.667,0.834,7,-4.743,1,0.0344,0.292,0,0.287,0.703,96.944,251720,4
2007-02-03,85,Show Me The Money,Petey Pablo,7I6DceMT3utDOHjcYCbrr4,False,0,58,4,0.863,0.772,0,-2.278,1,0.114,0.0167,0,0.206,0.83,110.514,224680,4
2007-02-03,86,Go Getta,Young Jeezy Featuring R. Kelly,03b1NUHnoavfpLLKcEMfIb,True,0,86,1,0.392,0.751,3,-6.586,0,0.155,0.105,0,0.15,0.438,173.825,229347,4
2007-02-03,87,This Is Why I'm Hot,Mims,0AA6zq5ArZ1sSH7VIMi4NK,True,0,87,1,0.621,0.6,8,-6.349,1,0.576,0.277,0,0.495,0.485,80.021,253707,4
2007-02-03,88,Anna-Molly,Incubus,0AA6zq5ArZ1sSH7VIMi4NK,False,93,66,8,0.451,0.973,8,-2.611,1,0.0514,0.00428,7.36e-06,0.0924,0.628,151.885,225880,4
2007-02-03,89,She's Like The Wind,Lumidee Featuring Tony Sunshine,2IGcz5WLif7DUR8k2U8wPO,True,0,89,1,0.4,0.646,9,-8.066,0,0.259,0.0871,0,0.126,0.267,208.078,257533,4
2007-02-03,90,"My, Oh My",The Wreckers,2IGcz5WLif7DUR8k2U8wPO,False,94,90,2,0.508,0.843,0,-4.433,1,0.0349,0.211,4.16e-05,0.254,0.766,176.043,210187,4
2007-02-03,91,Take Me As I Am,Mary J. Blige,2IGcz5WLif7DUR8k2U8wPO,False,96,58,16,0.599,0.565,11,-4.663,0,0.0334,0.0663,0,0.207,0.576,82.251,237493,4
2007-02-03,92,Come Back To Me,Vanessa Hudgens,2IGcz5WLif7DUR8k2U8wPO,False,88,55,19,0.65,0.868,5,-3.988,1,0.084,0.000836,1.61e-05,0.245,0.71,87.961,166867,4
2007-02-03,93,U + Ur Hand,P!nk,2IGcz5WLif7DUR8k2U8wPO,False,91,89,4,0.709,0.891,0,-3.688,1,0.0528,0.00144,0,0.034,0.886,141.04,214387,4
2007-02-03,94,Last Night,Diddy Featuring Keyshia Cole,3Cn1FSSTXeQ7hCfrbizrD0,True,0,94,1,0.916,0.849,3,-5.034,0,0.0639,0.166,0.000193,0.0859,0.974,121.002,255773,4
2007-02-03,95,From Yesterday,30 Seconds To Mars,1JBa9B1iA4yNVpJ5wVGrZH,True,0,95,1,0.468,0.876,10,-4.841,1,0.0692,0.00578,0.00625,0.035,0.13,135.062,247373,4
2007-02-03,96,Honestly,Cartel,1JBa9B1iA4yNVpJ5wVGrZH,False,97,89,4,0.449,0.903,1,-4.949,1,0.0388,2.48e-05,0,0.133,0.583,144.522,207333,4
2007-02-03,97,He Said She Said,Ashley Tisdale,1JBa9B1iA4yNVpJ5wVGrZH,False,77,77,2,0.694,0.709,7,-6.205,0,0.103,0.0966,0,0.267,0.566,114.966,188000,4
2007-02-03,98,One Wing In The Fire,Trent Tomlinson,1JBa9B1iA4yNVpJ5wVGrZH,False,0,96,3,0.613,0.526,3,-7.364,1,0.0306,0.373,0,0.137,0.412,142.055,232547,4
2007-02-03,99,Unappreciated,Cherish,1JBa9B1iA4yNVpJ5wVGrZH,False,85,41,17,0.735,0.521,7,-6.696,0,0.0876,0.0888,0,0.065,0.374,77.01,235333,4
2007-02-03,100,The Saints Are Coming,U2 & Green Day,1JBa9B1iA4yNVpJ5wVGrZH,False,0,51,9,0.315,0.81,4,-7.026,0,0.0468,0.0781,0.00321,0.152,0.118,152.116,201907,4
