date,position,title,artist,spotify_id,is_new,last_pos,peak_pos,weeks,danceability,energy,key,loudness,mode,speechiness,acousticness,instrumentalness,liveness,valence,tempo,duration_ms,time_signature
1990-07-07,1,Step By Step,New Kids On The Block,,False,1,1,7,0.787,0.63,0,-12.295,1,0.0609,0.0274,6.69e-06,0.161,0.882,125.347,267293,4
1990-07-07,2,"It Must Have Been Love (From ""Pretty Woman"")",Roxette,,False,2,1,14,0.52,0.652,5,-6.655,1,0.0274,0.34,5.49e-05,0.256,0.722,80.609,258787,4
1990-07-07,3,She Ain't Worth It,Glenn Medeiros Featuring Bobby Brown,,False,9,3,8,0.782,0.881,1,-7.763,1,0.064,0.0418,0,0.125,0.909,102.491,218840,4
1990-07-07,4,Poison,Bell Biv DeVoe,,False,3,3,14,0.84,0.56,6,-10.53,0,0.21,0.00195,0.00417,0.633,0.775,111.815,261853,4
1990-07-07,5,Hold On,En Vogue,,False,6,5,10,0.728,0.464,1,-11.156,1,0.0605,0.0865,0,0.343,0.383,96.944,304467,4
1990-07-07,6,Do You Remember?,Phil Collins,,False,4,4,11,0.677,0.509,5,-7.472,1,0.0252,0.114,0.0134,0.0659,0.525,93.042,275987,4
1990-07-07,7,I'll Be Your Shelter,Taylor Dayne,,False,8,7,10,0.692,0.912,0,-5.26,1,0.0353,0.151,0.000217,0.132,0.886,107.388,283040,4
1990-07-07,8,"Cradle Of Love (From ""Ford Fairlane"")",Billy Idol,,False,10,8,10,0.568,0.87,5,-8.02,0,0.045,0.000129,2.44e-05,0.0489,0.599,144.018,280697,4
1990-07-07,9,Hold On,Wilson Phillips,,False,5,1,17,0.679,0.657,5,-9.897,1,0.0255,0.4,0,0.0497,0.546,97.8,266867,4
1990-07-07,10,Rub You The Right Way,Johnny Gill,,False,11,10,9,0.66,0.873,10,-6.952,1,0.0461,0.0152,0.00324,0.331,0.864,111.872,332307,4
1990-07-07,11,Enjoy The Silence,Depeche Mode,,False,13,11,13,0.641,0.812,0,-7.945,0,0.0293,0.155,4.43e-05,0.078,0.822,112.777,257333,4
1990-07-07,12,Ready Or Not,After 7,,False,7,7,15,0.733,0.566,8,-12.06,0,0.039,0.0966,0,0.074,0.775,141.94,275827,4
1990-07-07,13,The Power,Snap!,,False,16,13,9,0.74,0.88,0,-7.693,1,0.0624,0.0434,0.00803,0.341,0.707,108.899,228994,4
1990-07-07,14,Girls Nite Out,Tyler Collins,,False,17,14,11,0.737,0.675,1,-10.027,1,0.0476,0.00012,0.34,0.302,0.577,109.06,237467,4
1990-07-07,15,When I'm Back On My Feet Again,Michael Bolton,,False,22,15,7,0.429,0.326,5,-12.703,1,0.03,0.377,0,0.101,0.185,77.849,228267,4
1990-07-07,16,U Can't Touch This,M.C. Hammer,,False,12,8,11,0.867,0.517,11,-13.222,0,0.0875,0.00456,0.000339,0.0864,0.866,133.148,257360,4
1990-07-07,17,Vision Of Love,Mariah Carey,,False,25,17,6,0.256,0.464,5,-10.959,1,0.0382,0.433,0,0.121,0.355,205.362,209293,3
1990-07-07,18,Mentirosa,Mellow Man Ace,,False,24,18,9,0.966,0.505,1,-14.762,1,0.111,0.0678,0,0.197,0.826,113.592,258533,4
1990-07-07,20,Vogue,Madonna,,False,14,1,13,0.737,0.88,6,-6.449,1,0.0433,0.00379,0.00351,0.417,0.329,115.998,316813,4
1990-07-07,21,Notice Me,Nikki,,False,23,21,11,0.617,0.364,10,-11.926,1,0.0468,0.229,0.873,0.0785,0.863,83.521,288382,4
1990-07-07,22,You Can't Deny It,Lisa Stansfield,,False,27,22,7,0.661,0.751,7,-6.734,1,0.107,0.359,8.1e-05,0.118,0.896,100.734,265440,4
1990-07-07,23,The Humpty Dance,Digital Underground,,False,19,11,17,0.813,0.693,10,-8.0,0,0.266,0.0341,0,0.121,0.618,103.508,391693,4
1990-07-07,24,"King Of Wishful Thinking (From ""Pretty Woman"")",Go West,,False,31,24,8,0.669,0.868,0,-7.377,1,0.0527,0.033,0,0.0991,0.913,107.885,241760,4
1990-07-07,25,Make You Sweat,Keith Sweat,,False,34,25,6,0.649,0.805,7,-10.53,1,0.0455,0.0465,3.51e-06,0.123,0.64,104.968,320507,4
1990-07-07,26,Children Of The Night,Richard Marx,,False,15,13,11,0.425,0.665,5,-8.117,1,0.0292,0.125,0.000201,0.186,0.376,76.369,284173,4
1990-07-07,27,Don't Go Away Mad (Just Go Away),Motley Crue,,False,37,27,6,0.286,0.958,2,-4.105,0,0.0634,0.00603,0.0118,0.145,0.564,118.264,279867,4
1990-07-07,28,Club At The End Of The Street,Elton John,,False,30,28,11,0.65,0.755,2,-9.645,1,0.0281,8.12e-05,0.0145,0.326,0.782,124.844,292173,4
1990-07-07,29,Bad Of The Heart,George LaMond,,False,32,29,9,0.625,0.727,1,-11.289,0,0.0482,0.00362,0.000316,0.375,0.789,118.039,257560,4
1990-07-07,30,Sending All My Love,Linear,,False,26,5,21,0.703,0.517,7,-13.644,1,0.0529,0.000407,0.0969,0.0963,0.768,104.833,234067,4
1990-07-07,31,All I Wanna Do Is Make Love To You,Heart,,False,21,2,15,0.626,0.746,7,-8.832,1,0.0282,0.16,0,0.0618,0.8,102.896,310893,4
1990-07-07,32,"Baby, It's Tonight",Jude Cole,,False,18,16,13,0.611,0.815,9,-6.301,1,0.0356,0.0438,3.12e-05,0.154,0.7,120.985,217933,4
1990-07-07,33,If Wishes Came True,Sweet Sensation,,False,43,33,4,0.493,0.453,3,-10.878,1,0.0248,0.0944,0.00467,0.1,0.188,143.725,315160,4
1990-07-07,34,Hanky Panky,Madonna,,False,40,34,2,0.637,0.626,2,-10.728,1,0.329,0.419,0,0.0543,0.485,169.969,239160,4
1990-07-07,35,Kiss This Thing Goodbye,Del Amitri,,False,38,35,8,0.687,0.535,7,-13.075,1,0.0327,0.108,0.0108,0.316,0.8,117.316,274507,4
1990-07-07,36,Could This Be Love,Seduction,,False,46,36,5,0.526,0.484,0,-11.302,1,0.0254,0.448,0,0.109,0.276,73.978,380400,4
1990-07-07,37,Love Is,Alannah Myles,,False,36,36,10,0.654,0.924,2,-7.44,1,0.0969,0.00309,0.00231,0.316,0.506,101.154,216107,4
1990-07-07,38,Up All Night,Slaughter,,False,28,27,11,0.516,0.733,7,-11.341,0,0.0326,0.000373,0.00716,0.258,0.552,98.005,226027,4
1990-07-07,39,Pure,Lightning Seeds,,False,47,39,8,0.617,0.895,4,-3.88,1,0.0293,0.0748,0.0428,0.0736,0.899,123.513,224672,4
1990-07-07,40,The Ballad Of Jayne,L.A. Guns,,False,33,33,14,0.474,0.369,6,-14.216,1,0.0296,0.0291,5.86e-05,0.128,0.156,61.207,274107,4
1990-07-07,41,Possession,Bad English,,False,50,41,5,0.514,0.603,1,-12.096,0,0.03,0.117,0,0.117,0.371,99.985,308307,4
1990-07-07,42,Nothing Compares 2 U,Sinead O'Connor,,False,35,1,17,0.511,0.574,5,-7.016,1,0.0273,0.0425,2.33e-05,0.105,0.161,119.917,280040,4
1990-07-07,43,Alright,Janet Jackson,,False,29,4,14,0.667,0.893,11,-7.083,1,0.0364,0.1,0.592,0.55,0.963,111.705,386533,4
1990-07-07,44,Come Back To Me,Janet Jackson,,False,93,44,2,0.428,0.409,5,-12.346,0,0.0271,0.626,0.00961,0.138,0.0611,77.906,332742,4
1990-07-07,45,Epic,Faith No More,,False,69,45,3,0.358,0.893,4,-7.486,0,0.12,0.0222,0.0524,0.126,0.262,174.238,293653,4
1990-07-07,46,The Blues,Tony Toni Tone,,False,48,46,6,0.863,0.576,1,-11.204,1,0.0751,0.0467,0,0.277,0.84,101.869,253133,4
1990-07-07,47,Turtle Power,Partners In Kryme,,False,39,13,12,0.679,0.94,11,-12.165,0,0.0725,0.034,0,0.0494,0.283,105.216,261600,4
1990-07-07,48,I Didn't Want To Need You,Heart,,False,57,48,3,0.291,0.804,9,-8.329,1,0.0628,0.149,5.23e-06,0.298,0.483,178.046,249533,4
1990-07-07,49,Welcome To The Real World,Jane Child,,False,52,49,6,0.625,0.721,8,-12.512,0,0.0325,0.00703,1.33e-06,0.317,0.851,104.651,299640,4
1990-07-07,50,Across The River,Bruce Hornsby & The Range,,False,53,50,3,0.529,0.816,7,-7.075,1,0.0385,0.276,0.0602,0.192,0.825,149.769,309720,4
1990-07-07,51,My Kinda Girl,Babyface,,False,51,51,4,0.711,0.804,4,-7.148,0,0.0445,0.0548,0.000314,0.0732,0.69,99.927,279267,4
1990-07-07,52,The Other Side,Aerosmith,,False,59,52,3,0.56,0.973,2,-4.345,1,0.0466,0.0613,0.00161,0.394,0.829,126.854,244200,4
1990-07-07,53,Jerk Out,The Time,,False,65,53,2,0.792,0.897,9,-6.777,0,0.0537,0.0239,0.000999,0.0491,0.9,120.639,409333,4
1990-07-07,54,Ooh La La (I Can't Get Over You),Perfect Gentlemen,,False,44,10,13,0.645,0.328,7,-11.329,0,0.0275,0.481,0,0.0812,0.296,136.433,286067,4
1990-07-07,55,Have You Seen Her,M.C. Hammer,,False,63,55,2,0.775,0.378,6,-14.892,0,0.102,0.207,5.3e-06,0.107,0.86,144.16,282800,4
1990-07-07,57,I'll See You In My Dreams,Giant,,False,42,20,16,0.412,0.493,2,-12.025,1,0.033,0.0561,0.000441,0.044,0.116,132.779,286707,4
1990-07-07,58,Release Me,Wilson Phillips,,False,76,58,2,0.724,0.471,0,-11.143,1,0.0358,0.448,2.5e-06,0.218,0.442,97.211,295693,4
1990-07-07,59,Love And Emotion,Stevie B,,False,70,59,2,0.552,0.817,6,-10.458,1,0.0831,0.0426,0,0.0855,0.911,200.997,222267,4
1990-07-07,60,The Girl I Used To Know,Brother Beyond,,False,64,60,3,0.465,0.886,1,-9.477,1,0.0807,4.64e-05,0.0271,0.325,0.954,185.595,254642,4
1990-07-07,61,The Right Combination,Seiko & Donnie Wahlberg,,False,62,61,4,0.458,0.367,9,-10.631,1,0.0267,0.661,0,0.0894,0.167,137.909,271738,4
1990-07-07,62,Nicety,Michel'le,,False,49,29,13,0.83,0.712,11,-7.447,1,0.0446,0.0105,0.24,0.049,0.814,103.141,211160,4
1990-07-07,63,Dare To Fall In Love,Brent Bourgeois,,False,41,32,11,0.708,0.522,8,-8.247,1,0.0527,0.421,0.913,0.0829,0.522,154.854,246008,4
1990-07-07,64,Talk To Me,Anita Baker,,False,71,64,3,0.462,0.596,7,-8.103,1,0.0435,0.351,0,0.1,0.388,188.181,234467,4
1990-07-07,65,Bang Bang,Danger Danger,,False,66,65,6,0.605,0.937,2,-7.841,1,0.0621,0.1,0,0.354,0.617,126.978,236933,4
1990-07-07,67,All I Do Is Think Of You,Troop,4XhrowM5IKGCRrY2HzYBH3,True,0,67,1,0.534,0.7,8,-8.71,0,0.0446,0.0143,0,0.197,0.447,122.609,229053,4
1990-07-07,69,When I Dream Of You,Tommy Page,,False,45,42,9,0.461,0.495,9,-8.854,0,0.026,0.47,1.2e-06,0.127,0.177,91.865,247493,4
1990-07-07,70,Unskinny Bop,Poison,1Z6lKdYhwp8WYoBqGCKxlM,True,0,70,1,0.574,0.93,1,-2.949,1,0.0413,0.0657,7.78e-06,0.108,0.69,92.303,228067,4
1990-07-07,71,House Of Pain,Faster Pussycat,1Z6lKdYhwp8WYoBqGCKxlM,False,61,28,20,0.519,0.61,0,-10.256,1,0.036,0.0766,6.49e-05,0.248,0.232,121.324,346627,4
1990-07-07,73,"Doubleback (From ""Back To The Future Part III"")",ZZ Top,,False,58,50,8,0.655,0.673,5,-10.187,1,0.0301,0.0698,0.000144,0.372,0.558,123.913,236200,4
1990-07-07,74,The Emperor's New Clothes,Sinead O'Connor,,False,79,74,3,0.736,0.711,3,-7.623,0,0.0503,0.0182,0.000798,0.158,0.709,123.165,316493,4
1990-07-07,75,"""B"" Girls",Young And Restless,,False,67,54,10,0.615,0.497,7,-11.913,1,0.439,0.016,0,0.312,0.769,193.762,242107,3
1990-07-07,76,Cuts Both Ways,Gloria Estefan,,False,83,76,2,0.38,0.309,11,-12.6,1,0.0329,0.649,0,0.0693,0.299,83.717,194333,4
1990-07-07,77,Expression,Salt-N-Pepa,,False,55,26,18,0.936,0.571,6,-10.834,1,0.0846,0.0347,2.81e-06,0.101,0.881,107.738,236240,4
1990-07-07,78,Do Me!,Bell Biv DeVoe,,False,92,78,2,0.716,0.772,10,-6.816,0,0.037,0.134,2.15e-06,0.35,0.671,107.823,272440,4
1990-07-07,79,Tic-Tac-Toe,Kyper,,False,91,79,2,0.808,0.912,7,-5.277,1,0.149,0.00427,0.0853,0.315,0.402,125.812,383427,4
1990-07-07,80,I Wanna Be Rich,Calloway,,False,56,2,22,0.733,0.781,0,-10.265,1,0.0857,0.0352,0.00793,0.147,0.869,114.181,304200,4
1990-07-07,81,Always And Forever,Whistle,,False,60,35,14,0.347,0.236,3,-13.536,1,0.0291,0.688,0,0.111,0.281,170.154,315040,4
1990-07-07,82,Close To You,Maxi Priest,,False,87,82,2,0.781,0.478,6,-15.427,1,0.0561,0.0849,3.93e-06,0.0877,0.962,95.992,325800,4
1990-07-07,83,Don't You Love Me,49-ers,,False,78,78,4,0.622,0.976,6,-7.506,0,0.0568,0.000781,0.00173,0.177,0.885,121.83,191080,4
1990-07-07,84,Your Baby Never Looked Good In Blue,Expose,,False,72,17,15,0.561,0.498,0,-9.91,1,0.026,0.622,0.000122,0.163,0.367,138.172,241840,4
1990-07-07,85,I'm Never Gonna Give You Up,The Brat Pack,,False,94,85,2,0.61,0.865,8,-8.455,1,0.0405,0.116,0.0682,0.0597,0.832,105.089,311467,4
1990-07-07,86,Counting The Days,Joey Kid,,False,80,70,10,0.654,0.92,6,-12.435,0,0.0604,0.00527,0.000621,0.27,0.718,118.368,233040,4
1990-07-07,87,I Melt With You,Modern English,,False,88,78,10,0.541,0.81,0,-11.745,1,0.0367,0.000975,0.00158,0.0681,0.647,155.582,251573,4
1990-07-07,88,Rise To It,KISS,,False,81,81,5,0.551,0.888,0,-10.916,1,0.0537,0.338,0.00277,0.317,0.287,130.667,244227,4
1990-07-07,89,La Raza,Kid Frost,3zCg6CUmhxHukbUs0nd7ar,True,0,89,1,0.801,0.529,1,-14.875,1,0.0962,0.0406,0.000609,0.0936,0.721,106.965,209067,4
1990-07-07,90,A Dreams A Dream,Soul II Soul,3zCg6CUmhxHukbUs0nd7ar,False,95,90,2,0.711,0.652,6,-13.49,0,0.0447,0.0269,0.00335,0.0565,0.544,103.258,338867,4
1990-07-07,91,Stranger To Love,St. Paul,6N86kXLekCFbsSif0tiSIO,True,0,91,1,0.602,0.531,9,-11.086,0,0.0345,0.572,0.000841,0.0772,0.395,125.271,344413,4
1990-07-07,92,How Bad Do You Want It?,Don Henley,6KIbBxMKqXxZeK8wOtRFiX,True,0,92,1,0.711,0.879,10,-9.325,1,0.0353,0.208,1.41e-05,0.0494,0.653,118.199,226307,4
1990-07-07,93,(Can't Live Without Your) Love And Affection,Nelson,0Vnp6QviX26xU5K1WnwKVu,True,0,93,1,0.305,0.363,2,-17.456,1,0.0425,0.992,0.918,0.12,0.965,127.773,161533,4
1990-07-07,95,Chain Of Fools,Little Caesar,,False,90,88,4,0.613,0.77,2,-8.626,1,0.0447,0.00333,1.92e-05,0.318,0.607,116.129,328160,4
1990-07-07,96,Coming Of Age,Damn Yankees,,False,86,60,12,0.563,0.866,7,-8.861,1,0.0499,0.154,0,0.579,0.582,125.884,259840,4
1990-07-07,97,Jealous Again,The Black Crowes,,False,82,75,9,0.633,0.842,7,-4.642,1,0.0262,0.111,0,0.139,0.674,114.449,275067,4
1990-07-07,98,What It Takes,Aerosmith,,False,77,9,17,0.522,0.738,0,-6.423,1,0.031,0.0286,5.8e-06,0.4,0.461,142.702,310533,4
1990-07-07,99,Show Me,Howard Hewett,,False,84,62,7,0.617,0.788,1,-7.512,0,0.0411,0.144,5.79e-06,0.891,0.695,154.11,335467,4
1990-07-07,100,The Heart Of The Matter,Don Henley,,False,85,21,21,0.579,0.529,2,-11.548,1,0.025,0.201,0,0.231,0.38,88.156,322600,4
