date,position,title,artist,spotify_id,is_new,last_pos,peak_pos,weeks,danceability,energy,key,loudness,mode,speechiness,acousticness,instrumentalness,liveness,valence,tempo,duration_ms,time_signature
1994-07-02,1,I Swear,All-4-One,4zwZhQnqJTr1rQ9wRY3nNr,False,1,1,11,0.532,0.407,6,-9.658,0,0.0233,0.235,0,0.117,0.23,83.207,259853,4
1994-07-02,2,"Regulate (From ""Above The Rim"")",Warren G & Nate Dogg,4zwZhQnqJTr1rQ9wRY3nNr,False,3,2,11,0.849,0.521,11,-12.999,0,0.216,0.304,1.65e-06,0.115,0.763,95.265,248867,4
1994-07-02,4,Don't Turn Around,Ace Of Base,,False,4,4,9,0.745,0.771,4,-8.231,0,0.0755,0.00104,0.387,0.0574,0.752,95.623,230187,4
1994-07-02,5,Back & Forth,Aaliyah,,False,6,5,10,0.706,0.727,5,-8.06,1,0.0317,0.0698,5.31e-06,0.115,0.903,92.938,231093,4
1994-07-02,6,"I'll Remember (From ""With Honors"")",Madonna,,False,5,2,14,0.691,0.601,7,-9.698,1,0.0428,0.628,0.017,0.0709,0.85,167.796,263813,4
1994-07-02,7,You Mean The World To Me,Toni Braxton,,False,7,7,14,0.595,0.736,11,-6.648,1,0.0469,0.0964,9.28e-06,0.104,0.521,167.669,296400,4
1994-07-02,8,"Stay (I Missed You) (From ""Reality Bites"")",Lisa Loeb & Nine Stories,,False,10,8,9,0.612,0.591,1,-7.02,1,0.051,0.462,0,0.111,0.349,160.659,184333,4
1994-07-02,9,"Baby I Love Your Way (From ""Reality Bites"")",Big Mountain,,False,9,6,19,0.651,0.747,1,-7.269,0,0.0699,0.0528,0,0.207,0.776,147.518,249520,4
1994-07-02,10,If You Go,Jon Secada,,False,13,10,9,0.631,0.813,7,-8.106,1,0.0337,0.0779,0,0.167,0.522,105.998,275000,4
1994-07-02,11,"Can You Feel The Love Tonight (From ""The Lion King"")",Elton John,,False,16,11,7,0.297,0.364,10,-9.261,1,0.0305,0.813,0.000761,0.0976,0.149,122.598,240000,4
1994-07-02,12,Anytime You Need A Friend,Mariah Carey,,False,12,12,6,0.57,0.549,9,-7.956,0,0.0312,0.469,7.91e-06,0.0715,0.295,136.13,265467,4
1994-07-02,13,The Sign,Ace Of Base,,False,8,1,27,0.808,0.786,4,-6.897,0,0.0447,0.00928,0.0701,0.0574,0.899,96.987,191240,4
1994-07-02,14,Your Body's Callin',R. Kelly,,False,15,13,8,0.658,0.55,9,-6.705,1,0.0302,0.457,0.000728,0.114,0.727,168.289,277493,4
1994-07-02,15,The Most Beautiful Girl In The World,Prince,,False,11,3,18,0.748,0.147,6,-20.606,1,0.123,0.57,0.507,0.0871,0.966,93.022,140480,4
1994-07-02,16,Funkdafied,Da Brat,,False,20,16,5,0.802,0.461,11,-12.367,0,0.302,0.0757,0,0.109,0.74,90.995,185933,4
1994-07-02,17,Shine,Collective Soul,,False,18,17,9,0.54,0.423,6,-8.799,1,0.0283,0.294,0.0884,0.152,0.353,150.135,306040,4
1994-07-02,18,Fantastic Voyage,Coolio,,False,35,18,5,0.888,0.584,7,-13.308,1,0.112,0.0389,3.25e-06,0.0625,0.762,104.704,334440,4
1994-07-02,19,Return To Innocence,Enigma,,False,14,4,18,0.476,0.584,10,-12.357,1,0.038,0.119,0,0.274,0.417,88.026,255467,4
1994-07-02,20,Don't Take The Girl,Tim McGraw,,False,17,17,7,0.439,0.454,0,-8.669,1,0.0308,0.279,0,0.123,0.354,204.263,249360,4
1994-07-02,21,I Miss You,Aaron Hall,,False,23,21,8,0.713,0.754,6,-5.277,1,0.0271,0.0298,0,0.136,0.564,120.079,381733,4
1994-07-02,22,Wild Night,John Mellencamp With Me'Shell Ndegeocello,,False,27,22,6,0.598,0.728,7,-8.208,1,0.0699,0.427,0.000424,0.0606,0.888,146.04,203566,4
1994-07-02,23,Beautiful In My Eyes,Joshua Kadison,,False,22,19,12,0.582,0.381,3,-10.045,1,0.0256,0.595,1.1e-05,0.132,0.283,141.947,249493,4
1994-07-02,24,I'm Ready,Tevin Campbell,,False,19,9,17,0.684,0.687,0,-6.393,1,0.0228,0.0631,1.29e-05,0.0601,0.752,91.201,286720,4
1994-07-02,25,Crazy,Aerosmith,,False,30,25,7,0.417,0.815,6,-4.145,0,0.0322,0.0314,2.79e-06,0.128,0.466,161.97,316667,3
1994-07-02,26,"Anything (From ""Above The Rim"")",SWV,,False,21,18,13,0.798,0.792,10,-5.667,0,0.0448,0.0103,0.00031,0.309,0.798,94.967,247440,4
1994-07-02,27,Always,Erasure,,False,29,27,10,0.596,0.731,5,-9.961,1,0.0284,0.296,3.64e-06,0.301,0.308,103.027,237800,4
1994-07-02,28,Misled,Celine Dion,,False,24,23,10,0.707,0.93,5,-6.477,0,0.0324,0.0868,0.00109,0.0986,0.89,109.877,210933,4
1994-07-02,29,Got Me Waiting,Heavy D & The Boyz,,False,28,20,15,0.809,0.302,2,-15.76,1,0.309,0.015,5.58e-05,0.12,0.546,90.177,271467,4
1994-07-02,30,Bump N' Grind,R. Kelly,,False,25,1,22,0.621,0.481,11,-8.016,1,0.0371,0.0984,0,0.241,0.679,65.004,256133,4
1994-07-02,31,Come To My Window,Melissa Etheridge,,False,32,31,19,0.512,0.636,7,-9.602,1,0.0262,0.08,0.000106,0.088,0.499,97.257,236000,4
1994-07-02,32,"I'll Take You There (From ""Threesome"")",General Public,,False,26,22,13,0.804,0.749,4,-9.598,1,0.0821,0.225,0.00163,0.0764,0.935,97.972,247093,4
1994-07-02,33,Willing To Forgive,Aretha Franklin,,False,42,33,8,0.547,0.693,2,-6.802,1,0.0327,0.00265,7.51e-05,0.144,0.434,152.117,252347,4
1994-07-02,34,Back In The Day,Ahmad,,False,40,34,6,0.63,0.641,10,-6.67,0,0.369,0.342,0,0.588,0.541,79.523,303373,4
1994-07-02,35,Moving On Up,M People,,False,34,34,9,0.899,0.857,0,-6.128,0,0.037,0.0499,0.0299,0.112,0.961,125.073,215533,4
1994-07-02,36,Whatta Man,Salt-N-Pepa Featuring En Vogue,,False,33,3,24,0.757,0.544,5,-10.722,1,0.219,0.154,6.07e-05,0.226,0.921,173.208,308360,4
1994-07-02,37,Loser,Beck,,False,31,10,23,0.654,0.611,2,-10.45,1,0.119,0.0337,0.000178,0.405,0.786,85.387,235000,4
1994-07-02,38,Mmm Mmm Mmm Mmm,Crash Test Dummies,,False,37,4,23,0.58,0.575,3,-7.72,1,0.0231,0.25,1.83e-05,0.0813,0.37,92.934,235173,4
1994-07-02,39,"The Place Where You Belong (From ""Beverly Hills Cop III"")",Shai,,False,48,39,5,0.764,0.535,2,-6.112,0,0.0776,0.0115,1.52e-05,0.401,0.548,95.643,261760,4
1994-07-02,40,Now And Forever,Richard Marx,,False,36,7,24,0.441,0.258,7,-11.227,1,0.0276,0.661,0,0.106,0.172,77.988,214827,1
1994-07-02,41,Sweet Potatoe Pie,Domino,,False,38,27,13,0.799,0.601,1,-10.785,1,0.201,0.00997,0,0.149,0.842,93.065,211853,4
1994-07-02,42,Prayer For The Dying,Seal,,False,53,42,4,0.306,0.763,5,-7.518,1,0.051,0.335,0.00593,0.0835,0.147,99.904,330267,4
1994-07-02,43,100% Pure Love,Crystal Waters,,False,47,43,6,0.811,0.725,8,-7.203,1,0.0491,0.0843,0.0059,0.0567,0.698,120.242,278627,4
1994-07-02,44,(She's) Some Kind Of Wonderful,Huey Lewis & The News,,False,46,44,8,0.768,0.829,5,-5.109,1,0.0313,0.0964,2.92e-05,0.097,0.962,118.773,234333,4
1994-07-02,45,The Power Of Love,Celine Dion,,False,41,1,32,0.546,0.519,8,-9.072,1,0.0291,0.36,0.00046,0.24,0.247,140.054,342400,4
1994-07-02,47,Pumps And A Bump,M.C. Hammer,,False,43,26,15,0.836,0.793,7,-7.744,1,0.109,0.0627,2.57e-05,0.219,0.887,106.005,305067,4
1994-07-02,48,Found Out About You,Gin Blossoms,,False,49,25,33,0.539,0.826,7,-8.037,1,0.0276,0.00224,0.0451,0.0832,0.669,134.718,233400,4
1994-07-02,49,Sending My Love,Zhane,,False,50,49,7,0.713,0.503,7,-9.663,1,0.0575,0.0323,0.167,0.0601,0.211,95.019,221173,4
1994-07-02,50,Love Sneakin' Up On You,Bonnie Raitt,,False,51,19,17,0.483,0.673,7,-8.105,1,0.0438,0.0217,6.53e-06,0.209,0.558,189.704,220733,4
1994-07-02,51,Fall Down,Toad The Wet Sprocket,,False,60,51,5,0.472,0.856,0,-6.881,1,0.0326,0.146,0.000672,0.175,0.774,151.972,202427,4
1994-07-02,52,When Can I See You,Babyface,,False,63,52,3,0.754,0.472,8,-11.787,1,0.0807,0.257,2.09e-05,0.121,0.613,169.199,229600,4
1994-07-02,53,Objects In The Rear View Mirror May Appear Closer Than...,Meat Loaf,,False,44,38,8,0.395,0.567,5,-5.667,1,0.0336,0.797,1.7e-06,0.0988,0.314,117.752,615093,4
1994-07-02,54,Always In My Heart,Tevin Campbell,,False,79,54,2,0.713,0.677,6,-6.761,1,0.0253,0.0282,5.99e-05,0.144,0.522,124.152,338732,4
1994-07-02,55,Ease My Mind,Arrested Development,,False,45,45,8,0.902,0.493,4,-12.565,0,0.272,0.00714,6.89e-06,0.0553,0.44,96.913,252440,4
1994-07-02,56,Bizarre Love Triangle,FRENTE!,,False,52,49,11,0.738,0.198,1,-10.919,1,0.0625,0.906,0,0.105,0.682,123.158,119813,4
1994-07-02,57,Selling The Drama,Live,,False,61,57,5,0.448,0.901,6,-6.722,1,0.0627,0.0121,0.000148,0.127,0.406,124.525,205413,4
1994-07-02,58,I Need Your Love,Boston,,False,66,58,4,0.362,0.578,7,-10.134,1,0.0369,0.0724,0.00119,0.0999,0.153,113.015,333973,4
1994-07-02,59,Worker Man,Patra,,False,65,53,10,0.814,0.759,7,-11.117,1,0.11,0.129,0,0.306,0.881,82.366,296827,4
1994-07-02,60,And Our Feelings,Babyface,,False,54,21,18,0.741,0.592,4,-7.819,1,0.0298,0.138,0,0.224,0.27,128.137,342360,4
1994-07-02,61,Dreams,The Cranberries,,False,69,42,14,0.551,0.643,4,-13.091,1,0.0353,0.00313,0.00385,0.421,0.514,128.661,271560,4
1994-07-02,62,Love On My Mind,Xscape,,False,55,46,11,0.892,0.488,3,-9.748,0,0.041,0.0316,0,0.0284,0.786,101.89,228902,4
1994-07-02,63,I Wish,Gabrielle,,False,64,52,10,0.459,0.655,0,-7.598,1,0.0288,5.22e-05,0.735,0.18,0.407,138.5,191379,4
1994-07-02,64,Backwater,Meat Puppets,,False,68,64,4,0.495,0.84,9,-6.613,1,0.0446,0.13,0.00151,0.185,0.478,111.82,220533,4
1994-07-02,65,How Do You Like It?,Keith Sweat,,False,67,48,15,0.798,0.646,1,-6.24,0,0.0947,0.0056,4.78e-06,0.0711,0.669,94.699,273693,4
1994-07-02,66,"Streets Of Philadelphia (From ""Philadelphia"")",Bruce Springsteen,,False,58,9,20,0.741,0.29,5,-13.251,1,0.0302,0.294,0.118,0.0924,0.443,93.699,195080,4
1994-07-02,67,I'm Not Over You,CeCe Peniston,,False,73,67,3,0.828,0.517,9,-10.769,1,0.0364,0.00607,1.37e-05,0.327,0.683,102.341,258600,4
1994-07-02,68,Born To Roll,Masta Ace Incorporated,,False,62,23,17,0.8,0.658,6,-9.591,0,0.254,0.00436,0,0.109,0.674,92.064,254533,4
1994-07-02,69,Maybe Love Will Change Your Mind,Stevie Nicks,,False,70,69,3,0.666,0.874,0,-6.117,1,0.0269,0.0529,2.79e-05,0.108,0.839,121.194,256790,4
1994-07-02,70,"(Meet) The Flintstones (From ""The Flintstones"")",The B.C. 52's,,False,56,33,7,0.314,0.124,3,-30.331,1,0.0424,0.99,0.921,0.132,0.769,167.474,176707,4
1994-07-02,71,"Crooklyn (From ""Crooklyn"")",The Crooklyn Dodgers,,False,74,71,7,0.814,0.819,1,-7.642,1,0.242,0.00381,1.29e-06,0.295,0.566,93.752,304801,4
1994-07-02,73,Take It Back,Pink Floyd,,False,82,73,3,0.469,0.602,7,-11.156,1,0.0289,0.133,0.00613,0.273,0.131,112.427,372226,4
1994-07-02,74,What's Up,DJ Miko,,False,92,74,3,0.794,0.965,9,-9.153,1,0.0433,0.0044,0.000462,0.109,0.72,135.03,315049,4
1994-07-02,75,I'll Remember You,Atlantic Starr,,False,81,75,5,0.562,0.481,0,-8.753,1,0.034,0.583,1.1e-06,0.123,0.23,139.743,261067,4
1994-07-02,76,Your Love Is So Divine,Miranda,,False,90,76,3,0.971,0.606,0,-6.666,1,0.194,0.0201,1.14e-05,0.152,0.522,128.056,291094,4
1994-07-02,77,Night In My Veins,Pretenders,,False,71,71,7,0.531,0.918,9,-4.982,0,0.0366,0.00684,0,0.127,0.898,136.052,197667,4
1994-07-02,78,Booti Call,BLACKstreet,,False,94,78,2,0.87,0.92,9,-2.858,0,0.0538,0.00819,0.000838,0.083,0.852,99.123,266493,4
1994-07-02,79,Player's Ball,OutKast,,False,72,37,19,0.857,0.764,1,-6.304,1,0.246,0.0398,0,0.425,0.578,93.071,261267,4
1994-07-02,80,Whenever You Come Around,Vince Gill,,False,76,72,7,0.719,0.22,11,-11.811,1,0.0294,0.736,9.4e-06,0.118,0.168,115.375,259160,4
1994-07-02,81,Closer,Nine Inch Nails,,False,87,75,4,0.547,0.714,10,-8.628,0,0.044,0.000242,0.636,0.122,0.541,89.996,373000,4
1994-07-02,82,Feenin',Jodeci,,False,75,25,17,0.673,0.618,5,-10.878,0,0.0649,0.152,0,0.949,0.649,121.711,310800,4
1994-07-02,83,Possession,Sarah McLachlan,,False,80,73,9,0.476,0.658,6,-6.737,0,0.0281,0.2,0.00155,0.0635,0.357,97.527,279467,4
1994-07-02,84,Indian Outlaw,Tim McGraw,,False,78,15,18,0.664,0.739,9,-7.229,1,0.0415,0.0364,4.99e-05,0.282,0.759,110.101,182120,4
1994-07-02,86,Sleeping In My Car,Roxette,0CicjlSiN0HdzD2nigN9j4,True,0,86,1,0.546,0.85,6,-4.315,1,0.0322,0.0123,0,0.193,0.584,135.162,214160,4
1994-07-02,87,Girls & Boys,Blur,0CicjlSiN0HdzD2nigN9j4,False,88,87,2,0.585,0.567,7,-19.242,0,0.0461,0.027,0,0.0418,0.651,124.237,258861,4
1994-07-02,88,It's Over Now,Cause And Effect,0CicjlSiN0HdzD2nigN9j4,False,97,88,2,0.728,0.487,8,-7.559,1,0.122,0.079,0,0.204,0.371,99.983,210826,4
1994-07-02,89,You,Candlebox,0CicjlSiN0HdzD2nigN9j4,False,86,78,16,0.329,0.861,11,-5.855,0,0.147,0.00789,2.88e-06,0.0844,0.599,195.303,297173,3
1994-07-02,90,Old To The New,Nice & Smooth,1eyHkqk22jB7DVr7kGXFs8,True,0,90,1,0.77,0.878,10,-6.734,0,0.0531,0.0052,0.000264,0.0857,0.468,100.419,253333,4
1994-07-02,91,Funky Y-2-C,The Puppies,7LMFh1bTeayMpV4ptZFuGu,True,0,91,1,0.901,0.744,1,-10.705,1,0.0727,5.73e-05,0.228,0.045,0.852,140.698,206750,4
1994-07-02,92,Nappy Heads,Fugees,0hKr166QnNZ0a37G4UO0VY,True,0,92,1,0.77,0.455,1,-16.027,1,0.328,0.137,6.92e-05,0.109,0.643,97.099,322067,4
1994-07-02,94,Cleopatra's Cat,Spin Doctors,,False,84,84,3,0.626,0.735,2,-8.475,1,0.093,0.349,1.78e-05,0.0877,0.477,99.701,244267,4
1994-07-02,95,Thinkin' Problem,David Ball,7zE9E6iBKPCwCW6orDoY4X,True,0,95,1,0.765,0.573,0,-11.243,1,0.0324,0.138,1.92e-05,0.221,0.74,110.434,181133,4
1994-07-02,96,Warrior's Drum,King Just,1t7yRpEelJCx3z54Em10xM,True,0,96,1,0.695,0.614,10,-10.976,0,0.49,0.038,1.28e-06,0.173,0.732,99.562,268304,4
1994-07-02,97,Low,Cracker,1t7yRpEelJCx3z54Em10xM,False,93,64,13,0.329,0.646,7,-6.962,1,0.0283,0.0093,0.00469,0.101,0.471,173.974,276132,4
1994-07-02,98,90's Girl,Blackgirl,7wihIPRid6q3FyrQPfSSuN,True,0,98,1,0.857,0.576,11,-8.339,0,0.0641,0.0139,0,0.043,0.665,102.326,415714,4
1994-07-02,99,Nuttin' But Love,Heavy D & The Boyz,43JSZNyRzLa3nD9W0hfD48,True,0,99,1,0.731,0.499,11,-13.619,0,0.374,0.0527,0.0015,0.0362,0.47,202.675,213733,4
1994-07-02,100,The Right Kinda Lover,Patti LaBelle,39KhQn8GOfE7z9wZbldgaQ,True,0,100,1,0.815,0.77,10,-8.412,0,0.0512,0.257,0.000227,0.0488,0.811,99.941,292667,4
