date,position,title,artist,spotify_id,is_new,last_pos,peak_pos,weeks,danceability,energy,key,loudness,mode,speechiness,acousticness,instrumentalness,liveness,valence,tempo,duration_ms,time_signature
2001-12-29,1,How You Remind Me,Nickelback,,False,1,1,17,0.446,0.764,10,-5.042,1,0.033,0.00135,0,0.099,0.543,172.094,223840,4
2001-12-29,2,U Got It Bad,Usher,,False,2,1,15,0.816,0.5,1,-4.551,1,0.03,0.0227,1.53e-06,0.0733,0.649,124.037,247840,4
2001-12-29,3,Family Affair,Mary J. Blige,,False,3,1,23,0.911,0.551,8,-3.75,0,0.0449,0.132,4.12e-05,0.0863,0.969,92.887,265867,4
2001-12-29,4,Get The Party Started,P!nk,,False,5,4,10,0.802,0.904,11,-3.267,0,0.0459,0.00108,0,0.173,0.961,128.931,192533,4
2001-12-29,5,Hero,Enrique Iglesias,,False,4,3,14,0.581,0.651,7,-5.617,1,0.0392,0.143,1.05e-05,0.107,0.146,151.959,264600,4
2001-12-29,6,"Whenever, Wherever",Shakira,,False,7,6,10,0.793,0.832,1,-4.862,0,0.0406,0.236,1.12e-05,0.202,0.872,107.661,196160,4
2001-12-29,7,Always On Time,Ja Rule Featuring Ashanti,,False,9,7,7,0.839,0.706,5,-6.104,0,0.199,0.208,0,0.242,0.839,96.673,245133,4
2001-12-29,8,Differences,Ginuwine,,False,6,4,23,0.562,0.594,3,-4.578,0,0.0558,0.318,0,0.311,0.423,62.876,265533,4
2001-12-29,9,My Sacrifice,Creed,,False,11,9,10,0.32,0.88,2,-6.035,1,0.0504,0.000101,4.31e-06,0.076,0.257,146.349,294600,4
2001-12-29,10,Livin' It Up,Ja Rule Featuring Case,,False,8,6,18,0.874,0.768,6,-4.086,1,0.311,0.0554,0,0.041,0.636,106.095,257067,4
2001-12-29,11,A Woman's Worth,Alicia Keys,,False,13,11,10,0.667,0.41,4,-8.323,0,0.138,0.331,0,0.064,0.493,75.069,303333,4
2001-12-29,12,Turn Off The Light,Nelly Furtado,,False,10,5,20,0.587,0.679,2,-6.26,1,0.0927,0.0839,0.000316,0.413,0.65,180.184,276107,4
2001-12-29,13,Gone,'N Sync,,False,12,11,15,0.704,0.409,11,-8.581,0,0.0597,0.43,0,0.109,0.495,113.863,292000,4
2001-12-29,14,Superman (It's Not Easy),Five For Fighting,,False,15,14,18,0.382,0.416,0,-9.303,1,0.0302,0.0733,0,0.0719,0.125,102.089,221693,4
2001-12-29,15,Wherever You Will Go,The Calling,,False,19,15,8,0.558,0.719,2,-5.113,1,0.0267,0.0367,0,0.115,0.371,112.027,208600,4
2001-12-29,16,Rock The Boat,Aaliyah,,False,17,14,17,0.691,0.695,8,-8.684,0,0.114,0.0468,0.000861,0.249,0.554,105.577,120015,4
2001-12-29,17,I Do!!,Toya,,False,20,16,31,0.781,0.583,6,-7.83,0,0.0628,0.0859,0.00216,0.058,0.91,156.264,213493,4
2001-12-29,18,I'm Real,Jennifer Lopez Featuring Ja Rule,,False,14,1,26,0.708,0.587,11,-7.93,0,0.151,0.273,0,0.0718,0.554,83.46,262133,4
2001-12-29,19,Only Time,Enya,,False,16,10,25,0.418,0.249,3,-13.744,1,0.0301,0.841,0.661,0.112,0.213,82.803,218547,4
2001-12-29,20,Where The Stars And Stripes And The Eagle Fly,Aaron Tippin,,False,25,20,11,0.597,0.773,2,-4.053,1,0.0288,0.0351,3.85e-05,0.248,0.354,100.009,228200,4
2001-12-29,21,Butterflies,Michael Jackson,,False,26,21,7,0.708,0.655,8,-2.69,1,0.0883,0.0583,2.1e-06,0.11,0.545,89.99,279160,4
2001-12-29,22,We Thuggin',Fat Joe Featuring R. Kelly,,False,23,22,10,0.896,0.649,8,-3.792,1,0.208,0.177,0,0.0759,0.822,99.107,213533,4
2001-12-29,23,Caramel,City High Featuring Eve,,False,24,19,12,0.801,0.66,5,-8.267,0,0.286,0.175,9.5e-06,0.0748,0.295,93.036,212293,4
2001-12-29,24,Fallin',Alicia Keys,,False,18,1,29,0.653,0.609,11,-7.519,0,0.037,0.263,0.00101,0.233,0.482,95.982,210200,3
2001-12-29,25,#1,Nelly,,False,22,22,11,0.69,0.592,7,-5.973,1,0.3,0.0236,0,0.56,0.466,179.98,198760,4
2001-12-29,26,In The End,Linkin Park,,False,32,26,9,0.556,0.864,3,-5.87,0,0.0584,0.00958,0,0.209,0.4,105.143,216880,4
2001-12-29,27,Hey Baby,No Doubt Featuring Bounty Killer,,False,36,27,4,0.705,0.872,11,-3.557,0,0.126,0.0618,0,0.227,0.75,93.628,207040,4
2001-12-29,28,Son Of A Gun,"Janet Featuring Missy Elliott, P. Diddy & Carly Simon",,False,29,28,6,0.885,0.765,9,-5.806,0,0.275,0.00844,9.87e-05,0.0981,0.484,104.466,356373,4
2001-12-29,29,Emotion,Destiny's Child,,False,21,10,14,0.412,0.577,7,-4.944,1,0.119,0.163,0,0.0969,0.345,173.675,236400,4
2001-12-29,30,Where Were You (When The World Stopped Turning),Alan Jackson,,False,30,30,6,0.623,0.387,0,-9.537,1,0.0316,0.549,0,0.0764,0.189,115.362,305093,4
2001-12-29,31,It's Been Awhile,Staind,,False,27,5,38,0.509,0.774,6,-4.054,1,0.0338,0.00189,0.000549,0.143,0.0824,116.529,264707,4
2001-12-29,32,Dig In,Lenny Kravitz,,False,31,31,12,0.671,0.921,9,-3.878,1,0.0291,0.0129,0.0235,0.0579,0.825,118.424,217533,4
2001-12-29,33,I Wanna Talk About Me,Toby Keith,,False,28,28,12,0.765,0.87,5,-5.191,1,0.0499,0.168,0,0.125,0.684,106.06,183960,4
2001-12-29,34,Roll Out (My Business),Ludacris,,False,42,34,8,0.921,0.668,7,-8.73,1,0.235,0.0949,0,0.592,0.892,131.059,296587,4
2001-12-29,35,7 Days,Craig David,,False,35,35,4,0.659,0.812,4,-7.499,0,0.0487,0.23,0,0.0951,0.888,83.013,235133,4
2001-12-29,36,Standing Still,Jewel,,False,41,36,7,0.615,0.68,2,-6.616,1,0.0338,0.152,7.18e-06,0.0797,0.34,123.9,270333,4
2001-12-29,37,Run,George Strait,,False,34,34,10,0.544,0.57,2,-10.192,1,0.0326,0.462,0.00183,0.213,0.295,75.59,245427,4
2001-12-29,38,"Lights, Camera, Action!",Mr. Cheeks,,False,38,38,12,0.792,0.93,1,-6.32,1,0.0693,0.115,0,0.292,0.812,105.505,261027,4
2001-12-29,39,Good Morning Beautiful,Steve Holy,,False,43,39,5,0.565,0.5,7,-8.822,1,0.031,0.452,0,0.137,0.242,70.984,210933,4
2001-12-29,40,Hanging By A Moment,Lifehouse,,False,33,2,47,0.541,0.864,1,-4.915,1,0.0357,0.00118,0,0.0896,0.435,124.557,216067,4
2001-12-29,41,Break Ya Neck,Busta Rhymes,,False,44,41,8,0.82,0.809,4,-6.759,0,0.251,0.443,0.00175,0.0613,0.737,83.011,231240,4
2001-12-29,42,Drops Of Jupiter (Tell Me),Train,,False,39,5,42,0.468,0.64,0,-5.862,1,0.0275,0.154,0,0.154,0.499,79.297,259933,4
2001-12-29,43,Riding With Private Malone,David Ball,,False,40,36,10,0.648,0.527,4,-8.862,1,0.0515,0.405,0,0.0978,0.515,93.93,275053,4
2001-12-29,44,I'm Tryin',Trace Adkins,,False,48,44,11,0.555,0.686,1,-4.883,1,0.0287,0.407,0.00972,0.09,0.437,80.057,221560,4
2001-12-29,45,Alive,P.O.D.,,False,53,45,9,0.421,0.95,10,-3.985,1,0.0768,1.21e-05,0.000214,0.314,0.553,80.912,205027,4
2001-12-29,46,Wrapped Up In You,Garth Brooks,,False,49,46,10,0.673,0.575,0,-8.171,1,0.0375,0.384,0.000141,0.0762,0.532,105.293,267297,4
2001-12-29,47,Bouncin' Back (Bumpin' Me Against The Wall),Mystikal,,False,54,47,3,0.883,0.896,0,-3.695,1,0.208,0.268,1.04e-06,0.0564,0.748,93.928,259547,4
2001-12-29,48,Wrapped Around,Brad Paisley,,False,55,48,7,0.616,0.758,9,-8.43,1,0.0434,0.093,0,0.132,0.447,141.495,202933,3
2001-12-29,49,You Gets No Love,Faith Evans,,False,47,38,13,0.749,0.677,5,-3.502,0,0.125,0.211,0,0.196,0.917,96.872,241400,4
2001-12-29,50,Raise Up,Petey Pablo,,False,45,25,21,0.735,0.844,1,-5.215,1,0.167,0.142,0,0.319,0.742,156.069,286427,4
2001-12-29,51,The Whole World,OutKast Featuring Killer Mike,,False,68,51,2,0.814,0.852,2,-6.176,1,0.401,0.0958,1.32e-06,0.0288,0.717,184.682,295347,3
2001-12-29,52,"Girls, Girls, Girls",JAY-Z,,False,37,17,12,0.509,0.952,2,-4.444,0,0.336,0.144,0,0.135,0.7,83.068,275373,4
2001-12-29,53,No More Drama,Mary J. Blige,,False,64,53,3,0.653,0.837,6,-6.818,0,0.124,0.534,7.12e-05,0.0784,0.64,97.914,326240,4
2001-12-29,54,Blurry,Puddle Of Mudd,,False,72,54,2,0.431,0.938,3,-4.507,0,0.0542,0.00805,0,0.138,0.523,157.462,304000,4
2001-12-29,55,Lifetime,Maxwell,,False,52,22,17,0.695,0.454,9,-7.267,1,0.0788,0.307,4.6e-06,0.0727,0.496,127.986,329413,4
2001-12-29,56,Bring On The Rain,Jo Dee Messina With Tim McGraw,,False,57,56,4,0.555,0.372,5,-9.437,1,0.0274,0.31,5.07e-06,0.115,0.0891,136.885,236994,4
2001-12-29,57,Can't Fight The Moonlight,LeAnn Rimes,,False,78,57,24,0.628,0.834,6,-6.341,0,0.0497,0.403,0,0.051,0.626,97.865,215507,4
2001-12-29,58,Everywhere,Michelle Branch,,False,51,12,18,0.523,0.828,1,-4.696,1,0.0762,0.0136,0.000255,0.165,0.476,96.952,214827,4
2001-12-29,59,The World's Greatest,R. Kelly,6QeMRyd3BmSfJbaNay3dpe,True,0,59,1,0.661,0.604,11,-6.436,0,0.0358,0.248,0,0.0469,0.721,95.971,277600,4
2001-12-29,60,Take Away,"Missy ""Misdemeanor"" Elliott Featuring Ginuwine & Tweet",6QeMRyd3BmSfJbaNay3dpe,False,60,60,3,0.824,0.318,9,-10.7,1,0.0637,0.133,0.0625,0.0517,0.523,125.79,276221,4
2001-12-29,61,Brotha,Angie Stone,6QeMRyd3BmSfJbaNay3dpe,False,63,61,8,0.801,0.434,7,-9.174,0,0.376,0.538,0,0.0729,0.661,132.254,268133,4
2001-12-29,62,Young'n (Holla Back),Fabolous,6QeMRyd3BmSfJbaNay3dpe,False,67,62,5,0.933,0.728,7,-5.902,1,0.148,0.326,8.55e-06,0.0717,0.898,108.994,206400,4
2001-12-29,64,I'm A Slave 4 U,Britney Spears,,False,50,27,11,0.847,0.843,5,-3.579,0,0.106,0.415,0.000134,0.107,0.963,110.027,203600,4
2001-12-29,65,Goodbye,Jagged Edge,,False,58,58,7,0.821,0.727,6,-6.262,1,0.105,0.134,2.4e-06,0.0532,0.971,130.0,273020,4
2001-12-29,66,The Long Goodbye,Brooks & Dunn,,False,75,66,2,0.5,0.619,8,-5.939,1,0.0297,0.263,1.42e-05,0.107,0.569,145.367,229987,4
2001-12-29,67,Love Of A Woman,Travis Tritt,,False,59,39,16,0.324,0.574,7,-5.647,1,0.0292,0.239,0,0.143,0.335,74.101,217533,4
2001-12-29,68,Let's Stay Home Tonight,Joe,,False,70,68,2,0.691,0.742,0,-4.49,0,0.0602,0.145,3.14e-05,0.0944,0.722,90.102,206667,4
2001-12-29,69,Wish You Were Here,Incubus,,False,62,60,15,0.246,0.768,9,-7.48,1,0.0387,0.000631,0.301,0.102,0.35,169.873,212733,4
2001-12-29,70,Welcome To Atlanta,Jermaine Dupri & Ludacris,19VTqucnxJuH6kilNdweTh,True,0,70,1,0.751,0.786,3,-7.441,0,0.383,0.0126,0,0.107,0.679,95.989,200840,4
2001-12-29,71,With Me,Lonestar,19VTqucnxJuH6kilNdweTh,False,65,63,10,0.617,0.907,9,-4.983,1,0.0399,0.0597,0,0.136,0.666,112.696,231840,4
2001-12-29,72,Dance With Me,112,19VTqucnxJuH6kilNdweTh,False,66,39,16,0.912,0.511,9,-6.365,1,0.203,0.0259,0,0.0442,0.611,101.628,231800,4
2001-12-29,73,God Bless The USA,Lee Greenwood,19VTqucnxJuH6kilNdweTh,False,69,16,14,0.379,0.407,5,-8.809,1,0.0277,0.0745,0,0.11,0.154,138.445,196520,4
2001-12-29,74,Ain't It Funny,Jennifer Lopez Featuring Ja Rule,5ahFyKndeg1hqfmNumL3WF,True,0,74,1,0.781,0.746,8,-2.686,1,0.17,0.364,0,0.098,0.786,89.43,229800,4
2001-12-29,76,Fade,Staind,,False,71,62,11,0.471,0.846,1,-3.632,1,0.0416,0.00209,0.0369,0.126,0.255,116.469,242600,4
2001-12-29,77,Don't You Forget It,Glenn Lewis,,False,77,77,5,0.708,0.513,6,-7.748,0,0.0888,0.118,0,0.114,0.31,89.0,248773,4
2001-12-29,78,Stuck In A Moment You Can't Get Out Of,U2,,False,73,52,14,0.524,0.644,4,-4.986,1,0.0238,0.391,0.000246,0.168,0.324,158.52,271800,4
2001-12-29,79,Smooth Criminal,Alien Ant Farm,,False,56,23,19,0.653,0.964,9,-4.261,0,0.0582,0.00316,0.00512,0.144,0.87,126.928,209267,4
2001-12-29,80,Drowning,Backstreet Boys,,False,61,28,11,0.568,0.782,6,-5.968,1,0.0396,0.0799,0,0.0985,0.481,141.942,267227,4
2001-12-29,81,Never Too Far/Hero Medley,Mariah Carey,6Yy8ujGSprmqMoYmi2xKxS,True,0,81,1,0.449,0.325,0,-13.61,1,0.0319,0.0617,0.307,0.142,0.217,118.047,287187,4
2001-12-29,82,AM To PM,Christina Milian,6Yy8ujGSprmqMoYmi2xKxS,False,83,27,19,0.872,0.868,10,-3.036,0,0.12,0.153,2.26e-05,0.843,0.822,105.005,231213,4
2001-12-29,83,Where I Come From,Alan Jackson,6Yy8ujGSprmqMoYmi2xKxS,False,80,34,19,0.726,0.631,11,-8.136,0,0.0334,0.22,0,0.193,0.746,124.711,239240,4
2001-12-29,84,Love Of My Life,Brian McKnight,6Yy8ujGSprmqMoYmi2xKxS,False,76,51,16,0.649,0.445,6,-7.13,1,0.029,0.134,7.42e-06,0.116,0.335,123.767,281867,4
2001-12-29,85,Part II,Method Man & Redman,6Yy8ujGSprmqMoYmi2xKxS,False,85,85,2,0.775,0.837,10,-4.965,0,0.39,0.0383,0,0.315,0.807,95.86,244600,4
2001-12-29,86,Control,Puddle Of Mudd,6Yy8ujGSprmqMoYmi2xKxS,False,84,68,12,0.444,0.913,6,-3.452,1,0.0992,0.00308,0,0.38,0.569,163.689,230067,4
2001-12-29,87,Angry All The Time,Tim McGraw,6Yy8ujGSprmqMoYmi2xKxS,False,79,38,20,0.545,0.498,2,-7.286,1,0.0266,0.195,0,0.169,0.363,127.604,270107,4
2001-12-29,88,Ugly,Bubba Sparxxx,6Yy8ujGSprmqMoYmi2xKxS,False,81,15,18,0.755,0.836,6,-5.742,1,0.166,0.32,3.03e-05,0.199,0.696,90.847,265227,4
2001-12-29,89,The Star Spangled Banner,Whitney Houston,6Yy8ujGSprmqMoYmi2xKxS,False,82,6,25,0.179,0.641,8,-6.93,1,0.0439,0.636,0.0303,0.94,0.495,85.378,134920,4
2001-12-29,90,You Rock My World,Michael Jackson,6Yy8ujGSprmqMoYmi2xKxS,False,87,10,17,0.854,0.673,4,-3.132,0,0.185,0.038,0.000227,0.255,0.955,95.0,337733,4
2001-12-29,91,Fatty Girl,"Ludacris, LL Cool J & Keith Murray",6Yy8ujGSprmqMoYmi2xKxS,False,88,87,9,0.775,0.742,6,-5.659,1,0.285,0.034,0,0.0951,0.882,102.19,233760,4
2001-12-29,92,Feelin' On Yo Booty,R. Kelly,6Yy8ujGSprmqMoYmi2xKxS,False,92,36,19,0.737,0.258,10,-7.784,1,0.0528,0.259,2.71e-06,0.101,0.83,61.028,245867,4
2001-12-29,93,Got Ur Self A...,Nas,6Yy8ujGSprmqMoYmi2xKxS,False,93,93,3,0.699,0.869,11,-4.263,0,0.238,0.0118,0,0.0982,0.616,93.612,228627,4
2001-12-29,94,What Am I Gonna Do,Tyrese,6Yy8ujGSprmqMoYmi2xKxS,False,90,71,14,0.69,0.475,10,-4.702,0,0.052,0.275,0,0.0951,0.536,145.597,280000,4
2001-12-29,95,I'm A Survivor,Reba,6Yy8ujGSprmqMoYmi2xKxS,False,86,49,16,0.67,0.627,2,-5.47,1,0.0303,0.278,0,0.104,0.569,88.858,187120,4
2001-12-29,97,What If,Babyface,,False,98,80,15,0.745,0.451,11,-6.314,0,0.112,0.212,0,0.0975,0.481,143.908,246178,4
2001-12-29,98,Round And Round,Jonell & Method Man,,False,96,96,3,0.679,0.732,5,-4.393,0,0.238,0.306,0,0.0946,0.904,90.634,230640,4
2001-12-29,99,God Bless America,Daniel Rodriguez,075DlN1s3ii0KiN9MIXDjW,True,0,99,1,0.16,0.591,8,-3.838,1,0.0381,0.93,0.0379,0.497,0.306,85.364,168147,4
2001-12-29,100,Who We Be,DMX,075DlN1s3ii0KiN9MIXDjW,False,89,60,12,0.723,0.833,7,-4.879,1,0.15,0.123,0,0.272,0.616,82.741,287867,4
