date,position,title,artist,spotify_id,is_new,last_pos,peak_pos,weeks,danceability,energy,key,loudness,mode,speechiness,acousticness,instrumentalness,liveness,valence,tempo,duration_ms,time_signature
1990-07-21,1,She Ain't Worth It,Glenn Medeiros Featuring Bobby Brown,6XYQYOkYSx0efQDjarg6CW,False,2,1,10,0.782,0.881,1,-7.763,1,0.064,0.0418,0,0.125,0.909,102.491,218840,4
1990-07-21,2,Hold On,En Vogue,6XYQYOkYSx0efQDjarg6CW,False,3,2,12,0.728,0.464,1,-11.156,1,0.0605,0.0865,0,0.343,0.383,96.944,304467,4
1990-07-21,3,"Cradle Of Love (From ""Ford Fairlane"")",Billy Idol,6XYQYOkYSx0efQDjarg6CW,False,5,3,12,0.568,0.87,5,-8.02,0,0.045,0.000129,2.44e-05,0.0489,0.599,144.018,280697,4
1990-07-21,4,Rub You The Right Way,Johnny Gill,6XYQYOkYSx0efQDjarg6CW,False,7,4,11,0.66,0.873,10,-6.952,1,0.0461,0.0152,0.00324,0.331,0.864,111.872,332307,4
1990-07-21,5,Vision Of Love,Mariah Carey,6XYQYOkYSx0efQDjarg6CW,False,14,5,8,0.256,0.464,5,-10.959,1,0.0382,0.433,0,0.121,0.355,205.362,209293,3
1990-07-21,6,Step By Step,New Kids On The Block,6XYQYOkYSx0efQDjarg6CW,False,1,1,9,0.787,0.63,0,-12.295,1,0.0609,0.0274,6.69e-06,0.161,0.882,125.347,267293,4
1990-07-21,7,The Power,Snap!,6XYQYOkYSx0efQDjarg6CW,False,9,7,11,0.74,0.88,0,-7.693,1,0.0624,0.0434,0.00803,0.341,0.707,108.899,228994,4
1990-07-21,8,Girls Nite Out,Tyler Collins,6XYQYOkYSx0efQDjarg6CW,False,11,8,13,0.737,0.675,1,-10.027,1,0.0476,0.00012,0.34,0.302,0.577,109.06,237467,4
1990-07-21,9,Enjoy The Silence,Depeche Mode,6XYQYOkYSx0efQDjarg6CW,False,8,8,15,0.641,0.812,0,-7.945,0,0.0293,0.155,4.43e-05,0.078,0.822,112.777,257333,4
1990-07-21,10,When I'm Back On My Feet Again,Michael Bolton,6XYQYOkYSx0efQDjarg6CW,False,13,10,9,0.429,0.326,5,-12.703,1,0.03,0.377,0,0.101,0.185,77.849,228267,4
1990-07-21,11,"It Must Have Been Love (From ""Pretty Woman"")",Roxette,6XYQYOkYSx0efQDjarg6CW,False,6,1,16,0.52,0.652,5,-6.655,1,0.0274,0.34,5.49e-05,0.256,0.722,80.609,258787,4
1990-07-21,12,I'll Be Your Shelter,Taylor Dayne,6XYQYOkYSx0efQDjarg6CW,False,4,4,12,0.692,0.912,0,-5.26,1,0.0353,0.151,0.000217,0.132,0.886,107.388,283040,4
1990-07-21,13,Poison,Bell Biv DeVoe,6XYQYOkYSx0efQDjarg6CW,False,10,3,16,0.84,0.56,6,-10.53,0,0.21,0.00195,0.00417,0.633,0.775,111.815,261853,4
1990-07-21,14,Mentirosa,Mellow Man Ace,6XYQYOkYSx0efQDjarg6CW,False,16,14,11,0.966,0.505,1,-14.762,1,0.111,0.0678,0,0.197,0.826,113.592,258533,4
1990-07-21,15,You Can't Deny It,Lisa Stansfield,6XYQYOkYSx0efQDjarg6CW,False,18,15,9,0.661,0.751,7,-6.734,1,0.107,0.359,8.1e-05,0.118,0.896,100.734,265440,4
1990-07-21,16,"King Of Wishful Thinking (From ""Pretty Woman"")",Go West,6XYQYOkYSx0efQDjarg6CW,False,19,16,10,0.669,0.868,0,-7.377,1,0.0527,0.033,0,0.0991,0.913,107.885,241760,4
1990-07-21,17,Hanky Panky,Madonna,6XYQYOkYSx0efQDjarg6CW,False,25,17,4,0.637,0.626,2,-10.728,1,0.329,0.419,0,0.0543,0.485,169.969,239160,4
1990-07-21,18,If Wishes Came True,Sweet Sensation,6XYQYOkYSx0efQDjarg6CW,False,24,18,6,0.493,0.453,3,-10.878,1,0.0248,0.0944,0.00467,0.1,0.188,143.725,315160,4
1990-07-21,19,Don't Go Away Mad (Just Go Away),Motley Crue,6XYQYOkYSx0efQDjarg6CW,False,21,19,8,0.286,0.958,2,-4.105,0,0.0634,0.00603,0.0118,0.145,0.564,118.264,279867,4
1990-07-21,20,Make You Sweat,Keith Sweat,6XYQYOkYSx0efQDjarg6CW,False,20,20,8,0.649,0.805,7,-10.53,1,0.0455,0.0465,3.51e-06,0.123,0.64,104.968,320507,4
1990-07-21,21,Do You Remember?,Phil Collins,6XYQYOkYSx0efQDjarg6CW,False,12,4,13,0.677,0.509,5,-7.472,1,0.0252,0.114,0.0134,0.0659,0.525,93.042,275987,4
1990-07-21,22,Hold On,Wilson Phillips,6XYQYOkYSx0efQDjarg6CW,False,15,1,19,0.679,0.657,5,-9.897,1,0.0255,0.4,0,0.0497,0.546,97.8,266867,4
1990-07-21,23,Come Back To Me,Janet Jackson,6XYQYOkYSx0efQDjarg6CW,False,30,23,4,0.428,0.409,5,-12.346,0,0.0271,0.626,0.00961,0.138,0.0611,77.906,332742,4
1990-07-21,24,Unskinny Bop,Poison,6XYQYOkYSx0efQDjarg6CW,False,36,24,3,0.574,0.93,1,-2.949,1,0.0413,0.0657,7.78e-06,0.108,0.69,92.303,228067,4
1990-07-21,25,Bad Of The Heart,George LaMond,6XYQYOkYSx0efQDjarg6CW,False,26,25,11,0.625,0.727,1,-11.289,0,0.0482,0.00362,0.000316,0.375,0.789,118.039,257560,4
1990-07-21,26,Jerk Out,The Time,6XYQYOkYSx0efQDjarg6CW,False,32,26,4,0.792,0.897,9,-6.777,0,0.0537,0.0239,0.000999,0.0491,0.9,120.639,409333,4
1990-07-21,27,Epic,Faith No More,6XYQYOkYSx0efQDjarg6CW,False,31,27,5,0.358,0.893,4,-7.486,0,0.12,0.0222,0.0524,0.126,0.262,174.238,293653,4
1990-07-21,28,Could This Be Love,Seduction,6XYQYOkYSx0efQDjarg6CW,False,29,28,7,0.526,0.484,0,-11.302,1,0.0254,0.448,0,0.109,0.276,73.978,380400,4
1990-07-21,29,Do Me!,Bell Biv DeVoe,6XYQYOkYSx0efQDjarg6CW,False,48,29,4,0.716,0.772,10,-6.816,0,0.037,0.134,2.15e-06,0.35,0.671,107.823,272440,4
1990-07-21,30,Ready Or Not,After 7,6XYQYOkYSx0efQDjarg6CW,False,17,7,17,0.733,0.566,8,-12.06,0,0.039,0.0966,0,0.074,0.775,141.94,275827,4
1990-07-21,31,Have You Seen Her,M.C. Hammer,6XYQYOkYSx0efQDjarg6CW,False,46,31,4,0.775,0.378,6,-14.892,0,0.102,0.207,5.3e-06,0.107,0.86,144.16,282800,4
1990-07-21,32,Pure,Lightning Seeds,6XYQYOkYSx0efQDjarg6CW,False,34,32,10,0.617,0.895,4,-3.88,1,0.0293,0.0748,0.0428,0.0736,0.899,123.513,224672,4
1990-07-21,33,Vogue,Madonna,6XYQYOkYSx0efQDjarg6CW,False,23,1,15,0.737,0.88,6,-6.449,1,0.0433,0.00379,0.00351,0.417,0.329,115.998,316813,4
1990-07-21,34,Possession,Bad English,6XYQYOkYSx0efQDjarg6CW,False,37,34,7,0.514,0.603,1,-12.096,0,0.03,0.117,0,0.117,0.371,99.985,308307,4
1990-07-21,35,I Didn't Want To Need You,Heart,6XYQYOkYSx0efQDjarg6CW,False,40,35,5,0.291,0.804,9,-8.329,1,0.0628,0.149,5.23e-06,0.298,0.483,178.046,249533,4
1990-07-21,36,U Can't Touch This,M.C. Hammer,6XYQYOkYSx0efQDjarg6CW,False,22,8,13,0.867,0.517,11,-13.222,0,0.0875,0.00456,0.000339,0.0864,0.866,133.148,257360,4
1990-07-21,37,Across The River,Bruce Hornsby & The Range,6XYQYOkYSx0efQDjarg6CW,False,44,37,5,0.529,0.816,7,-7.075,1,0.0385,0.276,0.0602,0.192,0.825,149.769,309720,4
1990-07-21,38,The Other Side,Aerosmith,6XYQYOkYSx0efQDjarg6CW,False,45,38,5,0.56,0.973,2,-4.345,1,0.0466,0.0613,0.00161,0.394,0.829,126.854,244200,4
1990-07-21,39,Release Me,Wilson Phillips,6XYQYOkYSx0efQDjarg6CW,False,50,39,4,0.724,0.471,0,-11.143,1,0.0358,0.448,2.5e-06,0.218,0.442,97.211,295693,4
1990-07-21,40,My Kinda Girl,Babyface,6XYQYOkYSx0efQDjarg6CW,False,49,40,6,0.711,0.804,4,-7.148,0,0.0445,0.0548,0.000314,0.0732,0.69,99.927,279267,4
1990-07-21,41,Love And Emotion,Stevie B,6XYQYOkYSx0efQDjarg6CW,False,51,41,4,0.552,0.817,6,-10.458,1,0.0831,0.0426,0,0.0855,0.911,200.997,222267,4
1990-07-21,42,The Ballad Of Jayne,L.A. Guns,6XYQYOkYSx0efQDjarg6CW,False,41,33,16,0.474,0.369,6,-14.216,1,0.0296,0.0291,5.86e-05,0.128,0.156,61.207,274107,4
1990-07-21,43,Sending All My Love,Linear,6XYQYOkYSx0efQDjarg6CW,False,35,5,23,0.703,0.517,7,-13.644,1,0.0529,0.000407,0.0969,0.0963,0.768,104.833,234067,4
1990-07-21,44,The Humpty Dance,Digital Underground,6XYQYOkYSx0efQDjarg6CW,False,27,11,19,0.813,0.693,10,-8.0,0,0.266,0.0341,0,0.121,0.618,103.508,391693,4
1990-07-21,45,The Girl I Used To Know,Brother Beyond,6XYQYOkYSx0efQDjarg6CW,False,54,45,5,0.465,0.886,1,-9.477,1,0.0807,4.64e-05,0.0271,0.325,0.954,185.595,254642,4
1990-07-21,47,Talk To Me,Anita Baker,,False,59,47,5,0.462,0.596,7,-8.103,1,0.0435,0.351,0,0.1,0.388,188.181,234467,4
1990-07-21,48,All I Do Is Think Of You,Troop,,False,57,48,3,0.534,0.7,8,-8.71,0,0.0446,0.0143,0,0.197,0.447,122.609,229053,4
1990-07-21,50,Tic-Tac-Toe,Kyper,,False,66,50,4,0.808,0.912,7,-5.277,1,0.149,0.00427,0.0853,0.315,0.402,125.812,383427,4
1990-07-21,51,Bang Bang,Danger Danger,,False,60,51,8,0.605,0.937,2,-7.841,1,0.0621,0.1,0,0.354,0.617,126.978,236933,4
1990-07-21,52,Children Of The Night,Richard Marx,,False,39,13,13,0.425,0.665,5,-8.117,1,0.0292,0.125,0.000201,0.186,0.376,76.369,284173,4
1990-07-21,53,All I Wanna Do Is Make Love To You,Heart,,False,43,2,17,0.626,0.746,7,-8.832,1,0.0282,0.16,0,0.0618,0.8,102.896,310893,4
1990-07-21,54,The Right Combination,Seiko & Donnie Wahlberg,,False,61,54,6,0.458,0.367,9,-10.631,1,0.0267,0.661,0,0.0894,0.167,137.909,271738,4
1990-07-21,55,"Baby, It's Tonight",Jude Cole,,False,47,16,15,0.611,0.815,9,-6.301,1,0.0356,0.0438,3.12e-05,0.154,0.7,120.985,217933,4
1990-07-21,56,Notice Me,Nikki,,False,33,21,13,0.617,0.364,10,-11.926,1,0.0468,0.229,0.873,0.0785,0.863,83.521,288382,4
1990-07-21,57,Club At The End Of The Street,Elton John,,False,42,28,13,0.65,0.755,2,-9.645,1,0.0281,8.12e-05,0.0145,0.326,0.782,124.844,292173,4
1990-07-21,58,"Blaze Of Glory (From ""Young Guns II"")",Jon Bon Jovi,1sUTfgduT0WIQO8kXKXxLC,True,0,58,1,0.55,0.618,7,-9.822,1,0.0307,0.0564,2.62e-05,0.0937,0.429,78.61,335240,4
1990-07-21,59,Cuts Both Ways,Gloria Estefan,1sUTfgduT0WIQO8kXKXxLC,False,67,59,4,0.38,0.309,11,-12.6,1,0.0329,0.649,0,0.0693,0.299,83.717,194333,4
1990-07-21,60,Close To You,Maxi Priest,1sUTfgduT0WIQO8kXKXxLC,False,71,60,4,0.781,0.478,6,-15.427,1,0.0561,0.0849,3.93e-06,0.0877,0.962,95.992,325800,4
1990-07-21,61,The Emperor's New Clothes,Sinead O'Connor,1sUTfgduT0WIQO8kXKXxLC,False,68,61,5,0.736,0.711,3,-7.623,0,0.0503,0.0182,0.000798,0.158,0.709,123.165,316493,4
1990-07-21,62,La Raza,Kid Frost,1sUTfgduT0WIQO8kXKXxLC,False,72,62,3,0.801,0.529,1,-14.875,1,0.0962,0.0406,0.000609,0.0936,0.721,106.965,209067,4
1990-07-21,63,(Can't Live Without Your) Love And Affection,Nelson,1sUTfgduT0WIQO8kXKXxLC,False,80,63,3,0.305,0.363,2,-17.456,1,0.0425,0.992,0.918,0.12,0.965,127.773,161533,4
1990-07-21,64,Nothing Compares 2 U,Sinead O'Connor,1sUTfgduT0WIQO8kXKXxLC,False,58,1,19,0.511,0.574,5,-7.016,1,0.0273,0.0425,2.33e-05,0.105,0.161,119.917,280040,4
1990-07-21,65,How Bad Do You Want It?,Don Henley,1sUTfgduT0WIQO8kXKXxLC,False,75,65,3,0.711,0.879,10,-9.325,1,0.0353,0.208,1.41e-05,0.0494,0.653,118.199,226307,4
1990-07-21,66,Oh Girl,Paul Young,1sUTfgduT0WIQO8kXKXxLC,False,88,66,2,0.57,0.575,9,-7.032,1,0.0318,0.267,0,0.0823,0.421,135.903,216373,4
1990-07-21,67,The Blues,Tony Toni Tone,1sUTfgduT0WIQO8kXKXxLC,False,63,46,8,0.863,0.576,1,-11.204,1,0.0751,0.0467,0,0.277,0.84,101.869,253133,4
1990-07-21,68,Stranger To Love,St. Paul,1sUTfgduT0WIQO8kXKXxLC,False,83,68,3,0.602,0.531,9,-11.086,0,0.0345,0.572,0.000841,0.0772,0.395,125.271,344413,4
1990-07-21,69,Can't Stop Falling Into Love,Cheap Trick,1HSV3wfPeq8fp0uAJ2rZ4Q,True,0,69,1,0.648,0.676,6,-11.587,0,0.0275,0.0535,0,0.0877,0.854,107.647,229680,4
1990-07-21,70,Turtle Power,Partners In Kryme,1HSV3wfPeq8fp0uAJ2rZ4Q,False,62,13,14,0.679,0.94,11,-12.165,0,0.0725,0.034,0,0.0494,0.283,105.216,261600,4
1990-07-21,71,Love Is,Alannah Myles,1HSV3wfPeq8fp0uAJ2rZ4Q,False,56,36,12,0.654,0.924,2,-7.44,1,0.0969,0.00309,0.00231,0.316,0.506,101.154,216107,4
1990-07-21,72,Up All Night,Slaughter,1HSV3wfPeq8fp0uAJ2rZ4Q,False,55,27,13,0.516,0.733,7,-11.341,0,0.0326,0.000373,0.00716,0.258,0.552,98.005,226027,4
1990-07-21,73,Kiss This Thing Goodbye,Del Amitri,1HSV3wfPeq8fp0uAJ2rZ4Q,False,38,35,10,0.687,0.535,7,-13.075,1,0.0327,0.108,0.0108,0.316,0.8,117.316,274507,4
1990-07-21,74,I'm Never Gonna Give You Up,The Brat Pack,1HSV3wfPeq8fp0uAJ2rZ4Q,False,81,74,4,0.61,0.865,8,-8.455,1,0.0405,0.116,0.0682,0.0597,0.832,105.089,311467,4
1990-07-21,75,Nicety,Michel'le,1HSV3wfPeq8fp0uAJ2rZ4Q,False,70,29,15,0.83,0.712,11,-7.447,1,0.0446,0.0105,0.24,0.049,0.814,103.141,211160,4
1990-07-21,76,I'll See You In My Dreams,Giant,1HSV3wfPeq8fp0uAJ2rZ4Q,False,64,20,18,0.412,0.493,2,-12.025,1,0.033,0.0561,0.000441,0.044,0.116,132.779,286707,4
1990-07-21,77,I Melt With You,Modern English,1HSV3wfPeq8fp0uAJ2rZ4Q,False,78,77,12,0.541,0.81,0,-11.745,1,0.0367,0.000975,0.00158,0.0681,0.647,155.582,251573,4
1990-07-21,78,Welcome To The Real World,Jane Child,1HSV3wfPeq8fp0uAJ2rZ4Q,False,53,49,8,0.625,0.721,8,-12.512,0,0.0325,0.00703,1.33e-06,0.317,0.851,104.651,299640,4
1990-07-21,79,"""B"" Girls",Young And Restless,1HSV3wfPeq8fp0uAJ2rZ4Q,False,77,54,12,0.615,0.497,7,-11.913,1,0.439,0.016,0,0.312,0.769,193.762,242107,3
1990-07-21,80,Don't You Come Cryin',Linear,1HSV3wfPeq8fp0uAJ2rZ4Q,False,90,80,2,0.802,0.613,9,-11.686,0,0.0445,0.119,1.1e-06,0.105,0.849,115.614,229773,4
1990-07-21,81,Banned In The U.S.A.,Luke Featuring The 2 Live Crew,3gMPNy3Zh3PVL14Or88bCc,True,0,81,1,0.841,0.51,4,-12.675,1,0.265,0.0233,0,0.327,0.472,115.921,264160,4
1990-07-21,82,Alright,Janet Jackson,3gMPNy3Zh3PVL14Or88bCc,False,65,4,16,0.667,0.893,11,-7.083,1,0.0364,0.1,0.592,0.55,0.963,111.705,386533,4
1990-07-21,83,Don't You Love Me,49-ers,3gMPNy3Zh3PVL14Or88bCc,False,82,78,6,0.622,0.976,6,-7.506,0,0.0568,0.000781,0.00173,0.177,0.885,121.83,191080,4
1990-07-21,85,All Lips N' Hips,Electric Boys,,False,92,85,2,0.561,0.927,7,-9.808,1,0.0586,0.0886,0.0133,0.343,0.11,93.209,264827,4
1990-07-21,86,A Dreams A Dream,Soul II Soul,,False,85,85,4,0.711,0.652,6,-13.49,0,0.0447,0.0269,0.00335,0.0565,0.544,103.258,338867,4
1990-07-21,87,All The Way,Calloway,5bqNu0YfNOZpgl34bcJiFQ,True,0,87,1,0.733,0.781,0,-10.265,1,0.0857,0.0352,0.00793,0.147,0.869,114.181,304200,4
1990-07-21,88,Same Old Look,Jimmy Ryser,5bqNu0YfNOZpgl34bcJiFQ,False,93,88,2,0.608,0.806,7,-6.202,1,0.0278,0.0139,0,0.345,0.719,125.095,252813,4
1990-07-21,89,Ooh La La (I Can't Get Over You),Perfect Gentlemen,5bqNu0YfNOZpgl34bcJiFQ,False,69,10,15,0.645,0.328,7,-11.329,0,0.0275,0.481,0,0.0812,0.296,136.433,286067,4
1990-07-21,90,Summer Vacation,The Party,1jf9JapAI6noZZCQ9JIlia,True,0,90,1,0.884,0.644,1,-13.184,1,0.0913,0.0177,7.28e-06,0.101,0.758,108.277,297936,4
1990-07-21,91,"Doubleback (From ""Back To The Future Part III"")",ZZ Top,1jf9JapAI6noZZCQ9JIlia,False,79,50,10,0.655,0.673,5,-10.187,1,0.0301,0.0698,0.000144,0.372,0.558,123.913,236200,4
1990-07-21,92,Dirty Cash (Money Talks),The Adventures Of Stevie V,3lcUQs5nyrjoHpQR9Vo2aA,True,0,92,1,0.757,0.83,5,-13.169,0,0.0413,0.00129,0.00741,0.0877,0.925,120.883,243133,4
1990-07-21,93,Expression,Salt-N-Pepa,3lcUQs5nyrjoHpQR9Vo2aA,False,84,26,20,0.936,0.571,6,-10.834,1,0.0846,0.0347,2.81e-06,0.101,0.881,107.738,236240,4
1990-07-21,94,Dare To Fall In Love,Brent Bourgeois,3lcUQs5nyrjoHpQR9Vo2aA,False,76,32,13,0.708,0.522,8,-8.247,1,0.0527,0.421,0.913,0.0829,0.522,154.854,246008,4
1990-07-21,95,First True Love,Tiana,3lcUQs5nyrjoHpQR9Vo2aA,False,96,95,2,0.646,0.872,11,-8.586,0,0.0371,0.000761,0.0568,0.105,0.0391,120.093,282053,4
1990-07-21,96,Holy Water,Bad Company,3lcUQs5nyrjoHpQR9Vo2aA,False,97,96,2,0.511,0.727,2,-10.372,1,0.0354,0.0534,1.09e-05,0.24,0.708,166.103,246240,4
1990-07-21,97,Slow Love,Doc Box & B. Fresh,7zFh6rhSiZ0bNVR7t7RDi9,True,0,97,1,0.75,0.637,7,-6.157,1,0.203,0.0431,0,0.433,0.816,81.857,339577,4
1990-07-21,98,What Will I Do,Timmy T.,4eJsGX9rhsU33HVz0hXGLS,True,0,98,1,0.609,0.738,0,-6.624,0,0.0518,0.00481,8.34e-06,0.292,0.928,126.234,248173,4
1990-07-21,99,Counting The Days,Joey Kid,4eJsGX9rhsU33HVz0hXGLS,False,87,70,12,0.654,0.92,6,-12.435,0,0.0604,0.00527,0.000621,0.27,0.718,118.368,233040,4
