date,position,title,artist,spotify_id,is_new,last_pos,peak_pos,weeks,danceability,energy,key,loudness,mode,speechiness,acousticness,instrumentalness,liveness,valence,tempo,duration_ms,time_signature
2017-12-30,1,Perfect,Ed Sheeran,6Za3190Sbw39BBC77WSS1C,False,1,1,16,0.598,0.448,8,-6.312,1,0.0232,0.162,0,0.106,0.168,95.009,263400,3
2017-12-30,2,Rockstar,Post Malone Featuring 21 Savage,6Za3190Sbw39BBC77WSS1C,False,2,1,13,0.585,0.52,5,-6.136,0,0.0712,0.124,7.01e-05,0.131,0.129,159.801,218147,4
2017-12-30,3,Havana,Camila Cabello Featuring Young Thug,6Za3190Sbw39BBC77WSS1C,False,3,2,18,0.765,0.523,2,-4.333,1,0.03,0.184,3.56e-05,0.132,0.394,104.988,217307,4
2017-12-30,4,Gucci Gang,Lil Pump,6Za3190Sbw39BBC77WSS1C,False,4,3,14,0.936,0.523,5,-6.71,1,0.0597,0.239,0,0.117,0.699,119.889,124056,4
2017-12-30,5,Thunder,Imagine Dragons,6Za3190Sbw39BBC77WSS1C,False,5,4,33,0.605,0.822,0,-4.833,1,0.0438,0.00671,0.134,0.147,0.288,167.997,187147,4
2017-12-30,6,MotorSport,"Migos, Nicki Minaj & Cardi B",6Za3190Sbw39BBC77WSS1C,False,15,6,7,0.904,0.518,2,-5.32,1,0.183,0.0305,0,0.325,0.188,137.996,303077,4
2017-12-30,7,Too Good At Goodbyes,Sam Smith,6Za3190Sbw39BBC77WSS1C,False,6,4,14,0.681,0.372,5,-8.237,1,0.0432,0.64,0,0.169,0.476,91.873,201000,4
2017-12-30,8,Bad At Love,Halsey,6Za3190Sbw39BBC77WSS1C,False,8,8,15,0.675,0.751,0,-3.539,1,0.0296,0.0604,0,0.0893,0.612,118.384,181279,4
2017-12-30,9,All I Want For Christmas Is You,Mariah Carey,6Za3190Sbw39BBC77WSS1C,False,11,9,22,0.695,0.652,11,-7.828,0,0.0751,0.000441,5.66e-06,0.0667,0.744,128.024,401680,4
2017-12-30,10,No Limit,G-Eazy Featuring A$AP Rocky & Cardi B,6Za3190Sbw39BBC77WSS1C,False,7,7,14,0.838,0.771,1,-3.791,1,0.244,0.0117,0,0.0853,0.405,175.957,245387,4
2017-12-30,11,Bodak Yellow (Money Moves),Cardi B,6Za3190Sbw39BBC77WSS1C,False,9,1,24,0.926,0.703,11,-6.337,0,0.103,0.0659,0,0.231,0.485,125.022,223713,4
2017-12-30,12,Gummo,6ix9ine,6Za3190Sbw39BBC77WSS1C,False,13,12,5,0.66,0.775,2,-4.926,1,0.172,0.0553,0,0.129,0.635,157.036,157643,4
2017-12-30,13,What Lovers Do,Maroon 5 Featuring SZA,6Za3190Sbw39BBC77WSS1C,False,10,9,16,0.797,0.605,5,-5.123,0,0.0578,0.0827,3.44e-06,0.124,0.448,110.024,199853,4
2017-12-30,14,New Rules,Dua Lipa,6Za3190Sbw39BBC77WSS1C,False,17,14,20,0.762,0.7,9,-6.021,0,0.0694,0.00261,1.56e-05,0.153,0.608,116.073,209320,4
2017-12-30,15,I Get The Bag,Gucci Mane Featuring Migos,6Za3190Sbw39BBC77WSS1C,False,14,11,17,0.89,0.633,11,-5.475,1,0.168,0.0232,0.000343,0.0993,0.425,139.948,233087,4
2017-12-30,16,Let You Down,NF,6Za3190Sbw39BBC77WSS1C,False,22,16,9,0.662,0.714,5,-5.68,0,0.121,0.312,0,0.179,0.464,147.997,212120,4
2017-12-30,17,Feel It Still,Portugal. The Man,6Za3190Sbw39BBC77WSS1C,False,12,4,26,0.801,0.795,1,-5.115,0,0.0504,0.0417,0.000113,0.0717,0.754,79.028,163253,4
2017-12-30,18,Sorry Not Sorry,Demi Lovato,6Za3190Sbw39BBC77WSS1C,False,16,6,23,0.705,0.64,11,-6.928,0,0.225,0.0237,0,0.262,0.887,144.077,203760,4
2017-12-30,19,I Fall Apart,Post Malone,6Za3190Sbw39BBC77WSS1C,False,23,19,12,0.556,0.538,8,-5.408,0,0.0382,0.0689,0,0.196,0.291,143.95,223347,4
2017-12-30,20,Mi Gente,J Balvin & Willy William Featuring Beyonce,6Za3190Sbw39BBC77WSS1C,False,18,3,24,0.76,0.716,11,-6.36,0,0.0817,0.0223,0,0.231,0.469,105.007,209733,4
2017-12-30,21,Wolves,Selena Gomez X Marshmello,6Za3190Sbw39BBC77WSS1C,False,20,20,8,0.725,0.804,11,-4.614,0,0.0422,0.124,0,0.204,0.31,124.996,197993,4
2017-12-30,22,1-800-273-8255,Logic Featuring Alessia Cara & Khalid,6Za3190Sbw39BBC77WSS1C,False,19,3,33,0.62,0.574,5,-7.788,0,0.0479,0.569,0,0.19,0.357,100.023,250173,4
2017-12-30,23,Shape Of You,Ed Sheeran,6Za3190Sbw39BBC77WSS1C,False,25,1,49,0.825,0.652,1,-3.183,0,0.0802,0.581,0,0.0931,0.931,95.977,233713,4
2017-12-30,24,The Way Life Goes,Lil Uzi Vert Featuring Nicki Minaj,6Za3190Sbw39BBC77WSS1C,False,29,24,16,0.703,0.757,1,-3.612,1,0.05,0.617,0,0.106,0.696,82.008,221747,4
2017-12-30,25,Love.,Kendrick Lamar Featuring Zacari,6Za3190Sbw39BBC77WSS1C,False,27,18,25,0.8,0.585,10,-7.343,1,0.0924,0.264,0,0.153,0.779,126.058,213400,4
2017-12-30,26,Him & I,G-Eazy & Halsey,6Za3190Sbw39BBC77WSS1C,False,21,21,2,0.589,0.731,2,-6.343,1,0.0868,0.0534,0,0.308,0.191,87.908,268867,4
2017-12-30,27,Bank Account,21 Savage,6Za3190Sbw39BBC77WSS1C,False,24,12,23,0.884,0.346,8,-8.228,0,0.351,0.0151,7.04e-06,0.0871,0.376,75.016,220307,4
2017-12-30,28,Meant To Be,Bebe Rexha & Florida Georgia Line,6Za3190Sbw39BBC77WSS1C,False,31,28,8,0.643,0.783,10,-6.458,1,0.0856,0.047,0,0.083,0.579,154.084,163870,4
2017-12-30,29,How Long,Charlie Puth,6Za3190Sbw39BBC77WSS1C,False,26,26,10,0.845,0.561,1,-5.253,0,0.0778,0.211,3.49e-06,0.0383,0.811,109.974,200853,4
2017-12-30,30,Silence,Marshmello Featuring Khalid,6Za3190Sbw39BBC77WSS1C,False,33,30,18,0.52,0.761,4,-3.093,1,0.0853,0.256,4.96e-06,0.17,0.286,141.971,180823,4
2017-12-30,31,Despacito,Luis Fonsi & Daddy Yankee Featuring Justin Bieber,6Za3190Sbw39BBC77WSS1C,False,32,1,48,0.653,0.816,2,-4.353,1,0.167,0.228,0,0.0967,0.816,178.085,228827,4
2017-12-30,32,Young Dumb & Broke,Khalid,6Za3190Sbw39BBC77WSS1C,False,28,22,22,0.798,0.539,1,-6.351,1,0.0421,0.199,1.66e-05,0.165,0.394,136.949,202547,4
2017-12-30,33,Believer,Imagine Dragons,6Za3190Sbw39BBC77WSS1C,False,30,4,45,0.776,0.78,10,-4.374,0,0.128,0.0622,0,0.081,0.666,124.949,204347,4
2017-12-30,34,Rockin' Around The Christmas Tree,Brenda Lee,6Za3190Sbw39BBC77WSS1C,False,37,14,20,0.589,0.472,8,-8.749,1,0.0502,0.614,0,0.505,0.898,67.196,126267,4
2017-12-30,35,It's The Most Wonderful Time Of The Year,Andy Williams,6Za3190Sbw39BBC77WSS1C,False,45,35,3,0.24,0.598,7,-8.435,1,0.0369,0.766,0,0.117,0.776,201.629,151933,3
2017-12-30,36,Sky Walker,Miguel Featuring Travis Scott,6Za3190Sbw39BBC77WSS1C,False,35,35,12,0.674,0.506,6,-10.532,1,0.0434,0.173,0,0.0866,0.183,145.965,259333,4
2017-12-30,37,...Ready For It?,Taylor Swift,6Za3190Sbw39BBC77WSS1C,False,43,4,15,0.613,0.764,2,-6.509,1,0.136,0.0527,0,0.197,0.417,160.015,208187,4
2017-12-30,38,The Christmas Song (Merry Christmas To You),Nat King Cole,6Za3190Sbw39BBC77WSS1C,False,42,38,10,0.319,0.21,1,-15.231,1,0.0341,0.92,8.06e-05,0.138,0.209,78.696,192160,4
2017-12-30,39,The Weekend,SZA,6Za3190Sbw39BBC77WSS1C,False,38,37,20,0.4,0.366,8,-9.405,0,0.0597,0.242,0,0.126,0.161,73.313,272187,3
2017-12-30,40,Unforgettable,French Montana Featuring Swae Lee,6Za3190Sbw39BBC77WSS1C,False,34,3,36,0.726,0.769,6,-5.043,1,0.123,0.0293,0.0101,0.104,0.733,97.985,233902,4
2017-12-30,41,A Holly Jolly Christmas,Burl Ives,6Za3190Sbw39BBC77WSS1C,False,47,41,3,0.683,0.375,0,-13.056,1,0.0303,0.579,0,0.076,0.888,140.467,135533,4
2017-12-30,42,Attention,Charlie Puth,6Za3190Sbw39BBC77WSS1C,False,36,5,34,0.775,0.613,3,-4.586,0,0.0542,0.109,2.33e-05,0.134,0.797,100.066,208787,4
2017-12-30,43,That's What I Like,Bruno Mars,6Za3190Sbw39BBC77WSS1C,False,40,1,48,0.853,0.56,1,-4.961,1,0.0406,0.013,0,0.0944,0.86,134.066,206693,4
2017-12-30,44,Last Christmas,Wham!,6Za3190Sbw39BBC77WSS1C,False,0,41,3,0.735,0.478,2,-12.472,1,0.0293,0.189,2.48e-06,0.355,0.947,107.682,262960,4
2017-12-30,45,Ric Flair Drip,Offset & Metro Boomin,6Za3190Sbw39BBC77WSS1C,False,44,44,7,0.88,0.428,9,-8.28,1,0.206,0.149,5.07e-05,0.114,0.333,100.007,172800,4
2017-12-30,46,Plain Jane,A$AP Ferg Featuring Nicki Minaj,6Za3190Sbw39BBC77WSS1C,False,41,41,12,0.797,0.844,11,-5.482,1,0.275,0.0651,0,0.087,0.52,170.142,173600,4
2017-12-30,47,Humble.,Kendrick Lamar,6Za3190Sbw39BBC77WSS1C,False,50,1,37,0.908,0.621,1,-6.638,0,0.102,0.000282,5.39e-05,0.0958,0.421,150.011,177000,4
2017-12-30,48,There's Nothing Holdin' Me Back,Shawn Mendes,6Za3190Sbw39BBC77WSS1C,False,46,6,34,0.866,0.811,11,-4.063,0,0.0553,0.375,0,0.078,0.969,121.995,199440,4
2017-12-30,49,End Game,Taylor Swift Featuring Ed Sheeran & Future,6Za3190Sbw39BBC77WSS1C,False,39,39,4,0.649,0.589,2,-6.237,1,0.0558,0.00845,0,0.108,0.151,159.073,244827,4
2017-12-30,50,Kooda,6ix9ine,6Za3190Sbw39BBC77WSS1C,False,61,50,2,0.885,0.641,1,-4.455,1,0.351,0.175,0,0.234,0.201,91.167,142582,4
2017-12-30,51,Roll In Peace,Kodak Black Featuring XXXTENTACION,6Za3190Sbw39BBC77WSS1C,False,56,51,17,0.747,0.524,10,-6.807,0,0.245,0.0306,0,0.2,0.363,140.053,213132,4
2017-12-30,52,Greatest Love Story,LANCO,6Za3190Sbw39BBC77WSS1C,False,54,45,15,0.669,0.617,10,-8.72,1,0.057,0.401,0,0.119,0.621,147.992,222573,4
2017-12-30,53,Pills And Automobiles,"Chris Brown Featuring Yo Gotti, A Boogie Wit da Hoodie & Kodak Black",6Za3190Sbw39BBC77WSS1C,False,52,46,14,0.82,0.696,7,-4.918,0,0.182,0.119,0,0.232,0.617,144.981,293435,4
2017-12-30,54,Like I Loved You,Brett Young,6Za3190Sbw39BBC77WSS1C,False,62,54,12,0.582,0.568,1,-6.051,1,0.0297,0.196,0,0.0841,0.64,76.025,207187,4
2017-12-30,55,Rubbin Off The Paint,YBN Nahmir,6Za3190Sbw39BBC77WSS1C,False,48,46,6,0.734,0.751,1,-7.26,1,0.285,0.00529,0,0.183,0.56,161.997,159916,4
2017-12-30,56,Let Me Go,Hailee Steinfeld & Alesso Featuring Florida Georgia Line & Watt,6Za3190Sbw39BBC77WSS1C,False,55,53,12,0.664,0.708,8,-4.154,1,0.0474,0.0337,0,0.0841,0.742,103.07,174800,4
2017-12-30,57,What About Us,P!nk,6Za3190Sbw39BBC77WSS1C,False,51,13,19,0.489,0.588,1,-6.177,1,0.0507,0.0285,2.11e-06,0.0906,0.187,113.617,269600,4
2017-12-30,58,Lemon,N*E*R*D & Rihanna,6Za3190Sbw39BBC77WSS1C,False,60,58,6,0.916,0.727,1,-6.556,1,0.0861,0.00214,0.000145,0.118,0.201,94.997,219707,4
2017-12-30,59,Lights Down Low,MAX Featuring gnash,6Za3190Sbw39BBC77WSS1C,False,66,59,10,0.623,0.493,5,-7.727,0,0.0338,0.0632,0,0.104,0.594,81.019,223847,4
2017-12-30,60,I'll Name The Dogs,Blake Shelton,6Za3190Sbw39BBC77WSS1C,False,63,58,14,0.348,0.87,4,-5.86,1,0.137,0.171,4.4e-06,0.202,0.763,83.392,183640,4
2017-12-30,61,Never Be The Same,Camila Cabello,4eWQlBRaTjPPUlzacqEeoQ,True,0,61,1,0.637,0.713,0,-4.333,1,0.0747,0.181,0.000637,0.137,0.243,129.923,226973,4
2017-12-30,62,Candy Paint,Post Malone,4eWQlBRaTjPPUlzacqEeoQ,False,59,59,8,0.664,0.667,4,-5.941,1,0.154,0.64,1.22e-06,0.0753,0.381,180.064,227533,4
2017-12-30,63,Codeine Dreaming,Kodak Black Featuring Lil Wayne,4eWQlBRaTjPPUlzacqEeoQ,False,58,52,3,0.736,0.604,1,-7.357,0,0.222,0.0652,6.43e-05,0.124,0.574,155.007,264532,4
2017-12-30,64,Good Old Days,Macklemore Featuring Kesha,4eWQlBRaTjPPUlzacqEeoQ,False,64,64,8,0.712,0.51,8,-8.162,1,0.0633,0.446,2.46e-05,0.112,0.268,122.964,240507,4
2017-12-30,65,Light It Up,Luke Bryan,4eWQlBRaTjPPUlzacqEeoQ,False,57,57,16,0.608,0.928,6,-2.724,0,0.0883,0.133,0,0.103,0.738,130.012,177306,4
2017-12-30,66,Yours,Russell Dickerson,4eWQlBRaTjPPUlzacqEeoQ,False,67,66,9,0.554,0.722,11,-6.005,1,0.034,0.119,0,0.0861,0.558,134.058,216960,4
2017-12-30,67,Go Legend,Big Sean & Metro Boomin Featuring Travis Scott,3wAI7MIQtTgwcRmwchPZBc,True,0,67,1,0.656,0.564,1,-8.925,0,0.0883,0.0167,1.39e-06,0.165,0.25,150.014,268947,4
2017-12-30,68,When It Rains It Pours,Luke Combs,3wAI7MIQtTgwcRmwchPZBc,False,65,33,20,0.551,0.801,6,-5.069,1,0.0303,0.013,6.03e-06,0.265,0.625,128.027,240760,4
2017-12-30,69,Round Here Buzz,Eric Church,3wAI7MIQtTgwcRmwchPZBc,False,70,68,12,0.638,0.441,2,-9.064,1,0.0347,0.0422,1.33e-05,0.107,0.473,76.078,214627,4
2017-12-30,70,Look What You Made Me Do,Taylor Swift,3wAI7MIQtTgwcRmwchPZBc,False,72,1,17,0.766,0.709,9,-6.471,0,0.123,0.204,1.41e-05,0.126,0.506,128.07,211853,4
2017-12-30,71,Unforgettable,Thomas Rhett,3wAI7MIQtTgwcRmwchPZBc,False,69,47,20,0.661,0.75,7,-5.497,1,0.0314,0.0303,0.000132,0.0849,0.828,130.077,157080,4
2017-12-30,72,Dark Knight Dummo,Trippie Redd Featuring Travis Scott,3YeJXuRSNS5FYwOsDu44kD,True,0,72,1,0.28,0.821,8,-2.864,0,0.111,0.167,0,0.139,0.254,181.444,256163,3
2017-12-30,73,Betrayed,Lil Xan,3YeJXuRSNS5FYwOsDu44kD,False,68,67,5,0.821,0.434,10,-9.194,0,0.118,0.434,0,0.128,0.241,120.012,187173,4
2017-12-30,74,Losing Sleep,Chris Young,3YeJXuRSNS5FYwOsDu44kD,False,77,63,12,0.584,0.621,1,-5.703,1,0.0443,0.0715,1.68e-06,0.389,0.634,92.003,178253,4
2017-12-30,75,Echame La Culpa,Luis Fonsi & Demi Lovato,3YeJXuRSNS5FYwOsDu44kD,False,75,47,4,0.733,0.897,0,-3.652,1,0.0389,0.0391,0,0.117,0.649,96.006,173800,4
2017-12-30,76,Pick It Up,Famous Dex Featuring A$AP Rocky,3YeJXuRSNS5FYwOsDu44kD,False,73,73,5,0.921,0.467,1,-8.443,1,0.119,0.0149,0.000238,0.334,0.287,135.995,191252,4
2017-12-30,77,My Dawg,Lil Baby,7CEJH5Ed7FBbXF6CqBQPlJ,True,0,77,1,0.943,0.544,10,-6.292,0,0.0642,0.0336,0,0.0954,0.515,133.012,215423,4
2017-12-30,78,I Could Use A Love Song,Maren Morris,7CEJH5Ed7FBbXF6CqBQPlJ,False,80,75,17,0.638,0.634,6,-6.474,1,0.0468,0.214,0,0.0866,0.473,92.097,196422,4
2017-12-30,79,MIC Drop,BTS Featuring Desiigner,7CEJH5Ed7FBbXF6CqBQPlJ,False,71,28,3,0.606,0.848,11,-3.952,1,0.184,0.0114,1.06e-06,0.206,0.54,170.01,307676,4
2017-12-30,80,Pull Up N Wreck,Big Sean & Metro Boomin Featuring 21 Savage,7CEJH5Ed7FBbXF6CqBQPlJ,False,0,80,2,0.49,0.44,10,-7.76,1,0.353,0.00806,0.00103,0.186,0.091,173.095,227533,4
2017-12-30,81,Tell Me You Love Me,Demi Lovato,7CEJH5Ed7FBbXF6CqBQPlJ,False,53,53,3,0.705,0.64,11,-6.928,0,0.225,0.0237,0,0.262,0.887,144.077,203760,4
2017-12-30,82,Danger,Migos & Marshmello,0nhVrTiCGiGRCoZOJiWzm1,True,0,82,1,0.814,0.743,9,-2.968,1,0.159,0.152,0,0.163,0.367,107.996,214587,4
2017-12-30,83,You Broke Up With Me,Walker Hayes,0nhVrTiCGiGRCoZOJiWzm1,False,84,83,8,0.847,0.699,0,-8.286,1,0.0733,0.525,0,0.267,0.874,120.002,196667,4
2017-12-30,84,Wanted You,NAV Featuring Lil Uzi Vert,0nhVrTiCGiGRCoZOJiWzm1,False,76,64,5,0.797,0.731,9,-4.443,0,0.0479,0.229,0,0.224,0.623,146.93,228387,4
2017-12-30,85,Dusk Till Dawn,Zayn Featuring Sia,0nhVrTiCGiGRCoZOJiWzm1,False,78,44,14,0.258,0.437,11,-6.593,0,0.039,0.101,1.27e-06,0.106,0.0967,180.043,239000,4
2017-12-30,86,Untouchable,Eminem,6IvespQWGW4USXwexlVKDm,True,0,86,1,0.554,0.887,7,-3.367,1,0.503,0.0803,0,0.15,0.648,172.233,370133,4
2017-12-30,87,Mayores,Becky G Featuring Bad Bunny,6IvespQWGW4USXwexlVKDm,False,83,74,8,0.745,0.836,5,-4.336,0,0.0444,0.145,0.00314,0.116,0.874,96.993,203187,4
2017-12-30,89,Written In The Sand,Old Dominion,,False,88,88,4,0.725,0.438,6,-9.602,1,0.0575,0.593,0,0.0842,0.76,83.984,184080,4
2017-12-30,90,Ghostface Killers,"21 Savage, Offset & Metro Boomin Featuring Travis Scott",,False,81,35,7,0.782,0.436,2,-7.033,1,0.155,0.331,1.3e-05,0.342,0.243,82.994,268933,4
2017-12-30,91,Too Much To Ask,Niall Horan,,False,89,66,8,0.509,0.534,0,-6.521,1,0.0377,0.366,0,0.126,0.222,153.631,223044,4
2017-12-30,92,Marry Me,Thomas Rhett,,False,97,92,2,0.333,0.412,3,-8.633,1,0.029,0.0977,0,0.113,0.474,85.028,205453,4
2017-12-30,93,No Smoke,YoungBoy Never Broke Again,,False,0,93,2,0.658,0.736,9,-6.097,0,0.308,0.113,0,0.0978,0.804,143.966,160000,4
2017-12-30,94,When We,Tank,,False,86,86,4,0.635,0.324,6,-9.51,0,0.0769,0.165,4.18e-06,0.108,0.0741,117.863,309120,4
2017-12-30,95,Five More Minutes,Scotty McCreery,,False,98,95,2,0.494,0.634,7,-4.933,1,0.0282,0.259,1.15e-06,0.109,0.28,156.03,241147,4
2017-12-30,96,Juice,Yo Gotti,,False,93,93,2,0.887,0.568,2,-5.853,1,0.323,0.00171,1.11e-05,0.0812,0.754,162.038,149242,4
2017-12-30,97,All On Me,Devin Dawson,,False,91,91,4,0.634,0.668,5,-5.488,1,0.0291,0.14,0,0.216,0.635,80.989,224627,4
2017-12-30,98,Jocelyn Flores,XXXTENTACION,,False,87,31,16,0.872,0.391,0,-9.144,0,0.242,0.469,4.13e-06,0.297,0.437,134.021,119133,4
2017-12-30,99,Legends,Kelsea Ballerini,,False,0,98,2,0.577,0.727,4,-5.848,1,0.0319,0.0547,0,0.0891,0.24,112.041,244467,4
2017-12-30,100,Faking It,Calvin Harris Featuring Kehlani & Lil Yachty,,False,96,94,4,0.776,0.589,9,-4.543,0,0.115,0.319,0,0.0715,0.668,120.034,240093,4
