date,position,title,artist,spotify_id,is_new,last_pos,peak_pos,weeks,danceability,energy,key,loudness,mode,speechiness,acousticness,instrumentalness,liveness,valence,tempo,duration_ms,time_signature
2011-01-15,1,Firework,Katy Perry,1NghHeg0wE32eBYrQBVQXL,False,2,1,11,0.638,0.826,8,-4.968,1,0.0479,0.139,0,0.0803,0.649,124.072,227880,4
2011-01-15,2,Grenade,Bruno Mars,1NghHeg0wE32eBYrQBVQXL,False,1,1,14,0.706,0.558,2,-7.237,0,0.0593,0.146,0,0.118,0.227,110.443,223253,4
2011-01-15,3,We R Who We R,Ke$ha,1NghHeg0wE32eBYrQBVQXL,False,3,1,10,0.736,0.817,8,-4.9,1,0.0407,0.00987,0.00167,0.117,0.653,119.95,204760,4
2011-01-15,4,What's My Name?,Rihanna Featuring Drake,1NghHeg0wE32eBYrQBVQXL,False,4,1,11,0.689,0.784,2,-2.972,1,0.074,0.182,0,0.0843,0.561,99.954,263173,4
2011-01-15,5,Raise Your Glass,P!nk,1NghHeg0wE32eBYrQBVQXL,False,5,1,13,0.7,0.709,7,-5.006,1,0.0839,0.0048,0,0.0289,0.625,122.019,202960,4
2011-01-15,6,Tonight (I'm Lovin' You),Enrique Iglesias Featuring Ludacris & DJ Frank E,1NghHeg0wE32eBYrQBVQXL,False,7,6,6,0.666,0.877,0,-4.657,0,0.0446,0.0277,1.15e-05,0.142,0.272,125.989,231653,4
2011-01-15,7,The Time (Dirty Bit),The Black Eyed Peas,1NghHeg0wE32eBYrQBVQXL,False,9,4,8,0.816,0.813,6,-7.798,0,0.0664,0.0662,2.77e-06,0.602,0.436,127.979,307640,4
2011-01-15,8,Black And Yellow,Wiz Khalifa,1NghHeg0wE32eBYrQBVQXL,False,6,6,13,0.684,0.834,2,-4.524,0,0.0675,0.0646,0,0.271,0.538,164.02,217667,4
2011-01-15,9,Just The Way You Are,Bruno Mars,1NghHeg0wE32eBYrQBVQXL,False,10,1,24,0.641,0.188,5,-9.954,1,0.0339,0.918,0,0.0857,0.294,109.317,219178,4
2011-01-15,10,Just A Dream,Nelly,1NghHeg0wE32eBYrQBVQXL,False,12,3,20,0.531,0.752,1,-6.161,1,0.0305,0.0421,0,0.12,0.103,89.917,237800,4
2011-01-15,11,Bottoms Up,Trey Songz Featuring Nicki Minaj,1NghHeg0wE32eBYrQBVQXL,False,8,6,21,0.844,0.601,1,-5.283,1,0.157,0.0205,0,0.385,0.331,73.989,242013,4
2011-01-15,12,Only Girl (In The World),Rihanna,1NghHeg0wE32eBYrQBVQXL,False,13,1,17,0.789,0.706,11,-4.233,0,0.0429,0.112,1.71e-05,0.0586,0.638,125.911,235493,4
2011-01-15,13,Dynamite,Taio Cruz,1NghHeg0wE32eBYrQBVQXL,False,16,2,31,0.754,0.804,4,-3.177,1,0.0853,0.00332,0,0.0329,0.818,119.968,203867,4
2011-01-15,14,Like A G6,Far*East Movement Featuring Cataracs & Dev,1NghHeg0wE32eBYrQBVQXL,False,15,1,21,0.435,0.837,3,-8.126,1,0.449,0.00676,0,0.117,0.778,124.913,216893,4
2011-01-15,15,No Hands,Waka Flocka Flame Featuring Roscoe Dash & Wale,1NghHeg0wE32eBYrQBVQXL,False,14,14,17,0.76,0.595,1,-6.366,1,0.0391,0.00544,0,0.241,0.361,131.497,263773,4
2011-01-15,16,DJ Got Us Fallin' In Love,Usher Featuring Pitbull,1NghHeg0wE32eBYrQBVQXL,False,17,4,25,0.663,0.861,7,-3.398,0,0.109,0.0338,0,0.082,0.654,119.963,220800,4
2011-01-15,17,6 Foot 7 Foot,Lil Wayne Featuring Cory Gunz,1NghHeg0wE32eBYrQBVQXL,False,11,9,3,0.365,0.751,2,-5.429,1,0.304,0.000707,0,0.318,0.604,79.119,248587,4
2011-01-15,18,Teenage Dream,Katy Perry,1NghHeg0wE32eBYrQBVQXL,False,21,1,24,0.719,0.798,10,-4.582,1,0.0361,0.0162,2.34e-06,0.134,0.591,120.011,227741,4
2011-01-15,19,Yeah 3X,Chris Brown,1NghHeg0wE32eBYrQBVQXL,False,19,19,10,0.705,0.882,11,-3.201,0,0.0445,0.000369,1.16e-06,0.0934,0.7,130.0,241667,4
2011-01-15,20,Please Don't Go,Mike Posner,1NghHeg0wE32eBYrQBVQXL,False,20,16,15,0.699,0.882,4,-3.896,0,0.0311,0.00296,0.0544,0.13,0.657,120.016,196813,4
2011-01-15,21,Stereo Love,Edward Maya & Vika Jigulina,1NghHeg0wE32eBYrQBVQXL,False,22,16,13,0.773,0.736,9,-5.589,1,0.0383,0.0335,0.0184,0.104,0.212,127.056,184000,4
2011-01-15,22,F**k You! (Forget You),CeeLo Green,1NghHeg0wE32eBYrQBVQXL,False,26,9,19,0.689,0.836,0,-6.058,1,0.0559,0.187,0,0.162,0.749,127.411,223067,4
2011-01-15,23,Coming Home,Diddy - Dirty Money Featuring Skylar Grey,1NghHeg0wE32eBYrQBVQXL,False,18,18,6,0.392,0.839,7,-1.921,1,0.193,0.158,0,0.3,0.232,168.001,238693,4
2011-01-15,24,Animal,Neon Trees,1NghHeg0wE32eBYrQBVQXL,False,24,13,31,0.482,0.833,5,-5.611,1,0.0449,0.000346,0,0.365,0.74,148.039,212293,4
2011-01-15,25,Back To December,Taylor Swift,1NghHeg0wE32eBYrQBVQXL,False,27,6,10,0.529,0.67,2,-4.663,1,0.0303,0.117,0,0.334,0.286,141.893,293027,4
2011-01-15,26,Secrets,OneRepublic,1NghHeg0wE32eBYrQBVQXL,False,28,21,28,0.516,0.764,2,-6.223,1,0.0366,0.0717,0,0.115,0.376,148.021,224693,4
2011-01-15,27,Hey Baby (Drop It To The Floor),Pitbull Featuring T-Pain,1NghHeg0wE32eBYrQBVQXL,False,32,27,14,0.595,0.912,10,-3.428,0,0.0884,0.0434,0,0.259,0.762,128.024,234453,4
2011-01-15,28,Right Above It,Lil Wayne Featuring Drake,1NghHeg0wE32eBYrQBVQXL,False,25,6,20,0.376,0.841,3,-4.348,0,0.356,0.0435,0,0.578,0.463,76.052,271947,4
2011-01-15,29,Whip My Hair,WILLOW,1NghHeg0wE32eBYrQBVQXL,False,23,11,11,0.552,0.98,9,-4.676,0,0.254,0.00159,0.00552,0.438,0.668,162.961,195440,4
2011-01-15,30,Club Can't Handle Me,Flo Rida Featuring David Guetta,1NghHeg0wE32eBYrQBVQXL,False,36,9,27,0.616,0.869,0,-3.911,1,0.0327,0.0283,0,0.064,0.473,127.966,234560,4
2011-01-15,31,Mine,Taylor Swift,1NghHeg0wE32eBYrQBVQXL,False,42,3,22,0.624,0.757,7,-2.94,1,0.0296,0.00265,1.87e-06,0.189,0.658,121.07,230707,4
2011-01-15,32,I Like It,Enrique Iglesias Featuring Pitbull,1NghHeg0wE32eBYrQBVQXL,False,38,4,34,0.646,0.94,10,-2.856,0,0.0838,0.0209,0,0.0691,0.704,129.011,231787,4
2011-01-15,33,If I Die Young,The Band Perry,1NghHeg0wE32eBYrQBVQXL,False,33,19,26,0.606,0.497,4,-6.611,1,0.0277,0.348,0,0.275,0.362,130.739,222773,4
2011-01-15,34,Rocketeer,Far*East Movement Featuring Ryan Tedder,1NghHeg0wE32eBYrQBVQXL,False,39,34,5,0.664,0.845,4,-6.115,0,0.0461,0.181,0,0.267,0.357,96.005,211253,4
2011-01-15,35,Love The Way You Lie,Eminem Featuring Rihanna,1NghHeg0wE32eBYrQBVQXL,False,35,1,28,0.749,0.925,10,-5.034,1,0.227,0.241,0,0.52,0.641,86.989,263373,4
2011-01-15,36,Stuck Like Glue,Sugarland,1NghHeg0wE32eBYrQBVQXL,False,40,17,23,0.702,0.795,1,-4.764,1,0.0568,0.329,0,0.0505,0.836,83.961,247587,4
2011-01-15,37,Love Like Woe,The Ready Set,1NghHeg0wE32eBYrQBVQXL,False,34,27,21,0.697,0.775,10,-4.106,1,0.0636,0.139,0,0.0737,0.822,90.015,200453,4
2011-01-15,38,No Love,Eminem Featuring Lil Wayne,1NghHeg0wE32eBYrQBVQXL,False,29,23,18,0.522,0.932,11,-2.87,1,0.255,0.119,0,0.177,0.33,129.473,299507,4
2011-01-15,39,Right Thru Me,Nicki Minaj,1NghHeg0wE32eBYrQBVQXL,False,37,26,14,0.381,0.683,1,-4.724,1,0.162,0.0869,0.00164,0.168,0.168,162.246,235773,3
2011-01-15,40,Pretty Girl Rock,Keri Hilson,1NghHeg0wE32eBYrQBVQXL,False,31,31,6,0.666,0.87,11,-5.004,0,0.246,0.203,0,0.0851,0.9,160.014,243920,4
2011-01-15,41,Jar Of Hearts,Christina Perri,1NghHeg0wE32eBYrQBVQXL,False,43,34,14,0.349,0.348,3,-6.142,1,0.0316,0.726,0,0.12,0.0886,74.541,246587,4
2011-01-15,42,Felt Good On My Lips,Tim McGraw,1NghHeg0wE32eBYrQBVQXL,False,47,26,9,0.56,0.869,3,-3.804,1,0.0387,0.024,2.94e-06,0.136,0.519,136.001,277400,4
2011-01-15,43,My Kinda Party,Jason Aldean,1NghHeg0wE32eBYrQBVQXL,False,46,39,19,0.41,0.9,0,-4.249,0,0.0656,0.0167,1.09e-05,0.339,0.558,176.962,284960,4
2011-01-15,44,Somewhere With You,Kenny Chesney,1NghHeg0wE32eBYrQBVQXL,False,48,36,9,0.68,0.849,1,-6.475,0,0.0376,0.0862,0.00013,0.174,0.536,111.969,243520,4
2011-01-15,45,Deuces,Chris Brown Featuring Tyga & Kevin McCall,1NghHeg0wE32eBYrQBVQXL,False,44,14,27,0.692,0.736,1,-5.109,1,0.11,0.0324,0,0.0787,0.217,73.987,276560,4
2011-01-15,46,Aston Martin Music,Rick Ross Featuring Drake & Chrisette Michele,1NghHeg0wE32eBYrQBVQXL,False,45,30,14,0.57,0.58,1,-5.547,1,0.21,0.0124,0,0.0498,0.404,171.812,270627,4
2011-01-15,47,Higher,Taio Cruz Featuring Travie McCoy,1NghHeg0wE32eBYrQBVQXL,False,41,41,3,0.528,0.9,8,-4.301,0,0.0759,0.0349,0,0.144,0.558,127.986,188133,4
2011-01-15,48,I Just Had Sex,The Lonely Island Featuring Akon,1NghHeg0wE32eBYrQBVQXL,False,30,30,2,0.615,0.811,6,-4.316,1,0.144,0.0188,0,0.196,0.808,167.995,166560,4
2011-01-15,49,Rhythm of Love,Plain White T's,1NghHeg0wE32eBYrQBVQXL,False,53,49,16,0.531,0.542,8,-7.721,1,0.0432,0.356,0,0.119,0.726,171.878,200200,4
2011-01-15,50,Freak The Freak Out,Victorious Cast Featuring Victoria Justice,1NghHeg0wE32eBYrQBVQXL,False,58,50,3,0.689,0.858,5,-3.185,1,0.061,0.00129,0,0.0988,0.51,140.022,234480,4
2011-01-15,51,Who Are You When I'm Not Looking,Blake Shelton,1NghHeg0wE32eBYrQBVQXL,False,54,51,9,0.412,0.457,4,-9.142,1,0.0288,0.409,0.0187,0.0978,0.202,74.824,187733,4
2011-01-15,52,Don't You Wanna Stay,Jason Aldean With Kelly Clarkson,1NghHeg0wE32eBYrQBVQXL,False,57,52,9,0.445,0.631,11,-4.798,1,0.0304,0.129,0,0.0911,0.152,143.846,256440,4
2011-01-15,53,Who Dat Girl,Flo Rida Featuring Akon,1NghHeg0wE32eBYrQBVQXL,False,59,53,5,0.719,0.616,1,-3.951,1,0.0395,0.00683,3.11e-05,0.0742,0.625,124.963,200880,4
2011-01-15,54,Dog Days Are Over,Florence + The Machine,1NghHeg0wE32eBYrQBVQXL,False,55,21,16,0.492,0.81,7,-5.315,1,0.0847,0.0416,0.00379,0.117,0.245,149.954,251840,4
2011-01-15,55,Down On Me,Jeremih Featuring 50 Cent,1NghHeg0wE32eBYrQBVQXL,False,51,51,8,0.7,0.598,2,-7.783,1,0.114,0.0369,0,0.111,0.594,160.041,228453,4
2011-01-15,56,We No Speak Americano,Yolanda Be Cool & Dcup,1NghHeg0wE32eBYrQBVQXL,False,56,29,16,0.865,0.691,3,-4.845,0,0.0501,0.0305,0.303,0.0964,0.456,124.972,269800,4
2011-01-15,57,Memories,David Guetta Featuring Kid Cudi,1NghHeg0wE32eBYrQBVQXL,False,52,46,13,0.561,0.87,8,-6.103,1,0.343,0.0015,2.82e-06,0.246,0.498,129.98,210093,4
2011-01-15,58,Kush,Dr. Dre Featuring Snoop Dogg & Akon,1NghHeg0wE32eBYrQBVQXL,False,50,34,7,0.444,0.866,7,-6.217,1,0.111,0.000622,4.72e-05,0.105,0.375,94.968,235120,4
2011-01-15,59,Hold My Hand,Michael Jackson Duet With Akon,1NghHeg0wE32eBYrQBVQXL,False,49,39,7,0.433,0.489,1,-11.388,1,0.0366,0.789,0.956,0.273,0.441,180.113,203024,4
2011-01-15,60,Mama's Song,Carrie Underwood,1NghHeg0wE32eBYrQBVQXL,False,63,56,15,0.341,0.659,2,-5.419,1,0.0357,0.442,0,0.096,0.269,79.987,240240,4
2011-01-15,61,Can't Be Friends,Trey Songz,1NghHeg0wE32eBYrQBVQXL,False,60,43,16,0.451,0.586,11,-7.975,0,0.193,0.0665,0,0.171,0.337,171.842,220373,4
2011-01-15,62,Put You In A Song,Keith Urban,1NghHeg0wE32eBYrQBVQXL,False,67,60,14,0.621,0.78,2,-8.502,1,0.0333,0.0174,0,0.0681,0.822,134.022,220387,4
2011-01-15,63,Moment 4 Life,Nicki Minaj Featuring Drake,1NghHeg0wE32eBYrQBVQXL,False,69,63,3,0.475,0.882,11,-3.883,1,0.351,0.406,0,0.241,0.369,98.001,279307,4
2011-01-15,64,Little Lion Man,Mumford & Sons,1NghHeg0wE32eBYrQBVQXL,False,74,61,21,0.517,0.481,5,-8.273,1,0.0272,0.0293,1.79e-05,0.0903,0.461,138.51,246973,4
2011-01-15,65,Waiting For The End,Linkin Park,1NghHeg0wE32eBYrQBVQXL,False,70,65,13,0.487,0.961,4,-4.139,1,0.132,0.0415,1.15e-06,0.553,0.323,170.005,231680,4
2011-01-15,66,Let Me Down Easy,Billy Currington,1NghHeg0wE32eBYrQBVQXL,False,72,62,6,0.606,0.497,1,-5.005,1,0.0278,0.361,0,0.106,0.18,125.059,228493,4
2011-01-15,67,Maybe,Sick Puppies,1NghHeg0wE32eBYrQBVQXL,False,79,66,6,0.437,0.913,7,-4.315,1,0.0972,0.0171,0,0.284,0.537,167.861,206120,4
2011-01-15,68,Voices,Chris Young,1NghHeg0wE32eBYrQBVQXL,False,80,63,9,0.552,0.788,0,-4.112,1,0.0525,0.38,0,0.15,0.641,76.528,186107,4
2011-01-15,69,Fire Flame,Birdman Featuring Lil Wayne,1NghHeg0wE32eBYrQBVQXL,False,64,64,5,0.652,0.7,8,-2.908,0,0.139,0.000679,0,0.184,0.628,148.119,260413,4
2011-01-15,70,More,Usher,1NghHeg0wE32eBYrQBVQXL,False,73,70,4,0.551,0.893,7,-2.628,1,0.0543,0.00166,0,0.348,0.794,125.083,219987,4
2011-01-15,71,Turn On The Radio,Reba,1NghHeg0wE32eBYrQBVQXL,False,82,53,16,0.603,0.859,11,-3.772,1,0.0416,0.026,0,0.224,0.702,123.072,215387,4
2011-01-15,72,Marry Me,Train,1NghHeg0wE32eBYrQBVQXL,False,77,72,7,0.461,0.267,0,-8.514,1,0.0278,0.834,2.03e-05,0.107,0.481,87.918,205453,4
2011-01-15,73,Lay It Down,Lloyd,1NghHeg0wE32eBYrQBVQXL,False,71,64,11,0.527,0.796,1,-5.111,0,0.062,0.017,0,0.0798,0.534,155.99,240107,4
2011-01-15,74,Only Prettier,Miranda Lambert,1NghHeg0wE32eBYrQBVQXL,False,78,61,18,0.389,0.695,8,-2.4,1,0.0348,0.0818,0,0.0698,0.778,167.968,189440,4
2011-01-15,75,Runaway,Kanye West Featuring Pusha T,1NghHeg0wE32eBYrQBVQXL,False,76,12,13,0.374,0.568,1,-3.825,0,0.109,0.219,0.00219,0.513,0.111,84.733,547733,4
2011-01-15,76,This Is Country Music,Brad Paisley,1NghHeg0wE32eBYrQBVQXL,False,65,65,2,0.507,0.669,2,-5.104,1,0.0275,0.126,0.000263,0.111,0.484,88.525,311640,4
2011-01-15,77,A Year Without Rain,Selena Gomez & The Scene,1NghHeg0wE32eBYrQBVQXL,False,75,35,8,0.629,0.806,2,-5.264,0,0.0442,0.0102,1.72e-05,0.112,0.409,119.966,234333,4
2011-01-15,78,Fall For Your Type,Jamie Foxx Featuring Drake,1NghHeg0wE32eBYrQBVQXL,False,62,62,4,0.593,0.393,1,-11.736,1,0.0827,0.394,3.24e-06,0.11,0.193,136.866,269533,4
2011-01-15,79,Big Night,Big Time Rush,3mTyzSoSqh6KJj9p88WHaY,True,0,79,1,0.607,0.733,6,-4.13,0,0.0312,0.000486,1.59e-06,0.313,0.57,140.097,196133,4
2011-01-15,80,Are You Gonna Kiss Me Or Not,Thompson Square,3mTyzSoSqh6KJj9p88WHaY,False,87,80,3,0.485,0.701,8,-3.807,1,0.0288,0.039,0,0.0977,0.613,151.948,184920,4
2011-01-15,81,The Breath You Take,George Strait,3mTyzSoSqh6KJj9p88WHaY,False,92,63,18,0.492,0.383,11,-7.735,0,0.0277,0.752,0.000413,0.119,0.248,132.1,215880,3
2011-01-15,82,Hello World,Lady Antebellum,3mTyzSoSqh6KJj9p88WHaY,False,94,70,8,0.427,0.531,8,-6.985,1,0.0297,0.0555,0.00106,0.0835,0.145,111.079,326107,4
2011-01-15,83,Smoke A Little Smoke,Eric Church,3mTyzSoSqh6KJj9p88WHaY,False,93,78,16,0.77,0.641,10,-6.077,0,0.035,0.0206,0.00023,0.106,0.639,96.98,191333,4
2011-01-15,84,Someone Else Calling You Baby,Luke Bryan,3mTyzSoSqh6KJj9p88WHaY,False,96,75,10,0.498,0.915,8,-3.729,1,0.0662,0.0509,1.36e-06,0.0734,0.353,115.044,229253,4
2011-01-15,85,Marry You,Bruno Mars,3mTyzSoSqh6KJj9p88WHaY,False,86,85,5,0.62,0.832,10,-4.848,1,0.036,0.332,0,0.104,0.481,144.926,230120,4
2011-01-15,86,Make A Movie,Twista Featuring Chris Brown,3mTyzSoSqh6KJj9p88WHaY,False,83,71,8,0.846,0.774,1,-5.131,1,0.0509,0.00752,0,0.207,0.375,120.012,202000,4
2011-01-15,87,Bullets In The Gun,Toby Keith,3mTyzSoSqh6KJj9p88WHaY,False,98,84,9,0.61,0.761,9,-6.022,1,0.0627,0.339,1.88e-05,0.0839,0.433,120.017,256613,4
2011-01-15,88,That's All She Wrote,T.I. Featuring Eminem,3mTyzSoSqh6KJj9p88WHaY,False,68,18,4,0.496,0.785,7,-3.472,1,0.306,0.0328,0,0.0941,0.357,170.02,318360,4
2011-01-15,89,Why Wait,Rascal Flatts,3mTyzSoSqh6KJj9p88WHaY,False,97,48,20,0.612,0.765,2,-4.915,1,0.0404,0.122,0,0.103,0.553,122.021,224840,4
2011-01-15,90,Anything Like Me,Brad Paisley,3mTyzSoSqh6KJj9p88WHaY,False,91,48,18,0.545,0.522,2,-9.241,1,0.0341,0.422,0,0.119,0.446,164.869,268187,4
2011-01-15,91,No BS,Chris Brown,3mTyzSoSqh6KJj9p88WHaY,False,90,81,4,0.426,0.612,1,-6.359,0,0.0567,0.12,0,0.119,0.106,172.171,247933,4
2011-01-15,92,Monster,"Kanye West Featuring Jay-Z, Rick Ross, Bon Iver & Nicki Minaj",3mTyzSoSqh6KJj9p88WHaY,False,100,18,9,0.628,0.692,2,-5.64,1,0.202,0.00244,0.0129,0.668,0.0963,124.887,378893,5
2011-01-15,93,Do The John Wall,Troop 41,3mTyzSoSqh6KJj9p88WHaY,False,81,81,2,0.66,0.925,7,-2.094,1,0.317,0.252,0,0.87,0.576,81.041,263880,4
2011-01-15,94,What Do You Want,Jerrod Niemann,3mTyzSoSqh6KJj9p88WHaY,False,0,90,2,0.555,0.496,4,-10.12,1,0.143,0.657,1.14e-06,0.106,0.543,153.301,214573,4
2011-01-15,95,Shake,Jesse McCartney,3mTyzSoSqh6KJj9p88WHaY,False,89,54,12,0.769,0.824,6,-2.778,1,0.0621,0.0928,0,0.0275,0.938,150.02,188560,4
2011-01-15,96,Check It Out,will.i.am & Nicki Minaj,3mTyzSoSqh6KJj9p88WHaY,False,88,24,15,0.849,0.657,1,-5.124,1,0.0599,0.0601,7.91e-06,0.121,0.741,130.107,252027,4
2011-01-15,97,Roman's Revenge,Nicki Minaj Featuring Eminem,3mTyzSoSqh6KJj9p88WHaY,False,84,56,3,0.809,0.947,10,-2.868,1,0.311,0.518,0,0.345,0.443,112.377,276173,4
2011-01-15,98,A Little Bit Stronger,Sara Evans,5FIp4LrsffxiHLhmmpCbCx,True,0,98,1,0.536,0.65,2,-5.603,1,0.0337,0.282,1.16e-06,0.0876,0.288,147.93,301987,4
2011-01-15,99,Bass Down Low,Dev Featuring The Cataracs,5FIp4LrsffxiHLhmmpCbCx,False,0,74,3,0.798,0.627,0,-8.086,1,0.0602,0.0778,0,0.0472,0.84,113.029,210600,4
2011-01-15,100,Opposite Of Adults,Chiddy Bang,5FIp4LrsffxiHLhmmpCbCx,False,0,90,2,0.674,0.899,9,-5.115,1,0.193,0.011,0,0.327,0.604,95.999,191600,4
