date,position,title,artist,spotify_id,is_new,last_pos,peak_pos,weeks,danceability,energy,key,loudness,mode,speechiness,acousticness,instrumentalness,liveness,valence,tempo,duration_ms,time_signature
2019-08-10,1,Old Town Road,Lil Nas X Featuring Billy Ray Cyrus,3QzAOrNlsabgbMwlZt7TAY,False,1,1,22,0.878,0.619,6,-5.56,1,0.102,0.0533,0,0.113,0.639,136.041,157067,4
2019-08-10,2,Bad Guy,Billie Eilish,3QzAOrNlsabgbMwlZt7TAY,False,2,2,18,0.701,0.425,7,-10.965,1,0.375,0.328,0.13,0.1,0.562,135.128,194088,4
2019-08-10,3,Senorita,Shawn Mendes & Camila Cabello,3QzAOrNlsabgbMwlZt7TAY,False,3,2,6,0.759,0.54,9,-6.039,0,0.0287,0.037,0,0.0945,0.75,116.947,190960,4
2019-08-10,4,Truth Hurts,Lizzo,3QzAOrNlsabgbMwlZt7TAY,False,5,4,13,0.715,0.624,4,-3.046,0,0.114,0.11,0,0.123,0.412,158.087,173325,4
2019-08-10,5,Talk,Khalid,3QzAOrNlsabgbMwlZt7TAY,False,4,3,25,0.901,0.4,0,-8.575,1,0.126,0.051,0,0.0599,0.346,135.984,197573,4
2019-08-10,6,No Guidance,Chris Brown Featuring Drake,3QzAOrNlsabgbMwlZt7TAY,False,11,6,8,0.696,0.454,1,-6.756,0,0.153,0.123,0,0.155,0.136,92.928,260640,4
2019-08-10,7,I Don't Care,Ed Sheeran & Justin Bieber,3QzAOrNlsabgbMwlZt7TAY,False,6,2,12,0.798,0.675,6,-5.041,1,0.0442,0.0912,0,0.0894,0.842,101.956,219947,4
2019-08-10,8,Goodbyes,Post Malone Featuring Young Thug,3QzAOrNlsabgbMwlZt7TAY,False,7,3,4,0.548,0.653,5,-3.875,1,0.081,0.456,0,0.103,0.163,150.068,174853,4
2019-08-10,9,Sucker,Jonas Brothers,3QzAOrNlsabgbMwlZt7TAY,False,8,1,22,0.842,0.734,1,-5.065,0,0.0588,0.0427,0,0.106,0.952,137.958,181027,4
2019-08-10,10,Ran$om,Lil Tecca,3QzAOrNlsabgbMwlZt7TAY,False,19,10,9,0.536,0.715,7,-6.577,1,0.287,0.571,0.000418,0.471,0.391,179.631,60070,4
2019-08-10,11,Sunflower (Spider-Man: Into The Spider-Verse),Post Malone & Swae Lee,3QzAOrNlsabgbMwlZt7TAY,False,9,1,41,0.76,0.479,2,-5.574,1,0.0466,0.556,0,0.0703,0.913,89.911,158040,4
2019-08-10,12,If I Can't Have You,Shawn Mendes,3QzAOrNlsabgbMwlZt7TAY,False,10,2,13,0.69,0.809,2,-4.198,1,0.0603,0.524,0,0.147,0.864,123.912,190800,4
2019-08-10,13,Money In The Grave,Drake Featuring Rick Ross,3QzAOrNlsabgbMwlZt7TAY,False,13,7,7,0.831,0.502,10,-4.045,0,0.046,0.101,0,0.122,0.101,100.541,205427,4
2019-08-10,14,Suge,DaBaby,3QzAOrNlsabgbMwlZt7TAY,False,12,7,18,0.876,0.662,2,-6.482,0,0.426,0.0608,0,0.127,0.844,75.445,163320,4
2019-08-10,15,The Git Up,Blanco Brown,3QzAOrNlsabgbMwlZt7TAY,False,14,14,8,0.847,0.678,9,-8.635,1,0.109,0.0669,0,0.274,0.811,97.984,200594,4
2019-08-10,16,You Need To Calm Down,Taylor Swift,3QzAOrNlsabgbMwlZt7TAY,False,15,2,7,0.771,0.671,2,-5.617,1,0.0553,0.00929,0,0.0637,0.714,85.026,171360,4
2019-08-10,17,"Hey Look Ma, I Made It",Panic! At The Disco,3QzAOrNlsabgbMwlZt7TAY,False,16,16,16,0.577,0.833,5,-3.337,1,0.0695,0.0137,0,0.121,0.58,107.936,169667,4
2019-08-10,18,Someone You Loved,Lewis Capaldi,3QzAOrNlsabgbMwlZt7TAY,False,20,18,12,0.501,0.405,1,-5.679,1,0.0319,0.751,0,0.105,0.446,109.891,182161,4
2019-08-10,19,Dancing With A Stranger,Sam Smith & Normani,3QzAOrNlsabgbMwlZt7TAY,False,17,7,29,0.741,0.52,8,-7.513,1,0.0656,0.45,1.97e-06,0.222,0.347,102.998,171030,4
2019-08-10,20,Wow.,Post Malone,3QzAOrNlsabgbMwlZt7TAY,False,18,2,32,0.829,0.539,11,-7.359,0,0.208,0.136,1.78e-06,0.103,0.388,99.96,149547,4
2019-08-10,21,Beer Never Broke My Heart,Luke Combs,3QzAOrNlsabgbMwlZt7TAY,False,24,21,13,0.538,0.863,1,-4.483,1,0.0481,0.0139,0,0.0874,0.637,77.001,186733,4
2019-08-10,22,Without Me,Halsey,3QzAOrNlsabgbMwlZt7TAY,False,22,1,43,0.752,0.488,6,-7.05,1,0.0705,0.297,9.11e-06,0.0936,0.533,136.041,201661,4
2019-08-10,23,Beautiful People,Ed Sheeran Featuring Khalid,3QzAOrNlsabgbMwlZt7TAY,False,25,19,5,0.64,0.648,5,-8.113,0,0.187,0.124,0,0.0802,0.548,92.977,197867,4
2019-08-10,24,God's Country,Blake Shelton,3QzAOrNlsabgbMwlZt7TAY,False,21,17,18,0.538,0.752,10,-5.106,1,0.0396,0.0608,5.39e-06,0.118,0.217,139.984,205107,4
2019-08-10,25,Happier,Marshmello & Bastille,3QzAOrNlsabgbMwlZt7TAY,False,27,2,50,0.687,0.792,5,-2.749,1,0.0452,0.191,0,0.167,0.671,100.015,214290,4
2019-08-10,26,Speechless,Dan + Shay,3QzAOrNlsabgbMwlZt7TAY,False,30,24,32,0.616,0.438,1,-5.968,1,0.0298,0.356,0,0.24,0.386,135.929,213387,4
2019-08-10,27,Pop Out,Polo G Featuring Lil Tjay,3QzAOrNlsabgbMwlZt7TAY,False,26,11,19,0.772,0.639,1,-7.119,1,0.467,0.15,0,0.0698,0.261,168.112,166560,4
2019-08-10,28,The London,"Young Thug, J. Cole & Travis Scott",3QzAOrNlsabgbMwlZt7TAY,False,23,12,10,0.796,0.586,4,-6.946,0,0.147,0.0247,0,0.132,0.179,97.981,200107,4
2019-08-10,29,Never Really Over,Katy Perry,3QzAOrNlsabgbMwlZt7TAY,False,32,15,9,0.77,0.882,8,-4.792,1,0.0602,0.194,0,0.316,0.385,99.991,223523,4
2019-08-10,30,7 Rings,Ariana Grande,3QzAOrNlsabgbMwlZt7TAY,False,33,1,28,0.778,0.317,1,-10.732,0,0.334,0.592,0,0.0881,0.327,140.048,178627,4
2019-08-10,31,Panini,Lil Nas X,3QzAOrNlsabgbMwlZt7TAY,False,28,16,6,0.717,0.598,5,-5.613,0,0.0809,0.22,0,0.122,0.496,153.905,151040,4
2019-08-10,32,High Hopes,Panic! At The Disco,3QzAOrNlsabgbMwlZt7TAY,False,34,4,52,0.579,0.904,5,-2.729,1,0.0618,0.193,0,0.064,0.681,82.014,190947,4
2019-08-10,33,Sweet But Psycho,Ava Max,3QzAOrNlsabgbMwlZt7TAY,False,31,10,33,0.72,0.706,1,-4.719,1,0.0473,0.0684,0,0.166,0.62,133.002,187436,4
2019-08-10,34,Otro Trago,"Sech, Darell, Nicky Jam, Ozuna & Anuel AA",3QzAOrNlsabgbMwlZt7TAY,False,79,34,8,0.725,0.79,0,-2.331,1,0.197,0.0711,1.14e-06,0.0602,0.763,175.988,287773,4
2019-08-10,35,Whiskey Glasses,Morgan Wallen,3QzAOrNlsabgbMwlZt7TAY,False,35,17,22,0.614,0.68,6,-4.58,1,0.0289,0.369,1.84e-06,0.115,0.707,149.959,234347,4
2019-08-10,36,Shotta Flow,NLE Choppa,3QzAOrNlsabgbMwlZt7TAY,False,36,36,15,0.894,0.511,2,-4.768,1,0.42,0.0251,0,0.14,0.568,120.08,176632,4
2019-08-10,37,Knockin' Boots,Luke Bryan,3QzAOrNlsabgbMwlZt7TAY,False,38,37,14,0.739,0.682,2,-3.728,1,0.205,0.129,0,0.328,0.634,131.983,199382,4
2019-08-10,38,My Type,Saweetie,3QzAOrNlsabgbMwlZt7TAY,False,37,37,5,0.899,0.811,2,-6.294,1,0.258,0.000677,0,0.0672,0.587,105.038,126446,4
2019-08-10,39,Gold Roses,Rick Ross Featuring Drake,1rX5L6pyl3rVWb55D8Cprr,True,0,39,1,0.502,0.633,1,-5.8,1,0.419,0.00991,0,0.389,0.552,83.226,349600,4
2019-08-10,40,How Do You Sleep?,Sam Smith,1rX5L6pyl3rVWb55D8Cprr,False,29,29,2,0.477,0.682,1,-4.931,0,0.0925,0.153,0,0.0763,0.345,110.567,202205,5
2019-08-10,41,Baby,Lil Baby & DaBaby,1rX5L6pyl3rVWb55D8Cprr,False,42,41,2,0.97,0.463,10,-7.259,1,0.366,0.0957,0,0.151,0.46,108.003,142417,4
2019-08-10,42,Cash Shit,Megan Thee Stallion Featuring DaBaby,1rX5L6pyl3rVWb55D8Cprr,False,51,42,6,0.921,0.635,1,-4.904,1,0.416,0.0218,0,0.0946,0.549,130.028,192540,4
2019-08-10,43,All To Myself,Dan + Shay,1rX5L6pyl3rVWb55D8Cprr,False,41,41,13,0.646,0.781,1,-4.616,1,0.0313,0.208,0,0.125,0.565,94.975,169920,4
2019-08-10,44,China,"Anuel AA, Daddy Yankee, Karol G, Ozuna & J Balvin",1rX5L6pyl3rVWb55D8Cprr,False,52,44,2,0.786,0.808,7,-3.702,1,0.0882,0.0846,0.000289,0.0822,0.609,105.027,301714,4
2019-08-10,45,Better,Khalid,1rX5L6pyl3rVWb55D8Cprr,False,43,8,46,0.596,0.552,0,-10.278,0,0.097,0.0765,0.334,0.104,0.112,97.949,229320,4
2019-08-10,46,Rearview Town,Jason Aldean,1rX5L6pyl3rVWb55D8Cprr,False,54,46,10,0.526,0.85,10,-4.47,0,0.0313,0.023,0,0.0948,0.338,141.973,184173,4
2019-08-10,47,Shallow,Lady Gaga & Bradley Cooper,1rX5L6pyl3rVWb55D8Cprr,False,47,1,44,0.572,0.385,7,-6.362,1,0.0308,0.371,0,0.231,0.323,95.799,215733,4
2019-08-10,48,Going Bad,Meek Mill Featuring Drake,1rX5L6pyl3rVWb55D8Cprr,False,45,6,35,0.889,0.496,4,-6.365,0,0.0905,0.259,0,0.252,0.544,86.003,180522,4
2019-08-10,49,Clout,Offset Featuring Cardi B,1rX5L6pyl3rVWb55D8Cprr,False,50,39,17,0.919,0.622,1,-7.384,1,0.0997,0.228,4.24e-06,0.122,0.424,140.022,205803,4
2019-08-10,50,Sicko Mode,Travis Scott,1rX5L6pyl3rVWb55D8Cprr,False,46,1,52,0.834,0.73,8,-3.714,1,0.222,0.00513,0,0.124,0.446,155.008,312820,4
2019-08-10,51,The Ones That Didn't Make It Back Home,Justin Moore,1rX5L6pyl3rVWb55D8Cprr,False,68,51,7,0.537,0.784,3,-4.869,1,0.034,0.0979,0,0.224,0.468,137.995,191018,4
2019-08-10,52,Callaita,Bad Bunny & Tainy,1rX5L6pyl3rVWb55D8Cprr,False,55,52,8,0.61,0.624,2,-4.773,1,0.309,0.6,2.12e-06,0.243,0.244,176.169,250534,4
2019-08-10,53,Worth It,YK Osiris,1rX5L6pyl3rVWb55D8Cprr,False,53,52,24,0.749,0.535,5,-4.054,0,0.0638,0.517,0,0.0942,0.459,124.008,189253,5
2019-08-10,54,Go Loko,"YG, Tyga & Jon Z",1rX5L6pyl3rVWb55D8Cprr,False,56,49,13,0.88,0.67,2,-5.177,1,0.0468,0.325,4.17e-06,0.0662,0.131,101.008,299227,4
2019-08-10,55,One Thing Right,Marshmello & Kane Brown,1rX5L6pyl3rVWb55D8Cprr,False,60,55,6,0.659,0.623,4,-2.253,1,0.0451,0.0667,0,0.582,0.439,88.042,181824,4
2019-08-10,56,Just Us,DJ Khaled Featuring SZA,1rX5L6pyl3rVWb55D8Cprr,False,57,43,11,0.639,0.859,9,-2.758,0,0.147,0.135,0,0.129,0.566,93.132,221379,4
2019-08-10,57,Easier,5 Seconds Of Summer,1rX5L6pyl3rVWb55D8Cprr,False,64,48,10,0.562,0.46,5,-4.173,1,0.259,0.476,0,0.107,0.623,176.055,158099,4
2019-08-10,58,Hot Shower,Chance The Rapper Featuring MadeinTYO & DaBaby,00ko9WaS4jOX1kEk3gvHjf,True,0,58,1,0.899,0.509,9,-8.04,1,0.387,0.00157,0,0.0573,0.599,150.001,225924,4
2019-08-10,59,Some Of It,Eric Church,00ko9WaS4jOX1kEk3gvHjf,False,59,43,10,0.56,0.736,0,-7.306,1,0.0446,0.341,9.81e-06,0.155,0.824,79.843,195147,4
2019-08-10,60,Trampoline,SHAED,00ko9WaS4jOX1kEk3gvHjf,False,67,60,9,0.689,0.412,7,-7.523,0,0.0301,0.488,0.00016,0.0659,0.537,126.754,184060,4
2019-08-10,61,ME!,Taylor Swift Featuring Brendon Urie,00ko9WaS4jOX1kEk3gvHjf,False,58,2,15,0.61,0.83,0,-4.105,1,0.0571,0.033,0,0.118,0.728,182.162,193000,4
2019-08-10,62,Raised On Country,Chris Young,00ko9WaS4jOX1kEk3gvHjf,False,71,62,9,0.572,0.794,2,-3.224,1,0.0455,0.395,0,0.23,0.79,148.095,175595,4
2019-08-10,63,Talk You Out Of It,Florida Georgia Line,00ko9WaS4jOX1kEk3gvHjf,False,65,63,24,0.651,0.708,4,-4.791,1,0.0376,0.582,0,0.0796,0.558,119.964,202920,4
2019-08-10,64,Single Again,Big Sean,7IP0lO9tHfNwBWZ9X6TJ84,True,0,64,1,0.635,0.677,10,-5.548,1,0.0909,0.161,0,0.154,0.253,94.95,213733,4
2019-08-10,65,Call You Mine,The Chainsmokers & Bebe Rexha,7IP0lO9tHfNwBWZ9X6TJ84,False,66,65,9,0.585,0.696,4,-5.6,0,0.0307,0.204,0,0.344,0.522,104.01,217640,4
2019-08-10,66,Press,Cardi B,7IP0lO9tHfNwBWZ9X6TJ84,False,63,16,9,0.888,0.525,1,-5.665,1,0.305,0.029,5.68e-06,0.137,0.243,133.983,143792,4
2019-08-10,67,Time,NF,7IP0lO9tHfNwBWZ9X6TJ84,False,0,67,2,0.677,0.688,0,-4.058,0,0.0633,0.138,0,0.114,0.198,98.049,240429,4
2019-08-10,68,EARFQUAKE,"Tyler, The Creator",7IP0lO9tHfNwBWZ9X6TJ84,False,70,13,11,0.554,0.498,9,-8.866,1,0.0685,0.23,5.98e-06,0.795,0.413,79.635,190067,4
2019-08-10,69,Takeaway,The Chainsmokers & ILLENIUM Featuring Lennon Stella,3g0mEQx3NTanacLseoP0Gw,True,0,69,1,0.528,0.511,3,-8.144,1,0.0324,0.126,0,0.101,0.351,100.1,209880,4
2019-08-10,70,Only Human,Jonas Brothers,3g0mEQx3NTanacLseoP0Gw,False,78,70,7,0.795,0.496,0,-5.883,1,0.0722,0.108,0,0.0645,0.874,94.01,183000,4
2019-08-10,71,Soltera,"Lunay, Daddy Yankee & Bad Bunny",3g0mEQx3NTanacLseoP0Gw,False,74,71,12,0.795,0.783,5,-4.271,1,0.0432,0.361,0,0.437,0.799,92.01,266087,4
2019-08-10,72,Rodeo,Lil Nas X & Cardi B Or Nas,3g0mEQx3NTanacLseoP0Gw,False,73,22,6,0.706,0.679,9,-5.614,1,0.0324,0.139,6.98e-05,0.465,0.657,140.081,158707,4
2019-08-10,73,I Don't Know About You,Chris Lane,3g0mEQx3NTanacLseoP0Gw,False,86,73,4,0.593,0.81,1,-5.733,1,0.0625,0.602,0,0.119,0.712,144.011,207933,4
2019-08-10,74,Hate Me,Ellie Goulding & Juice WRLD,3g0mEQx3NTanacLseoP0Gw,False,82,74,2,0.657,0.768,8,-4.628,1,0.0507,0.108,0,0.144,0.759,75.025,186223,4
2019-08-10,75,It's You,Ali Gatie,3g0mEQx3NTanacLseoP0Gw,False,72,70,7,0.732,0.463,11,-6.972,0,0.0287,0.374,0,0.194,0.397,95.971,212607,4
2019-08-10,76,Lalala,Y2K & bbno$,3g0mEQx3NTanacLseoP0Gw,False,77,68,5,0.843,0.391,2,-7.899,1,0.0845,0.181,0,0.137,0.496,129.972,160627,4
2019-08-10,77,Cross Me,Ed Sheeran Featuring Chance The Rapper & PnB Rock,3g0mEQx3NTanacLseoP0Gw,False,61,25,10,0.746,0.787,4,-6.373,1,0.12,0.214,0,0.0669,0.607,95.005,206187,4
2019-08-10,78,Antisocial,Ed Sheeran & Travis Scott,3g0mEQx3NTanacLseoP0Gw,False,62,37,3,0.716,0.823,5,-5.313,0,0.0495,0.132,0,0.361,0.91,151.957,161747,4
2019-08-10,79,The Archer,Taylor Swift,3g0mEQx3NTanacLseoP0Gw,False,69,69,2,0.292,0.574,0,-9.375,1,0.0401,0.12,0.00569,0.0663,0.166,124.344,211240,4
2019-08-10,80,No Me Conoce,"Jhay Cortez, J Balvin & Bad Bunny",3g0mEQx3NTanacLseoP0Gw,False,83,80,4,0.804,0.786,10,-3.837,0,0.0735,0.144,0,0.0928,0.575,91.992,309120,4
2019-08-10,81,Southbound,Carrie Underwood,3g0mEQx3NTanacLseoP0Gw,False,89,81,3,0.614,0.884,0,-4.019,1,0.0402,0.00122,0,0.077,0.721,100.531,202853,4
2019-08-10,82,Living,Dierks Bentley,54K7AZoGpQklpygKrxZlKN,True,0,82,1,0.517,0.813,1,-6.325,1,0.0558,0.0153,0,0.106,0.444,83.005,222147,4
2019-08-10,83,La La Land,Bryce Vine Featuring YG,54K7AZoGpQklpygKrxZlKN,False,75,75,9,0.774,0.473,1,-5.122,0,0.0569,0.221,0,0.222,0.416,97.953,177253,4
2019-08-10,84,24/7,Meek Mill Featuring Ella Mai,54K7AZoGpQklpygKrxZlKN,False,80,54,17,0.657,0.711,0,-5.355,1,0.374,0.0135,0,0.221,0.368,86.957,221522,4
2019-08-10,85,Leave Me Alone,NF,3EtyEzMpfKSaoVhPunvbRV,True,0,85,1,0.722,0.741,1,-3.72,1,0.19,0.249,0,0.151,0.46,162.11,308652,4
2019-08-10,86,The Search,NF,3EtyEzMpfKSaoVhPunvbRV,False,0,70,2,0.789,0.786,2,-4.788,1,0.297,0.596,0,0.0997,0.39,119.957,248040,4
2019-08-10,87,Before I Let Go,Beyonce,3EtyEzMpfKSaoVhPunvbRV,False,85,65,15,0.713,0.842,6,-5.424,0,0.0984,0.0686,0,0.341,0.435,102.968,240777,4
2019-08-10,89,Daddy,Blueface & Rich The Kid,4hanO6Du5J7QEguNHYZHmw,True,0,89,1,0.869,0.59,11,-8.214,1,0.257,0.07,0,0.236,0.479,107.934,151147,4
2019-08-10,90,Tap,NAV Featuring Meek Mill,4hanO6Du5J7QEguNHYZHmw,False,87,87,8,0.901,0.676,2,-7.033,1,0.251,0.0646,0,0.0863,0.452,85.018,148278,4
2019-08-10,91,Love Ain't,Eli Young Band,4hanO6Du5J7QEguNHYZHmw,False,92,50,16,0.6,0.851,11,-4.645,1,0.0388,0.00566,9.78e-06,0.0891,0.727,98.007,186119,4
2019-08-10,92,MEGATRON,Nicki Minaj,4hanO6Du5J7QEguNHYZHmw,False,100,20,5,0.893,0.641,1,-3.051,1,0.272,0.128,8.06e-05,0.086,0.771,94.017,190747,4
2019-08-10,93,Ballin',Mustard & Roddy Ricch,4hanO6Du5J7QEguNHYZHmw,False,94,93,2,0.809,0.545,7,-6.678,1,0.0735,0.392,0,0.151,0.244,97.008,180435,4
2019-08-10,94,All Day Long,Chance The Rapper Featuring John Legend,1g3ErLqysBJ5EIGdYYMWFZ,True,0,94,1,0.767,0.884,2,-3.674,1,0.161,0.028,0,0.103,0.717,123.01,208238,4
2019-08-10,95,Do You Remember,Chance The Rapper Featuring Death Cab For Cutie,67xBtV07CC73eFw7z5oCvU,True,0,95,1,0.606,0.655,6,-6.328,1,0.402,0.139,0,0.103,0.696,159.824,236686,4
2019-08-10,96,Calma,Pedro Capo X Farruko,67xBtV07CC73eFw7z5oCvU,False,95,71,20,0.826,0.773,11,-4.218,0,0.0524,0.323,0,0.143,0.761,126.899,238200,4
2019-08-10,97,Cool,Jonas Brothers,67xBtV07CC73eFw7z5oCvU,False,84,27,17,0.683,0.598,0,-5.487,1,0.0423,0.00873,0,0.156,0.62,78.969,167107,4
2019-08-10,98,Tip Of My Tongue,Kenny Chesney,67xBtV07CC73eFw7z5oCvU,False,98,83,3,0.669,0.56,5,-5.003,1,0.0251,0.0821,0,0.0703,0.49,95.0,199413,4
2019-08-10,99,What If I Never Get Over You,Lady Antebellum,67xBtV07CC73eFw7z5oCvU,False,0,86,2,0.576,0.724,0,-5.147,1,0.0274,0.016,0,0.107,0.34,93.029,206598,4
2019-08-10,100,Nightmare,Halsey,67xBtV07CC73eFw7z5oCvU,False,81,15,11,0.611,0.622,9,-5.075,0,0.0734,0.0188,0,0.359,0.538,146.11,231999,4
