date,position,title,artist,spotify_id,is_new,last_pos,peak_pos,weeks,danceability,energy,key,loudness,mode,speechiness,acousticness,instrumentalness,liveness,valence,tempo,duration_ms,time_signature
2005-05-07,1,Hollaback Girl,Gwen Stefani,7ANroj1yWw0YEGcLf7HO3Q,False,3,1,6,0.926,0.916,10,-2.221,0,0.0929,0.35,6.17e-06,0.0234,0.904,110.007,199853,4
2005-05-07,2,Hate It Or Love It,The Game Featuring 50 Cent,7ANroj1yWw0YEGcLf7HO3Q,False,2,2,13,0.802,0.785,9,-4.781,1,0.207,0.14,0,0.123,0.435,99.998,206400,4
2005-05-07,3,Candy Shop,50 Cent Featuring Olivia,7ANroj1yWw0YEGcLf7HO3Q,False,1,1,14,0.614,0.574,11,-7.961,1,0.466,0.0253,3.2e-05,0.38,0.755,125.173,209107,5
2005-05-07,4,Lonely,Akon,7ANroj1yWw0YEGcLf7HO3Q,False,4,4,11,0.632,0.533,5,-7.873,0,0.0338,0.351,0,0.236,0.595,90.064,235800,4
2005-05-07,5,Oh,Ciara Featuring Ludacris,7ANroj1yWw0YEGcLf7HO3Q,False,8,5,7,0.8,0.496,7,-7.135,1,0.0506,0.000298,0,0.0697,0.357,128.29,256347,4
2005-05-07,6,Since U Been Gone,Kelly Clarkson,7ANroj1yWw0YEGcLf7HO3Q,False,5,2,21,0.662,0.741,0,-5.406,1,0.0334,0.00165,0.0303,0.114,0.404,131.0,188960,4
2005-05-07,7,Lonely No More,Rob Thomas,7ANroj1yWw0YEGcLf7HO3Q,False,13,7,12,0.551,0.896,9,-3.152,0,0.109,0.033,0,0.0899,0.858,171.79,226640,4
2005-05-07,8,Speed Of Sound,Coldplay,7clUVcSOtkNWa58Gw5RfD4,True,0,8,1,0.514,0.898,11,-6.765,0,0.0577,0.00488,0.0345,0.0746,0.353,123.067,287907,4
2005-05-07,9,Obsession (No Es Amor),Frankie J Featuring Baby Bash,7clUVcSOtkNWa58Gw5RfD4,False,6,3,15,0.649,0.51,8,-8.329,1,0.0432,0.098,0,0.3,0.557,75.039,225293,4
2005-05-07,10,1 Thing,Amerie,7clUVcSOtkNWa58Gw5RfD4,False,10,8,13,0.612,0.961,10,-3.078,0,0.333,0.107,4.17e-05,0.0413,0.867,129.873,238760,5
2005-05-07,11,Boulevard Of Broken Dreams,Green Day,7clUVcSOtkNWa58Gw5RfD4,False,7,2,24,0.496,0.682,8,-4.095,1,0.0294,0.00552,2.94e-05,0.0589,0.474,167.06,262333,4
2005-05-07,12,We Belong Together,Mariah Carey,7clUVcSOtkNWa58Gw5RfD4,False,30,12,4,0.837,0.462,0,-7.89,1,0.0601,0.0339,0,0.09,0.762,139.986,201400,4
2005-05-07,13,Mr. Brightside,The Killers,7clUVcSOtkNWa58Gw5RfD4,False,11,11,13,0.356,0.924,1,-3.74,1,0.0808,0.00101,0,0.0953,0.232,148.017,222587,4
2005-05-07,14,Just A Lil Bit,50 Cent,7clUVcSOtkNWa58Gw5RfD4,False,22,14,7,0.489,0.692,1,-6.672,1,0.41,0.0322,0.00608,0.315,0.527,96.946,237707,4
2005-05-07,15,Disco Inferno,50 Cent,7clUVcSOtkNWa58Gw5RfD4,False,9,3,22,0.925,0.659,3,-4.763,1,0.231,0.206,7.88e-05,0.279,0.71,97.018,214227,4
2005-05-07,16,Slow Down,Bobby Valentino,7clUVcSOtkNWa58Gw5RfD4,False,18,16,10,0.568,0.732,11,-4.896,0,0.103,0.179,4.92e-06,0.401,0.626,186.048,258667,4
2005-05-07,17,Switch,Will Smith,7clUVcSOtkNWa58Gw5RfD4,False,12,12,10,0.877,0.885,1,-4.966,1,0.17,0.007,0.000497,0.557,0.517,102.507,196653,4
2005-05-07,18,Some Cut,Trillville Featuring Cutty,7clUVcSOtkNWa58Gw5RfD4,False,14,14,20,0.9,0.515,1,-6.626,1,0.372,0.00341,0,0.111,0.659,84.995,283455,4
2005-05-07,19,Holiday,Green Day,7clUVcSOtkNWa58Gw5RfD4,False,45,19,5,0.29,0.827,8,-3.451,1,0.0362,0.000659,2.55e-06,0.301,0.45,167.086,493400,4
2005-05-07,20,Goin' Crazy,Natalie,7clUVcSOtkNWa58Gw5RfD4,False,16,13,13,0.6,0.556,1,-7.294,1,0.026,0.624,0.00735,0.0837,0.233,105.957,294093,4
2005-05-07,21,Don't Phunk With My Heart,The Black Eyed Peas,7clUVcSOtkNWa58Gw5RfD4,False,31,21,3,0.241,0.799,7,-3.897,1,0.169,0.527,0.915,0.13,0.267,181.969,199599,5
2005-05-07,22,Karma,Alicia Keys,7clUVcSOtkNWa58Gw5RfD4,False,20,20,24,0.727,0.736,10,-6.203,1,0.0615,0.0743,0.00311,0.0347,0.687,85.1,256000,4
2005-05-07,23,Rich Girl,Gwen Stefani Featuring Eve,7clUVcSOtkNWa58Gw5RfD4,False,15,7,20,0.856,0.754,7,-2.728,0,0.0416,0.0294,1.49e-05,0.206,0.722,98.018,236213,4
2005-05-07,24,Let Me Love You,Mario,7clUVcSOtkNWa58Gw5RfD4,False,17,1,29,0.656,0.578,7,-8.97,0,0.0922,0.235,0,0.118,0.556,94.514,256733,4
2005-05-07,25,"1, 2 Step",Ciara Featuring Missy Elliott,7clUVcSOtkNWa58Gw5RfD4,False,21,2,28,0.805,0.896,7,-2.53,0,0.0414,0.0176,0.00293,0.336,0.776,98.738,231773,4
2005-05-07,26,Sugar (Gimme Some),"Trick Daddy Featuring Ludacris, Lil' Kim & Cee-Lo",7clUVcSOtkNWa58Gw5RfD4,False,26,25,16,0.822,0.673,4,-6.141,0,0.228,0.144,0,0.323,0.85,120.02,245107,4
2005-05-07,27,Caught Up,Usher,7clUVcSOtkNWa58Gw5RfD4,False,19,8,22,0.817,0.806,6,-4.606,1,0.0623,0.027,9e-06,0.119,0.805,110.086,224640,4
2005-05-07,28,U Don't Know Me,T.I.,7clUVcSOtkNWa58Gw5RfD4,False,23,23,16,0.779,0.66,1,-4.854,1,0.17,0.0496,0,0.0825,0.526,83.914,243506,4
2005-05-07,29,Let Me Go,3 Doors Down,7clUVcSOtkNWa58Gw5RfD4,False,33,29,14,0.48,0.863,1,-4.914,0,0.0385,0.0181,0,0.111,0.491,91.972,243053,4
2005-05-07,30,Girlfight,Brooke Valentine Featuring Lil Jon & Big Boi,7clUVcSOtkNWa58Gw5RfD4,False,35,30,10,0.745,0.62,11,-8.24,1,0.148,0.0131,0,0.118,0.603,99.985,234733,4
2005-05-07,31,Number One Spot,Ludacris,7clUVcSOtkNWa58Gw5RfD4,False,24,19,10,0.542,0.946,6,-4.279,1,0.378,0.0346,0,0.323,0.509,146.7,274467,4
2005-05-07,32,Wait (The Whisper Song),Ying Yang Twins,7clUVcSOtkNWa58Gw5RfD4,False,32,30,11,0.933,0.513,7,-13.203,1,0.347,0.00112,0.00248,0.107,0.595,102.017,179160,4
2005-05-07,33,It's Like That,Mariah Carey,7clUVcSOtkNWa58Gw5RfD4,False,27,16,15,0.8,0.633,8,-4.875,0,0.0514,0.0901,0,0.0315,0.836,95.953,203360,4
2005-05-07,34,How We Do,The Game Featuring 50 Cent,7clUVcSOtkNWa58Gw5RfD4,False,25,4,24,0.862,0.648,4,-7.401,0,0.251,0.0455,0,0.0332,0.637,98.012,235533,4
2005-05-07,35,Incomplete,Backstreet Boys,7clUVcSOtkNWa58Gw5RfD4,False,28,28,3,0.437,0.589,4,-4.834,1,0.0331,0.231,0,0.0768,0.165,133.631,239587,4
2005-05-07,36,Truth Is,Fantasia,7clUVcSOtkNWa58Gw5RfD4,False,36,21,16,0.707,0.451,11,-10.38,1,0.0761,0.309,0,0.0524,0.616,73.209,236747,4
2005-05-07,37,Girl,Destiny's Child,7clUVcSOtkNWa58Gw5RfD4,False,37,37,6,0.567,0.747,6,-6.019,0,0.105,0.31,0,0.04,0.556,89.036,224147,4
2005-05-07,38,Breakaway,Kelly Clarkson,7clUVcSOtkNWa58Gw5RfD4,False,34,6,37,0.446,0.701,9,-4.179,0,0.0295,0.0298,8.89e-06,0.0931,0.394,159.958,237000,3
2005-05-07,39,When You Tell Me That You Love Me,American Idol Finalists Season 4,56aPHHyolL6Q6uvl6S4Vrj,True,0,39,1,0.377,0.513,8,-7.139,0,0.0308,0.421,0,0.168,0.122,75.955,224733,4
2005-05-07,40,Collide,Howie Day,56aPHHyolL6Q6uvl6S4Vrj,False,38,38,13,0.636,0.625,11,-7.895,1,0.0277,0.222,5.35e-05,0.119,0.342,93.931,249120,4
2005-05-07,41,Under Pressure,The Used And My Chemical Romance,56aPHHyolL6Q6uvl6S4Vrj,False,54,41,2,0.528,0.897,2,-5.943,1,0.0589,0.00134,0,0.19,0.29,125.009,211733,4
2005-05-07,42,U Already Know,112 Featuring Foxy Brown,56aPHHyolL6Q6uvl6S4Vrj,False,41,39,10,0.694,0.511,8,-9.34,1,0.0449,0.274,0,0.166,0.931,87.014,198880,4
2005-05-07,43,Blue Orchid,The White Stripes,4jU7NPkz4HVnM4hweqNhI1,True,0,43,1,0.481,0.645,10,-8.535,0,0.318,0.0863,6.2e-06,0.332,0.612,151.307,157560,4
2005-05-07,44,Baby I'm Back,Baby Bash Featuring Akon,4jU7NPkz4HVnM4hweqNhI1,False,44,42,11,0.901,0.392,9,-4.414,0,0.105,0.0525,0,0.102,0.761,100.014,219187,4
2005-05-07,45,Beverly Hills,Weezer,4jU7NPkz4HVnM4hweqNhI1,False,29,13,4,0.693,0.823,5,-3.761,1,0.0726,0.0932,0,0.328,0.741,87.904,196093,4
2005-05-07,46,Behind These Hazel Eyes,Kelly Clarkson,4jU7NPkz4HVnM4hweqNhI1,False,65,46,3,0.548,0.889,9,-4.682,1,0.0382,0.00165,0.00109,0.197,0.425,90.048,198973,4
2005-05-07,47,I'm A Hustla,Cassidy,4jU7NPkz4HVnM4hweqNhI1,False,43,43,8,0.727,0.913,8,-5.571,0,0.306,0.283,0,0.527,0.618,90.985,259933,4
2005-05-07,48,Ordinary People,John Legend,4jU7NPkz4HVnM4hweqNhI1,False,40,24,18,0.469,0.132,10,-14.001,1,0.0798,0.928,0,0.0873,0.36,66.989,281467,3
2005-05-07,49,Okay,Nivea Featuring Lil Jon & YoungBloodZ,4jU7NPkz4HVnM4hweqNhI1,False,49,40,20,0.779,0.562,6,-7.031,0,0.0578,0.111,0,0.0968,0.684,86.01,283360,4
2005-05-07,50,O,Omarion,4jU7NPkz4HVnM4hweqNhI1,False,39,27,16,0.742,0.515,0,-6.265,1,0.0405,0.081,0,0.194,0.587,120.086,280707,4
2005-05-07,51,Almost,Bowling For Soup,4jU7NPkz4HVnM4hweqNhI1,False,47,46,12,0.546,0.882,11,-4.019,1,0.0394,0.000784,0,0.186,0.64,139.966,206160,4
2005-05-07,52,Grind With Me,Pretty Ricky,4jU7NPkz4HVnM4hweqNhI1,False,57,52,4,0.7,0.538,1,-5.952,1,0.045,0.000204,0,0.105,0.189,136.518,237733,4
2005-05-07,53,Again,Faith Evans,4jU7NPkz4HVnM4hweqNhI1,False,58,53,7,0.489,0.763,7,-6.077,1,0.24,0.0158,0,0.42,0.362,173.822,198787,4
2005-05-07,54,How Could You,Mario,4jU7NPkz4HVnM4hweqNhI1,False,55,54,8,0.843,0.48,11,-7.031,0,0.143,0.0468,0,0.081,0.743,122.005,236000,4
2005-05-07,55,You And Me,Lifehouse,4jU7NPkz4HVnM4hweqNhI1,False,67,28,12,0.459,0.427,7,-7.734,1,0.0267,0.114,0,0.168,0.354,139.902,195493,3
2005-05-07,56,Mockingbird,Eminem,4jU7NPkz4HVnM4hweqNhI1,False,42,11,19,0.637,0.678,0,-3.798,1,0.266,0.209,0,0.156,0.254,84.039,250760,4
2005-05-07,57,Scars,Papa Roach,4jU7NPkz4HVnM4hweqNhI1,False,60,57,13,0.384,0.921,11,-3.334,1,0.055,0.0948,0,0.168,0.471,89.922,208186,4
2005-05-07,58,Gone,Montgomery Gentry,4jU7NPkz4HVnM4hweqNhI1,False,53,53,14,0.647,0.901,7,-5.138,1,0.0437,0.0172,1.35e-06,0.0527,0.581,118.957,250040,4
2005-05-07,59,Look What You've Done,Jet,4jU7NPkz4HVnM4hweqNhI1,False,48,37,15,0.398,0.547,0,-6.846,1,0.0261,0.414,0.00143,0.146,0.305,73.396,230880,4
2005-05-07,60,Be Yourself,Audioslave,4jU7NPkz4HVnM4hweqNhI1,False,51,32,7,0.423,0.845,11,-3.509,0,0.0559,0.143,5.07e-06,0.213,0.317,116.602,278973,4
2005-05-07,61,Anything But Mine,Kenny Chesney,4jU7NPkz4HVnM4hweqNhI1,False,52,48,13,0.501,0.496,4,-9.469,1,0.0317,0.0337,0,0.0655,0.364,148.06,324920,4
2005-05-07,62,It's Getting Better All The Time,Brooks & Dunn,4jU7NPkz4HVnM4hweqNhI1,False,56,56,13,0.46,0.398,4,-7.993,1,0.0266,0.814,0.000152,0.085,0.153,134.718,254707,4
2005-05-07,63,Homewrecker,Gretchen Wilson,4jU7NPkz4HVnM4hweqNhI1,False,66,63,7,0.502,0.68,4,-5.707,1,0.0322,0.0415,3.7e-06,0.362,0.381,148.608,205973,4
2005-05-07,64,Still Tippin',Mike Jones Featuring Slim Thug & Paul Wall,4jU7NPkz4HVnM4hweqNhI1,False,64,60,8,0.86,0.861,6,-7.131,0,0.307,0.0361,4.07e-05,0.113,0.79,143.184,271053,4
2005-05-07,65,Making Memories Of Us,Keith Urban,4jU7NPkz4HVnM4hweqNhI1,False,75,65,3,0.687,0.454,4,-9.379,1,0.0255,0.614,0.000107,0.107,0.331,103.93,236000,4
2005-05-07,66,Sunday Morning,Maroon 5,4jU7NPkz4HVnM4hweqNhI1,False,63,31,18,0.443,0.772,0,-5.066,1,0.067,0.0851,0,0.0566,0.794,87.825,243080,4
2005-05-07,67,If Heaven,Andy Griggs,4jU7NPkz4HVnM4hweqNhI1,False,69,67,13,0.523,0.365,4,-8.977,1,0.0276,0.548,1.2e-05,0.133,0.256,144.871,210973,4
2005-05-07,68,My Give A Damn's Busted,Jo Dee Messina,4jU7NPkz4HVnM4hweqNhI1,False,74,68,12,0.665,0.874,2,-4.082,1,0.0308,0.143,1.05e-05,0.251,0.766,103.98,198960,4
2005-05-07,69,Breathe (2 AM),Anna Nalick,4jU7NPkz4HVnM4hweqNhI1,False,92,69,2,0.386,0.452,2,-7.715,1,0.0278,0.417,0,0.0881,0.287,169.837,279827,3
2005-05-07,70,Songs About Me,Trace Adkins,4jU7NPkz4HVnM4hweqNhI1,False,73,70,7,0.582,0.901,0,-3.044,1,0.0571,0.00545,0,0.117,0.391,117.943,204533,4
2005-05-07,71,That's What I Love About Sunday,Craig Morgan,4jU7NPkz4HVnM4hweqNhI1,False,62,51,14,0.6,0.56,8,-6.311,1,0.0325,0.479,0,0.111,0.417,139.469,201493,4
2005-05-07,72,Signs,Snoop Dogg Featuring Charlie Wilson & Justin Timberlake,4jU7NPkz4HVnM4hweqNhI1,False,59,46,12,0.934,0.706,7,-5.317,1,0.178,0.0305,0.000121,0.136,0.614,112.962,236480,4
2005-05-07,73,Chariot,Gavin DeGraw,4jU7NPkz4HVnM4hweqNhI1,False,80,73,4,0.281,0.779,7,-5.104,1,0.0514,0.0437,0,0.37,0.344,167.172,239173,4
2005-05-07,74,Lot Of Leavin' Left To Do,Dierks Bentley,4jU7NPkz4HVnM4hweqNhI1,False,79,74,6,0.578,0.878,11,-3.434,1,0.0287,0.00112,0.0146,0.6,0.693,118.029,272627,4
2005-05-07,75,The Hand That Feeds,Nine Inch Nails,4jU7NPkz4HVnM4hweqNhI1,False,76,31,5,0.587,0.99,0,-4.496,1,0.0783,0.0172,0.000668,0.104,0.486,127.992,211680,4
2005-05-07,76,Nothin' To Lose,Josh Gracin,4jU7NPkz4HVnM4hweqNhI1,False,68,39,16,0.607,0.876,7,-4.117,1,0.0382,0.371,0,0.519,0.886,121.043,156893,4
2005-05-07,77,What's A Guy Gotta Do,Joe Nichols,4jU7NPkz4HVnM4hweqNhI1,False,77,77,10,0.625,0.966,5,-3.908,1,0.0668,0.609,8.89e-05,0.0667,0.929,170.194,141947,4
2005-05-07,78,Honkytonk U,Toby Keith,4jU7NPkz4HVnM4hweqNhI1,False,70,61,11,0.64,0.762,9,-4.358,1,0.0275,0.0432,5.28e-05,0.331,0.545,113.014,214107,4
2005-05-07,79,Get Right,Jennifer Lopez,4jU7NPkz4HVnM4hweqNhI1,False,72,12,16,0.741,0.759,0,-5.096,0,0.12,0.0218,0,0.628,0.362,97.084,225533,4
2005-05-07,80,E-Pro,Beck,4jU7NPkz4HVnM4hweqNhI1,False,78,65,7,0.624,0.959,11,-6.253,0,0.0769,0.00133,0.171,0.101,0.69,95.794,202360,4
2005-05-07,81,"Sitting, Waiting, Wishing",Jack Johnson,4jU7NPkz4HVnM4hweqNhI1,False,82,66,10,0.765,0.535,0,-7.229,1,0.0265,0.22,2.55e-05,0.104,0.548,105.019,183720,4
2005-05-07,82,B.Y.O.B.,System Of A Down,4jU7NPkz4HVnM4hweqNhI1,False,83,70,4,0.556,0.981,1,-2.688,0,0.128,0.00662,0,0.218,0.716,101.423,255467,4
2005-05-07,83,You'll Be There,George Strait,4jU7NPkz4HVnM4hweqNhI1,False,84,83,3,0.583,0.481,4,-8.822,1,0.0276,0.264,0,0.119,0.172,98.909,257493,4
2005-05-07,84,MJB Da MVP,Mary J. Blige Featuring The Game & 50 Cent,4jU7NPkz4HVnM4hweqNhI1,False,86,84,2,0.745,0.739,1,-4.461,0,0.083,0.131,1.23e-06,0.101,0.481,100.002,201213,4
2005-05-07,85,So Much More,Fat Joe,4jU7NPkz4HVnM4hweqNhI1,False,81,81,4,0.599,0.791,1,-5.987,1,0.294,0.006,0,0.0552,0.708,97.628,238376,4
2005-05-07,86,Fast Cars And Freedom,Rascal Flatts,0CKba2KBPP9TFbh5Nf8i4P,True,0,86,1,0.616,0.824,3,-4.842,0,0.03,0.0135,2.13e-05,0.108,0.623,117.954,262187,4
2005-05-07,87,Drugs Or Jesus,Tim McGraw,0CKba2KBPP9TFbh5Nf8i4P,False,90,87,7,0.498,0.673,0,-4.589,1,0.0268,0.303,4.01e-05,0.0943,0.278,146.943,279933,4
2005-05-07,88,Hold You Down,Jennifer Lopez Featuring Fat Joe,0CKba2KBPP9TFbh5Nf8i4P,False,71,64,8,0.674,0.485,10,-12.443,1,0.32,0.00717,0,0.106,0.527,85.265,272733,4
2005-05-07,89,Free Yourself,Fantasia,0CKba2KBPP9TFbh5Nf8i4P,False,100,89,2,0.717,0.449,5,-9.688,0,0.0596,0.681,0,0.0902,0.611,108.802,257427,4
2005-05-07,90,Cater 2 U,Destiny's Child,0CKba2KBPP9TFbh5Nf8i4P,False,95,90,2,0.605,0.584,11,-7.043,0,0.197,0.286,0,0.235,0.464,125.802,245400,4
2005-05-07,91,All Because Of You,Marques Houston Featuring Young Rome,43PXNweF6u0LS9N6czAY0M,True,0,91,1,0.448,0.875,1,-6.383,0,0.108,0.00876,0,0.653,0.683,169.898,212013,4
2005-05-07,92,Happy?,Mudvayne,43PXNweF6u0LS9N6czAY0M,False,89,89,2,0.546,0.971,5,-2.661,0,0.0965,0.000823,2.11e-05,0.275,0.383,100.078,216427,4
2005-05-07,93,La Camisa Negra,Juanes,43PXNweF6u0LS9N6czAY0M,False,91,91,5,0.749,0.727,6,-4.423,0,0.031,0.0868,0,0.0541,0.973,97.015,216867,4
2005-05-07,94,I'll Take That As A Yes (The Hot Tub Song),Phil Vassar,43PXNweF6u0LS9N6czAY0M,False,96,94,2,0.653,0.76,7,-3.774,1,0.0284,0.0533,0,0.505,0.59,91.845,206147,4
2005-05-07,95,Don't Cha,The Pussycat Dolls Featuring Busta Rhymes,1gZ7i4qxXkHZb1r6eioaAP,True,0,95,1,0.877,0.637,1,-3.493,0,0.101,0.00516,2.5e-06,0.0959,0.569,119.988,272080,4
2005-05-07,96,Jerk It Out,Caesars,1gZ7i4qxXkHZb1r6eioaAP,False,93,70,10,0.58,0.981,8,-2.603,0,0.06,0.0171,1.07e-05,0.386,0.861,134.007,195667,4
2005-05-07,97,Class Reunion (That Used To Be Us),Lonestar,1gZ7i4qxXkHZb1r6eioaAP,False,99,97,2,0.589,0.872,7,-2.626,1,0.029,0.0151,2.99e-06,0.0577,0.524,116.986,272347,4
2005-05-07,98,La Tortura,Shakira Feat. Alejandro Sanz,5BSclXJTa9B0iURhUjZo50,True,0,98,1,0.74,0.783,0,-5.367,1,0.0427,0.0297,0.000308,0.123,0.812,100.011,212893,4
2005-05-07,99,Give Me That,Webbie Featuring Bun B,2s9NvnrAU9WahyWRa0Ou9m,True,0,99,1,0.62,0.782,8,-6.034,1,0.363,0.00687,0,0.319,0.54,156.109,267520,4
2005-05-07,100,Trapped In The Closet,R. Kelly,45LrQ3tg1z8plpuQRCuSwE,True,0,100,1,0.551,0.583,4,-6.473,1,0.159,0.539,0,0.365,0.419,107.424,992160,4
