date,position,title,artist,spotify_id,is_new,last_pos,peak_pos,weeks,danceability,energy,key,loudness,mode,speechiness,acousticness,instrumentalness,liveness,valence,tempo,duration_ms,time_signature
2014-06-28,1,Fancy,Iggy Azalea Featuring Charli XCX,2dgFqylK6gyILa4HY65u0y,False,1,1,15,0.912,0.716,10,-4.141,0,0.0697,0.0904,0,0.0491,0.377,94.981,199938,4
2014-06-28,2,Problem,Ariana Grande Featuring Iggy Azalea,2dgFqylK6gyILa4HY65u0y,False,2,2,7,0.66,0.805,1,-5.352,0,0.153,0.0192,8.83e-06,0.159,0.625,103.008,193920,4
2014-06-28,3,Rude,MAGIC!,2dgFqylK6gyILa4HY65u0y,False,7,3,8,0.774,0.756,1,-4.995,1,0.0389,0.0423,0,0.305,0.931,144.032,224840,4
2014-06-28,4,All Of Me,John Legend,2dgFqylK6gyILa4HY65u0y,False,3,1,36,0.422,0.264,8,-7.064,1,0.0322,0.922,0,0.132,0.331,119.93,269560,4
2014-06-28,5,Wiggle,Jason Derulo Featuring Snoop Dogg,2dgFqylK6gyILa4HY65u0y,False,5,5,7,0.697,0.621,9,-6.886,0,0.25,0.0802,0,0.162,0.721,81.946,193296,4
2014-06-28,6,Turn Down For What,DJ Snake & Lil Jon,2dgFqylK6gyILa4HY65u0y,False,4,4,25,0.818,0.799,1,-4.1,0,0.156,0.00107,0.128,0.057,0.0815,100.014,213733,4
2014-06-28,7,Am I Wrong,Nico & Vinz,2dgFqylK6gyILa4HY65u0y,False,8,6,9,0.729,0.675,8,-6.003,1,0.0312,0.175,1.58e-06,0.55,0.779,119.968,245867,4
2014-06-28,8,Happy,Pharrell Williams,2dgFqylK6gyILa4HY65u0y,False,6,1,24,0.647,0.822,5,-4.662,0,0.183,0.219,0,0.0908,0.962,160.019,232720,4
2014-06-28,9,Summer,Calvin Harris,2dgFqylK6gyILa4HY65u0y,False,9,9,13,0.596,0.856,4,-3.556,0,0.0346,0.0211,0.0178,0.141,0.743,127.949,222533,4
2014-06-28,10,Stay With Me,Sam Smith,2dgFqylK6gyILa4HY65u0y,False,10,10,10,0.418,0.42,0,-6.444,1,0.0414,0.588,6.39e-05,0.11,0.184,84.094,172724,4
2014-06-28,11,Dark Horse,Katy Perry Featuring Juicy J,2dgFqylK6gyILa4HY65u0y,False,11,1,39,0.645,0.585,6,-6.122,1,0.0513,0.00314,0,0.165,0.353,131.931,215672,4
2014-06-28,12,Ain't It Fun,Paramore,2dgFqylK6gyILa4HY65u0y,False,13,10,16,0.61,0.893,9,-3.681,1,0.0921,0.154,4.41e-05,0.021,0.673,104.031,296520,4
2014-06-28,13,Not A Bad Thing,Justin Timberlake,2dgFqylK6gyILa4HY65u0y,False,12,8,16,0.308,0.563,0,-9.169,1,0.0719,0.527,4.58e-06,0.134,0.109,85.901,688453,4
2014-06-28,14,Latch,Disclosure Featuring Sam Smith,2dgFqylK6gyILa4HY65u0y,False,17,14,13,0.729,0.735,1,-5.455,1,0.0919,0.0178,0.000193,0.089,0.544,121.986,255867,4
2014-06-28,15,Talk Dirty,Jason Derulo Featuring 2 Chainz,2dgFqylK6gyILa4HY65u0y,False,14,3,26,0.76,0.652,6,-7.321,1,0.232,0.0348,0,0.307,0.759,100.315,177685,4
2014-06-28,16,Sing,Ed Sheeran,2dgFqylK6gyILa4HY65u0y,False,16,13,10,0.818,0.67,8,-4.451,0,0.0472,0.304,1.22e-06,0.0601,0.939,119.988,235382,4
2014-06-28,18,Classic,MKTO,,False,23,18,18,0.72,0.791,1,-4.689,1,0.124,0.0384,0,0.157,0.756,102.071,175427,4
2014-06-28,19,Birthday,Katy Perry,,False,22,17,10,0.719,0.674,11,-5.122,1,0.0681,0.0879,3.75e-06,0.112,0.843,125.98,215042,4
2014-06-28,20,Me And My Broken Heart,Rixton,,False,21,14,12,0.545,0.783,5,-4.261,0,0.0345,0.00489,0,0.132,0.551,174.084,193733,4
2014-06-28,21,Loyal,Chris Brown Featuring Lil Wayne & French Montana Or Too $hort Or Tyga,,False,24,9,22,0.841,0.522,10,-5.963,0,0.049,0.0168,1.37e-06,0.188,0.616,99.059,264947,4
2014-06-28,22,Let It Go,Idina Menzel,,False,19,5,29,0.543,0.485,8,-6.85,1,0.0305,0.558,0,0.12,0.371,136.961,223840,4
2014-06-28,23,Play It Again,Luke Bryan,,False,20,14,14,0.506,0.886,11,-3.225,1,0.0655,0.0916,0,0.0734,0.595,143.935,226867,4
2014-06-28,24,Pills N Potions,Nicki Minaj,,False,43,24,4,0.391,0.604,2,-8.104,1,0.212,0.00812,5.18e-06,0.0443,0.168,169.658,268000,4
2014-06-28,25,Pompeii,Bastille,,False,18,5,44,0.679,0.715,9,-6.383,1,0.0407,0.0755,0,0.271,0.571,127.435,214148,4
2014-06-28,26,Hangover,PSY Featuring Snoop Dogg,4ngypPwfcqpHBxQjJIOgvr,True,0,26,1,0.698,0.813,1,-5.171,1,0.0395,0.00681,3.18e-05,0.103,0.355,150.001,236773,4
2014-06-28,27,Counting Stars,OneRepublic,4ngypPwfcqpHBxQjJIOgvr,False,25,2,52,0.664,0.705,1,-4.972,0,0.0382,0.0654,0,0.115,0.477,122.017,257840,4
2014-06-28,28,Beachin',Jake Owen,4ngypPwfcqpHBxQjJIOgvr,False,27,27,12,0.527,0.902,6,-5.352,1,0.0601,0.344,4.63e-05,0.0669,0.709,181.964,191040,4
2014-06-28,29,Boom Clap,Charli XCX,4ngypPwfcqpHBxQjJIOgvr,False,62,29,2,0.659,0.911,4,-2.28,1,0.0786,0.154,0.000304,0.191,0.576,91.999,169866,4
2014-06-28,30,Love Runs Out,OneRepublic,4ngypPwfcqpHBxQjJIOgvr,False,32,30,6,0.719,0.935,7,-3.752,1,0.0589,0.167,0,0.0973,0.738,120.022,224227,4
2014-06-28,31,Na Na,Trey Songz,4ngypPwfcqpHBxQjJIOgvr,False,31,22,21,0.67,0.476,9,-6.253,0,0.0406,0.328,0,0.104,0.235,96.975,231907,4
2014-06-28,32,Best Day Of My Life,American Authors,4ngypPwfcqpHBxQjJIOgvr,False,28,11,31,0.673,0.902,2,-2.392,1,0.0346,0.0591,0.000262,0.0558,0.538,100.012,194240,4
2014-06-28,33,Love Never Felt So Good,Michael Jackson & Justin Timberlake,4ngypPwfcqpHBxQjJIOgvr,False,29,9,7,0.775,0.719,7,-6.212,0,0.0435,0.132,1.79e-06,0.0662,0.712,117.513,246027,4
2014-06-28,34,Believe Me,Lil Wayne Featuring Drake,4ngypPwfcqpHBxQjJIOgvr,False,26,26,3,0.844,0.491,10,-8.807,0,0.17,0.272,0,0.111,0.196,91.935,337640,4
2014-06-28,35,Chandelier,Sia,4ngypPwfcqpHBxQjJIOgvr,False,37,35,6,0.399,0.787,1,-2.88,1,0.0499,0.0197,6.07e-05,0.0685,0.572,117.089,216120,5
2014-06-28,36,Wake Me Up!,Avicii,4ngypPwfcqpHBxQjJIOgvr,False,34,4,51,0.532,0.783,2,-5.697,1,0.0523,0.0038,0.0012,0.161,0.643,124.08,247427,4
2014-06-28,37,She Looks So Perfect,5 Seconds Of Summer,4ngypPwfcqpHBxQjJIOgvr,False,30,24,11,0.494,0.951,9,-4.237,1,0.132,0.000569,0,0.327,0.441,160.025,202496,4
2014-06-28,38,Timber,Pitbull Featuring Ke$ha,4ngypPwfcqpHBxQjJIOgvr,False,33,1,36,0.581,0.963,11,-4.087,1,0.0981,0.0295,0,0.139,0.788,129.992,204160,4
2014-06-28,39,Come With Me Now,KONGOS,4ngypPwfcqpHBxQjJIOgvr,False,39,39,11,0.654,0.726,10,-3.803,0,0.0401,0.0311,6.35e-05,0.0618,0.728,103.987,211960,4
2014-06-28,40,Bailando,Enrique Iglesias Featuring Descemer Bueno & Gente de Zona,4ngypPwfcqpHBxQjJIOgvr,False,53,40,7,0.723,0.777,7,-3.503,1,0.108,0.0426,3.68e-06,0.0451,0.961,91.017,243413,4
2014-06-28,41,Team,Lorde,4ngypPwfcqpHBxQjJIOgvr,False,36,6,38,0.69,0.578,6,-7.436,1,0.0929,0.167,0,0.305,0.416,99.961,193059,4
2014-06-28,42,My Eyes,Blake Shelton Featuring Gwen Sebastian,4ngypPwfcqpHBxQjJIOgvr,False,47,42,7,0.453,0.587,4,-7.584,1,0.0406,0.475,0,0.109,0.625,145.334,190213,4
2014-06-28,43,Drunk On A Plane,Dierks Bentley,4ngypPwfcqpHBxQjJIOgvr,False,42,42,5,0.423,0.73,9,-5.566,1,0.032,0.00495,1.13e-05,0.238,0.66,205.972,254467,4
2014-06-28,44,2 On,Tinashe Featuring ScHoolboy Q,4ngypPwfcqpHBxQjJIOgvr,False,52,44,6,0.742,0.595,9,-7.51,1,0.107,0.15,0,0.111,0.431,101.013,227000,4
2014-06-28,45,Demons,Imagine Dragons,4ngypPwfcqpHBxQjJIOgvr,False,40,6,60,0.505,0.71,3,-3.015,1,0.0321,0.19,0.00025,0.329,0.428,89.938,175200,4
2014-06-28,46,Don't,Ed Sheeran,1huvTbEYtgltjQRXzrNKGi,True,0,46,1,0.806,0.608,1,-7.008,1,0.0659,0.0113,0,0.635,0.849,95.049,219840,4
2014-06-28,47,I Don't Dance,Lee Brice,1huvTbEYtgltjQRXzrNKGi,False,48,47,9,0.587,0.559,1,-7.742,1,0.0321,0.399,6.69e-06,0.0992,0.19,92.036,221173,4
2014-06-28,48,Or Nah,Ty Dolla $ign Featuring Wiz Khalifa & DJ Mustard,1huvTbEYtgltjQRXzrNKGi,False,72,48,13,0.805,0.33,1,-8.712,0,0.1,0.22,0,0.105,0.211,121.97,242983,4
2014-06-28,49,Lettin' The Night Roll,Justin Moore,1huvTbEYtgltjQRXzrNKGi,False,50,49,17,0.542,0.859,2,-5.137,1,0.0424,0.0873,0,0.145,0.637,140.9,203120,4
2014-06-28,50,Beat Of The Music,Brett Eldredge,1huvTbEYtgltjQRXzrNKGi,False,44,44,19,0.629,0.808,9,-4.125,1,0.0269,0.00898,9.06e-06,0.0751,0.773,110.001,179293,4
2014-06-28,51,Who I Am With You,Chris Young,1huvTbEYtgltjQRXzrNKGi,False,57,51,8,0.466,0.702,0,-4.308,1,0.032,0.0983,1.29e-05,0.242,0.47,150.309,191573,4
2014-06-28,52,Bartender,Lady Antebellum,1huvTbEYtgltjQRXzrNKGi,False,46,46,4,0.631,0.937,11,-3.858,0,0.034,0.0198,7.38e-06,0.327,0.654,101.011,198267,4
2014-06-28,53,Dare (La La La),Shakira,1huvTbEYtgltjQRXzrNKGi,False,83,53,4,0.792,0.73,11,-5.376,1,0.0698,0.0623,2.66e-05,0.089,0.616,128.029,186507,4
2014-06-28,54,Whiskey In My Water,Tyler Farr,1huvTbEYtgltjQRXzrNKGi,False,54,54,12,0.526,0.872,7,-5.079,1,0.0428,0.245,0,0.243,0.583,153.929,188147,4
2014-06-28,55,Cut Her Off,KCamp Featuring 2 Chainz,1huvTbEYtgltjQRXzrNKGi,False,59,55,10,0.769,0.611,8,-2.85,1,0.039,0.098,0,0.221,0.0901,144.037,243333,4
2014-06-28,56,Yeah,Joe Nichols,1huvTbEYtgltjQRXzrNKGi,False,58,56,8,0.404,0.845,11,-4.647,1,0.049,0.00637,1.34e-05,0.357,0.591,165.703,231027,4
2014-06-28,57,Trumpets,Jason Derulo,1huvTbEYtgltjQRXzrNKGi,False,56,56,3,0.635,0.691,0,-4.862,1,0.258,0.555,0,0.097,0.638,82.142,217419,4
2014-06-28,58,La La La,Naughty Boy Featuring Sam Smith,1huvTbEYtgltjQRXzrNKGi,False,41,19,17,0.772,0.65,6,-5.202,0,0.0306,0.107,1.13e-06,0.0905,0.262,125.082,222200,4
2014-06-28,59,We Are One (Ole Ola) [The 2014 FIFA World Cup Official Song],Pitbull Featuring Jennifer Lopez & Claudia Leitte,1huvTbEYtgltjQRXzrNKGi,False,0,59,3,0.592,0.935,6,-4.317,0,0.0581,0.00879,0.0154,0.132,0.567,125.013,222520,4
2014-06-28,60,Move That Doh,"Future Featuring Pharrell, Pusha T & Casino",1huvTbEYtgltjQRXzrNKGi,False,51,46,14,0.876,0.63,2,-4.992,1,0.135,0.0841,0,0.0838,0.316,131.033,340413,4
2014-06-28,61,Work,Iggy Azalea,1huvTbEYtgltjQRXzrNKGi,False,60,54,7,0.699,0.804,7,-4.898,1,0.144,0.0631,0,0.414,0.491,140.012,223197,4
2014-06-28,62,We Dem Boyz,Wiz Khalifa,1huvTbEYtgltjQRXzrNKGi,False,64,62,9,0.717,0.862,8,-4.736,1,0.054,0.00689,0,0.321,0.52,130.021,224933,4
2014-06-28,63,Habits (Stay High),Tove Lo,1huvTbEYtgltjQRXzrNKGi,False,73,63,3,0.729,0.65,5,-3.539,1,0.0313,0.0702,6.69e-05,0.0829,0.347,110.02,209160,4
2014-06-28,64,We Are Tonight,Billy Currington,1huvTbEYtgltjQRXzrNKGi,False,65,64,8,0.559,0.812,11,-5.347,1,0.0371,0.0323,0,0.195,0.472,127.911,232107,4
2014-06-28,65,Who Do You Love?,YG Featuring Drake,1huvTbEYtgltjQRXzrNKGi,False,67,54,14,0.676,0.415,9,-9.752,1,0.508,0.0281,0,0.0915,0.146,193.206,233507,4
2014-06-28,66,Good Kisser,Usher,1huvTbEYtgltjQRXzrNKGi,False,75,66,6,0.64,0.782,5,-4.177,0,0.189,0.379,0,0.109,0.825,97.516,249626,4
2014-06-28,67,Automatic,Miranda Lambert,1huvTbEYtgltjQRXzrNKGi,False,35,35,17,0.591,0.703,10,-6.211,1,0.0256,0.0435,2.34e-06,0.145,0.402,95.993,247827,4
2014-06-28,68,The Worst,Jhene Aiko,1huvTbEYtgltjQRXzrNKGi,False,68,43,19,0.539,0.414,1,-9.156,0,0.0601,0.253,1.3e-06,0.143,0.123,94.895,254493,4
2014-06-28,69,River Bank,Brad Paisley,1huvTbEYtgltjQRXzrNKGi,False,71,69,6,0.639,0.875,7,-5.793,1,0.0372,0.0929,0,0.296,0.892,117.028,179800,4
2014-06-28,70,Trophies,Young Money Featuring Drake,1huvTbEYtgltjQRXzrNKGi,False,61,50,15,0.746,0.687,1,-7.475,1,0.382,0.155,0,0.137,0.283,143.931,188320,4
2014-06-28,71,A Sky Full Of Stars,Coldplay,1huvTbEYtgltjQRXzrNKGi,False,63,10,7,0.545,0.675,6,-6.474,1,0.0279,0.00617,0.00197,0.209,0.162,124.97,267867,4
2014-06-28,72,Keep Them Kisses Comin',Craig Campbell,1huvTbEYtgltjQRXzrNKGi,False,74,72,7,0.704,0.767,6,-5.708,1,0.0398,0.0524,0.000469,0.361,0.889,120.035,159827,4
2014-06-28,73,Main Chick,Kid Ink Featuring Chris Brown,1huvTbEYtgltjQRXzrNKGi,False,76,73,5,0.775,0.496,10,-5.652,1,0.0354,0.0393,0,0.526,0.204,95.072,197813,4
2014-06-28,74,Girls Chase Boys,Ingrid Michaelson,1huvTbEYtgltjQRXzrNKGi,False,82,74,10,0.518,0.828,8,-5.725,1,0.04,0.03,1.33e-05,0.0456,0.69,84.835,221413,4
2014-06-28,75,Shower,Becky G,1huvTbEYtgltjQRXzrNKGi,False,88,75,2,0.699,0.529,2,-7.548,1,0.0487,0.0317,3.59e-05,0.285,0.121,119.987,206167,4
2014-06-28,76,Wasted,Tiesto Featuring Matthew Koma,1huvTbEYtgltjQRXzrNKGi,False,95,76,2,0.638,0.816,2,-5.503,1,0.0308,0.00149,0.00115,0.195,0.386,112.014,190014,4
2014-06-28,77,"Where It's At (Yep, Yep)",Dustin Lynch,1huvTbEYtgltjQRXzrNKGi,False,80,77,6,0.557,0.737,3,-5.75,1,0.0476,0.0142,0,0.314,0.817,158.05,204187,4
2014-06-28,78,Wild Wild Love,Pitbull Featuring G.R.L.,1huvTbEYtgltjQRXzrNKGi,False,66,30,16,0.66,0.685,2,-6.658,1,0.0477,0.0165,0,0.442,0.32,119.991,203160,4
2014-06-28,79,Somethin' Bad,Miranda Lambert Duet With Carrie Underwood,1huvTbEYtgltjQRXzrNKGi,False,55,39,4,0.68,0.888,9,-5.308,1,0.055,0.0527,2.82e-06,0.0575,0.484,90.076,169587,4
2014-06-28,80,Come Get It Bae,Pharrell Williams,1huvTbEYtgltjQRXzrNKGi,False,78,78,4,0.934,0.798,0,-5.665,1,0.0849,0.266,4.54e-05,0.0962,0.895,120.162,201933,4
2014-06-28,81,Studio,ScHoolboy Q Featuring BJ The Chicago Kid,1huvTbEYtgltjQRXzrNKGi,False,89,81,2,0.709,0.589,8,-7.776,0,0.0433,0.0507,0,0.0585,0.58,133.922,278067,3
2014-06-28,82,Meanwhile Back At Mama's,Tim McGraw Featuring Faith Hill,1huvTbEYtgltjQRXzrNKGi,False,86,82,3,0.524,0.679,6,-8.68,1,0.0435,0.583,5.79e-05,0.163,0.676,172.977,228107,4
2014-06-28,83,Tennis Court,Lorde,1huvTbEYtgltjQRXzrNKGi,False,92,71,12,0.758,0.546,0,-8.597,1,0.0635,0.0156,0.000194,0.237,0.404,90.019,198907,4
2014-06-28,84,Human,Christina Perri,1huvTbEYtgltjQRXzrNKGi,False,77,31,19,0.439,0.489,8,-6.286,1,0.0368,0.132,0.000643,0.114,0.253,143.808,250707,4
2014-06-28,85,You & I,One Direction,1huvTbEYtgltjQRXzrNKGi,False,84,68,9,0.574,0.329,1,-6.829,1,0.0274,0.22,0,0.0986,0.356,130.993,237933,4
2014-06-28,86,Empire,Shakira,1huvTbEYtgltjQRXzrNKGi,False,81,58,12,0.541,0.628,0,-4.682,0,0.0603,0.733,0,0.056,0.364,80.027,239333,4
2014-06-28,87,Chainsaw,The Band Perry,1huvTbEYtgltjQRXzrNKGi,False,91,87,5,0.608,0.732,2,-4.254,1,0.0251,0.168,0,0.0817,0.656,84.006,227840,4
2014-06-28,88,Ready Set Roll,Chase Rice,1huvTbEYtgltjQRXzrNKGi,False,93,88,3,0.513,0.803,0,-4.45,1,0.0777,0.0161,0,0.667,0.746,156.038,190587,4
2014-06-28,89,I Got A Car,George Strait,1huvTbEYtgltjQRXzrNKGi,False,94,89,3,0.602,0.631,4,-7.371,1,0.033,0.332,0,0.12,0.472,138.389,272267,4
2014-06-28,90,Sleeping With A Friend,Neon Trees,1huvTbEYtgltjQRXzrNKGi,False,79,51,16,0.582,0.882,2,-4.256,1,0.0355,0.00189,1.03e-05,0.32,0.507,107.034,228840,4
2014-06-28,91,On Top Of The World,Imagine Dragons,1huvTbEYtgltjQRXzrNKGi,False,90,79,19,0.635,0.926,0,-5.589,1,0.151,0.0893,4.53e-06,0.0928,0.761,100.048,189840,4
2014-06-28,92,Really Don't Care,Demi Lovato Featuring Cher Lloyd,1huvTbEYtgltjQRXzrNKGi,False,0,92,2,0.705,0.729,7,-3.601,1,0.0847,0.122,0,0.185,0.849,121.019,201600,4
2014-06-28,93,Song About A Girl,Eric Paslay,1huvTbEYtgltjQRXzrNKGi,False,98,93,2,0.605,0.885,9,-5.592,1,0.0495,0.349,0.000287,0.151,0.742,92.055,224960,4
2014-06-28,94,V. 3005,Childish Gambino,1huvTbEYtgltjQRXzrNKGi,False,0,94,2,0.676,0.446,6,-7.153,0,0.329,0.119,0,0.112,0.655,82.912,234215,4
2014-06-28,95,Small Town Throwdown,Brantley Gilbert Featuring Justin Moore & Thomas Rhett,0rX4YStqUt1k1VEBe1U4HJ,True,0,95,1,0.555,0.863,7,-3.867,1,0.0379,0.0246,0,0.0563,0.699,98.006,201680,4
2014-06-28,96,I Choose You,Sara Bareilles,0rX4YStqUt1k1VEBe1U4HJ,False,85,81,5,0.731,0.572,6,-7.889,0,0.0445,0.105,0.00012,0.133,0.947,154.038,218573,4
2014-06-28,97,Rather Be,Clean Bandit Featuring Jess Glynne,3s4U7OHV7gnj42VV72eSZ6,True,0,97,1,0.799,0.586,11,-6.735,1,0.0377,0.162,2.03e-06,0.193,0.549,120.97,227833,4
2014-06-28,98,I'm Ready,AJR,3s4U7OHV7gnj42VV72eSZ6,False,99,98,2,0.628,0.867,9,-3.555,1,0.0913,0.0108,0,0.308,0.597,78.043,227311,4
2014-06-28,99,Hope You Get Lonely Tonight,Cole Swindell,5BtS8w1kkjLV1BbvB0t12u,True,0,99,1,0.45,0.795,10,-4.249,1,0.0355,0.103,0,0.166,0.364,151.884,227987,4
2014-06-28,100,Jungle,Jamie N Commons & X Ambassadors,3xgK660fsZH7ZDcOMfIdfB,True,0,100,1,0.389,0.748,2,-4.461,1,0.0805,0.000821,0.00058,0.358,0.216,78.056,189707,4
