date,position,title,artist,spotify_id,is_new,last_pos,peak_pos,weeks,danceability,energy,key,loudness,mode,speechiness,acousticness,instrumentalness,liveness,valence,tempo,duration_ms,time_signature
2008-07-26,1,I Kissed A Girl,Katy Perry,3Q39dywbYuBZmQ7sW8sc95,False,1,1,10,0.699,0.76,5,-3.173,1,0.0677,0.00223,0,0.132,0.696,129.996,179640,4
2008-07-26,2,Take A Bow,Rihanna,3Q39dywbYuBZmQ7sW8sc95,False,2,1,14,0.697,0.467,9,-7.536,1,0.0715,0.248,0,0.0941,0.572,82.082,229413,4
2008-07-26,3,Lollipop,Lil Wayne Featuring Static Major,3Q39dywbYuBZmQ7sW8sc95,False,3,1,18,0.829,0.428,0,-9.469,1,0.0831,0.056,0.00413,0.137,0.45,148.075,299333,4
2008-07-26,4,Forever,Chris Brown,3Q39dywbYuBZmQ7sW8sc95,False,6,4,12,0.672,0.82,11,-4.456,1,0.0459,0.0368,0.000188,0.184,0.438,120.005,278573,4
2008-07-26,5,Bleeding Love,Leona Lewis,3Q39dywbYuBZmQ7sW8sc95,False,4,1,22,0.638,0.656,5,-5.886,1,0.0357,0.188,0,0.146,0.225,104.036,262467,4
2008-07-26,6,Pocketful Of Sunshine,Natasha Bedingfield,3Q39dywbYuBZmQ7sW8sc95,False,7,5,22,0.721,0.88,9,-3.896,0,0.0454,0.191,0,0.0769,0.655,110.021,202907,4
2008-07-26,7,Viva La Vida,Coldplay,3Q39dywbYuBZmQ7sW8sc95,False,5,1,10,0.486,0.617,5,-7.115,0,0.0287,0.0954,3.23e-06,0.109,0.417,138.015,242373,4
2008-07-26,8,A Milli,Lil Wayne,3Q39dywbYuBZmQ7sW8sc95,False,11,8,12,0.674,0.695,6,-8.636,0,0.278,0.0387,0.00202,0.194,0.773,151.486,221840,4
2008-07-26,9,7 Things,Miley Cyrus,3Q39dywbYuBZmQ7sW8sc95,False,10,9,6,0.59,0.903,1,-4.478,0,0.0363,0.0232,0,0.0786,0.542,107.023,213453,4
2008-07-26,10,Bust It Baby Part 2,Plies Featuring Ne-Yo,3Q39dywbYuBZmQ7sW8sc95,False,9,7,16,0.713,0.548,8,-11.495,1,0.052,0.052,0,0.239,0.927,158.025,235506,4
2008-07-26,11,Leavin',Jesse McCartney,3Q39dywbYuBZmQ7sW8sc95,False,13,10,12,0.687,0.71,9,-5.84,1,0.0522,0.0283,3.71e-06,0.0689,0.886,79.235,216880,4
2008-07-26,12,When I Grow Up,The Pussycat Dolls,3Q39dywbYuBZmQ7sW8sc95,False,12,9,7,0.671,0.685,11,-5.762,0,0.05,0.00165,0,0.398,0.368,118.449,245680,4
2008-07-26,13,Burnin' Up,Jonas Brothers,3Q39dywbYuBZmQ7sW8sc95,False,8,5,3,0.667,0.954,2,-3.462,1,0.0817,0.0296,0,0.331,0.807,114.0,175093,4
2008-07-26,14,Dangerous,Kardinal Offishall Featuring Akon,3Q39dywbYuBZmQ7sW8sc95,False,16,14,10,0.949,0.79,8,-5.957,1,0.0756,0.00437,0,0.0816,0.807,117.002,246053,4
2008-07-26,15,Disturbia,Rihanna,3Q39dywbYuBZmQ7sW8sc95,False,15,11,4,0.707,0.813,11,-4.515,0,0.0571,0.0863,0,0.168,0.722,124.921,238627,4
2008-07-26,16,Shake It,Metro Station,3Q39dywbYuBZmQ7sW8sc95,False,14,10,15,0.618,0.955,4,-3.836,1,0.0798,0.00221,3.09e-06,0.486,0.79,150.034,179947,4
2008-07-26,17,Closer,Ne-Yo,3Q39dywbYuBZmQ7sW8sc95,False,27,17,13,0.711,0.753,4,-6.461,0,0.0766,0.028,2.96e-05,0.152,0.588,126.051,234360,4
2008-07-26,18,Get Like Me,David Banner Featuring Chris Brown,3Q39dywbYuBZmQ7sW8sc95,False,24,18,10,0.609,0.751,1,-4.198,1,0.488,0.00312,0,0.228,0.653,60.896,224547,3
2008-07-26,19,Lolli Lolli (Pop That Body),"Three 6 Mafia Featuring Project Pat, Young D & Superpower",3Q39dywbYuBZmQ7sW8sc95,False,21,19,9,0.89,0.946,2,-5.673,1,0.0489,0.0188,0.000128,0.11,0.872,120.0,251373,4
2008-07-26,20,I Luv Your Girl,The-Dream,3Q39dywbYuBZmQ7sW8sc95,False,22,20,12,0.723,0.322,8,-9.702,1,0.0341,0.014,0,0.119,0.0406,90.063,267867,4
2008-07-26,21,No Air,Jordin Sparks Duet With Chris Brown,3Q39dywbYuBZmQ7sW8sc95,False,19,3,28,0.475,0.501,11,-5.125,1,0.0309,0.715,0,0.0666,0.371,159.972,253693,4
2008-07-26,22,What You Got,Colby O'Donis Featuring Akon,3Q39dywbYuBZmQ7sW8sc95,False,20,14,20,0.775,0.641,1,-6.718,1,0.038,0.0327,0,0.18,0.305,119.974,243013,4
2008-07-26,23,Damaged,Danity Kane,3Q39dywbYuBZmQ7sW8sc95,False,17,10,18,0.774,0.653,8,-5.158,0,0.05,0.0912,0,0.151,0.818,120.01,244267,4
2008-07-26,24,It's Not My Time,3 Doors Down,3Q39dywbYuBZmQ7sW8sc95,False,25,17,21,0.532,0.935,0,-4.798,1,0.0619,0.00133,8.37e-06,0.106,0.309,128.025,241960,4
2008-07-26,25,All I Want To Do,Sugarland,3Q39dywbYuBZmQ7sW8sc95,False,18,18,4,0.709,0.725,4,-4.999,1,0.0556,0.208,4.54e-05,0.158,0.759,97.046,213360,4
2008-07-26,26,Love In This Club,Usher Featuring Young Jeezy,3Q39dywbYuBZmQ7sW8sc95,False,23,1,22,0.573,0.712,0,-5.976,1,0.0732,0.0572,0,0.167,0.346,140.012,259720,4
2008-07-26,27,Sexy Can I,Ray J & Yung Berg,3Q39dywbYuBZmQ7sW8sc95,False,26,3,24,0.575,0.686,1,-6.008,1,0.319,0.296,0,0.617,0.926,172.167,204040,4
2008-07-26,28,Heaven Sent,Keyshia Cole,3Q39dywbYuBZmQ7sW8sc95,False,37,28,11,0.642,0.742,2,-3.614,0,0.0429,0.0832,0,0.0887,0.407,78.858,232880,4
2008-07-26,29,Realize,Colbie Caillat,3Q39dywbYuBZmQ7sW8sc95,False,28,20,23,0.693,0.594,1,-6.408,1,0.0325,0.13,0,0.115,0.192,123.932,244107,4
2008-07-26,30,Got Money,Lil Wayne Featuring T-Pain,3Q39dywbYuBZmQ7sW8sc95,False,35,13,7,0.694,0.661,7,-4.847,1,0.118,0.00188,0,0.676,0.702,82.48,244627,4
2008-07-26,31,American Boy,Estelle Featuring Kanye West,3Q39dywbYuBZmQ7sW8sc95,False,40,31,13,0.727,0.729,0,-2.99,1,0.326,0.171,0,0.07,0.512,117.932,284733,4
2008-07-26,32,I'm Yours,Jason Mraz,3Q39dywbYuBZmQ7sW8sc95,False,44,32,13,0.686,0.457,11,-8.322,1,0.0468,0.595,0,0.105,0.718,150.953,242187,4
2008-07-26,33,In Love With A Girl,Gavin DeGraw,3Q39dywbYuBZmQ7sW8sc95,False,32,24,19,0.439,0.906,3,-4.8,1,0.0439,0.0193,0,0.373,0.687,161.905,206000,4
2008-07-26,34,Get Silly,V.I.C.,3Q39dywbYuBZmQ7sW8sc95,False,30,29,12,0.846,0.814,1,-4.945,1,0.353,0.0769,0,0.0588,0.671,75.01,227120,4
2008-07-26,35,Put On,Young Jeezy Featuring Kanye West,3Q39dywbYuBZmQ7sW8sc95,False,42,35,6,0.654,0.77,9,-6.091,0,0.0353,0.00342,0,0.0887,0.272,137.616,321293,4
2008-07-26,36,Love Song,Sara Bareilles,3Q39dywbYuBZmQ7sW8sc95,False,33,4,37,0.583,0.786,2,-3.142,0,0.0301,0.0208,0,0.188,0.573,123.055,258827,4
2008-07-26,37,Summertime,New Kids On The Block,3Q39dywbYuBZmQ7sW8sc95,False,36,36,9,0.632,0.785,4,-7.336,1,0.101,0.00972,0,0.0676,0.786,83.94,202413,4
2008-07-26,38,Should've Said No,Taylor Swift,3Q39dywbYuBZmQ7sW8sc95,False,46,38,8,0.476,0.777,4,-3.771,0,0.0289,0.0103,0,0.196,0.472,167.964,242200,4
2008-07-26,39,Out Here Grindin,"DJ Khaled Feat. Akon, Plies, Young Jeezy, Rick Ross, Ace Hood, Trick Daddy & Lil' Boosie",3Q39dywbYuBZmQ7sW8sc95,False,38,38,2,0.633,0.842,11,-1.928,1,0.183,0.0114,0,0.179,0.336,176.029,261133,4
2008-07-26,40,Good Time,Alan Jackson,3Q39dywbYuBZmQ7sW8sc95,False,45,40,10,0.652,0.767,9,-10.445,1,0.0372,0.0355,6.92e-06,0.397,0.73,132.017,306773,4
2008-07-26,41,Home,Blake Shelton,3Q39dywbYuBZmQ7sW8sc95,False,41,41,14,0.576,0.455,7,-7.587,1,0.0267,0.583,2.73e-05,0.0912,0.206,127.856,227040,4
2008-07-26,42,Say,John Mayer,3Q39dywbYuBZmQ7sW8sc95,False,34,12,27,0.485,0.723,10,-6.565,1,0.0317,0.541,1.12e-06,0.075,0.541,167.845,230213,4
2008-07-26,43,Low,Flo Rida Featuring T-Pain,3Q39dywbYuBZmQ7sW8sc95,False,39,1,38,0.918,0.609,10,-5.64,0,0.0791,0.0928,0,0.139,0.304,128.008,231400,4
2008-07-26,44,4 Minutes,Madonna Featuring Justin Timberlake & Timbaland,3Q39dywbYuBZmQ7sW8sc95,False,31,3,17,0.753,0.931,2,-4.922,1,0.0652,0.00994,0.00696,0.234,0.767,113.029,189693,4
2008-07-26,45,Take You Down,Chris Brown,3Q39dywbYuBZmQ7sW8sc95,False,47,43,13,0.387,0.64,11,-5.817,0,0.081,0.107,0,0.319,0.617,59.989,245933,4
2008-07-26,46,Handlebars,Flobots,3Q39dywbYuBZmQ7sW8sc95,False,50,46,14,0.704,0.571,5,-7.136,1,0.0969,0.0222,0,0.101,0.524,141.888,206813,4
2008-07-26,47,Fall For You,Secondhand Serenade,3Q39dywbYuBZmQ7sW8sc95,False,62,47,5,0.387,0.442,0,-7.086,1,0.0352,0.19,0,0.0788,0.382,169.481,185600,4
2008-07-26,48,In The Ayer,Flo Rida Featuring will.i.am,3Q39dywbYuBZmQ7sW8sc95,False,53,38,4,0.83,0.746,5,-6.286,0,0.0579,0.00456,0,0.26,0.646,125.992,220507,4
2008-07-26,49,The Time Of My Life,David Cook,3Q39dywbYuBZmQ7sW8sc95,False,52,3,8,0.414,0.578,8,-6.383,1,0.0287,0.0541,0,0.124,0.281,154.96,216147,3
2008-07-26,50,Stop And Stare,OneRepublic,3Q39dywbYuBZmQ7sW8sc95,False,48,12,31,0.492,0.859,4,-4.274,1,0.0332,0.0659,0,0.0756,0.251,92.474,223853,4
2008-07-26,51,If I Never See Your Face Again,Maroon 5 Featuring Rihanna,3Q39dywbYuBZmQ7sW8sc95,False,60,51,10,0.745,0.867,1,-2.446,1,0.0374,0.017,0,0.281,0.936,106.006,201000,4
2008-07-26,52,One Step At A Time,Jordin Sparks,3Q39dywbYuBZmQ7sW8sc95,False,70,52,3,0.766,0.692,1,-4.672,1,0.0289,0.0825,0,0.0384,0.691,102.028,205160,4
2008-07-26,53,You Look Good In My Shirt,Keith Urban,3Q39dywbYuBZmQ7sW8sc95,False,57,53,4,0.653,0.865,7,-6.395,1,0.0325,0.0075,1.18e-06,0.0629,0.828,116.966,227733,4
2008-07-26,54,Teenage Love Affair,Alicia Keys,3Q39dywbYuBZmQ7sW8sc95,False,58,54,10,0.636,0.826,11,-4.668,1,0.162,0.632,0,0.197,0.679,87.665,190200,4
2008-07-26,55,Mercy,Duffy,3Q39dywbYuBZmQ7sW8sc95,False,43,27,12,0.793,0.859,0,-3.774,1,0.0332,0.266,0.000356,0.133,0.964,129.911,219920,4
2008-07-26,56,Lookin Boy,Hot Stylz Featuring Yung Joc,3Q39dywbYuBZmQ7sW8sc95,False,54,54,6,0.85,0.687,0,-5.995,0,0.308,0.213,0,0.0724,0.502,149.989,207013,4
2008-07-26,57,This Is Me,Demi Lovato & Joe Jonas,3Q39dywbYuBZmQ7sW8sc95,False,29,9,4,0.421,0.821,1,-2.783,1,0.0372,0.00971,0,0.1,0.594,91.245,189173,4
2008-07-26,58,Last Name,Carrie Underwood,3Q39dywbYuBZmQ7sW8sc95,False,49,19,15,0.395,0.869,3,-3.154,1,0.109,0.194,0,0.0874,0.688,159.833,241053,4
2008-07-26,59,Gunpowder And Lead,Miranda Lambert,3Q39dywbYuBZmQ7sW8sc95,False,61,59,10,0.333,0.907,0,-3.191,1,0.0959,0.153,0,0.395,0.353,187.826,191693,4
2008-07-26,60,Better As A Memory,Kenny Chesney,3Q39dywbYuBZmQ7sW8sc95,False,55,46,14,0.576,0.302,2,-11.845,1,0.033,0.433,3.3e-05,0.133,0.145,70.932,252707,4
2008-07-26,61,Put A Girl In It,Brooks & Dunn,3Q39dywbYuBZmQ7sW8sc95,False,66,61,7,0.589,0.952,4,-3.316,1,0.0619,0.0327,0.00103,0.062,0.771,119.967,207880,4
2008-07-26,62,Free Fallin',John Mayer,3Q39dywbYuBZmQ7sW8sc95,False,51,51,2,0.315,0.296,5,-13.262,1,0.0317,0.771,0,0.702,0.436,172.638,263573,4
2008-07-26,63,Back When I Knew It All,Montgomery Gentry,3Q39dywbYuBZmQ7sW8sc95,False,56,56,15,0.533,0.732,2,-5.592,1,0.034,0.00499,2.25e-06,0.125,0.516,148.261,228587,4
2008-07-26,64,All Around Me,Flyleaf,3Q39dywbYuBZmQ7sW8sc95,False,59,40,19,0.473,0.871,9,-4.893,1,0.0456,0.0216,0,0.0525,0.47,146.975,198507,4
2008-07-26,65,All Summer Long,Kid Rock,3Q39dywbYuBZmQ7sW8sc95,False,80,65,2,0.7,0.864,7,-3.629,1,0.0283,0.0212,0,0.0956,0.887,102.997,297587,4
2008-07-26,66,Girls Around The World,Lloyd Featuring Lil Wayne,3Q39dywbYuBZmQ7sW8sc95,False,65,65,8,0.727,0.831,7,-8.699,1,0.126,0.0288,0.00038,0.145,0.579,97.6,229800,4
2008-07-26,67,I'm Still A Guy,Brad Paisley,3Q39dywbYuBZmQ7sW8sc95,False,64,33,18,0.494,0.599,2,-6.836,1,0.0316,0.104,0,0.0882,0.457,163.729,248787,3
2008-07-26,68,Here I Am,Rick Ross Featuring Nelly & Avery Storm,3Q39dywbYuBZmQ7sW8sc95,False,76,68,3,0.746,0.717,10,-5.788,0,0.127,0.189,0,0.0704,0.475,109.754,209547,4
2008-07-26,69,Moving Mountains,Usher,3Q39dywbYuBZmQ7sW8sc95,False,72,69,7,0.72,0.734,6,-4.515,1,0.0316,0.0856,0,0.303,0.37,115.999,298053,4
2008-07-26,70,Pork And Beans,Weezer,3Q39dywbYuBZmQ7sW8sc95,False,71,64,11,0.599,0.624,6,-6.622,1,0.0339,0.0109,8.06e-06,0.158,0.706,119.838,189400,4
2008-07-26,71,I Still Miss You,Keith Anderson,3Q39dywbYuBZmQ7sW8sc95,False,78,71,5,0.505,0.763,3,-5.386,1,0.0297,0.14,0,0.0949,0.446,156.024,235907,4
2008-07-26,72,She Never Cried In Front Of Me,Toby Keith,4CA1ZvDNhoaCJcozvGP8WH,True,0,72,1,0.458,0.621,7,-4.553,1,0.0306,0.374,0,0.0999,0.34,145.904,239507,4
2008-07-26,73,Come On Over,Jessica Simpson,4CA1ZvDNhoaCJcozvGP8WH,False,74,65,3,0.675,0.859,11,-2.57,1,0.0318,0.214,0,0.117,0.556,110.037,171413,4
2008-07-26,75,Play My Music,Jonas Brothers,,False,63,20,4,0.471,0.875,2,-3.499,1,0.087,0.000652,0,0.239,0.759,177.98,197507,4
2008-07-26,76,That's What You Get,Paramore,,False,81,76,6,0.528,0.831,8,-3.607,1,0.0429,9.43e-05,0,0.141,0.632,131.094,220480,3
2008-07-26,77,Bartender Song,Rehab,,False,79,77,3,0.667,0.673,4,-6.006,1,0.0536,0.117,0,0.343,0.706,151.834,229040,4
2008-07-26,78,Thunder,Boys Like Girls,,False,87,78,3,0.508,0.821,2,-5.279,1,0.0395,0.223,0,0.316,0.463,75.057,236680,4
2008-07-26,79,Addicted,Saving Abel,,False,94,79,5,0.512,0.864,7,-4.146,1,0.0338,0.000821,0,0.0982,0.527,138.018,222827,4
2008-07-26,80,Love Remains The Same,Gavin Rossdale,,False,83,76,6,0.406,0.632,4,-5.115,1,0.0344,0.236,0,0.18,0.109,149.258,249440,4
2008-07-26,81,Violet Hill,Coldplay,,False,75,40,10,0.33,0.58,1,-7.875,0,0.0374,0.0614,0.00129,0.115,0.11,76.093,222653,4
2008-07-26,82,Trying To Stop Your Leaving,Dierks Bentley,,False,73,73,15,0.617,0.57,7,-5.562,1,0.0302,0.00847,5.15e-05,0.0985,0.395,111.846,218147,4
2008-07-26,83,Life In A Northern Town,Sugarland Featuring Little Big Town & Jake Owen,,False,67,43,3,0.548,0.653,0,-6.055,1,0.0386,0.392,1.33e-05,0.973,0.214,117.856,254347,4
2008-07-26,84,Game's Pain,The Game Featuring Keyshia Cole,,False,77,75,7,0.754,0.769,6,-4.658,0,0.354,0.0863,0,0.0534,0.372,97.012,261773,4
2008-07-26,85,Never Would Have Made It,Marvin Sapp,,False,89,82,5,0.338,0.559,0,-7.053,1,0.118,0.252,0,0.38,0.276,168.489,415133,4
2008-07-26,86,Magic,Robin Thicke,,False,91,86,3,0.737,0.624,7,-6.487,1,0.0398,0.251,0.00295,0.101,0.651,107.959,233227,4
2008-07-26,87,We Weren't Crazy,Josh Gracin,,False,92,82,8,0.418,0.84,0,-2.622,1,0.041,0.21,1.38e-06,0.162,0.659,164.02,227307,4
2008-07-26,88,The Business,Yung Berg Featuring Casha,33PowGnnFPgWSGHcGIQX1U,True,0,88,1,0.63,0.726,7,-5.372,1,0.177,0.00867,0,0.0864,0.327,133.317,253840,4
2008-07-26,89,Holler Back,The Lost Trailers,33PowGnnFPgWSGHcGIQX1U,False,98,89,2,0.442,0.921,2,-2.344,1,0.0635,0.259,0,0.163,0.601,178.124,190813,4
2008-07-26,90,Stepped On My J'z,Nelly Featuring Ciara & JD,0ybHhVmrX00hB6BLLhKHiU,True,0,90,1,0.695,0.778,4,-4.516,0,0.0771,0.107,0,0.206,0.772,79.002,277360,4
2008-07-26,91,Don't Think I Don't Think About It,Darius Rucker,5PcJXT5DM9Md4GZDgXGdZ5,True,0,91,1,0.577,0.752,9,-5.264,1,0.0332,0.0275,0,0.125,0.404,149.686,183307,4
2008-07-26,92,Check Yes Juliet (Run Baby Run),WE the Kings,0wVluBsVAVzBKrqspuCcwR,True,0,92,1,0.352,0.912,7,-4.253,1,0.0725,0.00197,0,0.193,0.351,166.795,220147,4
2008-07-26,93,Inside The Fire,Disturbed,0wVluBsVAVzBKrqspuCcwR,False,86,73,15,0.463,0.962,7,-6.43,1,0.0704,0.000233,0.109,0.0906,0.66,94.003,231573,4
2008-07-26,94,Johnny & June,Heidi Newfield,6FmgSnILynpsvDmWTE9uPW,True,0,94,1,0.592,0.515,5,-6.486,1,0.0299,0.458,1.28e-06,0.116,0.269,141.949,218453,4
2008-07-26,95,Mr. Carter,Lil Wayne Featuring Jay-Z,6FmgSnILynpsvDmWTE9uPW,False,95,62,6,0.485,0.71,7,-6.288,1,0.364,0.0444,0,0.35,0.473,170.942,316267,4
2008-07-26,96,Learning How To Bend,Gary Allan,4s74ZQGzkOKumax5AqZrWC,True,0,96,1,0.506,0.731,2,-4.486,1,0.0334,0.0375,0.000192,0.529,0.315,98.935,205800,4
2008-07-26,97,Troubadour,George Strait,4qjmnM1aYvayCTDd0uuRKH,True,0,97,1,0.568,0.621,11,-6.395,1,0.0261,0.356,0.000577,0.274,0.346,136.094,176227,4
2008-07-26,98,That Song In My Head,Julianne Hough,4qjmnM1aYvayCTDd0uuRKH,False,96,88,6,0.496,0.84,0,-2.528,1,0.0803,0.0705,0,0.0745,0.746,185.978,193493,4
2008-07-26,99,Waitin' On A Woman,Brad Paisley,3uJggzf2q1lCOl8EiQHFvN,True,0,99,1,0.548,0.617,0,-7.093,1,0.0283,0.0846,5.09e-05,0.113,0.339,76.371,272587,4
2008-07-26,100,I'll Be Lovin' U Long Time,Mariah Carey,1PzVLh1uoq5pAUnqNQElQq,True,0,100,1,0.468,0.723,1,-5.344,1,0.0782,0.19,0,0.366,0.449,178.86,181027,4
