date,position,title,artist,spotify_id,is_new,last_pos,peak_pos,weeks,danceability,energy,key,loudness,mode,speechiness,acousticness,instrumentalness,liveness,valence,tempo,duration_ms,time_signature
2013-07-06,1,Blurred Lines,Robin Thicke Featuring T.I. + Pharrell,4REEbsJ6WV9NoGubnlhnkm,False,1,1,10,0.853,0.599,7,-4.756,1,0.0411,0.00334,7.93e-06,0.0759,0.843,119.993,263827,4
2013-07-06,2,Get Lucky,Daft Punk Featuring Pharrell Williams,4REEbsJ6WV9NoGubnlhnkm,False,2,2,10,0.794,0.811,6,-8.966,0,0.038,0.0426,1.07e-06,0.101,0.862,116.047,248413,4
2013-07-06,3,Radioactive,Imagine Dragons,4REEbsJ6WV9NoGubnlhnkm,False,4,3,43,0.448,0.784,9,-3.686,1,0.0627,0.106,0.000108,0.668,0.236,136.245,186813,4
2013-07-06,4,Cruise,Florida Georgia Line Featuring Nelly,4REEbsJ6WV9NoGubnlhnkm,False,6,4,38,0.457,0.948,10,-3.364,1,0.0354,0.0191,0,0.0536,0.878,148.0,208960,4
2013-07-06,5,We Can't Stop,Miley Cyrus,4REEbsJ6WV9NoGubnlhnkm,False,27,5,3,0.613,0.622,1,-5.794,0,0.0334,0.00882,0,0.37,0.484,80.003,231240,4
2013-07-06,6,Can't Hold Us,Macklemore & Ryan Lewis Featuring Ray Dalton,4REEbsJ6WV9NoGubnlhnkm,False,3,1,20,0.641,0.922,2,-4.457,1,0.0786,0.0291,0,0.0862,0.847,146.078,258343,4
2013-07-06,7,Mirrors,Justin Timberlake,4REEbsJ6WV9NoGubnlhnkm,False,5,2,19,0.574,0.512,5,-6.664,0,0.0503,0.234,0,0.0946,0.512,76.899,484147,4
2013-07-06,8,Treasure,Bruno Mars,4REEbsJ6WV9NoGubnlhnkm,False,11,8,6,0.874,0.692,5,-5.28,0,0.0431,0.0412,7.24e-05,0.324,0.937,116.017,178560,4
2013-07-06,9,Come & Get It,Selena Gomez,4REEbsJ6WV9NoGubnlhnkm,False,8,6,11,0.552,0.783,7,-4.138,0,0.0504,0.00887,0.00026,0.0954,0.575,79.984,231413,4
2013-07-06,10,Just Give Me A Reason,P!nk Featuring Nate Ruess,4REEbsJ6WV9NoGubnlhnkm,False,7,1,19,0.778,0.547,2,-7.273,1,0.0489,0.346,0.000302,0.132,0.441,95.002,242733,4
2013-07-06,11,The Way,Ariana Grande Featuring Mac Miller,4REEbsJ6WV9NoGubnlhnkm,False,9,9,13,0.645,0.877,5,-3.208,0,0.113,0.294,0,0.0759,0.861,82.324,227027,4
2013-07-06,12,I Love It,Icona Pop Featuring Charli XCX,4REEbsJ6WV9NoGubnlhnkm,False,10,7,21,0.711,0.906,8,-2.671,1,0.0284,0.00952,1.64e-05,0.153,0.824,125.916,157153,4
2013-07-06,13,My Songs Know What You Did In The Dark (Light Em Up),Fall Out Boy,4REEbsJ6WV9NoGubnlhnkm,False,13,13,20,0.558,0.924,9,-4.341,0,0.064,0.0271,3.32e-06,0.537,0.567,151.99,186827,4
2013-07-06,14,Clarity,Zedd Featuring Foxes,4REEbsJ6WV9NoGubnlhnkm,False,14,14,14,0.509,0.781,8,-3.48,1,0.072,0.0398,0,0.0749,0.176,128.0,271427,4
2013-07-06,15,Boys 'round Here,Blake Shelton Featuring Pistol Annies & Friends,4REEbsJ6WV9NoGubnlhnkm,False,12,12,13,0.611,0.688,2,-6.369,1,0.0529,0.251,2.35e-06,0.248,0.649,169.895,288760,4
2013-07-06,16,#Beautiful,Mariah Carey Featuring Miguel,4REEbsJ6WV9NoGubnlhnkm,False,15,15,7,0.677,0.749,4,-5.405,1,0.0391,0.346,0,0.347,0.469,107.042,199867,4
2013-07-06,17,Cups (Pitch Perfect's When I'm Gone),Anna Kendrick,4REEbsJ6WV9NoGubnlhnkm,False,18,17,26,0.878,0.455,0,-8.845,1,0.077,0.0462,0.00484,0.0353,0.79,129.953,128013,4
2013-07-06,18,Stay,Rihanna Featuring Mikky Ekko,4REEbsJ6WV9NoGubnlhnkm,False,16,3,20,0.621,0.31,9,-10.164,0,0.0283,0.945,6.12e-05,0.117,0.125,111.893,240707,4
2013-07-06,19,I Want Crazy,Hunter Hayes,4REEbsJ6WV9NoGubnlhnkm,False,31,19,11,0.562,0.878,8,-4.806,1,0.0387,0.0539,0,0.112,0.558,103.029,236865,4
2013-07-06,20,When I Was Your Man,Bruno Mars,4REEbsJ6WV9NoGubnlhnkm,False,17,1,27,0.612,0.28,0,-8.648,1,0.0434,0.932,0,0.088,0.387,72.795,213827,4
2013-07-06,21,Thrift Shop,Macklemore & Ryan Lewis Featuring Wanz,4REEbsJ6WV9NoGubnlhnkm,False,19,1,38,0.781,0.526,6,-6.986,0,0.293,0.0633,0,0.0457,0.665,94.993,235613,4
2013-07-06,22,Love Somebody,Maroon 5,4REEbsJ6WV9NoGubnlhnkm,False,24,22,5,0.675,0.792,1,-6.303,1,0.0368,0.145,0,0.12,0.395,120.016,229813,4
2013-07-06,23,Power Trip,J. Cole Featuring Miguel,4REEbsJ6WV9NoGubnlhnkm,False,21,20,19,0.667,0.608,1,-7.054,1,0.216,0.324,0.000198,0.426,0.475,99.992,241160,4
2013-07-06,24,I Need Your Love,Calvin Harris Featuring Ellie Goulding,4REEbsJ6WV9NoGubnlhnkm,False,30,24,10,0.695,0.869,8,-5.066,1,0.0483,0.41,0,0.237,0.58,124.989,234507,4
2013-07-06,25,The Other Side,Jason Derulo,4REEbsJ6WV9NoGubnlhnkm,False,25,25,10,0.561,0.836,9,-3.939,1,0.1,0.0525,0,0.136,0.517,127.923,226987,4
2013-07-06,26,Wagon Wheel,Darius Rucker,4REEbsJ6WV9NoGubnlhnkm,False,22,15,20,0.537,0.66,9,-7.174,1,0.0296,0.455,0,0.135,0.574,148.096,298373,4
2013-07-06,27,Bad,Wale Featuring Tiara Thomas Or Rihanna,4REEbsJ6WV9NoGubnlhnkm,False,23,21,19,0.807,0.702,6,-6.594,0,0.0748,0.307,0,0.111,0.447,114.038,238827,4
2013-07-06,28,Same Love,Macklemore & Ryan Lewis Featuring Mary Lambert,4REEbsJ6WV9NoGubnlhnkm,False,33,28,15,0.688,0.473,8,-9.059,1,0.167,0.716,4.46e-05,0.104,0.299,84.958,318525,4
2013-07-06,29,Here's To Never Growing Up,Avril Lavigne,4REEbsJ6WV9NoGubnlhnkm,False,20,20,11,0.482,0.873,0,-3.145,1,0.0853,0.0111,0,0.409,0.737,165.084,214320,4
2013-07-06,30,Crash My Party,Luke Bryan,4REEbsJ6WV9NoGubnlhnkm,False,28,18,11,0.526,0.816,7,-4.009,1,0.0421,0.0285,0,0.22,0.414,144.032,234760,4
2013-07-06,31,Feel This Moment,Pitbull Featuring Christina Aguilera,4REEbsJ6WV9NoGubnlhnkm,False,34,8,22,0.673,0.758,7,-3.632,1,0.158,0.039,0,0.341,0.542,135.956,229507,4
2013-07-06,32,Counting Stars,OneRepublic,6sy3LkhNFjJWlaeSMNwQ62,True,0,32,1,0.664,0.705,1,-4.972,0,0.0382,0.0654,0,0.115,0.477,122.017,257840,4
2013-07-06,33,U.O.E.N.O.,Rocko Featuring Future & Rick Ross,6sy3LkhNFjJWlaeSMNwQ62,False,36,33,11,0.422,0.641,10,-4.947,0,0.323,0.422,0,0.317,0.654,187.027,260276,3
2013-07-06,34,Heart Attack,Demi Lovato,6sy3LkhNFjJWlaeSMNwQ62,False,26,10,17,0.504,0.785,8,-4.802,1,0.104,0.0738,0,0.239,0.502,173.968,210840,4
2013-07-06,35,Highway Don't Care,Tim McGraw With Taylor Swift,6sy3LkhNFjJWlaeSMNwQ62,False,29,22,17,0.477,0.791,2,-5.348,1,0.0396,0.0259,0,0.0841,0.505,157.83,279067,4
2013-07-06,36,"Gone, Gone, Gone",Phillip Phillips,6sy3LkhNFjJWlaeSMNwQ62,False,43,36,16,0.664,0.642,6,-5.961,1,0.038,0.129,0,0.114,0.501,118.002,209693,4
2013-07-06,37,No New Friends (SFTB Remix),"DJ Khaled Featuring Drake, Rick Ross & Lil Wayne",6sy3LkhNFjJWlaeSMNwQ62,False,45,37,9,0.703,0.681,2,-6.356,1,0.133,0.00589,0,0.449,0.245,124.928,308333,4
2013-07-06,38,Body Party,Ciara,6sy3LkhNFjJWlaeSMNwQ62,False,40,35,9,0.577,0.576,2,-6.299,1,0.0563,0.0143,0,0.602,0.12,133.973,234040,4
2013-07-06,39,Sail,AWOLNATION,6sy3LkhNFjJWlaeSMNwQ62,False,41,30,42,0.825,0.435,1,-9.582,1,0.0568,0.452,0.609,0.0953,0.243,119.038,259102,4
2013-07-06,40,Rich As F**k,Lil Wayne Featuring 2 Chainz,6sy3LkhNFjJWlaeSMNwQ62,False,38,38,14,0.595,0.359,8,-13.488,1,0.453,0.289,0,0.15,0.886,131.969,229198,4
2013-07-06,41,22,Taylor Swift,6sy3LkhNFjJWlaeSMNwQ62,False,32,20,17,0.658,0.729,7,-6.561,1,0.0378,0.00215,0.0013,0.0752,0.668,104.007,230133,4
2013-07-06,42,"Bitch, Don't Kill My Vibe",Kendrick Lamar,6sy3LkhNFjJWlaeSMNwQ62,False,42,32,18,0.587,0.698,1,-8.948,1,0.0943,0.0152,0,0.442,0.0985,133.954,310720,4
2013-07-06,43,Safe And Sound,Capital Cities,6sy3LkhNFjJWlaeSMNwQ62,False,56,43,8,0.655,0.819,0,-4.852,1,0.0316,0.000176,0.00374,0.104,0.766,117.956,192790,5
2013-07-06,44,Runnin' Outta Moonlight,Randy Houser,6sy3LkhNFjJWlaeSMNwQ62,False,48,44,7,0.526,0.801,2,-3.717,1,0.0393,0.0354,3.17e-06,0.0637,0.769,172.024,193773,4
2013-07-06,45,Started From The Bottom,Drake,6sy3LkhNFjJWlaeSMNwQ62,False,35,6,20,0.793,0.524,8,-7.827,1,0.156,0.0319,0,0.156,0.579,86.325,174133,4
2013-07-06,46,Ho Hey,The Lumineers,6sy3LkhNFjJWlaeSMNwQ62,False,39,3,55,0.685,0.466,0,-9.074,1,0.0304,0.794,2.06e-06,0.0915,0.353,79.936,163133,4
2013-07-06,47,Anywhere With You,Jake Owen,6sy3LkhNFjJWlaeSMNwQ62,False,46,46,14,0.475,0.936,5,-2.545,1,0.0413,0.0418,0,0.0873,0.598,151.988,209587,4
2013-07-06,48,Suit & Tie,Justin Timberlake Featuring JAY Z,6sy3LkhNFjJWlaeSMNwQ62,False,44,3,24,0.795,0.596,11,-3.799,0,0.219,0.103,0,0.164,0.357,101.985,326280,4
2013-07-06,49,I Knew You Were Trouble.,Taylor Swift,6sy3LkhNFjJWlaeSMNwQ62,False,49,2,36,0.622,0.469,3,-6.798,0,0.0363,0.00454,2.25e-06,0.0398,0.679,77.019,217973,4
2013-07-06,50,Beat This Summer,Brad Paisley,6sy3LkhNFjJWlaeSMNwQ62,False,52,50,15,0.563,0.722,6,-5.252,1,0.0407,0.313,0,0.393,0.801,150.039,281453,4
2013-07-06,51,Next To Me,Emeli Sande,6sy3LkhNFjJWlaeSMNwQ62,False,37,25,18,0.674,0.81,7,-5.117,0,0.0378,0.0923,4.74e-05,0.11,0.391,94.995,196867,4
2013-07-06,52,See You Again,Carrie Underwood,6sy3LkhNFjJWlaeSMNwQ62,False,51,51,8,0.514,0.742,8,-2.525,1,0.0258,0.27,1.7e-06,0.085,0.47,101.0,246453,4
2013-07-06,53,Lego House,Ed Sheeran,6sy3LkhNFjJWlaeSMNwQ62,False,50,42,13,0.592,0.637,11,-8.48,1,0.0992,0.562,0,0.13,0.565,159.701,185093,4
2013-07-06,54,Don't Ya,Brett Eldredge,6sy3LkhNFjJWlaeSMNwQ62,False,58,54,5,0.537,0.693,9,-5.256,1,0.0847,0.0566,0,0.146,0.581,176.004,181210,4
2013-07-06,55,DONE.,The Band Perry,6sy3LkhNFjJWlaeSMNwQ62,False,53,46,15,0.65,0.89,1,-2.995,1,0.0366,0.322,0,0.0543,0.757,100.053,205267,4
2013-07-06,56,New Slaves,Kanye West,4cAgkb0ifwn0FSHGXnr4F6,True,0,56,1,0.506,0.59,1,-4.322,1,0.076,0.165,1.09e-05,0.096,0.359,141.099,256093,4
2013-07-06,57,Tapout,"Rich Gang Featuring Lil Wayne, Birdman, Future, Mack Maine, Nicki Minaj",4cAgkb0ifwn0FSHGXnr4F6,False,59,57,7,0.762,0.577,8,-5.229,1,0.175,0.0309,0,0.108,0.287,142.055,284587,4
2013-07-06,58,Beat It,Sean Kingston Featuring Chris Brown & Wiz Khalifa,4cAgkb0ifwn0FSHGXnr4F6,False,64,58,9,0.477,0.637,1,-5.386,1,0.109,0.00487,0,0.284,0.555,198.12,253453,4
2013-07-06,59,Crazy Kids,Ke$ha Featuring will.i.am Or Juicy J,4cAgkb0ifwn0FSHGXnr4F6,False,62,59,4,0.742,0.706,0,-4.6,0,0.0433,0.0141,0.00568,0.133,0.478,128.03,230747,4
2013-07-06,60,Hey Pretty Girl,Kip Moore,4cAgkb0ifwn0FSHGXnr4F6,False,61,60,14,0.291,0.4,2,-10.615,1,0.0306,0.145,1.86e-05,0.259,0.0935,83.112,215920,1
2013-07-06,61,#thatPOWER,will.i.am Featuring Justin Bieber,4cAgkb0ifwn0FSHGXnr4F6,False,54,17,14,0.797,0.608,6,-6.096,0,0.0584,0.00112,7.66e-05,0.0748,0.402,127.999,279507,4
2013-07-06,62,Fine China,Chris Brown,4cAgkb0ifwn0FSHGXnr4F6,False,57,31,12,0.654,0.731,10,-4.767,0,0.0568,0.0419,0,0.122,0.59,104.002,213200,4
2013-07-06,63,Redneck Crazy,Tyler Farr,4cAgkb0ifwn0FSHGXnr4F6,False,77,63,4,0.487,0.667,7,-4.216,0,0.0309,0.153,0,0.161,0.463,145.854,216040,4
2013-07-06,64,Harlem Shake,Baauer,4cAgkb0ifwn0FSHGXnr4F6,False,60,1,19,0.452,0.794,0,-5.151,1,0.0483,0.0111,0.00182,0.416,0.282,137.825,196664,4
2013-07-06,65,Jump Right In,Zac Brown Band,4cAgkb0ifwn0FSHGXnr4F6,False,70,65,9,0.697,0.82,1,-5.108,1,0.0575,0.0888,0,0.143,0.655,104.022,180813,4
2013-07-06,66,All Over The Road,Easton Corbin,4cAgkb0ifwn0FSHGXnr4F6,False,71,66,7,0.491,0.841,5,-3.579,1,0.0421,0.0471,0,0.0886,0.721,199.851,163067,4
2013-07-06,67,Demons,Imagine Dragons,4cAgkb0ifwn0FSHGXnr4F6,False,67,64,14,0.505,0.71,3,-3.015,1,0.0321,0.19,0.00025,0.329,0.428,89.938,175200,4
2013-07-06,68,Little Bit Of Everything,Keith Urban,4cAgkb0ifwn0FSHGXnr4F6,False,68,68,5,0.619,0.882,8,-5.99,1,0.0912,0.239,0,0.033,0.897,159.98,205707,4
2013-07-06,69,Black Skinhead,Kanye West,722tgOgdIbNe3BEyLnejw4,True,0,69,1,0.766,0.809,1,-6.123,1,0.279,0.0011,0,0.168,0.325,130.127,188013,4
2013-07-06,70,We Still In This B****,B.o.B Featuring T.I. & Juicy J,722tgOgdIbNe3BEyLnejw4,False,65,65,19,0.693,0.733,1,-5.126,1,0.139,0.013,0,0.0924,0.497,140.01,247987,4
2013-07-06,71,We Own It (Fast & Furious),2 Chainz & Wiz Khalifa,722tgOgdIbNe3BEyLnejw4,False,55,16,5,0.554,0.899,8,-4.573,1,0.408,0.0521,0,0.0568,0.552,171.966,227893,4
2013-07-06,72,Bugatti,Ace Hood Featuring Future & Rick Ross,722tgOgdIbNe3BEyLnejw4,False,63,33,19,0.6,0.592,1,-4.947,1,0.0545,0.0191,0,0.0955,0.0663,130.205,269267,4
2013-07-06,73,People Like Us,Kelly Clarkson,722tgOgdIbNe3BEyLnejw4,False,73,73,6,0.6,0.787,6,-5.163,1,0.0366,0.043,0,0.358,0.608,127.977,258907,4
2013-07-06,74,Crooked Smile,J. Cole Featuring TLC,5gFoAVTN9YlM9uJCrFZtgl,True,0,74,1,0.606,0.784,7,-6.293,1,0.268,0.435,0,0.689,0.48,80.985,278573,4
2013-07-06,75,Born To Fly,Danielle Bradbery,1rIusB0mmJglKOFmV1iMft,True,0,75,1,0.536,0.832,9,-5.186,1,0.0642,0.0146,7.76e-05,0.438,0.516,100.037,197200,4
2013-07-06,76,Round Here,Florida Georgia Line,1rIusB0mmJglKOFmV1iMft,False,89,76,2,0.523,0.954,1,-3.051,1,0.0374,0.00385,1.65e-06,0.243,0.901,141.982,215120,4
2013-07-06,77,Paper Doll,John Mayer,5FDh0G5oQ2UD9JxWiDCT1x,True,0,77,1,0.658,0.475,7,-11.703,1,0.0292,0.521,0.0067,0.176,0.685,153.851,257387,4
2013-07-06,78,Danny's Song,The Swon Brothers,5FDh0G5oQ2UD9JxWiDCT1x,False,66,66,2,0.519,0.555,1,-5.917,1,0.0305,0.128,0,0.133,0.36,139.796,205640,4
2013-07-06,79,Gentleman,PSY,5FDh0G5oQ2UD9JxWiDCT1x,False,75,5,11,0.861,0.742,3,-3.292,0,0.148,0.0035,0,0.0643,0.655,126.01,194960,4
2013-07-06,80,Downtown,Lady Antebellum,5FDh0G5oQ2UD9JxWiDCT1x,False,76,29,20,0.532,0.825,9,-5.287,1,0.0468,0.18,0,0.296,0.96,169.961,195867,4
2013-07-06,81,More Than Miles,Brantley Gilbert,5FDh0G5oQ2UD9JxWiDCT1x,False,80,79,17,0.47,0.778,5,-5.992,1,0.037,0.0295,0.000225,0.354,0.448,152.005,252867,4
2013-07-06,82,Alive,Krewella,5FDh0G5oQ2UD9JxWiDCT1x,False,72,32,19,0.663,0.822,9,-2.909,1,0.0557,0.00413,0.00318,0.234,0.567,128.002,290760,4
2013-07-06,83,Hey Girl,Billy Currington,5FDh0G5oQ2UD9JxWiDCT1x,False,85,75,5,0.548,0.673,1,-5.29,1,0.0268,0.0158,0,0.0794,0.652,81.947,200533,4
2013-07-06,84,High School,Nicki Minaj Featuring Lil Wayne,5FDh0G5oQ2UD9JxWiDCT1x,False,81,64,12,0.531,0.683,1,-4.093,0,0.333,0.135,0.00265,0.22,0.212,84.817,218747,4
2013-07-06,85,Ooh La La,Britney Spears,7bpvfjoneSQvW0tbtVm1Jk,True,0,85,1,0.69,0.568,6,-4.501,1,0.0525,0.0165,6.98e-06,0.111,0.728,128.059,257493,4
2013-07-06,86,Young And Beautiful,Lana Del Rey,7bpvfjoneSQvW0tbtVm1Jk,False,69,22,9,0.324,0.416,11,-8.92,0,0.0368,0.262,3.69e-05,0.11,0.151,113.986,236053,4
2013-07-06,87,How Many Drinks?,Miguel,7bpvfjoneSQvW0tbtVm1Jk,False,86,82,10,0.379,0.608,0,-7.011,0,0.134,0.00311,0.000614,0.248,0.241,81.822,272987,4
2013-07-06,88,What About Love,Austin Mahone,7bpvfjoneSQvW0tbtVm1Jk,False,74,74,2,0.632,0.784,2,-7.457,1,0.0393,0.000157,3.6e-05,0.037,0.278,100.019,203344,4
2013-07-06,89,Point At You,Justin Moore,7bpvfjoneSQvW0tbtVm1Jk,False,87,87,4,0.626,0.805,7,-5.81,1,0.0449,0.0126,0,0.156,0.882,116.03,180720,4
2013-07-06,90,Right Now,Rihanna Featuring David Guetta,28OX5qT45GZBuu8CNKBOj6,True,0,90,1,0.668,0.64,3,-5.208,0,0.0888,0.049,0,0.0675,0.259,130.004,181627,4
2013-07-06,91,Blood On The Leaves,Kanye West,42GcjriRK6srwHkfbkBqVl,True,0,91,1,0.397,0.69,2,-4.108,0,0.195,0.395,0,0.101,0.36,172.073,359800,4
2013-07-06,92,Why,Michelle Chamuel,0eRdvRqJTPGZmdFftzF6Sx,True,0,92,1,0.517,0.572,0,-5.329,1,0.0263,0.0118,0,0.0733,0.08,93.969,196587,4
2013-07-06,93,Maybe It Was Memphis,Danielle Bradbery,0eRdvRqJTPGZmdFftzF6Sx,False,0,92,2,0.465,0.733,9,-4.825,1,0.0348,0.0714,2.33e-05,0.0955,0.364,147.944,202600,4
2013-07-06,94,It Goes Like This,Thomas Rhett,0eRdvRqJTPGZmdFftzF6Sx,False,96,94,2,0.543,0.837,11,-6.448,1,0.0608,0.117,0,0.0872,0.506,168.056,186080,4
2013-07-06,95,Bubble Butt,"Major Lazer Featuring Bruno Mars, Tyga & Mystic",0eRdvRqJTPGZmdFftzF6Sx,False,97,95,2,0.765,0.771,7,-6.99,1,0.347,0.0115,0.00237,0.606,0.394,194.072,227813,4
2013-07-06,96,Wild For The Night,A$AP Rocky Featuring Skrillex,0eRdvRqJTPGZmdFftzF6Sx,False,83,80,15,0.757,0.848,2,-4.234,1,0.335,0.0481,0,0.121,0.686,139.995,212640,4
2013-07-06,97,Ain't Worried About Nothin,French Montana,0UAmPUdpTRq8w54B3H8TzY,True,0,97,1,0.688,0.904,1,-2.234,1,0.106,0.0229,0,0.0909,0.71,127.887,212427,4
2013-07-06,98,One,Usher & Michelle Chamuel,64ujSykVY35bgU74PTmCsJ,True,0,98,1,0.736,0.453,11,-11.111,0,0.0713,0.066,0,0.125,0.964,79.977,203973,4
2013-07-06,99,I Can't Tell You Why,The Swon Brothers,2bvxIrwSsQiaHOePGrjnJ9,True,0,99,1,0.464,0.772,11,-3.836,0,0.0372,0.0794,0,0.148,0.404,169.878,197427,4
2013-07-06,100,Brave,Sara Bareilles,2bvxIrwSsQiaHOePGrjnJ9,False,0,61,2,0.551,0.836,10,-3.838,0,0.0524,0.00502,2.1e-05,0.0425,0.758,185.063,220573,4
