date,position,title,artist,spotify_id,is_new,last_pos,peak_pos,weeks,danceability,energy,key,loudness,mode,speechiness,acousticness,instrumentalness,liveness,valence,tempo,duration_ms,time_signature
2008-10-25,1,Womanizer,Britney Spears,7CNd7rjfVt74TFlcOcnZgN,False,96,1,2,0.724,0.695,11,-5.226,1,0.0622,0.073,0,0.0889,0.235,139.0,224400,4
2008-10-25,2,Whatever You Like,T.I.,7CNd7rjfVt74TFlcOcnZgN,False,2,1,10,0.68,0.687,9,-6.162,0,0.0709,0.0161,0,0.261,0.467,150.053,249533,4
2008-10-25,3,Live Your Life,T.I. Featuring Rihanna,7CNd7rjfVt74TFlcOcnZgN,False,1,1,3,0.375,0.862,11,-3.363,0,0.255,0.071,0,0.211,0.478,159.841,338853,4
2008-10-25,4,So What,P!nk,7CNd7rjfVt74TFlcOcnZgN,False,3,1,8,0.534,0.87,11,-3.078,0,0.0425,0.000329,0,0.241,0.462,126.019,215160,4
2008-10-25,5,Hot N Cold,Katy Perry,7CNd7rjfVt74TFlcOcnZgN,False,6,5,11,0.706,0.841,7,-3.956,1,0.0418,7.95e-05,0,0.0688,0.861,132.032,220227,4
2008-10-25,6,Disturbia,Rihanna,7CNd7rjfVt74TFlcOcnZgN,False,4,1,17,0.707,0.813,11,-4.515,0,0.0571,0.0863,0,0.168,0.722,124.921,238627,4
2008-10-25,7,Let It Rock,Kevin Rudolf Featuring Lil Wayne,7CNd7rjfVt74TFlcOcnZgN,False,5,5,7,0.607,0.783,7,-4.41,1,0.0397,0.000683,0,0.0678,0.434,113.172,231173,4
2008-10-25,8,Can't Believe It,T-Pain Featuring Lil Wayne,7CNd7rjfVt74TFlcOcnZgN,False,8,7,11,0.648,0.516,10,-8.869,0,0.049,0.00179,0,0.0772,0.0756,89.828,273827,4
2008-10-25,9,Miss Independent,Ne-Yo,7CNd7rjfVt74TFlcOcnZgN,False,11,9,8,0.673,0.683,1,-5.693,1,0.115,0.522,0,0.235,0.713,171.86,232000,4
2008-10-25,10,Paper Planes,M.I.A.,7CNd7rjfVt74TFlcOcnZgN,False,9,4,13,0.447,0.848,2,-6.175,1,0.222,0.033,7.46e-05,0.65,0.485,172.253,205200,4
2008-10-25,11,Better In Time,Leona Lewis,7CNd7rjfVt74TFlcOcnZgN,False,14,11,14,0.584,0.7,6,-4.251,1,0.0506,0.512,2.43e-05,0.13,0.549,163.953,234173,4
2008-10-25,12,Love Lockdown,Kanye West,7CNd7rjfVt74TFlcOcnZgN,False,15,3,4,0.76,0.524,1,-7.67,0,0.0323,0.0542,0.5,0.112,0.112,119.603,270307,4
2008-10-25,13,Closer,Ne-Yo,7CNd7rjfVt74TFlcOcnZgN,False,12,7,26,0.711,0.753,4,-6.461,0,0.0766,0.028,2.96e-05,0.152,0.588,126.051,234360,4
2008-10-25,14,Love Story,Taylor Swift,7CNd7rjfVt74TFlcOcnZgN,False,13,5,5,0.626,0.79,2,-4.302,1,0.0311,0.135,3.97e-06,0.0989,0.416,119.082,235767,4
2008-10-25,15,I'm Yours,Jason Mraz,7CNd7rjfVt74TFlcOcnZgN,False,16,6,26,0.686,0.457,11,-8.322,1,0.0468,0.595,0,0.105,0.718,150.953,242187,4
2008-10-25,16,Gotta Be Somebody,Nickelback,7CNd7rjfVt74TFlcOcnZgN,False,10,10,2,0.536,0.89,0,-5.222,1,0.0601,0.000354,0.00165,0.133,0.205,115.998,252653,4
2008-10-25,17,Keeps Gettin' Better,Christina Aguilera,7CNd7rjfVt74TFlcOcnZgN,False,7,7,2,0.645,0.697,5,-4.733,0,0.0285,0.0739,0.000842,0.575,0.25,130.001,181947,4
2008-10-25,18,Mrs. Officer,Lil Wayne Featuring Bobby Valentino & Kidd Kidd,7CNd7rjfVt74TFlcOcnZgN,False,19,18,8,0.92,0.553,6,-5.068,1,0.191,0.236,0,0.0767,0.947,112.022,286907,5
2008-10-25,19,One Step At A Time,Jordin Sparks,7CNd7rjfVt74TFlcOcnZgN,False,21,17,16,0.766,0.692,1,-4.672,1,0.0289,0.0825,0,0.0384,0.691,102.028,205160,4
2008-10-25,20,Forever,Chris Brown,7CNd7rjfVt74TFlcOcnZgN,False,18,2,25,0.672,0.82,11,-4.456,1,0.0459,0.0368,0.000188,0.184,0.438,120.005,278573,4
2008-10-25,21,Got Money,Lil Wayne Featuring T-Pain,7CNd7rjfVt74TFlcOcnZgN,False,20,10,20,0.694,0.661,7,-4.847,1,0.118,0.00188,0,0.676,0.702,82.48,244627,4
2008-10-25,22,Crush,David Archuleta,7CNd7rjfVt74TFlcOcnZgN,False,25,2,9,0.57,0.664,0,-4.718,0,0.0322,0.00836,1.2e-05,0.0719,0.487,162.084,213520,4
2008-10-25,23,My Life,The Game Featuring Lil Wayne,7CNd7rjfVt74TFlcOcnZgN,False,23,21,10,0.673,0.766,11,-5.018,1,0.349,0.0724,0,0.0563,0.382,148.113,320893,4
2008-10-25,24,Viva La Vida,Coldplay,7CNd7rjfVt74TFlcOcnZgN,False,22,1,23,0.486,0.617,5,-7.115,0,0.0287,0.0954,3.23e-06,0.109,0.417,138.015,242373,4
2008-10-25,25,Fall For You,Secondhand Serenade,7CNd7rjfVt74TFlcOcnZgN,False,26,21,18,0.387,0.442,0,-7.086,1,0.0352,0.19,0,0.0788,0.382,169.481,185600,4
2008-10-25,26,Right Now (Na Na Na),Akon,7CNd7rjfVt74TFlcOcnZgN,False,27,17,3,0.826,0.853,8,-4.219,0,0.172,0.289,0,0.35,0.567,137.996,244680,4
2008-10-25,27,Spotlight,Jennifer Hudson,7CNd7rjfVt74TFlcOcnZgN,False,29,27,12,0.707,0.724,11,-3.887,0,0.051,0.0448,0,0.072,0.659,108.984,250107,4
2008-10-25,28,American Boy,Estelle Featuring Kanye West,7CNd7rjfVt74TFlcOcnZgN,False,24,9,26,0.727,0.729,0,-2.99,1,0.326,0.171,0,0.07,0.512,117.932,284733,4
2008-10-25,29,In The Ayer,Flo Rida Featuring will.i.am,7CNd7rjfVt74TFlcOcnZgN,False,30,9,17,0.83,0.746,5,-6.286,0,0.0579,0.00456,0,0.26,0.646,125.992,220507,4
2008-10-25,30,Krazy,Pitbull Featuring Lil Jon,7CNd7rjfVt74TFlcOcnZgN,False,33,30,3,0.871,0.883,11,-5.075,0,0.105,0.0155,0,0.14,0.581,125.037,231507,4
2008-10-25,31,Dangerous,Kardinal Offishall Featuring Akon,7CNd7rjfVt74TFlcOcnZgN,False,28,5,23,0.949,0.79,8,-5.957,1,0.0756,0.00437,0,0.0816,0.807,117.002,246053,4
2008-10-25,32,Swagga Like Us,Jay-Z & T.I. Featuring Kanye West & Lil Wayne,7CNd7rjfVt74TFlcOcnZgN,False,31,5,5,0.579,0.809,4,-5.031,1,0.206,0.00154,0,0.564,0.258,88.99,329680,4
2008-10-25,33,Addicted,Saving Abel,7CNd7rjfVt74TFlcOcnZgN,False,42,33,18,0.512,0.864,7,-4.146,1,0.0338,0.000821,0,0.0982,0.527,138.018,222827,4
2008-10-25,34,Love Remains The Same,Gavin Rossdale,7CNd7rjfVt74TFlcOcnZgN,False,37,27,19,0.406,0.632,4,-5.115,1,0.0344,0.236,0,0.18,0.109,149.258,249440,4
2008-10-25,35,All Summer Long,Kid Rock,7CNd7rjfVt74TFlcOcnZgN,False,34,23,15,0.7,0.864,7,-3.629,1,0.0283,0.0212,0,0.0956,0.887,102.997,297587,4
2008-10-25,37,Just A Dream,Carrie Underwood,,False,41,37,10,0.526,0.781,7,-3.673,1,0.0369,0.0613,0,0.121,0.358,142.06,284707,4
2008-10-25,38,Need U Bad,Jazmine Sullivan,,False,40,37,13,0.529,0.659,7,-5.318,1,0.0629,0.0232,0,0.114,0.36,138.196,257427,4
2008-10-25,39,Bleeding Love,Leona Lewis,,False,35,1,35,0.638,0.656,5,-5.886,1,0.0357,0.188,0,0.146,0.225,104.036,262467,4
2008-10-25,40,I'm So Paid,Akon Featuring Lil Wayne & Young Jeezy,5264rU21ndum3CYYaSGUUm,True,0,40,1,0.471,0.865,6,-4.179,1,0.325,0.118,0,0.0994,0.516,92.037,263640,4
2008-10-25,41,Shake It,Metro Station,5264rU21ndum3CYYaSGUUm,False,49,10,28,0.618,0.955,4,-3.836,1,0.0798,0.00221,3.09e-06,0.486,0.79,150.034,179947,4
2008-10-25,42,Don't Think I Don't Think About It,Darius Rucker,5264rU21ndum3CYYaSGUUm,False,39,35,14,0.577,0.752,9,-5.264,1,0.0332,0.0275,0,0.125,0.404,149.686,183307,4
2008-10-25,43,Everybody Wants To Go To Heaven,Kenny Chesney With The Wailers,5264rU21ndum3CYYaSGUUm,False,46,41,9,0.705,0.693,11,-7.153,1,0.155,0.374,1.21e-05,0.65,0.555,137.741,252987,4
2008-10-25,44,T-Shirt,Shontelle,5264rU21ndum3CYYaSGUUm,False,51,44,6,0.679,0.657,6,-6.222,1,0.0423,0.0219,0,0.295,0.363,86.984,234760,4
2008-10-25,45,Take A Bow,Rihanna,5264rU21ndum3CYYaSGUUm,False,38,1,27,0.697,0.467,9,-7.536,1,0.0715,0.248,0,0.0941,0.572,82.082,229413,4
2008-10-25,46,I Kissed A Girl,Katy Perry,5264rU21ndum3CYYaSGUUm,False,36,1,23,0.699,0.76,5,-3.173,1,0.0677,0.00223,0,0.132,0.696,129.996,179640,4
2008-10-25,47,Chicken Fried,Zac Brown Band,5264rU21ndum3CYYaSGUUm,False,52,47,4,0.566,0.713,6,-4.25,1,0.0417,0.645,0,0.114,0.807,169.864,238147,4
2008-10-25,48,What About Now,Daughtry,5264rU21ndum3CYYaSGUUm,False,56,18,10,0.387,0.862,9,-2.219,0,0.0457,0.107,0,0.103,0.337,161.984,251627,4
2008-10-25,49,She Never Cried In Front Of Me,Toby Keith,5264rU21ndum3CYYaSGUUm,False,54,47,14,0.458,0.621,7,-4.553,1,0.0306,0.374,0,0.0999,0.34,145.904,239507,4
2008-10-25,50,Pocketful Of Sunshine,Natasha Bedingfield,5264rU21ndum3CYYaSGUUm,False,47,5,35,0.721,0.88,9,-3.896,0,0.0454,0.191,0,0.0769,0.655,110.021,202907,4
2008-10-25,51,Put On,Young Jeezy Featuring Kanye West,5264rU21ndum3CYYaSGUUm,False,45,12,19,0.654,0.77,9,-6.091,0,0.0353,0.00342,0,0.0887,0.272,137.616,321293,4
2008-10-25,52,Human,The Killers,5264rU21ndum3CYYaSGUUm,False,32,32,2,0.557,0.8,10,-8.477,1,0.0601,0.00132,0.0012,0.0906,0.582,135.47,245373,4
2008-10-25,53,Shattered (Turn The Car Around),O.A.R.,5264rU21ndum3CYYaSGUUm,False,55,51,10,0.571,0.784,11,-6.396,1,0.0352,0.0175,0,0.19,0.462,105.973,255493,4
2008-10-25,54,So Fly,Slim Featuring Yung Joc,5264rU21ndum3CYYaSGUUm,False,58,54,7,0.784,0.559,2,-4.862,1,0.0846,0.0021,0,0.412,0.698,90.994,212453,4
2008-10-25,55,Swing,Savage Featuring Soulja Boy Tell'em,5264rU21ndum3CYYaSGUUm,False,57,45,11,0.885,0.474,1,-8.133,0,0.25,0.0209,0,0.0895,0.794,150.072,217893,4
2008-10-25,56,When I Grow Up,The Pussycat Dolls,5264rU21ndum3CYYaSGUUm,False,50,9,20,0.671,0.685,11,-5.762,0,0.05,0.00165,0,0.398,0.368,118.449,245680,4
2008-10-25,57,All Summer Long,The Rock Heroes,5264rU21ndum3CYYaSGUUm,False,48,29,4,0.606,0.885,7,-4.377,1,0.0336,0.00825,0,0.0634,0.855,102.992,296347,4
2008-10-25,58,Green Light,John Legend Featuring Andre 3000,5264rU21ndum3CYYaSGUUm,False,59,44,6,0.622,0.882,9,-5.59,0,0.119,0.0912,0,0.216,0.762,77.506,284187,4
2008-10-25,59,Waitin' On A Woman,Brad Paisley,5264rU21ndum3CYYaSGUUm,False,61,44,14,0.548,0.617,0,-7.093,1,0.0283,0.0846,5.09e-05,0.113,0.339,76.371,272587,4
2008-10-25,60,Just Dance,Lady Gaga Featuring Colby O'Donis,5264rU21ndum3CYYaSGUUm,False,66,60,10,0.813,0.74,1,-4.668,0,0.0327,0.0318,1.43e-05,0.166,0.699,118.976,244055,4
2008-10-25,61,Body On Me,Nelly Featuring Ashanti & Akon,5264rU21ndum3CYYaSGUUm,False,60,42,13,0.66,0.623,7,-7.321,0,0.152,0.0851,0,0.0841,0.736,179.986,200720,4
2008-10-25,62,Johnny & June,Heidi Newfield,5264rU21ndum3CYYaSGUUm,False,63,58,14,0.592,0.515,5,-6.486,1,0.0299,0.458,1.28e-06,0.116,0.269,141.949,218453,4
2008-10-25,63,Roll With Me,Montgomery Gentry,5264rU21ndum3CYYaSGUUm,False,73,63,5,0.552,0.648,2,-6.71,1,0.0273,0.0533,0.00015,0.144,0.407,142.159,233933,4
2008-10-25,64,Let It Go,Tim McGraw,5264rU21ndum3CYYaSGUUm,False,72,64,5,0.477,0.86,1,-4.16,1,0.032,0.322,0,0.313,0.473,159.27,225027,4
2008-10-25,65,Do You Believe Me Now,Jimmy Wayne,5264rU21ndum3CYYaSGUUm,False,62,36,13,0.503,0.827,4,-4.046,1,0.0553,0.0723,1.15e-06,0.126,0.376,161.834,204387,4
2008-10-25,66,Light On,David Cook,5264rU21ndum3CYYaSGUUm,False,17,17,2,0.446,0.834,9,-4.014,0,0.0341,0.0794,0,0.114,0.363,132.034,228827,4
2008-10-25,67,Angel,Natasha Bedingfield,5264rU21ndum3CYYaSGUUm,False,70,67,4,0.566,0.749,2,-4.435,1,0.0507,0.0574,0,0.388,0.503,134.909,246947,4
2008-10-25,68,It's Over,Jesse McCartney,5264rU21ndum3CYYaSGUUm,False,88,68,2,0.593,0.679,1,-4.68,0,0.0507,0.284,0,0.152,0.207,135.931,246907,4
2008-10-25,69,Right Here (Departed),Brandy,5264rU21ndum3CYYaSGUUm,False,74,69,5,0.568,0.682,8,-5.781,1,0.0439,0.256,0,0.231,0.366,92.99,217947,4
2008-10-25,70,Bartender Song,Rehab,5264rU21ndum3CYYaSGUUm,False,68,64,16,0.667,0.673,4,-6.006,1,0.0536,0.117,0,0.343,0.706,151.834,229040,4
2008-10-25,71,Already Gone,Sugarland,5264rU21ndum3CYYaSGUUm,False,75,71,3,0.48,0.596,1,-5.844,1,0.03,0.214,1.06e-05,0.151,0.332,154.769,275867,3
2008-10-25,72,Come On Get Higher,Matt Nathanson,5264rU21ndum3CYYaSGUUm,False,69,69,7,0.672,0.623,9,-5.699,1,0.0297,0.241,0,0.0848,0.617,92.018,215173,4
2008-10-25,73,I Don't Care,Fall Out Boy,5264rU21ndum3CYYaSGUUm,False,79,21,5,0.55,0.938,11,-3.556,0,0.0522,0.00171,2.18e-05,0.555,0.433,133.99,214493,4
2008-10-25,74,Headfirst Slide Into Cooperstown On A Bad Bet,Fall Out Boy,5qiG5FhrnE7dl0ZxhKc3My,True,0,74,1,0.606,0.768,2,-4.269,0,0.0326,0.00806,5.21e-06,0.378,0.541,120.054,234493,4
2008-10-25,75,Bad Girlfriend,Theory Of A Deadman,5qiG5FhrnE7dl0ZxhKc3My,False,77,75,4,0.504,0.957,0,-2.657,1,0.0529,0.00298,0,0.187,0.676,135.013,205627,4
2008-10-25,76,The Business,Yung Berg Featuring Casha,5qiG5FhrnE7dl0ZxhKc3My,False,65,33,14,0.63,0.726,7,-5.372,1,0.177,0.00867,0,0.0864,0.327,133.317,253840,4
2008-10-25,77,Troubadour,George Strait,5qiG5FhrnE7dl0ZxhKc3My,False,67,54,14,0.568,0.621,11,-6.395,1,0.0261,0.356,0.000577,0.274,0.346,136.094,176227,4
2008-10-25,78,Country Man,Luke Bryan,5qiG5FhrnE7dl0ZxhKc3My,False,85,78,6,0.739,0.836,4,-4.433,1,0.0307,0.031,0,0.494,0.858,120.001,190227,4
2008-10-25,79,Cry For You,September,5qiG5FhrnE7dl0ZxhKc3My,False,81,74,9,0.776,0.878,9,-3.377,1,0.0304,0.00141,0.000204,0.0574,0.96,130.022,211600,4
2008-10-25,80,Magic,Robin Thicke,5qiG5FhrnE7dl0ZxhKc3My,False,64,59,16,0.737,0.624,7,-6.487,1,0.0398,0.251,0.00295,0.101,0.651,107.959,233227,4
2008-10-25,81,Bust Your Windows,Jazmine Sullivan,56z2qI0gKcPthQF6l8AW3E,True,0,81,1,0.683,0.664,5,-4.233,0,0.0332,0.538,0,0.0671,0.866,106.991,266307,4
2008-10-25,82,Feel That Fire,Dierks Bentley,0U7Q336Pth6J3mPy736fQq,True,0,82,1,0.412,0.833,1,-3.865,1,0.0352,0.371,1.28e-05,0.208,0.669,179.846,201507,4
2008-10-25,83,Here,Rascal Flatts,0U7Q336Pth6J3mPy736fQq,False,94,83,2,0.458,0.585,2,-5.574,1,0.0342,0.324,0,0.231,0.196,145.977,245373,4
2008-10-25,84,I'll Walk,Bucky Covington,0U7Q336Pth6J3mPy736fQq,False,93,84,2,0.509,0.389,7,-7.433,1,0.0272,0.8,0,0.113,0.302,77.098,210213,4
2008-10-25,85,In Color,Jamey Johnson,0U7Q336Pth6J3mPy736fQq,False,99,85,2,0.544,0.404,3,-8.751,1,0.0354,0.391,3.98e-06,0.157,0.251,129.518,290680,4
2008-10-25,86,Lovebug,Jonas Brothers,0U7Q336Pth6J3mPy736fQq,False,86,78,5,0.597,0.499,4,-6.216,1,0.0581,0.126,0,0.214,0.521,79.071,220693,4
2008-10-25,87,Superwoman,Alicia Keys,0U7Q336Pth6J3mPy736fQq,False,82,82,5,0.408,0.494,0,-8.291,1,0.0476,0.267,0.00285,0.11,0.136,161.698,274107,4
2008-10-25,88,The Day That Never Comes,Metallica,0U7Q336Pth6J3mPy736fQq,False,91,31,7,0.334,0.986,4,-1.046,0,0.0576,0.000114,0.0353,0.0805,0.48,124.668,476267,4
2008-10-25,89,Please Excuse My Hands,Plies Featuring Jamie Foxx & The-Dream,0U7Q336Pth6J3mPy736fQq,False,71,66,12,0.698,0.828,2,-5.248,0,0.0756,0.0229,0,0.0836,0.484,124.964,264440,4
2008-10-25,90,All I Ever Wanted,Chuck Wicks,0U7Q336Pth6J3mPy736fQq,False,95,90,2,0.538,0.773,11,-4.659,1,0.0281,0.0268,0,0.0829,0.611,94.053,207333,4
2008-10-25,91,Lookin' For A Good Time,Lady Antebellum,1Ec7xc3zWcd4ysMINmr9LW,True,0,91,1,0.665,0.936,7,-2.97,1,0.0544,0.0146,0,0.125,0.848,122.003,187320,4
2008-10-25,92,I Still Miss You,Keith Anderson,1Ec7xc3zWcd4ysMINmr9LW,False,80,48,18,0.505,0.763,3,-5.386,1,0.0297,0.14,0,0.0949,0.446,156.024,235907,4
2008-10-25,93,The Shock Of The Lightning,Oasis,72pRggptACNxeYG0vG3V3Q,True,0,93,1,0.329,0.953,11,-2.416,0,0.0874,4.47e-05,0.558,0.302,0.0374,136.922,299947,4
2008-10-25,94,You Look Good In My Shirt,Keith Urban,72pRggptACNxeYG0vG3V3Q,False,98,44,17,0.653,0.865,7,-6.395,1,0.0325,0.0075,1.18e-06,0.0629,0.828,116.966,227733,4
2008-10-25,95,Without You,Hinder,72pRggptACNxeYG0vG3V3Q,False,89,89,2,0.415,0.816,3,-3.831,1,0.0333,0.0299,2.09e-05,0.129,0.264,136.017,232267,4
2008-10-25,96,"You're Gonna Go Far, Kid",The Offspring,6TfBA04WJ3X1d1wXhaCFVT,True,0,96,1,0.55,0.917,0,-3.159,1,0.0638,0.00428,0,0.197,0.601,126.115,177827,4
2008-10-25,97,No Me Doy Por Vencido,Luis Fonsi,6TfBA04WJ3X1d1wXhaCFVT,False,100,92,5,0.273,0.721,3,-3.992,1,0.0608,0.42,0,0.393,0.405,173.222,237093,3
2008-10-25,98,Out Here Grindin,"DJ Khaled Feat. Akon, Plies, Young Jeezy, Rick Ross, Ace Hood, Trick Daddy & Lil' Boosie",6TfBA04WJ3X1d1wXhaCFVT,False,87,38,15,0.633,0.842,11,-1.928,1,0.183,0.0114,0,0.179,0.336,176.029,261133,4
2008-10-25,99,Burnin' Up,Jonas Brothers,6TfBA04WJ3X1d1wXhaCFVT,False,84,5,16,0.667,0.954,2,-3.462,1,0.0817,0.0296,0,0.331,0.807,114.0,175093,4
2008-10-25,100,If I Were A Boy,Beyonce,26NX1wPt1TRCH536yocd6i,True,0,100,1,0.632,0.518,6,-6.126,1,0.0313,0.107,0,0.354,0.427,90.007,249147,4
