date,position,title,artist,spotify_id,is_new,last_pos,peak_pos,weeks,danceability,energy,key,loudness,mode,speechiness,acousticness,instrumentalness,liveness,valence,tempo,duration_ms,time_signature
1997-06-07,1,MMMBop,Hanson,,False,1,1,6,0.683,0.937,9,-6.335,1,0.0449,0.00481,0.0046,0.07,0.619,104.872,268653,4
1997-06-07,2,Return Of The Mack,Mark Morrison,,False,4,2,15,0.715,0.833,2,-5.379,1,0.108,0.00631,0,0.164,0.612,95.487,213093,4
1997-06-07,3,Say You'll Be There,Spice Girls,,False,3,3,3,0.726,0.679,1,-6.219,1,0.0473,0.0149,1.49e-06,0.0837,0.751,107.02,235973,4
1997-06-07,4,Hypnotize,The Notorious B.I.G.,,False,2,1,7,0.901,0.697,9,-3.439,1,0.28,0.145,0,0.287,0.67,93.941,229827,4
1997-06-07,5,The Freshmen,The Verve Pipe,,False,8,5,16,0.571,0.505,1,-9.312,0,0.0238,0.0757,1.04e-05,0.109,0.276,99.562,269467,4
1997-06-07,6,I Belong To You (Every Time I See Your Face),Rome,,False,7,6,13,0.759,0.337,0,-11.034,0,0.035,0.026,0,0.0753,0.335,117.845,273267,4
1997-06-07,8,G.H.E.T.T.O.U.T.,Changing Faces,,False,12,8,5,0.71,0.312,10,-6.918,0,0.0325,0.391,2.19e-06,0.0682,0.535,108.262,264960,4
1997-06-07,9,It's Your Love,Tim McGraw With Faith Hill,,False,13,9,4,0.453,0.291,7,-13.132,1,0.0265,0.303,0.141,0.144,0.17,140.268,228768,4
1997-06-07,10,Hard To Say I'm Sorry,Az Yet Featuring Peter Cetera,,False,11,8,16,0.537,0.413,5,-9.949,0,0.0366,0.604,0,0.16,0.22,127.77,195693,4
1997-06-07,11,I Want You,Savage Garden,,False,9,4,15,0.628,0.871,7,-6.44,1,0.0363,0.0077,1.64e-06,0.392,0.615,106.101,232067,4
1997-06-07,12,"For You I Will (From ""Space Jam"")",Monica,,False,6,4,13,0.652,0.473,0,-7.981,0,0.0313,0.243,0,0.134,0.368,123.208,294867,4
1997-06-07,13,Where Have All The Cowboys Gone?,Paula Cole,,False,10,8,9,0.588,0.826,11,-6.182,0,0.0569,0.0351,0,0.454,0.621,129.021,263653,4
1997-06-07,14,Bitch,Meredith Brooks,,False,20,14,7,0.617,0.886,9,-5.953,1,0.055,0.0112,9.63e-05,0.0523,0.629,96.328,252760,4
1997-06-07,16,Cupid,112,,False,15,13,15,0.685,0.38,8,-11.219,1,0.112,0.373,0,0.0371,0.87,175.562,252267,4
1997-06-07,17,Da' Dip,Freak Nasty,,False,16,15,23,0.953,0.428,8,-17.199,1,0.298,0.0079,0.0302,0.224,0.723,131.737,237000,4
1997-06-07,18,Barely Breathing,Duncan Sheik,,False,17,16,28,0.482,0.807,0,-6.976,1,0.0457,0.0281,0,0.177,0.516,187.918,254547,4
1997-06-07,20,My Baby Daddy,B-Rock & The Bizz,,False,18,10,8,0.384,0.924,9,-7.424,1,0.0527,0.000105,0.911,0.1,0.583,134.006,152560,4
1997-06-07,21,"Don't Wanna Be A Player (From ""Booty Call"")",Joe,,False,21,21,6,0.509,0.547,8,-5.675,0,0.0619,0.534,0,0.0461,0.878,81.736,307160,4
1997-06-07,22,Thinking Of You,Tony Toni Tone,,False,28,22,5,0.789,0.599,11,-6.96,1,0.0565,0.504,1.2e-05,0.117,0.66,85.438,238800,4
1997-06-07,23,Your Woman,White Town,,False,24,23,11,0.815,0.605,5,-9.118,0,0.0368,0.033,0.684,0.114,0.795,102.643,259893,4
1997-06-07,24,Un-Break My Heart,Toni Braxton,,False,23,1,33,0.625,0.426,2,-8.392,0,0.0271,0.413,0,0.116,0.112,110.018,270333,4
1997-06-07,25,Do You Know (What It Takes),Robyn,,False,36,25,2,0.635,0.74,3,-4.439,0,0.0355,0.00465,0.0152,0.129,0.857,200.102,221293,4
1997-06-07,26,Secret Garden,Bruce Springsteen,,False,22,19,19,0.52,0.329,0,-14.224,1,0.0266,0.576,0.0418,0.12,0.118,86.857,266613,4
1997-06-07,27,"I Believe I Can Fly (From ""Space Jam"")",R. Kelly,,False,26,2,26,0.572,0.538,7,-5.241,1,0.0279,0.151,0,0.0754,0.0584,120.455,284800,4
1997-06-07,28,Wannabe,Spice Girls,,False,25,1,20,0.768,0.864,11,-6.145,1,0.0324,0.101,0,0.162,0.891,110.008,173027,4
1997-06-07,29,Every Time I Close My Eyes,Babyface,,False,27,6,19,0.654,0.417,5,-7.699,1,0.025,0.0624,0,0.0963,0.279,143.676,296267,4
1997-06-07,30,Don't Let Go (Love),En Vogue,,False,30,2,31,0.618,0.688,5,-5.867,0,0.0477,0.409,6.32e-06,0.3,0.561,78.311,291880,4
1997-06-07,31,Staring At The Sun,U2,,False,29,26,7,0.533,0.702,9,-8.504,0,0.0265,0.0549,0.0221,0.27,0.515,140.201,276800,4
1997-06-07,32,In My Bed,Dru Hill,,False,32,4,22,0.828,0.654,10,-7.674,0,0.226,0.106,0,0.0689,0.817,95.254,242360,4
1997-06-07,33,Everyday Is A Winding Road,Sheryl Crow,,False,31,11,11,0.629,0.673,6,-8.285,1,0.0406,0.0419,3.64e-05,0.1,0.717,112.955,256000,4
1997-06-07,34,Alone,Bee Gees,7GsoUeI9DtaTSjJHenyCNP,True,0,34,1,0.639,0.792,2,-5.084,1,0.0301,0.0912,0.000194,0.303,0.748,110.016,290067,4
1997-06-07,35,For You,Kenny Lattimore,7GsoUeI9DtaTSjJHenyCNP,False,33,33,11,0.633,0.42,4,-11.784,1,0.0352,0.737,0,0.0727,0.482,137.693,236147,4
1997-06-07,36,Get It Together,702,7GsoUeI9DtaTSjJHenyCNP,False,35,10,17,0.791,0.186,10,-11.367,1,0.0333,0.625,2.67e-06,0.0574,0.317,114.061,291400,4
1997-06-07,37,All By Myself,Celine Dion,7GsoUeI9DtaTSjJHenyCNP,False,37,4,11,0.344,0.325,11,-10.005,0,0.0287,0.35,0.0223,0.0686,0.0775,118.515,312307,4
1997-06-07,38,It's No Good,Depeche Mode,7GsoUeI9DtaTSjJHenyCNP,False,40,38,4,0.601,0.756,10,-6.48,0,0.0348,0.00866,0.0413,0.0821,0.185,99.096,358520,4
1997-06-07,39,Ooh Aah... Just A Little Bit,Gina G,7GsoUeI9DtaTSjJHenyCNP,False,39,12,28,0.647,0.942,1,-7.101,1,0.0341,0.626,0.168,0.0411,0.937,130.978,203120,4
1997-06-07,41,Naked Eye,Luscious Jackson,,False,38,36,25,0.737,0.657,4,-10.962,0,0.0284,0.0863,0.0339,0.0953,0.76,131.022,280693,4
1997-06-07,42,I'll Be,Foxy Brown Featuring Jay-Z,,False,34,7,17,0.855,0.614,11,-8.984,0,0.41,0.015,0,0.307,0.495,105.986,178600,4
1997-06-07,43,5 Miles To Empty,Brownstone,,False,52,43,4,0.671,0.733,3,-10.884,0,0.0283,5.01e-05,0.858,0.0745,0.803,123.577,225933,4
1997-06-07,44,Come On,Billy Lawrence Featuring MC Lyte,,False,47,44,9,0.758,0.495,7,-8.252,1,0.0566,0.133,2.68e-06,0.698,0.733,94.414,248027,4
1997-06-07,45,Until I Find You Again,Richard Marx,,False,42,42,8,0.535,0.112,0,-18.323,1,0.0654,0.993,0.913,0.106,0.312,72.913,276867,4
1997-06-07,46,"The Perfect Drug (From ""Lost Highway"")",Nine Inch Nails,,False,48,46,2,0.627,0.883,5,-8.988,0,0.0947,0.0207,0.00346,0.323,0.252,149.024,315440,4
1997-06-07,47,I Wanna Be There,Blessid Union Of Souls,,False,51,47,5,0.506,0.657,7,-7.291,1,0.0278,0.0373,0,0.0432,0.496,140.481,270027,4
1997-06-07,48,Call Me,Le Click,,False,54,48,14,0.674,0.849,1,-11.271,0,0.029,0.0126,1.37e-05,0.357,0.791,136.033,225400,4
1997-06-07,49,I Shot The Sheriff,Warren G,,False,41,20,12,0.859,0.68,10,-9.213,0,0.159,0.0289,1.09e-05,0.261,0.753,91.444,250240,4
1997-06-07,50,Let Me Clear My Throat,DJ Kool,,False,44,30,19,0.697,0.901,7,-7.154,1,0.259,0.169,0,0.356,0.535,103.145,290160,4
1997-06-07,52,What's On Tonight,Montell Jordan,,False,43,21,17,0.826,0.447,5,-11.535,1,0.0442,0.33,3.2e-06,0.126,0.434,111.806,276653,4
1997-06-07,53,One More Time,Real McCoy,,False,45,27,11,0.671,0.862,5,-11.367,1,0.0351,0.000889,0.7,0.167,0.855,133.117,238707,3
1997-06-07,55,A Little Bit Of Ecstasy,Jocelyn Enriquez,,False,61,55,10,0.496,0.762,6,-7.64,0,0.0628,0.036,0.00199,0.315,0.674,130.004,248000,4
1997-06-07,56,"Go The Distance (From ""Hercules"")",Michael Bolton,3hS5RCp5EE1wUiiE7f8dM1,True,0,56,1,0.363,0.435,2,-8.141,1,0.0307,0.399,0,0.219,0.148,125.892,280640,4
1997-06-07,57,Here's Your Sign (Get The Picture),Bill Engvall With Special Guest Travis Tritt,3hS5RCp5EE1wUiiE7f8dM1,False,56,43,16,0.586,0.936,7,-6.605,1,0.549,0.337,0,0.928,0.732,178.068,220173,4
1997-06-07,58,That's Right,DJ Taz Featuring Raheem The Dream,3hS5RCp5EE1wUiiE7f8dM1,False,68,58,10,0.827,0.678,6,-12.854,0,0.0738,0.00319,0,0.108,0.896,135.09,372493,4
1997-06-07,59,Blood On The Dance Floor,Michael Jackson,3hS5RCp5EE1wUiiE7f8dM1,False,57,42,5,0.807,0.741,1,-4.472,1,0.083,0.0135,0.0316,0.06,0.558,108.989,253000,4
1997-06-07,61,Full Of Smoke,Christion,,False,63,61,7,0.389,0.616,1,-8.747,0,0.284,0.453,0,0.916,0.716,145.461,289227,3
1997-06-07,62,"Let It Go (From ""Set It Off"")",Ray J,,False,59,25,14,0.626,0.922,9,-2.037,1,0.0714,0.00789,0.000598,0.277,0.554,139.987,184811,4
1997-06-07,63,"Too Late, Too Soon",Jon Secada,,False,53,41,13,0.642,0.45,8,-9.53,1,0.0382,0.452,0.00152,0.107,0.187,160.651,255267,4
1997-06-07,64,In My Arms,Erasure,,False,55,55,3,0.591,0.911,2,-5.65,1,0.0407,0.122,0.000575,0.391,0.438,99.992,216200,4
1997-06-07,65,Sweet Sexy Thing,Nu Flavor Featuring Roger,,False,67,65,8,0.824,0.574,1,-7.541,0,0.0324,0.308,0,0.0668,0.781,103.179,285760,4
1997-06-07,66,Silent All These Years,Tori Amos,,False,66,65,12,0.484,0.158,4,-14.687,1,0.0374,0.94,1.64e-05,0.109,0.296,128.06,251226,4
1997-06-07,67,If Tomorrow Never Comes,Joose,,False,65,51,12,0.6,0.223,6,-13.81,1,0.027,0.649,0.297,0.0832,0.218,141.001,244846,4
1997-06-07,68,"The World Tonight (From ""Fathers' Day"")",Paul McCartney,,False,64,64,3,0.69,0.596,4,-12.262,0,0.0279,0.0732,0.00104,0.128,0.742,120.014,245907,4
1997-06-07,69,You Don't Have To Hurt No More,Mint Condition,,False,58,32,11,0.769,0.449,8,-6.757,0,0.0282,0.0717,5.25e-05,0.0851,0.481,113.89,323027,4
1997-06-07,70,Step Into A World (Rapture's Delight),KRS-One,,False,71,70,10,0.803,0.806,0,-7.805,1,0.265,0.00761,0.00544,0.101,0.624,94.994,289907,4
1997-06-07,71,Gangstas Make The World Go Round,Westside Connection,,False,69,40,14,0.754,0.575,9,-8.22,1,0.366,0.0977,0,0.474,0.561,180.389,272834,4
1997-06-07,72,6 Underground,Sneaker Pimps,,False,79,72,6,0.587,0.687,1,-8.635,0,0.0509,0.0281,0.14,0.121,0.402,169.938,228840,4
1997-06-07,73,Insomnia,Faithless,,False,72,62,11,0.711,0.756,7,-10.637,1,0.0302,0.0352,0.00313,0.138,0.493,127.108,213547,4
1997-06-07,74,One More Day,New Edition,61jNGa6MxlzLNsDqyqn0Bi,True,0,74,1,0.655,0.742,7,-6.247,1,0.0448,0.402,3.03e-05,0.106,0.429,88.031,304467,4
1997-06-07,75,Just Another Day,John Mellencamp,61jNGa6MxlzLNsDqyqn0Bi,False,70,46,16,0.715,0.738,0,-5.674,1,0.0325,0.096,0.000136,0.0978,0.896,144.145,207893,4
1997-06-07,76,Jazzy Belle,OutKast,61jNGa6MxlzLNsDqyqn0Bi,False,76,52,9,0.878,0.65,11,-8.08,0,0.252,0.0178,0,0.0408,0.101,92.03,251667,4
1997-06-07,77,Head Over Heels,Allure Featuring NAS,61jNGa6MxlzLNsDqyqn0Bi,False,73,35,13,0.848,0.577,10,-10.07,0,0.103,0.08,0,0.369,0.674,96.045,251707,4
1997-06-07,78,The New Pollution,Beck,61jNGa6MxlzLNsDqyqn0Bi,False,78,78,2,0.671,0.769,1,-6.529,1,0.0268,0.0287,0.00987,0.32,0.89,131.787,219987,4
1997-06-07,79,"Step By Step (From ""The Preacher's Wife"")",Whitney Houston,61jNGa6MxlzLNsDqyqn0Bi,False,80,15,13,0.752,0.79,2,-8.648,1,0.0507,0.0797,5.78e-05,0.284,0.202,115.976,252533,4
1997-06-07,80,One Night At A Time,George Strait,61jNGa6MxlzLNsDqyqn0Bi,False,77,59,10,0.696,0.482,4,-11.811,1,0.0258,0.439,0.0023,0.0651,0.513,113.001,230933,4
1997-06-07,81,Havana,Kenny G,61jNGa6MxlzLNsDqyqn0Bi,False,81,66,14,0.403,0.328,0,-12.372,0,0.033,0.807,0.785,0.228,0.291,113.075,440400,4
1997-06-07,83,Ghetto Love,Da Brat Featuring T-Boz,,False,75,16,12,0.778,0.611,4,-8.796,0,0.111,0.00451,0,0.336,0.247,93.926,204000,4
1997-06-07,84,"Who You Wit (From ""Sprung"")",JAY-Z,3DG2hUPMLKcFptV1Gv32oI,True,0,84,1,0.798,0.643,1,-8.66,1,0.478,0.0766,0,0.611,0.566,92.396,269707,4
1997-06-07,85,When I Die,No Mercy,4z1IYRhVpbLCBaqZXYIl66,True,0,85,1,0.733,0.354,1,-14.382,1,0.0536,0.438,1.3e-05,0.12,0.816,147.859,269307,4
1997-06-07,86,The Theme (It's Party Time),Tracey Lee,4z1IYRhVpbLCBaqZXYIl66,False,83,55,17,0.75,0.658,6,-8.658,0,0.305,0.0108,0,0.125,0.427,99.113,272800,4
1997-06-07,87,If U Stay Ready,Suga Free,4z1IYRhVpbLCBaqZXYIl66,False,87,87,3,0.701,0.688,4,-5.66,0,0.211,0.0194,0,0.0384,0.445,97.683,287027,4
1997-06-07,88,Sometimes,The Brand New Heavies,4z1IYRhVpbLCBaqZXYIl66,False,91,88,4,0.784,0.677,9,-6.389,0,0.0323,0.0239,0,0.0883,0.691,96.916,286000,4
1997-06-07,89,Please Don't Go,No Mercy,4z1IYRhVpbLCBaqZXYIl66,False,90,21,18,0.715,0.838,7,-10.541,0,0.0341,0.169,3.67e-05,0.395,0.962,124.625,240093,4
1997-06-07,90,Don't Stop Movin',Livin' Joy,4z1IYRhVpbLCBaqZXYIl66,False,82,67,20,0.703,0.723,2,-10.816,0,0.0445,0.0287,0.00337,0.297,0.867,129.992,215227,4
1997-06-07,91,It Must Be Love,Robin S.,4z1IYRhVpbLCBaqZXYIl66,False,97,91,4,0.705,0.854,5,-8.439,0,0.0312,0.00271,0.117,0.16,0.614,124.954,577667,4
1997-06-07,93,The Old Apartment,Barenaked Ladies,,False,88,88,5,0.467,0.664,10,-10.189,1,0.0479,0.0448,0,0.365,0.642,159.858,209960,4
1997-06-07,94,Talk To Me,Wild Orchid,,False,86,48,15,0.726,0.829,8,-5.042,1,0.04,0.0389,4.49e-05,0.33,0.778,119.634,288800,4
1997-06-07,95,"It's Alright, It's Ok",Leah Andreone,,False,89,57,20,0.734,0.67,0,-5.838,0,0.0321,0.0113,1.25e-06,0.224,0.656,110.022,265133,4
1997-06-07,96,Do G's Get To Go To Heaven?,Richie Rich,,False,94,57,15,0.673,0.427,2,-10.131,1,0.248,0.602,0.000663,0.096,0.444,84.127,359493,4
1997-06-07,97,Feelin' It,JAY-Z,,False,99,79,6,0.558,0.703,10,-7.851,1,0.304,0.322,0,0.376,0.709,81.849,227360,4
1997-06-07,98,"Don't Cry For Me Argentina (From ""Evita"")",Madonna,,False,93,8,16,0.217,0.146,11,-13.9,1,0.0373,0.901,4.49e-06,0.222,0.0847,75.922,331467,4
1997-06-07,99,Precious Declaration,Collective Soul,,False,92,65,10,0.529,0.866,11,-5.053,1,0.0391,0.0321,0.00117,0.148,0.759,107.544,221187,4
1997-06-07,100,Falling In Love (Is Hard On The Knees),Aerosmith,,False,95,35,15,0.612,0.861,7,-4.571,0,0.0293,0.0144,0,0.119,0.888,116.663,205800,4
