date,position,title,artist,spotify_id,is_new,last_pos,peak_pos,weeks,danceability,energy,key,loudness,mode,speechiness,acousticness,instrumentalness,liveness,valence,tempo,duration_ms,time_signature
2016-02-13,1,Love Yourself,Justin Bieber,3anp5nvmUKwMBEIEL1sPHR,False,2,1,11,0.759,0.401,4,-8.999,1,0.259,0.86,0,0.299,0.576,100.126,232627,4
2016-02-13,2,Sorry,Justin Bieber,3anp5nvmUKwMBEIEL1sPHR,False,1,1,14,0.679,0.748,0,-3.624,0,0.0385,0.0878,0,0.299,0.438,100.035,200787,4
2016-02-13,3,Stressed Out,twenty one pilots,3anp5nvmUKwMBEIEL1sPHR,False,4,3,19,0.734,0.637,4,-5.677,0,0.141,0.0462,2.29e-05,0.0602,0.648,169.977,202333,4
2016-02-13,4,Hello,Adele,3anp5nvmUKwMBEIEL1sPHR,False,3,1,14,0.578,0.43,5,-6.134,0,0.0305,0.33,0,0.0854,0.288,78.991,295502,4
2016-02-13,5,My House,Flo Rida,3anp5nvmUKwMBEIEL1sPHR,False,12,5,12,0.688,0.702,7,-4.792,0,0.0499,0.0215,0,0.128,0.74,94.006,192191,4
2016-02-13,6,Roses,The Chainsmokers Featuring Rozes,3anp5nvmUKwMBEIEL1sPHR,False,8,6,15,0.713,0.802,4,-7.055,1,0.0561,0.0435,0.00377,0.309,0.343,100.001,226739,4
2016-02-13,7,Hands To Myself,Selena Gomez,3anp5nvmUKwMBEIEL1sPHR,False,21,7,8,0.811,0.507,5,-7.161,0,0.117,0.0146,2.14e-06,0.342,0.438,111.016,200680,4
2016-02-13,8,Same Old Love,Selena Gomez,3anp5nvmUKwMBEIEL1sPHR,False,7,5,20,0.672,0.593,11,-4.01,0,0.0304,0.0223,0,0.214,0.438,98.02,229080,4
2016-02-13,9,Work,Rihanna Featuring Drake,72TFWvU3wUYdUuxejTTIzt,True,0,9,1,0.725,0.534,11,-6.238,1,0.0946,0.0752,0,0.0919,0.558,91.974,219320,4
2016-02-13,10,Here,Alessia Cara,72TFWvU3wUYdUuxejTTIzt,False,5,5,26,0.376,0.821,0,-3.974,1,0.104,0.0785,0,0.0823,0.331,120.462,199453,4
2016-02-13,11,Stitches,Shawn Mendes,72TFWvU3wUYdUuxejTTIzt,False,6,4,36,0.736,0.74,10,-6.662,0,0.0912,0.0174,0,0.0481,0.737,74.99,206879,4
2016-02-13,12,"Me, Myself & I",G-Eazy x Bebe Rexha,72TFWvU3wUYdUuxejTTIzt,False,16,12,13,0.756,0.674,0,-6.518,0,0.0959,0.0184,0,0.158,0.389,111.995,251467,4
2016-02-13,13,In The Night,The Weeknd,72TFWvU3wUYdUuxejTTIzt,False,13,12,12,0.505,0.68,7,-4.993,1,0.0714,0.0796,0,0.0465,0.539,168.022,235653,3
2016-02-13,14,Hotline Bling,Drake,72TFWvU3wUYdUuxejTTIzt,False,9,2,26,0.891,0.628,2,-7.863,1,0.0551,0.00258,0.00019,0.0504,0.552,134.966,267067,4
2016-02-13,15,Like I'm Gonna Lose You,Meghan Trainor Featuring John Legend,72TFWvU3wUYdUuxejTTIzt,False,11,8,30,0.63,0.53,0,-7.259,1,0.0434,0.4,0,0.177,0.417,108.038,225053,3
2016-02-13,16,Don't,Bryson Tiller,72TFWvU3wUYdUuxejTTIzt,False,15,13,18,0.765,0.356,11,-5.556,0,0.195,0.223,0,0.0963,0.189,96.991,198293,4
2016-02-13,17,What Do You Mean?,Justin Bieber,72TFWvU3wUYdUuxejTTIzt,False,10,1,22,0.832,0.631,5,-6.19,0,0.0736,0.585,0.000892,0.0838,0.836,125.038,208543,4
2016-02-13,18,Cake By The Ocean,DNCE,72TFWvU3wUYdUuxejTTIzt,False,22,18,15,0.774,0.753,4,-5.446,0,0.0517,0.152,0,0.0371,0.896,119.002,219147,4
2016-02-13,19,White Iverson,Post Malone,72TFWvU3wUYdUuxejTTIzt,False,17,14,21,0.675,0.562,7,-7.678,1,0.0352,0.233,0,0.0816,0.309,130.098,256533,4
2016-02-13,20,Jumpman,Drake & Future,72TFWvU3wUYdUuxejTTIzt,False,14,12,19,0.852,0.553,1,-7.286,1,0.187,0.0559,0,0.332,0.656,142.079,205879,4
2016-02-13,21,The Hills,The Weeknd,72TFWvU3wUYdUuxejTTIzt,False,18,1,36,0.585,0.564,0,-7.063,0,0.0515,0.0671,0,0.135,0.137,113.003,242253,4
2016-02-13,22,One Call Away,Charlie Puth,72TFWvU3wUYdUuxejTTIzt,False,26,22,9,0.667,0.613,1,-5.353,1,0.0344,0.403,0,0.115,0.47,91.024,194453,4
2016-02-13,23,Antidote,Travis Scott,72TFWvU3wUYdUuxejTTIzt,False,19,16,21,0.713,0.526,1,-5.046,1,0.032,0.00767,0.000148,0.124,0.131,131.05,262693,4
2016-02-13,24,Hide Away,Daya,72TFWvU3wUYdUuxejTTIzt,False,30,24,19,0.885,0.8,11,-4.714,0,0.0846,0.23,1.99e-06,0.0734,0.464,95.018,192376,4
2016-02-13,25,I Know What You Did Last Summer,Shawn Mendes & Camila Cabello,72TFWvU3wUYdUuxejTTIzt,False,24,20,11,0.687,0.761,9,-4.582,0,0.0876,0.102,0,0.147,0.743,113.939,223853,4
2016-02-13,26,Die A Happy Man,Thomas Rhett,72TFWvU3wUYdUuxejTTIzt,False,25,21,19,0.595,0.389,2,-9.245,1,0.0349,0.418,1.39e-06,0.116,0.4,166.052,227427,4
2016-02-13,27,Say It,Tory Lanez,72TFWvU3wUYdUuxejTTIzt,False,23,23,15,0.546,0.529,11,-10.511,0,0.0583,0.0862,6.5e-06,0.124,0.247,107.331,237787,4
2016-02-13,28,679,Fetty Wap Featuring Remy Boyz,72TFWvU3wUYdUuxejTTIzt,False,20,4,31,0.618,0.717,7,-5.738,1,0.318,0.00256,0,0.625,0.603,190.05,196693,4
2016-02-13,29,When We Were Young,Adele,72TFWvU3wUYdUuxejTTIzt,False,35,22,10,0.376,0.595,3,-5.936,1,0.0496,0.303,0,0.095,0.265,144.361,290900,4
2016-02-13,30,Break Up In A Small Town,Sam Hunt,72TFWvU3wUYdUuxejTTIzt,False,33,29,17,0.579,0.776,8,-5.365,1,0.173,0.0749,0,0.239,0.434,136.044,229880,4
2016-02-13,31,Ex's & Oh's,Elle King,72TFWvU3wUYdUuxejTTIzt,False,29,10,30,0.612,0.921,7,-2.879,1,0.0848,0.0183,0,0.0576,0.453,139.986,202173,4
2016-02-13,32,On My Mind,Ellie Goulding,72TFWvU3wUYdUuxejTTIzt,False,27,13,19,0.702,0.705,0,-6.666,1,0.0543,0.258,5.93e-06,0.0879,0.743,154.911,213445,4
2016-02-13,33,Down In The DM,Yo Gotti Featuring Nicki Minaj,72TFWvU3wUYdUuxejTTIzt,False,31,31,9,0.776,0.662,1,-7.016,0,0.0489,0.00157,2.1e-05,0.0887,0.324,152.927,182733,4
2016-02-13,34,Wildest Dreams,Taylor Swift,72TFWvU3wUYdUuxejTTIzt,False,34,5,23,0.553,0.664,8,-7.417,1,0.0741,0.0709,0.0056,0.106,0.467,140.06,220440,4
2016-02-13,35,Can't Feel My Face,The Weeknd,72TFWvU3wUYdUuxejTTIzt,False,32,1,34,0.709,0.777,9,-5.526,0,0.0444,0.122,0,0.0883,0.6,107.943,213525,4
2016-02-13,36,Lean On,Major Lazer & DJ Snake Featuring MO,72TFWvU3wUYdUuxejTTIzt,False,36,4,43,0.723,0.809,7,-3.081,0,0.0625,0.00346,0.00123,0.565,0.274,98.007,176561,4
2016-02-13,37,Stand By You,Rachel Platten,72TFWvU3wUYdUuxejTTIzt,False,42,37,11,0.506,0.897,9,-4.632,1,0.26,0.146,0.000451,0.0868,0.525,188.03,219000,4
2016-02-13,38,Home Alone Tonight,Luke Bryan Featuring Karen Fairchild,72TFWvU3wUYdUuxejTTIzt,False,44,38,10,0.501,0.966,8,-1.177,1,0.112,0.0796,0,0.0903,0.497,161.881,190773,4
2016-02-13,39,Watch Me,Silento,72TFWvU3wUYdUuxejTTIzt,False,28,3,49,0.821,0.759,8,-8.541,1,0.121,0.247,0,0.321,0.962,140.01,185143,4
2016-02-13,40,Exchange,Bryson Tiller,72TFWvU3wUYdUuxejTTIzt,False,39,39,14,0.525,0.433,6,-10.598,1,0.185,0.107,0,0.135,0.276,160.108,194613,4
2016-02-13,41,See You Again,Wiz Khalifa Featuring Charlie Puth,72TFWvU3wUYdUuxejTTIzt,False,37,1,47,0.689,0.481,10,-7.503,1,0.0815,0.369,1.03e-06,0.0649,0.283,80.025,229526,4
2016-02-13,42,No Role Modelz,J. Cole,72TFWvU3wUYdUuxejTTIzt,False,41,36,24,0.692,0.521,10,-8.465,0,0.33,0.301,0,0.0565,0.463,100.45,292987,4
2016-02-13,43,Perfect,One Direction,72TFWvU3wUYdUuxejTTIzt,False,38,10,15,0.647,0.823,2,-5.231,1,0.0762,0.0598,0,0.119,0.396,99.933,230333,4
2016-02-13,44,Out Of The Woods,Taylor Swift,72TFWvU3wUYdUuxejTTIzt,False,50,18,6,0.552,0.841,7,-6.938,1,0.0372,0.00103,1.23e-05,0.337,0.342,91.993,235800,4
2016-02-13,45,Adventure Of A Lifetime,Coldplay,72TFWvU3wUYdUuxejTTIzt,False,47,39,12,0.638,0.924,7,-3.887,1,0.036,0.00205,0.000175,0.149,0.53,111.995,263787,4
2016-02-13,46,Again,Fetty Wap,72TFWvU3wUYdUuxejTTIzt,False,43,33,25,0.748,0.733,11,-4.421,0,0.072,0.0062,0,0.329,0.291,93.019,312240,4
2016-02-13,47,Confident,Demi Lovato,72TFWvU3wUYdUuxejTTIzt,False,40,21,17,0.594,0.737,3,-6.309,1,0.0716,0.00183,0.000159,0.128,0.339,130.028,205627,4
2016-02-13,48,Back To Sleep,Chris Brown,72TFWvU3wUYdUuxejTTIzt,False,49,48,7,0.647,0.646,9,-5.483,0,0.243,0.0424,0,0.0888,0.721,92.981,201253,4
2016-02-13,49,Best Friend,Young Thug,72TFWvU3wUYdUuxejTTIzt,False,45,45,10,0.959,0.598,8,-5.534,1,0.0713,0.0358,0,0.358,0.408,127.029,213000,4
2016-02-13,50,Stay A Little Longer,Brothers Osborne,72TFWvU3wUYdUuxejTTIzt,False,46,46,17,0.557,0.886,6,-5.356,1,0.0302,0.0377,0.108,0.163,0.545,96.989,335480,4
2016-02-13,51,Irresistible,Fall Out Boy,72TFWvU3wUYdUuxejTTIzt,False,52,48,11,0.484,0.938,2,-3.123,1,0.112,0.0706,0,0.236,0.444,165.049,206507,4
2016-02-13,52,Get Ugly,Jason Derulo,72TFWvU3wUYdUuxejTTIzt,False,54,52,6,0.75,0.683,9,-4.829,0,0.12,0.0462,1.32e-06,0.297,0.539,111.066,200492,4
2016-02-13,53,Oui,Jeremih,72TFWvU3wUYdUuxejTTIzt,False,55,53,4,0.418,0.724,5,-3.724,1,0.0964,0.213,0,0.112,0.604,78.521,238320,5
2016-02-13,54,Sugar,Robin Schulz Featuring Francesco Yates,72TFWvU3wUYdUuxejTTIzt,False,58,54,4,0.636,0.815,5,-5.098,0,0.0581,0.0185,0,0.163,0.636,123.063,219043,4
2016-02-13,55,Backroad Song,Granger Smith,72TFWvU3wUYdUuxejTTIzt,False,57,55,8,0.488,0.833,11,-6.571,1,0.0437,0.0352,0.0172,0.34,0.751,174.006,236787,4
2016-02-13,56,Bake Sale,Wiz Khalifa Featuring Travi$ Scott,2okC0OWtgS86P2LC18IzHy,True,0,56,1,0.855,0.522,3,-5.54,1,0.226,0.196,0,0.1,0.355,139.917,238530,4
2016-02-13,57,7 Years,Lukas Graham,2okC0OWtgS86P2LC18IzHy,False,96,57,2,0.765,0.473,10,-5.829,1,0.0514,0.287,0,0.391,0.34,119.992,237300,4
2016-02-13,58,Heartbeat,Carrie Underwood,2okC0OWtgS86P2LC18IzHy,False,60,58,4,0.54,0.766,1,-4.478,1,0.05,0.606,0,0.0903,0.435,139.999,209920,4
2016-02-13,59,I Took A Pill In Ibiza,Mike Posner,2okC0OWtgS86P2LC18IzHy,False,79,59,2,0.664,0.714,7,-6.645,0,0.111,0.0353,8.42e-06,0.0843,0.71,101.969,197933,4
2016-02-13,60,You Should Be Here,Cole Swindell,2okC0OWtgS86P2LC18IzHy,False,70,60,7,0.489,0.641,7,-4.455,1,0.0282,0.0592,0,0.0857,0.303,136.095,190173,4
2016-02-13,61,Break On Me.,Keith Urban,2okC0OWtgS86P2LC18IzHy,False,65,61,5,0.618,0.764,8,-7.086,1,0.0299,0.379,0.000211,0.108,0.447,87.012,208360,4
2016-02-13,62,Drunk On Your Love,Brett Eldredge,2okC0OWtgS86P2LC18IzHy,False,69,62,3,0.443,0.831,11,-5.606,1,0.0616,0.414,0,0.204,0.588,182.064,173960,4
2016-02-13,63,Beautiful Drug,Zac Brown Band,2okC0OWtgS86P2LC18IzHy,False,64,63,10,0.619,0.852,8,-5.243,0,0.0808,0.0539,2.82e-06,0.124,0.339,125.943,191600,4
2016-02-13,64,Watch Out,2 Chainz,2okC0OWtgS86P2LC18IzHy,False,88,64,5,0.899,0.504,8,-6.758,0,0.5,0.826,0,0.052,0.537,129.89,207813,4
2016-02-13,65,Walking On A Dream,Empire Of The Sun,2okC0OWtgS86P2LC18IzHy,False,82,65,2,0.871,0.701,5,-5.594,0,0.0458,0.257,7.52e-06,0.0589,0.716,126.975,198440,4
2016-02-13,66,Dibs,Kelsea Ballerini,2okC0OWtgS86P2LC18IzHy,False,71,66,13,0.638,0.733,4,-4.7,1,0.052,0.231,0,0.103,0.651,87.999,183947,4
2016-02-13,67,2 Phones,Kevin Gates,2okC0OWtgS86P2LC18IzHy,False,62,62,4,0.895,0.681,7,-5.267,0,0.358,0.157,0,0.189,0.554,121.918,240000,4
2016-02-13,68,I Love This Life,LOCASH,2okC0OWtgS86P2LC18IzHy,False,56,56,14,0.586,0.927,2,-3.014,1,0.0547,0.0164,7.24e-06,0.153,0.549,111.977,208864,4
2016-02-13,69,Confession,Florida Georgia Line,2okC0OWtgS86P2LC18IzHy,False,78,69,5,0.549,0.878,1,-5.066,1,0.0358,0.106,6.07e-05,0.176,0.44,104.98,190640,4
2016-02-13,70,Good To Be Alive (Hallelujah),Andy Grammer,2okC0OWtgS86P2LC18IzHy,False,83,62,7,0.797,0.896,5,-3.678,1,0.0512,0.0349,0,0.635,0.685,120.037,189098,4
2016-02-13,71,Big Rings,Drake & Future,2okC0OWtgS86P2LC18IzHy,False,63,52,19,0.776,0.675,8,-6.224,0,0.266,0.00196,0,0.227,0.27,131.984,217707,4
2016-02-13,72,We Went,Randy Houser,2okC0OWtgS86P2LC18IzHy,False,90,72,6,0.646,0.882,4,-3.77,0,0.0371,0.097,0,0.311,0.544,101.997,179360,4
2016-02-13,73,I Got The Boy,Jana Kramer,2okC0OWtgS86P2LC18IzHy,False,59,56,16,0.625,0.569,0,-5.954,1,0.0271,0.26,0,0.127,0.361,149.987,201013,4
2016-02-13,74,The Fix,Nelly Featuring Jeremih,2okC0OWtgS86P2LC18IzHy,False,66,62,18,0.812,0.479,8,-6.47,1,0.0429,0.0485,0,0.102,0.0873,95.505,173045,4
2016-02-13,75,Let It Go,James Bay,2okC0OWtgS86P2LC18IzHy,False,86,75,6,0.546,0.311,1,-10.396,1,0.0288,0.818,1.65e-05,0.107,0.246,147.464,260533,4
2016-02-13,76,Nobody To Blame,Chris Stapleton,2okC0OWtgS86P2LC18IzHy,False,80,76,4,0.534,0.666,9,-9.471,1,0.0335,0.0143,0.0615,0.113,0.59,87.401,244147,4
2016-02-13,77,Sorry Not Sorry,Bryson Tiller,2okC0OWtgS86P2LC18IzHy,False,67,67,7,0.681,0.608,1,-6.093,1,0.207,0.0477,0,0.225,0.262,97.934,200760,4
2016-02-13,78,Do It Like Me,DLOW,2okC0OWtgS86P2LC18IzHy,False,53,45,12,0.883,0.85,10,-4.053,0,0.361,0.308,0,0.368,0.711,150.138,146000,4
2016-02-13,79,Bang My Head,David Guetta Featuring Sia & Fetty Wap,2okC0OWtgS86P2LC18IzHy,False,84,79,3,0.599,0.869,0,-3.697,1,0.0789,0.0525,0.00719,0.103,0.593,108.061,193333,4
2016-02-13,80,$ave Dat Money,Lil Dicky Featuring Fetty Wap & Rich Homie Quan,2okC0OWtgS86P2LC18IzHy,False,73,71,14,0.858,0.697,2,-5.361,1,0.23,0.114,0,0.224,0.364,98.013,290836,4
2016-02-13,81,Something In The Way You Move,Ellie Goulding,3ZCDG0nujwGfxrEmZlZoEt,True,0,81,1,0.658,0.814,1,-6.156,0,0.0492,0.0401,0,0.114,0.318,109.023,227423,4
2016-02-13,82,Really Really,Kevin Gates,3ZCDG0nujwGfxrEmZlZoEt,False,76,76,6,0.762,0.666,0,-6.055,1,0.0916,0.00427,0,0.127,0.278,118.97,232093,4
2016-02-13,83,Back Up,DeJ Loaf Featuring Big Sean,3ZCDG0nujwGfxrEmZlZoEt,False,61,47,17,0.816,0.535,9,-8.302,1,0.338,0.147,4.53e-06,0.176,0.435,80.012,241267,4
2016-02-13,84,WTF (Where They From),Missy Elliott Featuring Pharrell Williams,3ZCDG0nujwGfxrEmZlZoEt,False,77,22,12,0.932,0.819,8,-3.484,0,0.203,0.0181,6.81e-06,0.0577,0.556,119.941,192773,4
2016-02-13,85,Mr. Misunderstood,Eric Church,3ZCDG0nujwGfxrEmZlZoEt,False,85,84,5,0.385,0.808,7,-6.67,1,0.045,0.0629,0,0.33,0.546,129.22,319240,4
2016-02-13,86,Hollow,Tori Kelly,3ZCDG0nujwGfxrEmZlZoEt,False,81,80,7,0.606,0.656,2,-6.85,0,0.0361,0.0187,0.00654,0.44,0.454,126.044,210606,4
2016-02-13,87,I Like The Sound Of That,Rascal Flatts,5S5rw0WLVCAux5B5bWCehK,True,0,87,1,0.611,0.8,0,-5.61,1,0.0377,0.257,0,0.194,0.527,89.974,209280,4
2016-02-13,88,Middle,DJ Snake Featuring Bipolar Sunshine,5S5rw0WLVCAux5B5bWCehK,False,95,88,2,0.583,0.695,9,-5.336,1,0.0423,0.0141,0,0.0527,0.224,104.879,220573,4
2016-02-13,89,Focus,Ariana Grande,5S5rw0WLVCAux5B5bWCehK,False,51,7,13,0.671,0.876,6,-6.034,1,0.239,0.266,0,0.444,0.8,100.016,211360,4
2016-02-13,90,Dessert,Dawin,5S5rw0WLVCAux5B5bWCehK,False,68,68,8,0.866,0.731,6,-5.226,1,0.0407,0.0796,0,0.0402,0.765,97.03,210893,4
2016-02-13,91,My Church,Maren Morris,1LM5zQv5pBKPyO7rm7Uz6U,True,0,91,1,0.517,0.743,9,-4.336,1,0.0363,0.243,3.36e-06,0.107,0.664,76.979,197931,4
2016-02-13,92,Play No Games,Big Sean Featuring Chris Brown & Ty Dolla $ign,1LM5zQv5pBKPyO7rm7Uz6U,False,91,84,13,0.755,0.701,1,-3.586,1,0.0455,0.085,0,0.452,0.385,81.515,216653,4
2016-02-13,93,Gonna Know We Were Here,Jason Aldean,1LM5zQv5pBKPyO7rm7Uz6U,False,74,54,16,0.447,0.896,9,-5.57,1,0.173,0.0339,0,0.882,0.533,173.852,224067,4
2016-02-13,94,Country Nation,Brad Paisley,4yL5WpJZmoxAV4udhE55VY,True,0,94,1,0.387,0.861,4,-5.529,1,0.0413,0.0389,0.00047,0.1,0.482,177.94,225413,4
2016-02-13,95,Humble And Kind,Tim McGraw,4Pn0JlCUusD2QHjADuOzuV,True,0,95,1,0.355,0.48,11,-7.31,1,0.0282,0.679,2.28e-06,0.12,0.137,100.956,259267,3
2016-02-13,96,Emperor's New Clothes,Panic! At The Disco,4Pn0JlCUusD2QHjADuOzuV,False,72,68,4,0.562,0.904,1,-4.947,1,0.0807,0.00302,0,0.0433,0.651,94.481,158667,4
2016-02-13,97,Bottom Of The Bottle,Curren$Y Featuring August Alsina & Lil Wayne,4WC72P8F0CnYmqoPYQ7JDD,True,0,97,1,0.739,0.539,6,-9.735,1,0.337,0.0161,0,0.235,0.835,85.082,238339,4
2016-02-13,98,Somewhere On A Beach,Dierks Bentley,5CG9Ps5ynNjpKJHmwc95pa,True,0,98,1,0.569,0.638,7,-6.557,1,0.0291,0.000547,0,0.0848,0.438,144.042,197120,4
2016-02-13,99,Acquainted,The Weeknd,5CG9Ps5ynNjpKJHmwc95pa,False,100,60,5,0.386,0.486,7,-9.845,0,0.051,0.437,0,0.0889,0.237,105.79,348883,4
2016-02-13,100,Snapback,Old Dominion,7I5fYc4qKJddht8Ozhqqdx,True,0,100,1,0.687,0.793,5,-3.577,1,0.0333,0.302,3.46e-06,0.1,0.673,100.993,206507,4
