date,position,title,artist,spotify_id,is_new,last_pos,peak_pos,weeks,danceability,energy,key,loudness,mode,speechiness,acousticness,instrumentalness,liveness,valence,tempo,duration_ms,time_signature
2002-09-21,1,Dilemma,Nelly Featuring Kelly Rowland,3UnjHOCGgfHDAjzMEOyBqQ,False,1,1,11,0.727,0.552,2,-8.074,0,0.14,0.227,0.000164,0.198,0.607,168.189,289160,4
2002-09-21,2,Gangsta Lovin',Eve Featuring Alicia Keys,3UnjHOCGgfHDAjzMEOyBqQ,False,2,2,11,0.723,0.84,1,-3.523,0,0.0608,0.0619,0,0.0945,0.827,94.332,239267,4
2002-09-21,3,Complicated,Avril Lavigne,3UnjHOCGgfHDAjzMEOyBqQ,False,3,2,17,0.585,0.776,5,-5.898,1,0.0459,0.0572,7.74e-06,0.3,0.427,77.987,244507,4
2002-09-21,4,Cleanin' Out My Closet,Eminem,3UnjHOCGgfHDAjzMEOyBqQ,False,5,4,8,0.908,0.758,9,-4.753,0,0.174,0.0687,0,0.0783,0.87,148.015,297840,4
2002-09-21,5,Hot In Herre,Nelly,3UnjHOCGgfHDAjzMEOyBqQ,False,4,1,21,0.956,0.745,11,-4.753,0,0.12,0.206,0,0.0615,0.912,107.075,228240,4
2002-09-21,6,I Need A Girl (Part Two),"P. Diddy & Ginuwine Featuring Loon, Mario Winans & Tammy Ruggeri",3UnjHOCGgfHDAjzMEOyBqQ,False,6,4,16,0.713,0.471,1,-7.392,0,0.483,0.421,0,0.0308,0.781,199.765,285587,4
2002-09-21,7,One Last Breath,Creed,3UnjHOCGgfHDAjzMEOyBqQ,False,9,7,16,0.386,0.677,2,-5.83,1,0.0346,0.00841,0.00366,0.341,0.195,126.602,238240,4
2002-09-21,8,Happy,Ashanti,3UnjHOCGgfHDAjzMEOyBqQ,False,8,8,17,0.727,0.515,2,-6.553,0,0.0289,0.241,3.74e-06,0.124,0.695,89.488,262227,4
2002-09-21,9,Just Like A Pill,P!nk,3UnjHOCGgfHDAjzMEOyBqQ,False,10,8,12,0.689,0.774,9,-4.528,1,0.0278,8.85e-05,0,0.0941,0.253,102.052,236600,4
2002-09-21,10,Just A Friend 2002,Mario,3UnjHOCGgfHDAjzMEOyBqQ,False,7,4,18,0.538,0.677,0,-6.099,1,0.187,0.00541,0,0.236,0.913,132.346,214200,5
2002-09-21,11,Gotta Get Thru This,Daniel Bedingfield,3UnjHOCGgfHDAjzMEOyBqQ,False,14,11,9,0.837,0.765,7,-5.007,0,0.0631,0.0852,7.08e-05,0.1,0.912,133.57,161200,4
2002-09-21,12,Nothin',N.O.R.E.,3UnjHOCGgfHDAjzMEOyBqQ,False,11,10,18,0.791,0.863,3,-6.118,0,0.151,0.317,1.13e-06,0.27,0.742,97.035,264653,4
2002-09-21,13,Move B***h,Ludacris Featuring Mystikal & Infamous 2.0,3UnjHOCGgfHDAjzMEOyBqQ,False,13,12,16,0.787,0.732,8,-5.466,1,0.129,0.183,0,0.1,0.15,177.653,271627,4
2002-09-21,14,Down 4 U,"Irv Gotti Presents The Inc. Featuring Ja Rule, Ashanti, Charli Baltimore & Vita",3UnjHOCGgfHDAjzMEOyBqQ,False,12,6,14,0.64,0.59,7,-7.442,1,0.32,0.252,0,0.665,0.519,83.133,318213,4
2002-09-21,15,No Such Thing,John Mayer,3UnjHOCGgfHDAjzMEOyBqQ,False,15,13,17,0.668,0.739,4,-4.919,1,0.0308,0.0383,0,0.13,0.571,131.918,231467,4
2002-09-21,16,Heaven,DJ Sammy & Yanou Featuring Do,3UnjHOCGgfHDAjzMEOyBqQ,False,16,8,17,0.571,0.953,8,-5.601,1,0.0548,0.0011,0.000606,0.226,0.601,137.965,233600,4
2002-09-21,17,A Thousand Miles,Vanessa Carlton,3UnjHOCGgfHDAjzMEOyBqQ,False,17,5,30,0.56,0.825,11,-3.862,1,0.0379,0.323,0,0.161,0.268,94.931,237493,4
2002-09-21,18,Hey Ma,"Cam'Ron Featuring Juelz Santana, Freekey Zekey & Toya",3UnjHOCGgfHDAjzMEOyBqQ,False,21,18,4,0.791,0.666,8,-5.484,1,0.341,0.0256,6.33e-06,0.0796,0.938,90.345,232533,4
2002-09-21,19,If I Could Go!,Angie Martinez Featuring Lil' Mo & Sacario,3UnjHOCGgfHDAjzMEOyBqQ,False,20,19,14,0.791,0.649,9,-5.714,0,0.198,0.496,0,0.0566,0.645,97.874,263853,4
2002-09-21,20,Hero,Chad Kroeger Featuring Josey Scott,3UnjHOCGgfHDAjzMEOyBqQ,False,18,3,19,0.427,0.843,4,-4.54,1,0.0364,0.00216,0,0.179,0.304,147.387,200480,3
2002-09-21,21,Trade It All,Fabolous Featuring P. Diddy & Jagged Edge,3UnjHOCGgfHDAjzMEOyBqQ,False,36,21,6,0.819,0.778,1,-5.839,0,0.21,0.029,0,0.215,0.779,96.72,275267,4
2002-09-21,22,I Care 4 U,Aaliyah,3UnjHOCGgfHDAjzMEOyBqQ,False,34,22,5,0.384,0.496,0,-9.203,0,0.0482,0.345,0.000224,0.119,0.223,133.891,286699,3
2002-09-21,23,Good Times,Styles,3UnjHOCGgfHDAjzMEOyBqQ,False,25,23,10,0.697,0.761,11,-7.647,0,0.302,0.157,0,0.789,0.666,81.728,211493,4
2002-09-21,24,The Middle,Jimmy Eat World,3UnjHOCGgfHDAjzMEOyBqQ,False,19,5,28,0.643,0.849,2,-5.428,1,0.0526,0.0371,0,0.058,0.903,162.152,165853,4
2002-09-21,25,Soak Up The Sun,Sheryl Crow,3UnjHOCGgfHDAjzMEOyBqQ,False,27,17,24,0.717,0.733,4,-4.985,1,0.0427,0.0398,0,0.136,0.713,119.996,292307,4
2002-09-21,26,Ten Rounds With Jose Cuervo,Tracy Byrd,3UnjHOCGgfHDAjzMEOyBqQ,False,29,26,12,0.681,0.864,2,-7.839,1,0.0347,0.00504,0,0.212,0.931,127.079,182453,4
2002-09-21,27,Like I Love You,Justin Timberlake,3UnjHOCGgfHDAjzMEOyBqQ,False,46,27,3,0.853,0.811,6,-4.926,0,0.0646,0.0439,0.000304,0.0703,0.901,114.961,283627,4
2002-09-21,28,The Good Stuff,Kenny Chesney,3UnjHOCGgfHDAjzMEOyBqQ,False,24,22,16,0.612,0.62,7,-9.785,1,0.0645,0.255,0,0.129,0.502,143.78,200440,4
2002-09-21,29,The Impossible,Joe Nichols,3UnjHOCGgfHDAjzMEOyBqQ,False,32,29,17,0.617,0.504,9,-6.702,1,0.0295,0.354,3.1e-06,0.0875,0.197,77.988,245573,4
2002-09-21,30,I Miss My Friend,Darryl Worley,3UnjHOCGgfHDAjzMEOyBqQ,False,28,28,15,0.554,0.474,4,-7.843,1,0.025,0.155,1.67e-05,0.0859,0.41,139.832,242927,4
2002-09-21,31,Beautiful Mess,Diamond Rio,3UnjHOCGgfHDAjzMEOyBqQ,False,37,31,7,0.402,0.817,1,-3.756,1,0.0406,0.317,0,0.105,0.376,177.342,227920,4
2002-09-21,32,I'm Gonna Be Alright,Jennifer Lopez Featuring Nas,3UnjHOCGgfHDAjzMEOyBqQ,False,22,10,22,0.843,0.612,10,-4.71,0,0.157,0.0573,0.000305,0.154,0.791,93.975,200200,4
2002-09-21,33,Stingy,Ginuwine,3UnjHOCGgfHDAjzMEOyBqQ,False,48,33,8,0.622,0.573,1,-6.934,0,0.0547,0.26,0,0.173,0.617,127.132,259493,4
2002-09-21,34,Somebody Like You,Keith Urban,3UnjHOCGgfHDAjzMEOyBqQ,False,41,34,6,0.624,0.84,4,-5.768,1,0.0337,0.108,0.000546,0.144,0.656,111.02,323040,4
2002-09-21,35,Underneath It All,No Doubt Featuring Lady Saw,3UnjHOCGgfHDAjzMEOyBqQ,False,39,35,4,0.729,0.731,4,-4.823,1,0.0682,0.235,1.35e-06,0.391,0.838,138.204,302720,4
2002-09-21,36,Baby,Ashanti,3UnjHOCGgfHDAjzMEOyBqQ,False,51,36,9,0.567,0.58,4,-5.757,0,0.223,0.0084,5.37e-06,0.0342,0.46,157.596,265707,4
2002-09-21,37,I Keep Looking,Sara Evans,3UnjHOCGgfHDAjzMEOyBqQ,False,35,35,10,0.737,0.817,10,-4.246,1,0.0508,0.0577,0,0.118,0.751,112.866,276173,4
2002-09-21,38,Ordinary Day,Vanessa Carlton,3UnjHOCGgfHDAjzMEOyBqQ,False,38,38,5,0.371,0.666,0,-3.336,1,0.0301,0.244,0,0.151,0.449,185.476,238440,3
2002-09-21,39,Where Are You Going,Dave Matthews Band,3UnjHOCGgfHDAjzMEOyBqQ,False,40,39,15,0.444,0.583,7,-8.121,1,0.0259,0.5,0.15,0.105,0.258,97.492,231867,4
2002-09-21,40,Still Fly,Big Tymers,3UnjHOCGgfHDAjzMEOyBqQ,False,33,11,24,0.675,0.607,11,-3.538,1,0.162,0.0302,8.97e-06,0.339,0.56,177.928,335613,4
2002-09-21,41,Cry,Faith Hill,3UnjHOCGgfHDAjzMEOyBqQ,False,43,41,4,0.512,0.645,8,-5.631,1,0.029,0.141,0,0.0987,0.283,111.015,226307,3
2002-09-21,42,Work It,"Missy ""Misdemeanor"" Elliott",3UnjHOCGgfHDAjzMEOyBqQ,False,75,42,2,0.869,0.735,10,-6.364,0,0.157,0.228,0,0.0874,0.463,101.909,254813,4
2002-09-21,43,By The Way,Red Hot Chili Peppers,3UnjHOCGgfHDAjzMEOyBqQ,False,44,34,15,0.451,0.97,0,-4.938,1,0.107,0.0264,0.00355,0.102,0.198,122.444,216933,4
2002-09-21,44,Unbroken,Tim McGraw,3UnjHOCGgfHDAjzMEOyBqQ,False,26,26,12,0.595,0.792,1,-6.979,0,0.0286,0.0865,0,0.0769,0.536,119.8,241427,4
2002-09-21,45,Luv U Better,LL Cool J,3UnjHOCGgfHDAjzMEOyBqQ,False,59,45,5,0.668,0.806,6,-3.9,1,0.239,0.232,0,0.18,0.721,95.022,287000,4
2002-09-21,46,Feel It Boy,Beenie Man Featuring Janet,3UnjHOCGgfHDAjzMEOyBqQ,False,31,28,8,0.842,0.656,5,-3.189,0,0.107,0.16,0,0.0626,0.95,102.794,207133,4
2002-09-21,47,Sk8er Boi,Avril Lavigne,3UnjHOCGgfHDAjzMEOyBqQ,False,72,47,2,0.487,0.9,0,-4.417,1,0.0482,6.79e-05,0,0.358,0.484,149.937,204000,4
2002-09-21,48,Po' Folks,Nappy Roots Featuring Anthony Hamilton,3UnjHOCGgfHDAjzMEOyBqQ,False,57,48,10,0.854,0.847,2,-3.03,1,0.258,0.212,0,0.0894,0.651,86.062,255227,4
2002-09-21,49,Foolish,Ashanti,3UnjHOCGgfHDAjzMEOyBqQ,False,50,1,32,0.665,0.695,0,-5.763,1,0.0532,0.347,0,0.106,0.707,90.119,227387,4
2002-09-21,50,Goodbye To You,Michelle Branch,3UnjHOCGgfHDAjzMEOyBqQ,False,52,50,4,0.504,0.556,8,-6.19,1,0.0263,0.288,0.000246,0.173,0.276,81.008,251200,4
2002-09-21,51,Two Wrongs,Wyclef Jean Featuring Claudette Ortiz,3UnjHOCGgfHDAjzMEOyBqQ,False,49,28,11,0.662,0.613,9,-7.553,1,0.189,0.0899,0,0.0831,0.401,83.015,231133,4
2002-09-21,52,Love At First Sight,Kylie Minogue,3UnjHOCGgfHDAjzMEOyBqQ,False,30,23,13,0.583,0.417,5,-9.588,1,0.031,0.543,0,0.0858,0.435,142.942,215853,4
2002-09-21,53,Running Away,Hoobastank,3UnjHOCGgfHDAjzMEOyBqQ,False,53,53,12,0.608,0.801,9,-5.452,0,0.0376,0.0011,8.11e-06,0.223,0.544,100.25,178440,3
2002-09-21,54,Somewhere Out There,Our Lady Peace,3UnjHOCGgfHDAjzMEOyBqQ,False,54,54,5,0.388,0.746,1,-5.306,1,0.0318,0.000563,0,0.0719,0.458,159.675,251333,4
2002-09-21,55,Without Me,Eminem,3UnjHOCGgfHDAjzMEOyBqQ,False,47,2,20,0.908,0.669,7,-2.827,1,0.0738,0.00286,0,0.237,0.662,112.238,290320,4
2002-09-21,56,Long Time Gone,Dixie Chicks,3UnjHOCGgfHDAjzMEOyBqQ,False,23,7,14,0.549,0.693,2,-5.572,1,0.0311,0.18,1.75e-06,0.153,0.819,170.241,249412,4
2002-09-21,57,dontchange,Musiq,3UnjHOCGgfHDAjzMEOyBqQ,False,70,57,3,0.58,0.526,6,-6.664,0,0.0313,0.221,0,0.0959,0.2,101.89,304427,4
2002-09-21,58,Aerials,System Of A Down,3UnjHOCGgfHDAjzMEOyBqQ,False,58,55,6,0.364,0.922,0,-4.217,0,0.0566,0.000918,0.035,0.0696,0.227,79.342,235053,4
2002-09-21,59,Why Don't We Fall In Love,Amerie,3UnjHOCGgfHDAjzMEOyBqQ,False,42,23,16,0.551,0.773,11,-6.578,0,0.101,0.0673,3.39e-05,0.0511,0.649,90.003,159293,4
2002-09-21,60,A Moment Like This,Kelly Clarkson,4kvdX9zzsix7jYHsRVkVUH,True,0,60,1,0.414,0.572,8,-3.918,1,0.0311,0.163,0,0.115,0.16,145.184,228280,4
2002-09-21,61,Work In Progress,Alan Jackson,4kvdX9zzsix7jYHsRVkVUH,False,61,61,5,0.748,0.673,11,-8.45,0,0.0486,0.191,5.86e-06,0.212,0.661,135.257,247600,4
2002-09-21,62,"Courtesy Of The Red, White And Blue (The Angry American)",Toby Keith,4kvdX9zzsix7jYHsRVkVUH,False,55,25,16,0.424,0.661,2,-5.547,1,0.0425,0.521,1.62e-06,0.0719,0.384,111.762,195533,4
2002-09-21,63,Objection (Tango),Shakira,4kvdX9zzsix7jYHsRVkVUH,False,63,63,3,0.603,0.864,11,-5.282,0,0.0677,0.0147,0,0.0246,0.705,179.344,222533,4
2002-09-21,64,Big Machine,Goo Goo Dolls,4kvdX9zzsix7jYHsRVkVUH,False,64,64,3,0.42,0.895,3,-4.155,1,0.0614,0.00103,0.000207,0.356,0.577,108.832,189547,4
2002-09-21,65,I Do (Wanna Get Close To You),3LW Featuring P. Diddy & Loon,4kvdX9zzsix7jYHsRVkVUH,False,65,65,8,0.836,0.491,1,-5.734,1,0.19,0.139,0,0.0489,0.862,97.303,254227,4
2002-09-21,66,Oh Yeah!,"Big Tymers Featuring Tateeze, Boo & Gotti",4kvdX9zzsix7jYHsRVkVUH,False,69,66,4,0.882,0.769,11,-3.448,1,0.147,0.091,3.56e-06,0.0809,0.529,98.002,279680,4
2002-09-21,67,Dirrty,Christina Aguilera Featuring Redman,59ZTxQo8rBycIXPLUIKvE2,True,0,67,1,0.64,0.889,2,-3.073,1,0.322,0.107,0,0.339,0.436,99.931,298853,4
2002-09-21,68,Where Would You Be,Martina McBride,59ZTxQo8rBycIXPLUIKvE2,False,68,68,3,0.523,0.668,8,-6.646,1,0.0332,0.0607,3.23e-06,0.0353,0.278,128.092,272720,4
2002-09-21,69,Burnin' Up,"Faith Evans Featuring Missy ""Misdemeanor"" Elliott",59ZTxQo8rBycIXPLUIKvE2,False,60,60,6,0.726,0.82,11,-3.472,0,0.18,0.162,2.96e-06,0.212,0.894,98.051,211133,4
2002-09-21,70,Gimme The Light,Sean Paul,59ZTxQo8rBycIXPLUIKvE2,False,74,70,21,0.778,0.761,2,-5.529,1,0.0525,0.141,4.61e-05,0.0441,0.923,107.288,228000,4
2002-09-21,71,In Da Wind,Trick Daddy Featuring Cee-Lo & Big Boi,59ZTxQo8rBycIXPLUIKvE2,False,71,71,11,0.974,0.586,0,-3.801,1,0.18,0.12,0,0.0585,0.689,113.998,260480,4
2002-09-21,72,American Child,Phil Vassar,59ZTxQo8rBycIXPLUIKvE2,False,62,62,5,0.397,0.685,2,-5.815,1,0.0277,0.252,0,0.157,0.443,168.121,189373,3
2002-09-21,73,Out Of My Heart (Into Your Head),BBMak,59ZTxQo8rBycIXPLUIKvE2,False,56,56,6,0.533,0.909,10,-3.922,1,0.0351,0.00523,5.49e-06,0.337,0.545,123.425,243787,4
2002-09-21,74,Flake,Jack Johnson,59ZTxQo8rBycIXPLUIKvE2,False,77,73,8,0.758,0.654,5,-10.98,1,0.04,0.662,0.0197,0.199,0.962,97.657,281749,4
2002-09-21,75,Sweetness,Jimmy Eat World,59ZTxQo8rBycIXPLUIKvE2,False,76,75,8,0.487,0.898,5,-4.436,1,0.038,0.00305,0,0.26,0.597,135.331,220027,4
2002-09-21,76,Landslide,Dixie Chicks,5hviCr3lgg6LY6noG6DPKs,True,0,76,1,0.571,0.438,2,-7.007,1,0.0279,0.534,1.56e-05,0.187,0.444,145.948,230549,4
2002-09-21,77,Grindin',Clipse,5hviCr3lgg6LY6noG6DPKs,False,67,30,18,0.592,0.77,1,-3.402,1,0.318,0.122,1.22e-06,0.103,0.361,191.692,264760,4
2002-09-21,78,The Rising,Bruce Springsteen,5hviCr3lgg6LY6noG6DPKs,False,78,52,8,0.499,0.761,10,-6.381,1,0.0324,0.0655,0,0.0895,0.326,110.186,287040,4
2002-09-21,79,Don't Mess With My Man,Nivea Featuring Brian & Brandon Casey,5hviCr3lgg6LY6noG6DPKs,False,79,79,7,0.879,0.73,11,-4.369,0,0.164,0.114,0,0.241,0.885,99.925,213227,4
2002-09-21,80,When The Last Time,Clipse,5hviCr3lgg6LY6noG6DPKs,False,85,80,2,0.847,0.884,11,-3.326,1,0.245,0.514,0,0.303,0.845,99.036,254307,4
2002-09-21,81,She Was,Mark Chesnutt,5hviCr3lgg6LY6noG6DPKs,False,66,62,7,0.398,0.54,3,-9.31,1,0.0276,0.0118,0,0.0684,0.447,177.168,201173,4
2002-09-21,82,Days Go By,Dirty Vegas,5hviCr3lgg6LY6noG6DPKs,False,73,14,20,0.786,0.853,9,-8.274,0,0.0688,0.0499,0.0872,0.35,0.309,126.99,432147,4
2002-09-21,83,Someone To Love You,Ruff Endz,5hviCr3lgg6LY6noG6DPKs,False,81,49,20,0.637,0.678,8,-2.21,1,0.0345,0.0543,0,0.0961,0.426,77.928,297360,1
2002-09-21,84,Walking Away,Craig David,5hviCr3lgg6LY6noG6DPKs,False,80,44,18,0.596,0.686,9,-6.371,0,0.0345,0.196,0,0.121,0.815,172.835,204867,4
2002-09-21,85,I'd Rather,Luther Vandross,5hviCr3lgg6LY6noG6DPKs,False,87,85,2,0.705,0.467,0,-8.456,1,0.0298,0.236,0,0.113,0.522,119.938,259693,4
2002-09-21,86,Love Of My Life (An Ode To Hip Hop),Erykah Badu Featuring Common,5hviCr3lgg6LY6noG6DPKs,False,89,86,3,0.808,0.404,7,-9.27,1,0.348,0.118,0.000625,0.0913,0.487,87.461,337573,4
2002-09-21,87,She Loves Me Not,Papa Roach,5hviCr3lgg6LY6noG6DPKs,False,84,76,10,0.598,0.955,2,-4.52,1,0.0916,0.00122,0,0.243,0.402,119.126,209573,4
2002-09-21,88,Drift & Die,Puddle Of Mudd,5hviCr3lgg6LY6noG6DPKs,False,88,61,18,0.434,0.845,11,-4.316,1,0.0352,0.00554,0,0.11,0.332,96.073,265067,4
2002-09-21,89,Steve McQueen,Sheryl Crow,5hviCr3lgg6LY6noG6DPKs,False,97,89,2,0.555,0.893,0,-3.521,1,0.0952,0.0505,0,0.0688,0.762,169.966,205733,4
2002-09-21,90,My Friends Over You,New Found Glory,5hviCr3lgg6LY6noG6DPKs,False,93,90,3,0.404,0.98,2,-4.038,1,0.107,0.000193,0,0.0742,0.433,177.793,220200,4
2002-09-21,91,The One,Gary Allan,5hviCr3lgg6LY6noG6DPKs,False,86,37,19,0.594,0.601,8,-9.036,1,0.0312,0.54,0.004,0.0526,0.66,136.11,259760,4
2002-09-21,92,All Eyez On Me,Monica,5hviCr3lgg6LY6noG6DPKs,False,82,69,7,0.758,0.739,7,-4.429,1,0.0405,0.0281,0.000146,0.0439,0.848,108.995,238773,4
2002-09-21,93,Tainted,Slum Village Featuring Dwele,5hviCr3lgg6LY6noG6DPKs,False,92,87,10,0.915,0.442,9,-6.321,0,0.226,0.0102,1.62e-05,0.279,0.65,92.81,266960,4
2002-09-21,94,Full Moon,Brandy,5hviCr3lgg6LY6noG6DPKs,False,94,18,20,0.692,0.656,10,-4.81,0,0.151,0.358,0.0029,0.0929,0.629,105.994,248933,4
2002-09-21,95,Hate To Say I Told You So,The Hives,5hviCr3lgg6LY6noG6DPKs,False,96,86,10,0.451,0.929,5,-5.021,1,0.0549,0.00109,0.00785,0.442,0.378,135.767,199760,4
2002-09-21,96,Call Me,Tweet,5hviCr3lgg6LY6noG6DPKs,False,90,31,17,0.552,0.706,1,-8.117,0,0.363,0.484,6.49e-05,0.074,0.721,167.468,177373,4
2002-09-21,97,Way Of Life,Lil Wayne,5hviCr3lgg6LY6noG6DPKs,False,91,71,12,0.877,0.784,9,-4.146,0,0.298,0.0247,0,0.0792,0.686,97.89,239800,4
2002-09-21,98,Put Me Down,Donell Jones,5hviCr3lgg6LY6noG6DPKs,False,98,98,2,0.792,0.648,1,-6.827,0,0.0469,0.0702,0.00531,0.0693,0.76,101.406,260267,4
2002-09-21,99,I've Got You,Marc Anthony,5hviCr3lgg6LY6noG6DPKs,False,95,81,12,0.648,0.883,10,-5.745,0,0.06,0.00336,0,0.116,0.636,101.989,230200,4
2002-09-21,100,"My Neck, My Back",Khia Featuring DSD,5hviCr3lgg6LY6noG6DPKs,False,99,42,18,0.859,0.687,9,-2.089,0,0.12,0.0375,0,0.0542,0.73,102.068,222333,4
