date,position,title,artist,spotify_id,is_new,last_pos,peak_pos,weeks,danceability,energy,key,loudness,mode,speechiness,acousticness,instrumentalness,liveness,valence,tempo,duration_ms,time_signature
2013-08-17,1,Blurred Lines,Robin Thicke Featuring T.I. + Pharrell,29AR5X5yKPd4DBIAiqUMDy,False,1,1,16,0.853,0.599,7,-4.756,1,0.0411,0.00334,7.93e-06,0.0759,0.843,119.993,263827,4
2013-08-17,2,We Can't Stop,Miley Cyrus,29AR5X5yKPd4DBIAiqUMDy,False,3,2,9,0.613,0.622,1,-5.794,0,0.0334,0.00882,0,0.37,0.484,80.003,231240,4
2013-08-17,3,Radioactive,Imagine Dragons,29AR5X5yKPd4DBIAiqUMDy,False,4,3,49,0.448,0.784,9,-3.686,1,0.0627,0.106,0.000108,0.668,0.236,136.245,186813,4
2013-08-17,4,Get Lucky,Daft Punk Featuring Pharrell Williams,29AR5X5yKPd4DBIAiqUMDy,False,5,2,16,0.794,0.811,6,-8.966,0,0.038,0.0426,1.07e-06,0.101,0.862,116.047,248413,4
2013-08-17,5,Holy Grail,Jay Z Featuring Justin Timberlake,29AR5X5yKPd4DBIAiqUMDy,False,7,5,4,0.676,0.534,2,-6.901,0,0.0831,0.0594,8.59e-06,0.256,0.156,145.082,338413,4
2013-08-17,6,Cups (Pitch Perfect's When I'm Gone),Anna Kendrick,29AR5X5yKPd4DBIAiqUMDy,False,8,6,32,0.878,0.455,0,-8.845,1,0.077,0.0462,0.00484,0.0353,0.79,129.953,128013,4
2013-08-17,7,Treasure,Bruno Mars,29AR5X5yKPd4DBIAiqUMDy,False,6,5,12,0.874,0.692,5,-5.28,0,0.0431,0.0412,7.24e-05,0.324,0.937,116.017,178560,4
2013-08-17,8,Clarity,Zedd Featuring Foxes,29AR5X5yKPd4DBIAiqUMDy,False,13,8,20,0.509,0.781,8,-3.48,1,0.072,0.0398,0,0.0749,0.176,128.0,271427,4
2013-08-17,9,Safe And Sound,Capital Cities,29AR5X5yKPd4DBIAiqUMDy,False,15,9,14,0.655,0.819,0,-4.852,1,0.0316,0.000176,0.00374,0.104,0.766,117.956,192790,5
2013-08-17,10,Love Somebody,Maroon 5,29AR5X5yKPd4DBIAiqUMDy,False,14,10,11,0.675,0.792,1,-6.303,1,0.0368,0.145,0,0.12,0.395,120.016,229813,4
2013-08-17,11,Same Love,Macklemore & Ryan Lewis Featuring Mary Lambert,29AR5X5yKPd4DBIAiqUMDy,False,12,11,21,0.688,0.473,8,-9.059,1,0.167,0.716,4.46e-05,0.104,0.299,84.958,318525,4
2013-08-17,12,Cruise,Florida Georgia Line Featuring Nelly,29AR5X5yKPd4DBIAiqUMDy,False,10,4,44,0.457,0.948,10,-3.364,1,0.0354,0.0191,0,0.0536,0.878,148.0,208960,4
2013-08-17,13,Can't Hold Us,Macklemore & Ryan Lewis Featuring Ray Dalton,29AR5X5yKPd4DBIAiqUMDy,False,9,1,26,0.641,0.922,2,-4.457,1,0.0786,0.0291,0,0.0862,0.847,146.078,258343,4
2013-08-17,14,Mirrors,Justin Timberlake,29AR5X5yKPd4DBIAiqUMDy,False,11,2,25,0.574,0.512,5,-6.664,0,0.0503,0.234,0,0.0946,0.512,76.899,484147,4
2013-08-17,15,Best Song Ever,One Direction,29AR5X5yKPd4DBIAiqUMDy,False,2,2,2,0.652,0.877,1,-2.986,1,0.0465,0.0227,0,0.0789,0.486,118.491,200107,4
2013-08-17,16,I Need Your Love,Calvin Harris Featuring Ellie Goulding,29AR5X5yKPd4DBIAiqUMDy,False,19,16,16,0.695,0.869,8,-5.066,1,0.0483,0.41,0,0.237,0.58,124.989,234507,4
2013-08-17,17,Wake Me Up!,Avicii,29AR5X5yKPd4DBIAiqUMDy,False,48,17,6,0.532,0.783,2,-5.697,1,0.0523,0.0038,0.0012,0.161,0.643,124.08,247427,4
2013-08-17,18,The Other Side,Jason Derulo,29AR5X5yKPd4DBIAiqUMDy,False,18,18,16,0.561,0.836,9,-3.939,1,0.1,0.0525,0,0.136,0.517,127.923,226987,4
2013-08-17,19,Come & Get It,Selena Gomez,29AR5X5yKPd4DBIAiqUMDy,False,16,6,17,0.552,0.783,7,-4.138,0,0.0504,0.00887,0.00026,0.0954,0.575,79.984,231413,4
2013-08-17,20,The Way,Ariana Grande Featuring Mac Miller,29AR5X5yKPd4DBIAiqUMDy,False,17,9,19,0.645,0.877,5,-3.208,0,0.113,0.294,0,0.0759,0.861,82.324,227027,4
2013-08-17,21,Just Give Me A Reason,P!nk Featuring Nate Ruess,29AR5X5yKPd4DBIAiqUMDy,False,20,1,25,0.778,0.547,2,-7.273,1,0.0489,0.346,0.000302,0.132,0.441,95.002,242733,4
2013-08-17,22,I Want Crazy,Hunter Hayes,29AR5X5yKPd4DBIAiqUMDy,False,22,19,17,0.562,0.878,8,-4.806,1,0.0387,0.0539,0,0.112,0.558,103.029,236865,4
2013-08-17,23,Summertime Sadness,Lana Del Rey & Cedric Gervais,29AR5X5yKPd4DBIAiqUMDy,False,37,23,4,0.572,0.81,1,-5.791,0,0.0558,0.0157,6.53e-06,0.13,0.11,126.052,214912,4
2013-08-17,24,Runnin' Outta Moonlight,Randy Houser,29AR5X5yKPd4DBIAiqUMDy,False,25,24,13,0.526,0.801,2,-3.717,1,0.0393,0.0354,3.17e-06,0.0637,0.769,172.024,193773,4
2013-08-17,25,"Gone, Gone, Gone",Phillip Phillips,29AR5X5yKPd4DBIAiqUMDy,False,28,25,22,0.664,0.642,6,-5.961,1,0.038,0.129,0,0.114,0.501,118.002,209693,4
2013-08-17,26,Power Trip,J. Cole Featuring Miguel,29AR5X5yKPd4DBIAiqUMDy,False,26,19,25,0.667,0.608,1,-7.054,1,0.216,0.324,0.000198,0.426,0.475,99.992,241160,4
2013-08-17,27,Sail,AWOLNATION,29AR5X5yKPd4DBIAiqUMDy,False,31,27,48,0.825,0.435,1,-9.582,1,0.0568,0.452,0.609,0.0953,0.243,119.038,259102,4
2013-08-17,28,Crash My Party,Luke Bryan,29AR5X5yKPd4DBIAiqUMDy,False,27,18,17,0.526,0.816,7,-4.009,1,0.0421,0.0285,0,0.22,0.414,144.032,234760,4
2013-08-17,29,I Love It,Icona Pop Featuring Charli XCX,29AR5X5yKPd4DBIAiqUMDy,False,23,7,27,0.711,0.906,8,-2.671,1,0.0284,0.00952,1.64e-05,0.153,0.824,125.916,157153,4
2013-08-17,30,Body Party,Ciara,29AR5X5yKPd4DBIAiqUMDy,False,30,22,15,0.577,0.576,2,-6.299,1,0.0563,0.0143,0,0.602,0.12,133.973,234040,4
2013-08-17,31,Thrift Shop,Macklemore & Ryan Lewis Featuring Wanz,29AR5X5yKPd4DBIAiqUMDy,False,29,1,44,0.781,0.526,6,-6.986,0,0.293,0.0633,0,0.0457,0.665,94.993,235613,4
2013-08-17,32,Stay,Rihanna Featuring Mikky Ekko,29AR5X5yKPd4DBIAiqUMDy,False,32,3,26,0.621,0.31,9,-10.164,0,0.0283,0.945,6.12e-05,0.117,0.125,111.893,240707,4
2013-08-17,33,Take Back The Night,Justin Timberlake,29AR5X5yKPd4DBIAiqUMDy,False,52,33,4,0.588,0.664,7,-5.18,1,0.159,0.043,4.3e-05,0.639,0.333,106.502,353160,4
2013-08-17,34,When I Was Your Man,Bruno Mars,29AR5X5yKPd4DBIAiqUMDy,False,33,1,33,0.612,0.28,0,-8.648,1,0.0434,0.932,0,0.088,0.387,72.795,213827,4
2013-08-17,35,Don't Ya,Brett Eldredge,29AR5X5yKPd4DBIAiqUMDy,False,40,35,11,0.537,0.693,9,-5.256,1,0.0847,0.0566,0,0.146,0.581,176.004,181210,4
2013-08-17,36,Boys 'round Here,Blake Shelton Featuring Pistol Annies & Friends,29AR5X5yKPd4DBIAiqUMDy,False,35,12,19,0.611,0.688,2,-6.369,1,0.0529,0.251,2.35e-06,0.248,0.649,169.895,288760,4
2013-08-17,37,Round Here,Florida Georgia Line,29AR5X5yKPd4DBIAiqUMDy,False,39,37,8,0.523,0.954,1,-3.051,1,0.0374,0.00385,1.65e-06,0.243,0.901,141.982,215120,4
2013-08-17,38,U.O.E.N.O.,Rocko Featuring Future & Rick Ross,29AR5X5yKPd4DBIAiqUMDy,False,24,20,17,0.422,0.641,10,-4.947,0,0.323,0.422,0,0.317,0.654,187.027,260276,3
2013-08-17,39,Royals,Lorde,29AR5X5yKPd4DBIAiqUMDy,False,59,39,5,0.674,0.428,7,-9.504,1,0.122,0.121,0,0.132,0.337,84.878,190185,4
2013-08-17,40,Bad,Wale Featuring Tiara Thomas Or Rihanna,29AR5X5yKPd4DBIAiqUMDy,False,36,21,25,0.807,0.702,6,-6.594,0,0.0748,0.307,0,0.111,0.447,114.038,238827,4
2013-08-17,41,See You Again,Carrie Underwood,29AR5X5yKPd4DBIAiqUMDy,False,45,41,14,0.514,0.742,8,-2.525,1,0.0258,0.27,1.7e-06,0.085,0.47,101.0,246453,4
2013-08-17,42,Redneck Crazy,Tyler Farr,29AR5X5yKPd4DBIAiqUMDy,False,49,42,10,0.487,0.667,7,-4.216,0,0.0309,0.153,0,0.161,0.463,145.854,216040,4
2013-08-17,43,My Songs Know What You Did In The Dark (Light Em Up),Fall Out Boy,29AR5X5yKPd4DBIAiqUMDy,False,38,13,26,0.558,0.924,9,-4.341,0,0.064,0.0271,3.32e-06,0.537,0.567,151.99,186827,4
2013-08-17,44,Ho Hey,The Lumineers,29AR5X5yKPd4DBIAiqUMDy,False,47,3,61,0.685,0.466,0,-9.074,1,0.0304,0.794,2.06e-06,0.0915,0.353,79.936,163133,4
2013-08-17,45,Little Bit Of Everything,Keith Urban,29AR5X5yKPd4DBIAiqUMDy,False,51,45,11,0.619,0.882,8,-5.99,1,0.0912,0.239,0,0.033,0.897,159.98,205707,4
2013-08-17,46,Gas Pedal,Sage The Gemini Featuring IamSu!,29AR5X5yKPd4DBIAiqUMDy,False,58,46,2,0.843,0.538,1,-8.028,1,0.0833,0.0273,0,0.124,0.428,97.49,208160,4
2013-08-17,47,Crooked Smile,J. Cole Featuring TLC,29AR5X5yKPd4DBIAiqUMDy,False,55,47,7,0.606,0.784,7,-6.293,1,0.268,0.435,0,0.689,0.48,80.985,278573,4
2013-08-17,48,Tapout,"Rich Gang Featuring Lil Wayne, Birdman, Future, Mack Maine, Nicki Minaj",29AR5X5yKPd4DBIAiqUMDy,False,44,44,13,0.762,0.577,8,-5.229,1,0.175,0.0309,0,0.108,0.287,142.055,284587,4
2013-08-17,49,Wagon Wheel,Darius Rucker,29AR5X5yKPd4DBIAiqUMDy,False,46,15,26,0.537,0.66,9,-7.174,1,0.0296,0.455,0,0.135,0.574,148.096,298373,4
2013-08-17,50,Beneath Your Beautiful,Labrinth Featuring Emeli Sande,29AR5X5yKPd4DBIAiqUMDy,False,34,34,8,0.558,0.522,2,-5.857,1,0.036,0.228,0,0.104,0.228,83.977,271813,4
2013-08-17,51,Don't Drop That Thun Thun!,The FiNATTiCZ,29AR5X5yKPd4DBIAiqUMDy,False,50,35,4,0.926,0.334,4,-9.942,0,0.507,0.0721,0,0.0794,0.39,97.984,210200,4
2013-08-17,52,Crazy Kids,Ke$ha Featuring will.i.am Or Juicy J,29AR5X5yKPd4DBIAiqUMDy,False,43,40,10,0.742,0.706,0,-4.6,0,0.0433,0.0141,0.00568,0.133,0.478,128.03,230747,4
2013-08-17,53,Hey Pretty Girl,Kip Moore,29AR5X5yKPd4DBIAiqUMDy,False,42,41,20,0.291,0.4,2,-10.615,1,0.0306,0.145,1.86e-05,0.259,0.0935,83.112,215920,1
2013-08-17,54,It Goes Like This,Thomas Rhett,29AR5X5yKPd4DBIAiqUMDy,False,62,54,8,0.543,0.837,11,-6.448,1,0.0608,0.117,0,0.0872,0.506,168.056,186080,4
2013-08-17,55,Night Train,Jason Aldean,29AR5X5yKPd4DBIAiqUMDy,False,69,55,5,0.496,0.708,5,-5.175,1,0.0293,0.0512,1.06e-06,0.182,0.502,158.121,232307,4
2013-08-17,56,Hey Girl,Billy Currington,29AR5X5yKPd4DBIAiqUMDy,False,65,56,11,0.548,0.673,1,-5.29,1,0.0268,0.0158,0,0.0794,0.652,81.947,200533,4
2013-08-17,57,Right Now,Rihanna Featuring David Guetta,29AR5X5yKPd4DBIAiqUMDy,False,57,50,7,0.668,0.64,3,-5.208,0,0.0888,0.049,0,0.0675,0.259,130.004,181627,4
2013-08-17,58,All Over The Road,Easton Corbin,29AR5X5yKPd4DBIAiqUMDy,False,61,57,13,0.491,0.841,5,-3.579,1,0.0421,0.0471,0,0.0886,0.721,199.851,163067,4
2013-08-17,59,Red Nose,Sage The Gemini,29AR5X5yKPd4DBIAiqUMDy,False,64,59,3,0.681,0.473,11,-5.733,0,0.449,0.414,0,0.0794,0.766,194.826,193200,4
2013-08-17,60,#Beautiful,Mariah Carey Featuring Miguel,29AR5X5yKPd4DBIAiqUMDy,False,54,15,13,0.677,0.749,4,-5.405,1,0.0391,0.346,0,0.347,0.469,107.042,199867,4
2013-08-17,61,Everything Has Changed,Taylor Swift Featuring Ed Sheeran,29AR5X5yKPd4DBIAiqUMDy,False,41,41,5,0.624,0.458,6,-6.755,1,0.0287,0.36,3.89e-06,0.303,0.436,80.017,243933,4
2013-08-17,62,Turn The Night Up,Enrique Iglesias,4e3RCQgj1P4Fa7d86y2qT2,True,0,62,1,0.78,0.74,0,-5.31,1,0.042,0.00554,1.33e-05,0.0979,0.214,128.002,197733,4
2013-08-17,63,Demons,Imagine Dragons,4e3RCQgj1P4Fa7d86y2qT2,False,68,59,20,0.505,0.71,3,-3.015,1,0.0321,0.19,0.00025,0.329,0.428,89.938,175200,4
2013-08-17,64,No New Friends (SFTB Remix),"DJ Khaled Featuring Drake, Rick Ross & Lil Wayne",4e3RCQgj1P4Fa7d86y2qT2,False,63,37,15,0.703,0.681,2,-6.356,1,0.133,0.00589,0,0.449,0.245,124.928,308333,4
2013-08-17,65,Rich As F**k,Lil Wayne Featuring 2 Chainz,4e3RCQgj1P4Fa7d86y2qT2,False,60,38,20,0.595,0.359,8,-13.488,1,0.453,0.289,0,0.15,0.886,131.969,229198,4
2013-08-17,66,Ain't Worried About Nothin,French Montana,4e3RCQgj1P4Fa7d86y2qT2,False,70,66,7,0.688,0.904,1,-2.234,1,0.106,0.0229,0,0.0909,0.71,127.887,212427,4
2013-08-17,67,Counting Stars,OneRepublic,4e3RCQgj1P4Fa7d86y2qT2,False,76,32,7,0.664,0.705,1,-4.972,0,0.0382,0.0654,0,0.115,0.477,122.017,257840,4
2013-08-17,68,Still Into You,Paramore,4e3RCQgj1P4Fa7d86y2qT2,False,86,68,4,0.602,0.923,5,-3.763,1,0.044,0.0098,0,0.0561,0.765,136.01,216013,4
2013-08-17,69,Parking Lot Party,Lee Brice,4e3RCQgj1P4Fa7d86y2qT2,False,79,67,6,0.54,0.86,1,-5.763,1,0.081,0.00646,0,0.629,0.856,171.72,207893,4
2013-08-17,70,Brave,Sara Bareilles,4e3RCQgj1P4Fa7d86y2qT2,False,73,61,8,0.551,0.836,10,-3.838,0,0.0524,0.00502,2.1e-05,0.0425,0.758,185.063,220573,4
2013-08-17,71,What About Love,Austin Mahone,4e3RCQgj1P4Fa7d86y2qT2,False,71,66,8,0.632,0.784,2,-7.457,1,0.0393,0.000157,3.6e-05,0.037,0.278,100.019,203344,4
2013-08-17,72,HeadBand,B.o.B Featuring 2 Chainz,4e3RCQgj1P4Fa7d86y2qT2,False,85,65,8,0.919,0.506,1,-7.14,1,0.304,0.132,0,0.0771,0.273,97.465,220240,4
2013-08-17,73,Point At You,Justin Moore,4e3RCQgj1P4Fa7d86y2qT2,False,80,73,10,0.626,0.805,7,-5.81,1,0.0449,0.0126,0,0.156,0.882,116.03,180720,4
2013-08-17,74,Acapella,Karmin,4e3RCQgj1P4Fa7d86y2qT2,False,81,72,4,0.667,0.619,2,-4.933,1,0.151,0.126,0,0.101,0.427,169.865,198907,4
2013-08-17,75,Feds Watching,2 Chainz Featuring Pharrell,4e3RCQgj1P4Fa7d86y2qT2,False,83,67,5,0.79,0.875,7,-6.55,1,0.091,0.0476,0,0.312,0.759,139.985,247013,4
2013-08-17,76,Wop,J. Dash,4e3RCQgj1P4Fa7d86y2qT2,False,72,51,9,0.836,0.817,7,-5.672,1,0.0677,0.00968,0,0.114,0.647,112.007,230627,4
2013-08-17,77,Tom Ford,JAY-Z,4e3RCQgj1P4Fa7d86y2qT2,False,78,39,4,0.863,0.705,8,-6.202,1,0.31,0.05,2.21e-05,0.524,0.599,145.099,189013,4
2013-08-17,78,Southern Girl,Tim McGraw,4e3RCQgj1P4Fa7d86y2qT2,False,100,78,2,0.731,0.772,7,-4.559,1,0.0258,0.0407,0,0.449,0.928,110.04,255480,4
2013-08-17,79,Aw Naw,Chris Young,4e3RCQgj1P4Fa7d86y2qT2,False,90,79,3,0.652,0.859,2,-3.746,1,0.0358,0.0639,0,0.0777,0.491,109.971,188707,4
2013-08-17,80,Type Of Way,Rich Homie Quan,4e3RCQgj1P4Fa7d86y2qT2,False,89,80,3,0.854,0.75,6,-5.273,0,0.29,0.0606,0,0.0968,0.814,134.919,256000,4
2013-08-17,81,Sweater Weather,The Neighbourhood,4e3RCQgj1P4Fa7d86y2qT2,False,91,81,8,0.612,0.807,10,-2.81,1,0.0336,0.0495,0.0177,0.101,0.398,124.053,240400,4
2013-08-17,82,Beat It,Sean Kingston Featuring Chris Brown & Wiz Khalifa,4e3RCQgj1P4Fa7d86y2qT2,False,74,52,15,0.477,0.637,1,-5.386,1,0.109,0.00487,0,0.284,0.555,198.12,253453,4
2013-08-17,83,Bubble Butt,"Major Lazer Featuring Bruno Mars, Tyga & Mystic",4e3RCQgj1P4Fa7d86y2qT2,False,77,67,8,0.765,0.771,7,-6.99,1,0.347,0.0115,0.00237,0.606,0.394,194.072,227813,4
2013-08-17,84,How Many Drinks?,Miguel,4e3RCQgj1P4Fa7d86y2qT2,False,84,69,16,0.379,0.608,0,-7.011,0,0.134,0.00311,0.000614,0.248,0.241,81.822,272987,4
2013-08-17,85,True Love,P!nk Featuring Lily Allen,1QNqrsNQ1JVLEwncov3lEY,True,0,85,1,0.457,0.823,9,-4.76,1,0.311,0.00144,0,0.108,0.578,192.205,230733,4
2013-08-17,86,Goodbye Town,Lady Antebellum,1QNqrsNQ1JVLEwncov3lEY,False,99,86,6,0.678,0.72,4,-6.034,1,0.027,0.165,5.73e-06,0.114,0.538,95.027,288800,4
2013-08-17,87,Anywhere With You,Jake Owen,1QNqrsNQ1JVLEwncov3lEY,False,87,46,20,0.475,0.936,5,-2.545,1,0.0413,0.0418,0,0.0873,0.598,151.988,209587,4
2013-08-17,88,Jump Right In,Zac Brown Band,1QNqrsNQ1JVLEwncov3lEY,False,75,53,15,0.697,0.82,1,-5.108,1,0.0575,0.0888,0,0.143,0.655,104.022,180813,4
2013-08-17,89,Cruisin' For A Bruisin',"Ross Lynch, Grace Phipps And Jason Evigan",1QNqrsNQ1JVLEwncov3lEY,False,82,82,2,0.585,0.911,11,-4.623,1,0.119,0.0263,0,0.112,0.781,163.933,195733,4
2013-08-17,90,Love More,Chris Brown Featuring Nicki Minaj,1QNqrsNQ1JVLEwncov3lEY,False,56,56,2,0.882,0.621,1,-6.652,1,0.0461,0.000463,0.00055,0.0784,0.487,104.954,189707,4
2013-08-17,91,F*ckwithmeyouknowigotit,Jay Z Featuring Rick Ross,1QNqrsNQ1JVLEwncov3lEY,False,88,64,4,0.611,0.464,10,-8.068,0,0.294,0.0171,0.214,0.0794,0.274,127.766,243413,4
2013-08-17,92,LoveHate Thing,Wale Featuring Sam Dew,1QNqrsNQ1JVLEwncov3lEY,False,96,89,5,0.736,0.691,8,-6.118,1,0.169,0.0771,0,0.0422,0.18,99.954,267400,4
2013-08-17,93,Chloe (You're The One I Want),Emblem3,1QNqrsNQ1JVLEwncov3lEY,False,98,93,2,0.71,0.925,0,-3.329,1,0.0359,0.039,0,0.127,0.93,118.024,222987,4
2013-08-17,94,Beware,Big Sean Featuring Lil Wayne & Jhene Aiko,1QNqrsNQ1JVLEwncov3lEY,False,0,94,2,0.7,0.554,1,-5.909,1,0.187,0.219,1.36e-06,0.419,0.0633,97.127,235187,4
2013-08-17,95,Let Her Go,Passenger,0JmiBCpWc1IAc0et7Xm7FL,True,0,95,1,0.479,0.545,7,-7.346,1,0.0688,0.365,0,0.0963,0.243,74.897,252733,4
2013-08-17,96,When I See This Bar,Kenny Chesney,0JmiBCpWc1IAc0et7Xm7FL,False,97,96,2,0.712,0.726,7,-7.346,1,0.0248,0.0284,4.48e-05,0.104,0.558,111.069,362813,4
2013-08-17,97,Vivir Mi Vida,Marc Anthony,0JmiBCpWc1IAc0et7Xm7FL,False,92,92,2,0.656,0.877,0,-3.231,0,0.0342,0.345,0,0.349,0.894,105.018,252347,4
2013-08-17,98,Easy,Sheryl Crow,0JmiBCpWc1IAc0et7Xm7FL,False,0,98,2,0.522,0.571,9,-5.567,1,0.0245,0.0256,1.14e-06,0.0757,0.608,169.994,253360,4
2013-08-17,99,I'm Out,Ciara Featuring Nicki Minaj,0JmiBCpWc1IAc0et7Xm7FL,False,93,44,5,0.737,0.723,0,-5.834,1,0.261,0.0864,4.47e-06,0.522,0.555,148.113,241613,4
2013-08-17,100,Mine Would Be You,Blake Shelton,1zvQt99d5oTkEQLmSoO1yu,True,0,100,1,0.572,0.529,0,-6.897,1,0.0282,0.146,0,0.335,0.321,139.876,239507,4
