date,position,title,artist,spotify_id,is_new,last_pos,peak_pos,weeks,danceability,energy,key,loudness,mode,speechiness,acousticness,instrumentalness,liveness,valence,tempo,duration_ms,time_signature
1999-04-17,1,No Scrubs,TLC,7hWod2nZxzIewqWEw45iUR,False,1,1,9,0.743,0.675,8,-4.267,0,0.0953,0.0251,0.000717,0.0685,0.59,92.909,214400,4
1999-04-17,2,Believe,Cher,7hWod2nZxzIewqWEw45iUR,False,2,1,18,0.652,0.917,6,-6.72,1,0.0548,0.0082,0,0.0509,0.459,132.975,239027,4
1999-04-17,3,What's It Gonna Be?!,Busta Rhymes Featuring Janet,7hWod2nZxzIewqWEw45iUR,False,4,3,6,0.797,0.934,1,-4.507,1,0.0926,0.204,0,0.119,0.519,116.438,324400,4
1999-04-17,4,Every Morning,Sugar Ray,7hWod2nZxzIewqWEw45iUR,False,3,3,15,0.833,0.679,8,-4.496,1,0.0365,0.0834,0.00258,0.0769,0.975,109.916,219867,4
1999-04-17,5,Heartbreak Hotel,Whitney Houston Feat. Faith Evans & Kelly Price,7hWod2nZxzIewqWEw45iUR,False,5,2,17,0.724,0.535,3,-7.616,0,0.0588,0.0477,0,0.0314,0.664,133.816,281493,4
1999-04-17,6,Kiss Me,Sixpence None The Richer,7hWod2nZxzIewqWEw45iUR,False,6,5,11,0.526,0.749,3,-6.964,1,0.0283,0.023,1.76e-06,0.0692,0.421,99.982,208680,4
1999-04-17,7,I Still Believe,Mariah Carey,7hWod2nZxzIewqWEw45iUR,False,7,4,11,0.612,0.521,7,-7.647,1,0.0304,0.174,0,0.103,0.175,118.016,236467,4
1999-04-17,8,Angel Of Mine,Monica,7hWod2nZxzIewqWEw45iUR,False,8,1,20,0.592,0.562,10,-6.869,0,0.0239,0.00373,3.23e-05,0.223,0.208,90.16,250173,4
1999-04-17,9,C'est La Vie,B*Witched,7hWod2nZxzIewqWEw45iUR,False,16,9,9,0.705,0.936,7,-5.109,1,0.0306,0.0978,0.000124,0.0506,0.939,109.004,173693,4
1999-04-17,10,Stay The Same,Joey McIntyre,7hWod2nZxzIewqWEw45iUR,False,10,10,8,0.629,0.553,2,-5.773,1,0.0297,0.0249,0,0.141,0.285,130.115,227400,4
1999-04-17,11,All I Have To Give,Backstreet Boys,7hWod2nZxzIewqWEw45iUR,False,11,5,12,0.731,0.574,1,-7.114,1,0.029,0.0644,0,0.0675,0.392,95.995,276573,4
1999-04-17,12,All Night Long,Faith Evans Featuring Puff Daddy,7hWod2nZxzIewqWEw45iUR,False,9,9,11,0.712,0.773,11,-4.595,0,0.271,0.0243,0,0.13,0.699,100.409,234253,4
1999-04-17,13,If You (Lovin' Me),Silk,7hWod2nZxzIewqWEw45iUR,False,15,13,6,0.628,0.477,9,-8.77,0,0.0325,0.184,0,0.0726,0.336,99.216,337467,4
1999-04-17,14,When I Close My Eyes,Shanice,7hWod2nZxzIewqWEw45iUR,False,12,12,4,0.682,0.555,6,-6.349,1,0.0319,0.0225,0,0.0754,0.511,83.332,202227,4
1999-04-17,15,Slide,Goo Goo Dolls,7hWod2nZxzIewqWEw45iUR,False,14,8,20,0.395,0.843,8,-4.476,1,0.0374,0.00483,0,0.0404,0.481,112.423,212067,4
1999-04-17,16,Angel,Sarah McLachlan,7hWod2nZxzIewqWEw45iUR,False,13,4,20,0.532,0.0744,1,-16.092,1,0.0355,0.949,1.22e-05,0.106,0.125,117.131,270400,3
1999-04-17,17,Please Remember Me,Tim McGraw,7hWod2nZxzIewqWEw45iUR,False,25,17,3,0.465,0.54,1,-7.097,1,0.0277,0.177,2.82e-06,0.106,0.234,75.88,296333,4
1999-04-17,19,...Baby One More Time,Britney Spears,,False,17,1,22,0.759,0.699,0,-5.745,0,0.0307,0.202,0.000131,0.443,0.907,92.96,211067,4
1999-04-17,20,The Animal Song,Savage Garden,,False,19,19,6,0.652,0.669,6,-7.663,1,0.037,0.0639,3.83e-06,0.0671,0.834,116.088,278000,4
1999-04-17,21,Sweet Lady,Tyrese,,False,18,18,13,0.588,0.522,9,-6.254,0,0.0383,0.233,0,0.24,0.584,66.024,290600,4
1999-04-17,22,Fly Away,Lenny Kravitz,,False,22,22,20,0.587,0.872,7,-5.066,1,0.0484,0.018,0,0.622,0.735,159.925,221333,4
1999-04-17,23,What It's Like,Everlast,,False,23,23,18,0.678,0.556,0,-7.423,1,0.0281,0.0904,0.0334,0.0866,0.405,85.158,303133,4
1999-04-17,24,Hard Knock Life (Ghetto Anthem),JAY-Z,,False,20,15,21,0.884,0.679,10,-5.857,0,0.282,0.0957,0.00209,0.0289,0.591,76.993,238467,4
1999-04-17,25,Give It To You,Jordan Knight,,False,54,25,3,0.83,0.655,7,-7.072,1,0.0544,0.0552,1.09e-06,0.0567,0.653,134.869,289760,4
1999-04-17,26,We Like To Party!,Vengaboys,,False,33,26,10,0.785,0.931,8,-4.813,1,0.0465,0.0148,0.637,0.0459,0.969,135.986,222459,4
1999-04-17,27,(God Must Have Spent) A Little More Time On You,'N Sync,,False,29,8,20,0.61,0.926,8,-4.843,0,0.0479,0.031,0.0012,0.0821,0.861,172.638,200400,4
1999-04-17,28,My First Night With You,Mya,,False,45,28,5,0.627,0.422,8,-8.37,1,0.03,0.546,0.00103,0.128,0.174,138.913,338640,4
1999-04-17,29,Ex-Factor,Lauryn Hill,,False,21,21,15,0.593,0.619,3,-9.003,0,0.0976,0.118,0,0.484,0.668,80.02,326533,4
1999-04-17,30,One More Try,Divine,,False,35,30,3,0.605,0.273,5,-11.378,1,0.0282,0.766,0.136,0.108,0.0976,123.016,310590,3
1999-04-17,31,These Are The Times,Dru Hill,,False,0,21,18,0.718,0.473,9,-9.278,0,0.0267,0.106,0,0.0964,0.384,109.992,248400,4
1999-04-17,32,Back 2 Good,matchbox 20,,False,28,28,17,0.559,0.504,7,-9.455,1,0.0246,0.106,0,0.13,0.479,89.051,340173,4
1999-04-17,33,You,Jesse Powell,,False,27,10,9,0.722,0.327,0,-9.612,0,0.026,0.299,0.000661,0.0549,0.266,112.249,318467,4
1999-04-17,34,How Forever Feels,Kenny Chesney,,False,31,27,11,0.723,0.674,7,-7.427,1,0.0297,0.0986,1.83e-05,0.279,0.61,124.9,188200,4
1999-04-17,35,Save Tonight,Eagle-Eye Cherry,,False,30,5,20,0.547,0.693,0,-8.786,1,0.0353,9.24e-05,5.46e-05,0.113,0.583,119.567,239227,4
1999-04-17,36,Have You Ever?,Brandy,,False,26,1,20,0.698,0.533,2,-6.246,1,0.0437,0.542,0,0.333,0.275,134.001,273440,4
1999-04-17,37,I'm Not Ready,Keith Sweat,,False,32,16,6,0.753,0.349,9,-9.136,0,0.0275,0.405,0.00669,0.0782,0.289,107.971,257907,4
1999-04-17,38,Anywhere,112 Featuring Lil'z,,False,44,38,5,0.592,0.499,5,-7.806,1,0.277,0.174,0,0.122,0.863,125.824,244416,4
1999-04-17,39,When A Woman's Fed Up,R. Kelly,,False,40,22,17,0.684,0.587,2,-6.271,0,0.0814,0.428,5.58e-06,0.0932,0.693,77.009,275293,4
1999-04-17,40,Ordinary Life,Chad Brock,,False,42,40,9,0.539,0.395,3,-9.289,1,0.0285,0.491,0,0.114,0.196,125.057,236107,4
1999-04-17,41,I'll Think Of A Reason Later,Lee Ann Womack,,False,41,41,8,0.594,0.833,3,-5.543,1,0.0358,0.0848,7.8e-05,0.311,0.663,142.035,218667,4
1999-04-17,42,The Hardest Thing,98 Degrees,,False,49,42,4,0.723,0.48,10,-7.503,1,0.0282,0.154,0,0.0672,0.571,87.99,274627,4
1999-04-17,43,Nobody's Supposed To Be Here,Deborah Cox,,False,34,2,29,0.662,0.531,8,-5.3,1,0.0361,0.202,1.16e-05,0.595,0.399,119.957,262333,4
1999-04-17,44,Miami,Will Smith,,False,38,17,20,0.877,0.534,1,-6.178,1,0.15,0.0339,1.67e-05,0.0441,0.89,108.17,197560,4
1999-04-17,45,Everybody's Free (To Wear Sunscreen),Baz Luhrmann,,False,46,45,4,0.678,0.587,8,-8.166,1,0.0712,0.0128,0.306,0.106,0.662,89.996,435360,4
1999-04-17,46,Jumper,Third Eye Blind,,False,36,5,20,0.599,0.543,0,-9.226,1,0.0302,0.0129,0.00193,0.291,0.624,91.105,272973,4
1999-04-17,48,Faded Pictures,Case & Joe,,False,37,10,17,0.705,0.511,6,-7.422,0,0.202,0.125,1.72e-06,0.153,0.581,82.011,229773,4
1999-04-17,49,Drive Me Wild,Sawyer Brown,,False,58,49,8,0.651,0.708,2,-7.793,1,0.0258,0.159,0,0.162,0.95,128.829,215507,4
1999-04-17,50,Can I Get A...,Jay-Z Featuring Amil (Of Major Coinz) & Ja,,False,50,19,29,0.792,0.694,8,-8.496,0,0.33,0.0619,2.32e-05,0.25,0.804,177.094,309773,4
1999-04-17,51,Wish You Were Here,Mark Wills,,False,53,51,7,0.516,0.397,5,-10.278,1,0.0274,0.2,0,0.12,0.236,138.075,241960,4
1999-04-17,52,You Got Me,The Roots Featuring Erykah Badu,,False,39,39,10,0.729,0.442,11,-8.106,0,0.285,0.151,0,0.189,0.757,81.029,259307,4
1999-04-17,53,Praise You,Fatboy Slim,,False,59,53,6,0.621,0.885,1,-6.826,1,0.0473,0.0418,0.492,0.133,0.554,109.728,227973,4
1999-04-17,54,Livin' La Vida Loca,Ricky Martin,0Ph6L4l8dYUuXFmb71Ajnd,True,0,54,1,0.425,0.954,1,-3.756,0,0.0476,0.00411,0,0.0555,0.933,178.043,243160,4
1999-04-17,55,Georgy Porgy,Eric Benet Featuring Faith Evans,0Ph6L4l8dYUuXFmb71Ajnd,False,56,55,5,0.728,0.636,11,-7.033,0,0.171,0.00677,8.47e-05,0.296,0.821,96.512,280880,4
1999-04-17,56,That Don't Impress Me Much,Shania Twain,0Ph6L4l8dYUuXFmb71Ajnd,False,66,56,11,0.743,0.873,10,-4.943,0,0.0507,0.14,0,0.142,0.965,125.005,238707,5
1999-04-17,57,Blue Monday,Orgy,0Ph6L4l8dYUuXFmb71Ajnd,False,61,57,8,0.589,0.696,8,-8.109,1,0.034,8.65e-05,3.43e-05,0.0779,0.938,129.833,267000,4
1999-04-17,58,You Were Mine,Dixie Chicks,0Ph6L4l8dYUuXFmb71Ajnd,False,48,34,13,0.542,0.346,9,-6.598,1,0.0296,0.342,0,0.283,0.173,139.856,217807,4
1999-04-17,59,What's So Different,Ginuwine,0Ph6L4l8dYUuXFmb71Ajnd,False,52,49,9,0.798,0.616,11,-8.788,0,0.151,0.00941,5.09e-06,0.0637,0.96,78.884,235400,4
1999-04-17,60,Gone Crazy,Alan Jackson,0Ph6L4l8dYUuXFmb71Ajnd,False,60,60,6,0.538,0.34,5,-12.064,1,0.0244,0.43,5.82e-05,0.0936,0.165,76.344,230440,4
1999-04-17,61,Written In The Stars,Elton John & LeAnn Rimes,0Ph6L4l8dYUuXFmb71Ajnd,False,51,29,6,0.61,0.589,0,-7.594,1,0.0325,0.756,0,0.115,0.382,121.849,257840,4
1999-04-17,62,My Name Is,Eminem,0Ph6L4l8dYUuXFmb71Ajnd,False,43,36,8,0.869,0.68,1,-6.233,1,0.318,0.0416,1.12e-06,0.0914,0.815,85.519,268400,4
1999-04-17,63,You Won't Ever Be Lonely,Andy Griggs,0Ph6L4l8dYUuXFmb71Ajnd,False,67,63,4,0.471,0.617,8,-8.394,1,0.038,0.0522,0,0.229,0.491,182.323,210307,4
1999-04-17,64,I Can't Get Over You,Brooks & Dunn,0Ph6L4l8dYUuXFmb71Ajnd,False,55,51,10,0.618,0.75,0,-3.523,1,0.0241,0.0228,0.00101,0.0634,0.338,98.206,246560,4
1999-04-17,65,I Don't Want To Miss A Thing,Mark Chesnutt,0Ph6L4l8dYUuXFmb71Ajnd,False,57,17,18,0.496,0.47,10,-10.415,1,0.0333,0.0268,0,0.134,0.151,122.094,246227,4
1999-04-17,66,Hands Of A Working Man,Ty Herndon,0Ph6L4l8dYUuXFmb71Ajnd,False,68,66,5,0.607,0.628,0,-7.161,1,0.0283,0.0697,0,0.322,0.353,89.284,227133,4
1999-04-17,67,Hillbilly Shoes,Montgomery Gentry,0Ph6L4l8dYUuXFmb71Ajnd,False,71,67,4,0.655,0.837,7,-6.072,1,0.0355,0.0332,0.00223,0.111,0.708,115.938,192586,4
1999-04-17,68,Nann,Trick Daddy Featuring Trina,0Ph6L4l8dYUuXFmb71Ajnd,False,62,62,6,0.837,0.819,2,-5.245,1,0.211,0.000507,0,0.323,0.643,149.918,167400,4
1999-04-17,69,Anyone Else,Collin Raye,0Ph6L4l8dYUuXFmb71Ajnd,False,72,69,6,0.623,0.646,5,-9.888,1,0.0316,0.035,0,0.0736,0.492,121.301,227707,4
1999-04-17,70,One,Creed,0Ph6L4l8dYUuXFmb71Ajnd,False,70,70,8,0.386,0.677,2,-5.83,1,0.0346,0.00841,0.00366,0.341,0.195,126.602,238240,4
1999-04-17,71,Fortunate,Maxwell,0Ph6L4l8dYUuXFmb71Ajnd,False,78,71,2,0.74,0.359,10,-8.309,0,0.0462,0.0951,0,0.129,0.377,126.15,301160,4
1999-04-17,72,Stand Beside Me,Jo Dee Messina,0Ph6L4l8dYUuXFmb71Ajnd,False,64,34,19,0.587,0.72,0,-7.746,1,0.0278,0.179,0,0.0878,0.33,99.916,224640,4
1999-04-17,73,Two Teardrops,Steve Wariner,0Ph6L4l8dYUuXFmb71Ajnd,False,77,73,3,0.747,0.367,5,-8.825,1,0.0307,0.675,0,0.131,0.49,121.447,269827,4
1999-04-17,74,Love Ain't Like That,Faith Hill,0Ph6L4l8dYUuXFmb71Ajnd,False,74,68,7,0.458,0.52,2,-8.474,1,0.0266,0.285,0,0.466,0.407,147.579,229493,4
1999-04-17,75,Special,Garbage,0Ph6L4l8dYUuXFmb71Ajnd,False,75,75,4,0.443,0.944,0,-3.71,0,0.0377,8.79e-05,0.000542,0.369,0.573,131.828,223603,4
1999-04-17,76,What'd You Come Here For?,Trina & Tamara,0Ph6L4l8dYUuXFmb71Ajnd,False,86,76,3,0.795,0.436,1,-10.632,1,0.104,0.0517,0.000532,0.0616,0.783,102.901,246047,4
1999-04-17,77,808,Blaque,1Pqv7l6vxjBxd5fx4bWchC,True,0,77,1,0.867,0.42,1,-9.478,1,0.167,0.00328,3.18e-06,0.0887,0.367,121.66,306693,4
1999-04-17,78,With You,Lila McCann,1Pqv7l6vxjBxd5fx4bWchC,False,93,78,3,0.644,0.785,4,-6.118,1,0.0294,0.0281,1.19e-06,0.0996,0.628,127.9,212360,4
1999-04-17,79,Everytime I Cry,Terri Clark,1Pqv7l6vxjBxd5fx4bWchC,False,81,79,3,0.649,0.747,3,-4.695,1,0.03,0.0979,0,0.294,0.525,116.4,227387,4
1999-04-17,80,Anything But Down,Sheryl Crow,1Pqv7l6vxjBxd5fx4bWchC,False,83,80,2,0.626,0.766,4,-6.486,0,0.0331,0.0184,4.21e-06,0.108,0.561,121.23,258040,4
1999-04-17,81,Get Involved,Raphael Saadiq & Q-Tip,1Pqv7l6vxjBxd5fx4bWchC,False,69,69,3,0.852,0.526,0,-5.099,0,0.0515,0.0145,0.000461,0.0772,0.762,97.984,194694,4
1999-04-17,82,Down So Long,Jewel,5WmOYQAMavY2nk7tktsPbZ,True,0,82,1,0.611,0.55,9,-8.611,0,0.0436,0.306,0.00659,0.112,0.622,78.501,255147,4
1999-04-17,83,Busy Man,Billy Ray Cyrus,5WmOYQAMavY2nk7tktsPbZ,False,65,46,13,0.6,0.568,7,-9.867,1,0.0388,0.106,0,0.238,0.475,163.887,197267,4
1999-04-17,84,Heavy,Collective Soul,5WmOYQAMavY2nk7tktsPbZ,False,73,73,7,0.535,0.854,1,-6.519,1,0.0368,0.000919,0.00149,0.0676,0.618,106.929,177213,4
1999-04-17,85,Life,K-Ci & JoJo,5WmOYQAMavY2nk7tktsPbZ,False,79,79,5,0.573,0.546,9,-6.045,0,0.285,0.174,0,0.605,0.374,170.044,213252,4
1999-04-17,86,Slam Dunk,Five,6Dy0Tt2mdKo0Xkwl8yHBZV,True,0,86,1,0.721,0.923,2,-3.986,1,0.0444,0.023,0.0023,0.206,0.861,100.044,216000,4
1999-04-17,87,Sitting Home,Total,6Dy0Tt2mdKo0Xkwl8yHBZV,False,91,87,2,0.552,0.672,10,-9.772,0,0.0888,0.371,0.0159,0.0671,0.63,126.791,254859,5
1999-04-17,88,Why Don't You Get A Job?,The Offspring,6Dy0Tt2mdKo0Xkwl8yHBZV,False,88,88,2,0.766,0.882,5,-4.478,1,0.0719,0.0674,2.3e-06,0.281,0.544,107.932,172467,4
1999-04-17,89,Woof,Snoop Dogg Featuring Mystikal And Fiend,6Dy0Tt2mdKo0Xkwl8yHBZV,False,92,62,12,0.889,0.879,6,-4.475,0,0.294,0.172,0,0.792,0.752,96.016,172360,4
1999-04-17,90,Unbelievable,Diamond Rio,6Dy0Tt2mdKo0Xkwl8yHBZV,False,76,36,18,0.765,0.596,11,-7.586,1,0.0518,0.5,0,0.289,0.941,158.112,141533,3
1999-04-17,91,Holla Holla,Ja Rule,6Dy0Tt2mdKo0Xkwl8yHBZV,False,99,91,3,0.883,0.622,11,-7.968,1,0.35,0.0266,0,0.0869,0.499,92.969,264533,4
1999-04-17,92,Maria,Blondie,6Dy0Tt2mdKo0Xkwl8yHBZV,False,82,82,2,0.548,0.8,9,-6.926,1,0.0597,0.038,0.00255,0.0678,0.805,159.654,249427,4
1999-04-17,93,Man! I Feel Like A Woman!,Shania Twain,6sxptembJVty4sNtcPMAVz,True,0,93,1,0.657,0.639,10,-7.527,1,0.0412,0.581,0,0.278,0.674,124.882,234493,4
1999-04-17,94,My Favorite Girl,Dave Hollister,6sxptembJVty4sNtcPMAVz,False,95,94,2,0.655,0.662,8,-4.733,0,0.0537,0.434,0,0.152,0.613,120.0,332973,4
1999-04-17,95,Crush,Dave Matthews Band,6sxptembJVty4sNtcPMAVz,False,87,75,10,0.564,0.745,0,-6.933,1,0.0411,0.262,2.78e-05,0.108,0.672,94.044,488734,4
1999-04-17,96,Taking Everything,Gerald Levert,6sxptembJVty4sNtcPMAVz,False,84,11,12,0.689,0.71,3,-5.395,0,0.0413,0.0886,0,0.107,0.306,113.722,325667,4
1999-04-17,97,Run,Collective Soul,6sxptembJVty4sNtcPMAVz,False,85,76,6,0.552,0.727,11,-7.015,1,0.0242,0.0275,0.00121,0.0796,0.653,95.989,273453,4
1999-04-17,98,No Place That Far,Sara Evans,6sxptembJVty4sNtcPMAVz,False,89,37,19,0.547,0.373,0,-7.336,1,0.0273,0.504,0,0.176,0.182,132.741,217400,4
1999-04-17,99,Can't Get Enough,Patty Loveless,4r1uR1K59BugJMp6Wf1won,True,0,99,1,0.651,0.456,0,-9.458,1,0.0265,0.109,0.796,0.25,0.552,98.032,227813,4
1999-04-17,100,Ruff Ryders' Anthem,DMX,4r1uR1K59BugJMp6Wf1won,False,97,94,3,0.88,0.577,10,-8.093,0,0.302,0.0564,1.02e-06,0.201,0.74,90.991,214440,4
