date,position,title,artist,spotify_id,is_new,last_pos,peak_pos,weeks,danceability,energy,key,loudness,mode,speechiness,acousticness,instrumentalness,liveness,valence,tempo,duration_ms,time_signature
2004-10-09,1,Goodies,Ciara Featuring Petey Pablo,051NZ3rr3HXTULCEySJRX3,False,1,1,16,0.826,0.647,5,-6.306,0,0.0491,0.0277,1.52e-06,0.298,0.872,102.017,223000,4
2004-10-09,2,My Boo,Usher And Alicia Keys,051NZ3rr3HXTULCEySJRX3,False,5,2,5,0.662,0.507,5,-8.238,1,0.118,0.257,0,0.0465,0.676,86.412,223440,4
2004-10-09,3,Lean Back,Terror Squad,051NZ3rr3HXTULCEySJRX3,False,2,1,16,0.783,0.916,1,-3.344,1,0.415,0.11,0,0.0746,0.695,95.321,247427,4
2004-10-09,4,My Place,Nelly Featuring Jaheim,051NZ3rr3HXTULCEySJRX3,False,4,4,12,0.6,0.641,1,-4.237,0,0.0423,0.0498,1.49e-06,0.0982,0.642,163.153,336507,4
2004-10-09,5,Sunshine,Lil' Flip Featuring Lea,051NZ3rr3HXTULCEySJRX3,False,3,2,17,0.814,0.387,0,-9.867,1,0.0945,0.0248,0,0.131,0.792,93.961,225173,4
2004-10-09,6,She Will Be Loved,Maroon 5,051NZ3rr3HXTULCEySJRX3,False,6,5,12,0.618,0.504,11,-9.328,0,0.0319,0.496,4.73e-06,0.698,0.58,98.119,276787,4
2004-10-09,7,Lose My Breath,Destiny's Child,051NZ3rr3HXTULCEySJRX3,False,12,7,3,0.814,0.899,1,-5.958,1,0.0637,0.00727,0.219,0.0979,0.545,119.011,242013,4
2004-10-09,8,Locked Up,Akon Featuring Styles P.,051NZ3rr3HXTULCEySJRX3,False,10,8,18,0.828,0.58,7,-4.395,1,0.0941,0.0255,0,0.103,0.407,89.973,235067,4
2004-10-09,9,My Happy Ending,Avril Lavigne,051NZ3rr3HXTULCEySJRX3,False,9,9,11,0.414,0.936,2,-2.407,1,0.0758,0.00136,0,0.369,0.74,170.229,242413,4
2004-10-09,10,Diary,Alicia Keys Featuring Tony! Toni! Tone!,051NZ3rr3HXTULCEySJRX3,False,8,8,17,0.664,0.465,8,-9.711,0,0.0317,0.559,0.00174,0.125,0.281,127.932,284160,4
2004-10-09,11,Pieces Of Me,Ashlee Simpson,051NZ3rr3HXTULCEySJRX3,False,7,5,15,0.532,0.807,2,-4.301,1,0.057,0.0584,0,0.114,0.759,87.183,217440,4
2004-10-09,12,If I Ain't Got You,Alicia Keys,051NZ3rr3HXTULCEySJRX3,False,11,4,32,0.609,0.445,7,-9.129,1,0.106,0.603,6.77e-06,0.104,0.166,118.393,228707,3
2004-10-09,13,Why?,Jadakiss Featuring Anthony Hamilton,051NZ3rr3HXTULCEySJRX3,False,15,11,13,0.602,0.938,1,-3.378,0,0.238,0.0164,0,0.0612,0.562,168.417,240000,4
2004-10-09,14,Slow Motion,Juvenile Featuring Soulja Slim,051NZ3rr3HXTULCEySJRX3,False,13,1,24,0.713,0.734,0,-4.894,0,0.325,0.548,0,0.0687,0.89,172.872,248200,4
2004-10-09,15,Dip It Low,Christina Milian,051NZ3rr3HXTULCEySJRX3,False,14,5,25,0.754,0.718,11,-4.209,0,0.111,0.0122,0.000111,0.0923,0.576,169.116,201000,4
2004-10-09,16,Headsprung,LL Cool J,051NZ3rr3HXTULCEySJRX3,False,16,16,14,0.718,0.786,0,-5.76,1,0.0284,0.0114,2.5e-05,0.0745,0.465,99.916,267320,4
2004-10-09,17,Just Lose It,Eminem,0qcjuYtMWhBjXg0Xwt5SzS,True,0,17,1,0.94,0.633,8,-3.56,1,0.0467,0.0581,4.04e-05,0.281,0.962,121.003,248680,4
2004-10-09,18,On The Way Down,Ryan Cabrera,0qcjuYtMWhBjXg0Xwt5SzS,False,20,18,11,0.5,0.845,1,-5.015,1,0.0369,0.00184,0,0.106,0.539,95.199,212045,4
2004-10-09,19,One Thing,Finger Eleven,0qcjuYtMWhBjXg0Xwt5SzS,False,21,19,12,0.588,0.555,1,-9.401,1,0.0334,0.447,0,0.0806,0.445,151.991,279573,4
2004-10-09,20,Breakaway,Kelly Clarkson,0qcjuYtMWhBjXg0Xwt5SzS,False,27,20,7,0.446,0.701,9,-4.179,0,0.0295,0.0298,8.89e-06,0.0931,0.394,159.958,237000,3
2004-10-09,21,Turn Me On,Kevin Lyttle Featuring Spragga Benz,0qcjuYtMWhBjXg0Xwt5SzS,False,17,4,21,0.677,0.682,9,-6.879,1,0.0361,0.0405,0,0.0351,0.875,106.279,192107,4
2004-10-09,22,Breaking The Habit,Linkin Park,0qcjuYtMWhBjXg0Xwt5SzS,False,22,20,12,0.579,0.849,4,-5.218,0,0.0303,0.108,0,0.0909,0.581,100.021,196907,4
2004-10-09,23,Let's Get It Started,The Black Eyed Peas,0qcjuYtMWhBjXg0Xwt5SzS,False,24,21,10,0.726,0.769,2,-3.474,1,0.188,0.114,0,0.238,0.771,104.9,218993,4
2004-10-09,24,Heaven,Los Lonely Boys,0qcjuYtMWhBjXg0Xwt5SzS,False,23,16,22,0.653,0.818,11,-6.375,1,0.0638,0.376,1.64e-06,0.0754,0.798,91.896,226960,4
2004-10-09,25,The Reason,Hoobastank,0qcjuYtMWhBjXg0Xwt5SzS,False,19,2,30,0.472,0.671,4,-4.649,1,0.029,0.0129,0,0.159,0.0681,82.952,232800,4
2004-10-09,26,I Like That,"Houston Featuring Chingy, Nate Dogg & I-20",0qcjuYtMWhBjXg0Xwt5SzS,False,18,11,17,0.797,0.502,10,-3.925,0,0.0968,0.0154,0,0.1,0.385,106.997,236520,4
2004-10-09,27,This Love,Maroon 5,0qcjuYtMWhBjXg0Xwt5SzS,False,26,5,35,0.712,0.868,5,-4.098,0,0.038,0.0606,0,0.0897,0.758,95.041,205747,4
2004-10-09,28,"Breathe, Stretch, Shake",Mase Featuring P. Diddy,0qcjuYtMWhBjXg0Xwt5SzS,False,28,28,7,0.531,0.712,9,-4.887,1,0.336,0.0666,0,0.399,0.648,101.43,197277,4
2004-10-09,29,Let's Go,Trick Daddy Featuring Lil Jon & Twista,0qcjuYtMWhBjXg0Xwt5SzS,False,37,29,4,0.748,0.767,11,-7.806,0,0.172,0.0267,0,0.334,0.519,133.929,222200,4
2004-10-09,30,Move Ya Body,Nina Sky Featuring Jabba,0qcjuYtMWhBjXg0Xwt5SzS,False,25,4,24,0.87,0.712,11,-6.313,0,0.0432,0.0202,0.000331,0.0576,0.877,121.057,232000,4
2004-10-09,31,Nolia Clap,"Juvenile, Wacko & Skip",0qcjuYtMWhBjXg0Xwt5SzS,False,42,31,7,0.838,0.942,5,-2.353,1,0.395,0.0718,0,0.142,0.961,79.935,270333,4
2004-10-09,32,Days Go By,Keith Urban,0qcjuYtMWhBjXg0Xwt5SzS,False,31,31,12,0.589,0.892,2,-3.197,1,0.0365,0.0633,0,0.149,0.76,131.951,224630,4
2004-10-09,33,Oye Mi Canto,"N.O.R.E. Featuring Daddy Yankee, Nina Sky, Gem Star & Big Mato",0qcjuYtMWhBjXg0Xwt5SzS,False,36,33,7,0.677,0.946,6,-2.887,1,0.0553,0.185,3.56e-06,0.274,0.948,96.011,240973,4
2004-10-09,34,No Problem,Lil Scrappy,0qcjuYtMWhBjXg0Xwt5SzS,False,29,29,13,0.858,0.731,1,-7.224,1,0.237,0.053,0,0.15,0.139,85.984,214213,4
2004-10-09,35,Suds In The Bucket,Sara Evans,0qcjuYtMWhBjXg0Xwt5SzS,False,35,35,10,0.511,0.903,10,-3.163,1,0.0397,0.052,0.000529,0.304,0.898,161.992,227267,4
2004-10-09,36,Yeah!,Usher Featuring Lil Jon & Ludacris,0qcjuYtMWhBjXg0Xwt5SzS,False,33,1,40,0.894,0.791,2,-4.699,1,0.112,0.0183,0,0.0388,0.583,105.018,250373,4
2004-10-09,37,Leave (Get Out),JoJo,0qcjuYtMWhBjXg0Xwt5SzS,False,32,12,27,0.491,0.73,2,-4.399,0,0.0432,0.039,0,0.112,0.461,87.098,239560,4
2004-10-09,38,Broken,Seether Featuring Amy Lee,0qcjuYtMWhBjXg0Xwt5SzS,False,38,38,6,0.448,0.61,3,-2.695,0,0.0342,0.0102,0.000491,0.135,0.214,123.762,258333,4
2004-10-09,39,Jesus Walks,Kanye West,0qcjuYtMWhBjXg0Xwt5SzS,False,34,11,23,0.637,0.834,3,-4.686,0,0.323,0.614,0,0.317,0.715,87.312,193733,4
2004-10-09,40,Drop It Like It's Hot,Snoop Dogg Featuring Pharrell,0qcjuYtMWhBjXg0Xwt5SzS,False,51,40,2,0.888,0.622,1,-3.875,1,0.213,0.16,0,0.101,0.664,91.977,266707,4
2004-10-09,41,Charlene,Anthony Hamilton,0qcjuYtMWhBjXg0Xwt5SzS,False,45,41,6,0.556,0.346,0,-9.809,0,0.311,0.536,0,0.106,0.451,123.869,246773,4
2004-10-09,42,Here For The Party,Gretchen Wilson,0qcjuYtMWhBjXg0Xwt5SzS,False,39,39,10,0.656,0.717,0,-4.871,1,0.0279,0.0127,1.22e-05,0.904,0.809,123.988,196760,4
2004-10-09,43,I Hate Everything,George Strait,0qcjuYtMWhBjXg0Xwt5SzS,False,43,43,9,0.582,0.542,10,-10.041,1,0.0294,0.396,0.00114,0.123,0.45,90.918,235427,4
2004-10-09,44,Confessions Part II,Usher,0qcjuYtMWhBjXg0Xwt5SzS,False,30,1,24,0.845,0.467,1,-7.674,1,0.138,0.0586,0,0.0694,0.702,138.007,211200,4
2004-10-09,45,Hush,LL Cool J Featuring 7 Aurelius,0qcjuYtMWhBjXg0Xwt5SzS,False,49,45,3,0.768,0.725,11,-6.543,1,0.292,0.128,0,0.122,0.794,98.963,214560,4
2004-10-09,46,Vertigo,U2,57ZXcBtCZXSg9TVV5xRdnR,True,0,46,1,0.416,0.819,9,-3.974,1,0.0613,0.000138,0.00108,0.122,0.632,140.083,194520,4
2004-10-09,47,Live Like You Were Dying,Tim McGraw,57ZXcBtCZXSg9TVV5xRdnR,False,40,30,18,0.416,0.546,7,-7.728,1,0.0297,0.492,0,0.0845,0.418,159.929,300333,4
2004-10-09,48,1985,Bowling For Soup,57ZXcBtCZXSg9TVV5xRdnR,False,48,48,5,0.606,0.887,4,-4.404,1,0.0598,0.000242,0,0.337,0.903,119.974,193000,4
2004-10-09,49,Meant To Live,Switchfoot,57ZXcBtCZXSg9TVV5xRdnR,False,41,18,28,0.397,0.903,2,-4.577,1,0.0457,0.00575,1.6e-06,0.362,0.556,151.551,201373,4
2004-10-09,50,Too Much Of A Good Thing,Alan Jackson,57ZXcBtCZXSg9TVV5xRdnR,False,46,46,10,0.717,0.345,2,-13.846,1,0.0252,0.185,0.000226,0.0933,0.46,108.049,188200,4
2004-10-09,51,Go D.J.,Lil Wayne,57ZXcBtCZXSg9TVV5xRdnR,False,71,51,2,0.662,0.763,1,-8.455,1,0.377,0.0389,0,0.103,0.566,170.031,225307,4
2004-10-09,52,Stays In Mexico,Toby Keith,57ZXcBtCZXSg9TVV5xRdnR,False,53,52,7,0.655,0.902,9,-3.419,1,0.0779,0.108,0,0.302,0.686,122.975,214800,4
2004-10-09,53,In A Real Love,Phil Vassar,57ZXcBtCZXSg9TVV5xRdnR,False,56,53,6,0.575,0.797,9,-5.2,1,0.0305,0.154,0,0.282,0.744,90.907,214827,4
2004-10-09,54,That's What It's All About,Brooks & Dunn,57ZXcBtCZXSg9TVV5xRdnR,False,54,54,7,0.515,0.901,9,-3.063,1,0.0384,0.0437,1.78e-05,0.0585,0.289,118.378,239853,4
2004-10-09,55,Dare You To Move,Switchfoot,57ZXcBtCZXSg9TVV5xRdnR,False,64,55,2,0.426,0.881,4,-4.526,1,0.0404,0.00573,0.0693,0.389,0.259,139.986,247893,4
2004-10-09,56,Feels Like Today,Rascal Flatts,57ZXcBtCZXSg9TVV5xRdnR,False,61,56,8,0.364,0.72,6,-4.237,1,0.0274,0.0398,0.000458,0.213,0.393,170.093,200733,3
2004-10-09,57,Dangerously In Love,Beyonce,57ZXcBtCZXSg9TVV5xRdnR,False,57,57,4,0.609,0.407,6,-8.026,1,0.0808,0.345,0,0.19,0.459,99.982,293133,4
2004-10-09,58,Tilt Ya Head Back,Nelly & Christina Aguilera,57ZXcBtCZXSg9TVV5xRdnR,False,60,58,3,0.836,0.724,10,-5.789,0,0.145,0.0336,0,0.279,0.735,115.72,253253,4
2004-10-09,59,Nothing On But The Radio,Gary Allan,57ZXcBtCZXSg9TVV5xRdnR,False,66,59,4,0.679,0.736,9,-5.954,1,0.026,0.0572,9.25e-06,0.139,0.664,109.444,212027,4
2004-10-09,60,Breathe,Fabolous,57ZXcBtCZXSg9TVV5xRdnR,False,75,60,4,0.716,0.889,10,-6.325,0,0.268,0.223,0,0.337,0.503,82.992,270533,4
2004-10-09,61,Mr. Mom,Lonestar,57ZXcBtCZXSg9TVV5xRdnR,False,69,61,4,0.505,0.842,10,-3.316,1,0.0475,0.0576,0,0.111,0.671,172.136,208693,4
2004-10-09,62,Shadow,Ashlee Simpson,57ZXcBtCZXSg9TVV5xRdnR,False,68,62,2,0.462,0.738,0,-3.852,1,0.0282,0.0355,7.4e-06,0.101,0.303,77.966,237427,4
2004-10-09,63,Let's Get Away,T.I.,57ZXcBtCZXSg9TVV5xRdnR,False,55,35,14,0.567,0.826,10,-4.678,0,0.443,0.342,0,0.135,0.726,84.814,278720,4
2004-10-09,64,You & Me,J-Kwon Featuring Sadiyyah,57ZXcBtCZXSg9TVV5xRdnR,False,58,58,4,0.773,0.929,4,-2.232,0,0.216,0.0753,2.67e-06,0.0687,0.497,92.968,263733,4
2004-10-09,65,Flap Your Wings,Nelly,57ZXcBtCZXSg9TVV5xRdnR,False,52,52,6,0.897,0.835,4,-3.998,0,0.0652,0.0205,3.41e-06,0.0846,0.885,105.627,243560,4
2004-10-09,66,American Idiot,Green Day,57ZXcBtCZXSg9TVV5xRdnR,False,67,62,8,0.38,0.988,1,-2.042,1,0.0639,2.64e-05,7.86e-05,0.368,0.769,186.113,176346,4
2004-10-09,67,Balla Baby,Chingy,6HFXjB2fvQUBuE3B5kmvfW,True,0,67,1,0.928,0.643,11,-5.48,0,0.0759,0.0527,0,0.0988,0.895,93.006,215907,4
2004-10-09,68,U Should've Known Better,Monica,6HFXjB2fvQUBuE3B5kmvfW,False,44,19,19,0.753,0.516,6,-5.164,1,0.0308,0.191,0,0.275,0.826,122.019,257787,4
2004-10-09,69,Accidentally In Love,Counting Crows,6HFXjB2fvQUBuE3B5kmvfW,False,59,39,16,0.554,0.927,7,-3.641,1,0.0378,0.044,3.32e-06,0.0876,0.81,138.0,188613,4
2004-10-09,70,Baby It's You,JoJo Featuring Bow Wow,5TV96lkS2NF6kzILjORzLs,True,0,70,1,0.858,0.607,1,-4.199,1,0.118,0.0169,3.97e-05,0.0777,0.821,119.986,188293,3
2004-10-09,71,I Go Back,Kenny Chesney,5TV96lkS2NF6kzILjORzLs,False,65,32,18,0.532,0.842,5,-5.754,1,0.0503,0.0409,0,0.217,0.67,90.187,243667,4
2004-10-09,72,Just Like You,Three Days Grace,5TV96lkS2NF6kzILjORzLs,False,72,55,11,0.373,0.737,1,-5.282,1,0.0297,9.4e-06,0,0.0696,0.565,177.9,186893,4
2004-10-09,73,She Thinks She Needs Me,Andy Griggs,5TV96lkS2NF6kzILjORzLs,False,50,43,11,0.497,0.568,0,-7.67,1,0.0285,0.0788,0,0.223,0.386,138.107,239000,4
2004-10-09,74,If Nobody Believed In You,Joe Nichols,5TV96lkS2NF6kzILjORzLs,False,74,69,8,0.679,0.316,6,-11.327,1,0.031,0.625,4.85e-05,0.109,0.273,127.968,235067,4
2004-10-09,75,Fall To Pieces,Velvet Revolver,5TV96lkS2NF6kzILjORzLs,False,77,75,3,0.464,0.887,6,-4.65,1,0.0499,0.000429,0.333,0.126,0.23,132.759,271240,4
2004-10-09,76,So Sexy,Twista Featuring R. Kelly,5TV96lkS2NF6kzILjORzLs,False,70,25,16,0.868,0.805,11,-3.218,0,0.178,0.126,0,0.096,0.544,143.983,231200,4
2004-10-09,77,Somebody Told Me,The Killers,5TV96lkS2NF6kzILjORzLs,False,73,73,6,0.509,0.987,10,-3.198,0,0.0886,8.05e-05,0.000928,0.119,0.647,138.039,197160,4
2004-10-09,79,Girls Lie Too,Terri Clark,,False,62,36,14,0.499,0.883,4,-4.742,1,0.0451,0.0689,0,0.163,0.533,138.801,214200,4
2004-10-09,80,Take Me Out,Franz Ferdinand,,False,79,66,15,0.277,0.663,4,-8.821,0,0.0377,0.000409,0.00051,0.136,0.527,104.561,237027,4
2004-10-09,81,So Cold,Breaking Benjamin,,False,81,77,5,0.49,0.774,0,-5.436,0,0.0604,0.00305,8.16e-05,0.12,0.297,153.048,273440,4
2004-10-09,82,White Tee's,Dem Franchize Boyz,,False,82,82,6,0.875,0.63,7,-5.974,1,0.0871,0.00418,0,0.0759,0.695,161.978,278867,4
2004-10-09,83,Call My Name,Prince,,False,87,75,8,0.622,0.574,5,-5.068,0,0.155,0.685,0,0.111,0.405,113.984,315773,4
2004-10-09,84,King Of The Dancehall,Beenie Man,,False,83,81,6,0.81,0.829,5,-5.646,0,0.108,0.34,0,0.0539,0.851,104.695,217107,4
2004-10-09,85,You're My Everything,Anita Baker,,False,85,74,8,0.762,0.621,8,-6.221,0,0.0298,0.737,0.192,0.299,0.317,91.01,230067,4
2004-10-09,86,Feelin' Way Too Damn Good,Nickelback,,False,86,48,15,0.51,0.818,5,-5.626,1,0.0415,0.000722,0.000659,0.151,0.395,156.05,256453,4
2004-10-09,87,Nasty Girl,Nitty,,False,89,87,4,0.937,0.98,2,-5.037,1,0.0473,0.0566,0.000373,0.0273,0.939,122.007,248467,4
2004-10-09,88,Let Me In,Young Buck,,False,78,34,12,0.685,0.89,1,-4.302,0,0.32,0.117,0,0.0399,0.67,91.196,224253,4
2004-10-09,89,U Saved Me,R. Kelly,,False,76,52,11,0.651,0.56,6,-7.012,1,0.053,0.598,0,0.0873,0.297,104.045,373773,4
2004-10-09,90,Knuck If You Buck,Crime Mob Featuring Lil Scrappy,,False,92,90,8,0.865,0.844,8,-4.946,1,0.311,0.0582,0,0.373,0.755,150.09,205120,4
2004-10-09,91,Car Wash,Christina Aguilera Featuring Missy Elliott,,False,80,63,5,0.75,0.809,5,-7.62,1,0.0675,0.00802,0,0.595,0.757,115.975,227631,4
2004-10-09,92,Whiskey Lullaby,Brad Paisley Featuring Alison Krauss,,False,88,41,17,0.587,0.35,2,-10.954,1,0.0318,0.74,0,0.156,0.17,74.479,259453,4
2004-10-09,93,Still In Love,Teena Marie Featuring Baby,,False,93,70,20,0.713,0.663,0,-3.749,1,0.0386,0.607,0,0.255,0.903,79.004,256640,4
2004-10-09,94,Cold,Crossfade,,False,94,92,10,0.451,0.815,2,-5.55,0,0.0368,6.06e-05,0,0.27,0.618,147.974,194227,4
2004-10-09,95,Away From The Sun,3 Doors Down,,False,90,62,15,0.541,0.677,0,-6.211,1,0.0271,0.0244,0,0.0854,0.237,131.922,232067,4
2004-10-09,96,Tempted To Touch,Rupee,7khLgMuA7m4SA6aaDv1QSv,True,0,96,1,0.819,0.825,2,-7.012,0,0.0549,0.061,0,0.0904,0.939,105.988,207547,4
2004-10-09,97,Used To Love U,John Legend,7khLgMuA7m4SA6aaDv1QSv,False,97,97,2,0.661,0.794,7,-4.776,1,0.0839,0.0349,0,0.396,0.652,87.983,210867,4
2004-10-09,98,I Got A Feelin',Billy Currington,7khLgMuA7m4SA6aaDv1QSv,False,95,50,16,0.63,0.764,2,-4.353,1,0.0275,0.363,0,0.125,0.631,112.098,193760,4
2004-10-09,99,Float On,Modest Mouse,7khLgMuA7m4SA6aaDv1QSv,False,91,68,20,0.649,0.888,6,-4.807,1,0.0293,0.013,2.23e-06,0.0888,0.553,100.975,208467,4
2004-10-09,100,Whatever U Want,Christina Milian Featuring Joe Budden,3dWwcgXF8C4bguGHoWQkG3,True,0,100,1,0.611,0.729,1,-5.677,1,0.218,0.0128,1.07e-05,0.339,0.891,204.65,229333,4
