date,position,title,artist,spotify_id,is_new,last_pos,peak_pos,weeks,danceability,energy,key,loudness,mode,speechiness,acousticness,instrumentalness,liveness,valence,tempo,duration_ms,time_signature
1992-08-15,1,"End Of The Road (From ""Boomerang"")",Boyz II Men,6xMTU3y8sdJb76NpadGU0m,False,4,1,5,0.64,0.427,5,-9.29,0,0.0241,0.0664,0,0.0579,0.529,149.703,351467,3
1992-08-15,2,Baby-Baby-Baby,TLC,6xMTU3y8sdJb76NpadGU0m,False,3,2,11,0.679,0.597,11,-8.601,0,0.0439,0.0913,0.000673,0.0487,0.9,184.174,315040,4
1992-08-15,3,This Used To Be My Playground,Madonna,6xMTU3y8sdJb76NpadGU0m,False,1,1,7,0.499,0.308,7,-11.692,0,0.0264,0.754,0.000928,0.125,0.0708,75.91,310267,4
1992-08-15,4,Baby Got Back,Sir Mix-A-Lot,6xMTU3y8sdJb76NpadGU0m,False,2,1,19,0.926,0.669,1,-11.271,1,0.301,0.0051,0,0.0887,0.642,128.462,262827,4
1992-08-15,5,November Rain,Guns N' Roses,6xMTU3y8sdJb76NpadGU0m,False,5,5,8,0.294,0.641,11,-9.316,1,0.0291,0.0163,0.22,0.112,0.226,79.759,536067,4
1992-08-15,6,Just Another Day,Jon Secada,6xMTU3y8sdJb76NpadGU0m,False,7,5,18,0.717,0.642,1,-10.727,1,0.0287,0.0194,0.000249,0.043,0.732,105.894,327427,4
1992-08-15,7,Life Is A Highway,Tom Cochrane,6xMTU3y8sdJb76NpadGU0m,False,8,7,14,0.683,0.751,5,-10.184,1,0.0346,0.0681,8.36e-06,0.248,0.841,103.036,266560,4
1992-08-15,8,Giving Him Something He Can Feel,En Vogue,6xMTU3y8sdJb76NpadGU0m,False,9,8,11,0.496,0.298,9,-10.175,0,0.0405,0.306,1.72e-06,0.0875,0.705,203.824,235707,3
1992-08-15,9,Achy Breaky Heart,Billy Ray Cyrus,6xMTU3y8sdJb76NpadGU0m,False,6,4,15,0.8,0.563,9,-10.209,1,0.0303,0.051,0,0.0797,0.961,121.808,203373,4
1992-08-15,10,Move This,Technotronic Featuring Ya Kid K,6xMTU3y8sdJb76NpadGU0m,False,14,10,10,0.782,0.96,10,-4.047,1,0.0347,0.0637,0,0.0788,0.979,120.682,296986,4
1992-08-15,11,Come & Talk To Me,Jodeci,6xMTU3y8sdJb76NpadGU0m,False,12,11,20,0.609,0.57,7,-14.773,1,0.0912,0.223,0,0.366,0.84,172.095,276267,4
1992-08-15,12,The One,Elton John,6xMTU3y8sdJb76NpadGU0m,False,17,12,8,0.426,0.647,10,-8.228,1,0.0279,0.0163,0.00118,0.106,0.311,75.944,353160,4
1992-08-15,13,Warm It Up,Kris Kross,6xMTU3y8sdJb76NpadGU0m,False,13,13,11,0.865,0.778,1,-10.05,1,0.249,0.0411,0,0.303,0.763,103.008,248333,4
1992-08-15,14,Stay,Shakespear's Sister,6xMTU3y8sdJb76NpadGU0m,False,22,14,7,0.494,0.658,8,-5.84,1,0.0487,0.674,4.11e-05,0.0907,0.19,96.73,229000,4
1992-08-15,15,Humpin' Around,Bobby Brown,6xMTU3y8sdJb76NpadGU0m,False,39,15,2,0.71,0.8,1,-7.141,1,0.04,0.00223,0.211,0.0455,0.61,110.211,378493,4
1992-08-15,16,Too Funky,George Michael,6xMTU3y8sdJb76NpadGU0m,False,10,10,10,0.659,0.893,1,-8.324,1,0.076,0.0211,0.308,0.72,0.756,98.262,224933,4
1992-08-15,17,Keep On Walkin',CeCe Peniston,6xMTU3y8sdJb76NpadGU0m,False,21,17,13,0.766,0.712,6,-12.111,1,0.0427,0.00291,0.0201,0.226,0.655,104.974,270838,4
1992-08-15,18,Wishing On A Star,The Cover Girls,6xMTU3y8sdJb76NpadGU0m,False,11,9,12,0.353,0.544,5,-10.812,0,0.0331,0.581,9.95e-05,0.0835,0.48,88.898,281200,4
1992-08-15,19,Friday I'm In Love,The Cure,6xMTU3y8sdJb76NpadGU0m,False,18,18,10,0.526,0.762,0,-12.437,0,0.0342,0.000972,0.000116,0.338,0.505,136.203,214400,4
1992-08-15,20,The Best Things In Life Are Free,Luther Vandross And Janet Jackson With BBD And Ralph Tresvant,6xMTU3y8sdJb76NpadGU0m,False,19,10,12,0.852,0.863,6,-9.241,0,0.136,0.197,0,0.143,0.496,120.953,297907,4
1992-08-15,21,If You Asked Me To,Celine Dion,6xMTU3y8sdJb76NpadGU0m,False,15,4,17,0.46,0.437,7,-10.587,1,0.0304,0.128,0,0.025,0.227,172.382,234360,4
1992-08-15,22,Take This Heart,Richard Marx,6xMTU3y8sdJb76NpadGU0m,False,23,22,10,0.612,0.694,0,-8.277,1,0.026,0.00142,0.0012,0.0749,0.551,115.53,250667,4
1992-08-15,23,Under The Bridge,Red Hot Chili Peppers,6xMTU3y8sdJb76NpadGU0m,False,20,2,20,0.559,0.345,4,-13.496,1,0.0459,0.0576,0.000105,0.141,0.458,84.581,264307,4
1992-08-15,24,I'll Be There,Mariah Carey,6xMTU3y8sdJb76NpadGU0m,False,16,1,12,0.404,0.511,5,-9.427,1,0.0315,0.716,0,0.871,0.279,82.025,264160,4
1992-08-15,25,All I Want,Toad The Wet Sprocket,6xMTU3y8sdJb76NpadGU0m,False,28,25,8,0.6,0.811,5,-7.693,1,0.0788,0.0558,6.82e-06,0.109,0.622,124.303,196116,4
1992-08-15,26,Jam,Michael Jackson,6xMTU3y8sdJb76NpadGU0m,False,26,26,6,0.884,0.96,2,-4.613,1,0.0721,0.0487,0.0227,0.271,0.617,116.273,338173,4
1992-08-15,27,Jump Around,House Of Pain,6xMTU3y8sdJb76NpadGU0m,False,32,27,8,0.854,0.71,4,-6.32,0,0.0793,0.0113,8.72e-05,0.166,0.818,106.894,214947,4
1992-08-15,28,Tennessee,Arrested Development,6xMTU3y8sdJb76NpadGU0m,False,24,6,19,0.822,0.661,1,-10.234,0,0.164,0.0241,3.95e-06,0.315,0.67,99.883,272707,4
1992-08-15,29,"You Remind Me (From ""Strictly Business"")",Mary J. Blige,6xMTU3y8sdJb76NpadGU0m,False,34,29,9,0.656,0.768,11,-4.949,0,0.0593,0.259,4.16e-06,0.0944,0.507,95.067,258093,4
1992-08-15,30,Please Don't Go,K.W.S.,6xMTU3y8sdJb76NpadGU0m,False,35,30,9,0.725,0.954,8,-7.234,1,0.0375,0.0437,0.0857,0.132,0.594,120.248,373600,4
1992-08-15,31,Damn I Wish I Was Your Lover,Sophie B. Hawkins,6xMTU3y8sdJb76NpadGU0m,False,27,5,18,0.546,0.781,11,-9.439,0,0.0506,0.22,1.51e-05,0.363,0.539,95.032,323267,4
1992-08-15,32,My Lovin' (You're Never Gonna Get It),En Vogue,6xMTU3y8sdJb76NpadGU0m,False,25,2,22,0.767,0.839,8,-5.519,1,0.0613,0.0318,9.31e-06,0.111,0.461,98.055,281613,4
1992-08-15,33,Good Stuff,The B-52s,6xMTU3y8sdJb76NpadGU0m,False,29,28,9,0.754,0.78,1,-5.801,0,0.0299,0.0038,0.00226,0.0595,0.923,120.143,355093,4
1992-08-15,34,They Want EFX,Das EFX,6xMTU3y8sdJb76NpadGU0m,False,30,25,15,0.755,0.459,5,-12.84,0,0.358,0.115,0,0.0851,0.597,98.454,221400,4
1992-08-15,35,Jesus He Knows Me,Genesis,6xMTU3y8sdJb76NpadGU0m,False,43,35,3,0.561,0.883,3,-7.278,0,0.0462,0.53,1.36e-06,0.0772,0.606,94.997,256480,4
1992-08-15,36,Even Better Than The Real Thing,U2,6xMTU3y8sdJb76NpadGU0m,False,40,36,6,0.505,0.759,7,-6.871,1,0.0303,0.00112,0.000365,0.168,0.65,128.63,221373,4
1992-08-15,37,Hold On My Heart,Genesis,6xMTU3y8sdJb76NpadGU0m,False,33,12,16,0.465,0.365,5,-12.633,0,0.0295,0.618,0.0113,0.0747,0.265,171.904,276373,4
1992-08-15,38,Do I Have To Say The Words?,Bryan Adams,6xMTU3y8sdJb76NpadGU0m,False,47,38,3,0.505,0.585,7,-9.412,1,0.0289,0.0821,2.57e-06,0.161,0.47,128.051,371173,4
1992-08-15,39,She's Playing Hard To Get,Hi-Five,6xMTU3y8sdJb76NpadGU0m,False,53,39,3,0.525,0.811,1,-6.148,1,0.0602,0.00847,0,0.266,0.751,199.977,276573,4
1992-08-15,40,Everybody's Free (To Feel Good),Rozalla,6xMTU3y8sdJb76NpadGU0m,False,37,37,8,0.561,0.914,8,-4.415,0,0.047,0.0345,0.000155,0.0978,0.406,130.06,191637,4
1992-08-15,41,Just For Tonight,Vanessa Williams,6xMTU3y8sdJb76NpadGU0m,False,31,26,13,0.57,0.352,9,-15.484,1,0.0311,0.324,0,0.0969,0.318,141.969,268600,4
1992-08-15,42,Jump,Kris Kross,6xMTU3y8sdJb76NpadGU0m,False,36,1,20,0.749,0.745,2,-10.625,1,0.164,0.000501,0.00403,0.333,0.481,101.972,195107,4
1992-08-15,43,"I Wanna Love You (From ""Class Act"")",Jade,6xMTU3y8sdJb76NpadGU0m,False,51,43,6,0.731,0.707,0,-9.79,0,0.0769,0.0596,0.00654,0.264,0.838,200.306,271400,4
1992-08-15,44,Back To The Hotel,N2Deep,6xMTU3y8sdJb76NpadGU0m,False,44,44,6,0.69,0.38,9,-12.845,1,0.0609,0.000168,0.000533,0.136,0.305,201.697,304280,4
1992-08-15,45,Slow Motion,Color Me Badd,6xMTU3y8sdJb76NpadGU0m,False,38,18,15,0.783,0.885,6,-7.747,0,0.0648,0.00525,0.752,0.0435,0.941,92.042,265667,4
1992-08-15,46,"Mr. Loverman (From ""Deep Cover"")",Shabba Ranks,6xMTU3y8sdJb76NpadGU0m,False,41,40,10,0.732,0.653,7,-9.143,1,0.159,0.0118,5.77e-05,0.116,0.669,172.948,336467,4
1992-08-15,48,Restless Heart,Peter Cetera,,False,50,48,6,0.558,0.915,2,-8.501,1,0.0444,0.116,8.5e-06,0.313,0.758,184.78,249107,4
1992-08-15,49,Twilight Zone,2 Unlimited,,False,49,49,10,0.709,0.907,6,-12.405,1,0.0452,0.0631,0.00186,0.138,0.746,127.9,246675,4
1992-08-15,50,Crossover,EPMD,,False,55,50,4,0.614,0.621,6,-10.43,0,0.362,0.0308,0.000316,0.145,0.643,202.813,228760,4
1992-08-15,51,I Will Remember You,Amy Grant,,False,42,20,17,0.513,0.658,0,-6.432,1,0.0277,0.0329,9.3e-05,0.0805,0.336,177.625,300560,4
1992-08-15,52,We Are The Champions,Queen,,False,52,4,33,0.268,0.459,7,-6.948,0,0.0346,0.378,0,0.119,0.172,64.223,179200,4
1992-08-15,53,Sometimes Love Just Ain't Enough,Patty Smyth,3CUV8wsoTTKznGpEovrnZw,True,0,53,1,0.561,0.442,10,-10.687,1,0.0243,0.329,0,0.24,0.267,82.996,267600,4
1992-08-15,54,"Money Can't Buy You Love (From ""Mo' Money"")",Ralph Tresvant,3CUV8wsoTTKznGpEovrnZw,False,59,54,5,0.68,0.654,5,-11.977,0,0.0489,0.0274,0.84,0.0771,0.85,103.964,369152,4
1992-08-15,55,Honey Love,R. Kelly & Public Announcement,3CUV8wsoTTKznGpEovrnZw,False,46,39,13,0.693,0.65,4,-4.204,1,0.0441,0.109,0,0.167,0.452,71.034,243973,4
1992-08-15,56,Tequila,A.L.T. And The Lost Civilization,3CUV8wsoTTKznGpEovrnZw,False,61,56,6,0.782,0.704,10,-10.342,0,0.158,0.00603,1.23e-05,0.944,0.599,93.517,243800,4
1992-08-15,57,I Miss You,Joe Public,3CUV8wsoTTKznGpEovrnZw,False,60,57,7,0.64,0.492,5,-10.494,0,0.0319,0.0306,0,0.227,0.324,74.703,284827,4
1992-08-15,58,Just Take My Heart,Mr. Big,3CUV8wsoTTKznGpEovrnZw,False,54,16,19,0.508,0.362,0,-9.369,1,0.0349,0.483,0,0.0996,0.207,168.586,265307,4
1992-08-15,59,Make Love Like A Man,Def Leppard,3CUV8wsoTTKznGpEovrnZw,False,45,36,8,0.389,0.916,2,-6.481,1,0.0513,0.0408,0,0.28,0.582,205.733,255624,4
1992-08-15,60,Do It To Me,Lionel Richie,3CUV8wsoTTKznGpEovrnZw,False,58,21,16,0.696,0.515,0,-10.286,1,0.028,0.197,0.000115,0.462,0.501,91.48,270507,4
1992-08-15,61,Why,Annie Lennox,3CUV8wsoTTKznGpEovrnZw,False,56,34,14,0.531,0.471,0,-9.267,1,0.0236,0.28,6.22e-05,0.133,0.119,90.941,293838,4
1992-08-15,62,Sometimes I Rhyme Slow,Nice & Smooth,3CUV8wsoTTKznGpEovrnZw,False,57,44,15,0.797,0.563,6,-14.138,0,0.123,0.119,0.323,0.0969,0.687,108.369,172267,4
1992-08-15,63,They Reminisce Over You (T.R.O.Y.),Pete Rock & C.L. Smooth,3CUV8wsoTTKznGpEovrnZw,False,62,58,8,0.761,0.683,2,-10.889,1,0.164,0.141,0,0.342,0.671,101.787,286693,4
1992-08-15,64,Lithium,Nirvana,3CUV8wsoTTKznGpEovrnZw,False,69,64,2,0.678,0.656,7,-6.41,1,0.0381,0.00174,0,0.0631,0.485,123.207,257053,4
1992-08-15,65,Nothing Broken But My Heart,Celine Dion,3CUV8wsoTTKznGpEovrnZw,False,70,65,3,0.488,0.366,1,-13.507,0,0.0336,0.222,4.36e-05,0.195,0.116,171.832,355467,4
1992-08-15,66,Jump!,The Movement,3CUV8wsoTTKznGpEovrnZw,False,92,66,2,0.521,0.765,0,-14.367,1,0.0912,0.0027,0.0419,0.33,0.0924,135.025,235360,4
1992-08-15,67,Boot Scootin' Boogie,Brooks & Dunn,3CUV8wsoTTKznGpEovrnZw,False,67,67,4,0.656,0.817,11,-4.296,0,0.0435,0.22,0,0.304,0.862,130.448,198227,4
1992-08-15,68,Scenario,A Tribe Called Quest,3CUV8wsoTTKznGpEovrnZw,False,64,57,11,0.795,0.6,2,-14.004,1,0.341,0.112,0.000171,0.111,0.633,101.78,250133,4
1992-08-15,69,Give It Up,Wilson Phillips,3CUV8wsoTTKznGpEovrnZw,False,91,69,2,0.321,0.746,11,-10.413,1,0.0448,0.236,3.78e-05,0.26,0.914,185.764,291067,3
1992-08-15,70,Jus Lyke Compton,DJ Quik,3CUV8wsoTTKznGpEovrnZw,False,66,62,4,0.805,0.566,7,-12.604,1,0.177,0.055,0,0.582,0.658,94.65,251373,4
1992-08-15,71,When I Look Into Your Eyes,Firehouse,1yJWqYYDQge60nZKdLyiZU,True,0,71,1,0.396,0.612,6,-8.039,1,0.0277,0.00288,4.71e-05,0.233,0.241,146.759,239867,4
1992-08-15,72,Take Me In Your Arms,Lil Suzy,1yJWqYYDQge60nZKdLyiZU,False,72,72,7,0.774,0.754,7,-5.147,1,0.0488,0.272,9.05e-05,0.115,0.838,125.973,232933,4
1992-08-15,73,Divine Thing,The Soup Dragons,1yJWqYYDQge60nZKdLyiZU,False,87,73,2,0.674,0.955,7,-3.926,1,0.0822,0.0117,0.000124,0.416,0.827,118.401,232173,4
1992-08-15,74,Nobody Wins In This War,Mitch Malloy,1yJWqYYDQge60nZKdLyiZU,False,86,74,2,0.484,0.793,7,-3.617,1,0.0297,0.03,0,0.107,0.24,92.796,254482,4
1992-08-15,75,The Way I Feel,Tag,1yJWqYYDQge60nZKdLyiZU,False,63,63,7,0.59,0.661,9,-11.361,0,0.0304,0.0401,6.95e-05,0.0464,0.406,93.104,249067,4
1992-08-15,76,Give It Away,Red Hot Chili Peppers,1yJWqYYDQge60nZKdLyiZU,False,73,73,10,0.666,0.936,7,-9.919,1,0.0476,0.00244,0.086,0.153,0.776,91.577,282907,4
1992-08-15,77,The Hitman,AB Logic,1yJWqYYDQge60nZKdLyiZU,False,77,77,3,0.685,0.91,9,-10.281,1,0.0459,0.0347,0.0419,0.265,0.978,125.983,244333,4
1992-08-15,78,Where Does That Leave Love,George LaMond,1yJWqYYDQge60nZKdLyiZU,False,78,78,2,0.626,0.978,4,-4.376,1,0.0821,0.00484,0.00535,0.0903,0.463,118.996,244958,4
1992-08-15,79,In The Closet,Michael Jackson,1yJWqYYDQge60nZKdLyiZU,False,68,6,17,0.877,0.781,11,-3.775,0,0.0691,0.117,0.000746,0.149,0.606,110.494,390573,4
1992-08-15,80,James Brown Is Dead,L.A. Style,1yJWqYYDQge60nZKdLyiZU,False,71,59,18,0.599,0.976,0,-7.649,0,0.0859,0.0013,0.787,0.383,0.501,130.724,344400,4
1992-08-15,81,Constant Craving,k.d. lang,1yJWqYYDQge60nZKdLyiZU,False,88,81,3,0.6,0.77,5,-5.559,0,0.0302,0.0603,4.79e-06,0.0967,0.321,128.473,277240,4
1992-08-15,82,People Everyday,Arrested Development,5thts3213xwSroRd11fv5A,True,0,82,1,0.844,0.609,10,-10.675,1,0.217,0.0074,0,0.563,0.725,91.116,296333,4
1992-08-15,83,Keep It Comin' (Dance Till You Can't Dance No More!),C+C Music Factory,2UXJF7ZYR7Wmf4jPOJD3b1,True,0,83,1,0.902,0.755,11,-9.51,0,0.122,0.0151,0,0.113,0.631,113.127,236800,4
1992-08-15,84,You Won't See Me Cry,Wilson Phillips,2UXJF7ZYR7Wmf4jPOJD3b1,False,74,20,15,0.47,0.442,9,-11.142,1,0.0266,0.582,1.79e-06,0.0899,0.129,76.765,233533,4
1992-08-15,85,Slowly,Stacy Earl,2UXJF7ZYR7Wmf4jPOJD3b1,False,65,52,9,0.539,0.407,8,-13.017,1,0.0264,0.639,6.95e-05,0.0613,0.264,80.156,286667,4
1992-08-15,86,Wherever I May Roam,Metallica,2UXJF7ZYR7Wmf4jPOJD3b1,False,82,82,5,0.554,0.816,11,-7.871,1,0.0353,0.000526,0.000711,0.0988,0.362,131.409,404240,4
1992-08-15,87,Another Minute,Cause And Effect,2UXJF7ZYR7Wmf4jPOJD3b1,False,75,75,5,0.633,0.9,11,-10.731,0,0.0345,0.0641,0.000134,0.264,0.961,125.922,215440,4
1992-08-15,88,Brainstorming,M.C. Brains,2UXJF7ZYR7Wmf4jPOJD3b1,False,80,69,7,0.151,0.044,2,-20.621,1,0.0434,0.921,0.674,0.0816,0.0386,136.865,100955,3
1992-08-15,89,Please Don't Go,Boyz II Men,2UXJF7ZYR7Wmf4jPOJD3b1,False,81,49,20,0.644,0.663,6,-12.847,0,0.0454,0.197,0,0.302,0.743,135.622,263960,4
1992-08-15,90,Rhythm Is A Dancer,Snap!,4RADreHMvMkZwsPgPr9z5c,True,0,90,1,0.794,0.745,9,-11.367,0,0.037,0.273,0.000414,0.143,0.706,124.249,225882,4
1992-08-15,91,Kickin' It,After 7,43W4SFa3gwUMc37y9HArAd,True,0,91,1,0.701,0.911,1,-8.334,1,0.0374,0.0009,0.0562,0.0262,0.625,100.055,293560,4
1992-08-15,92,Silent Prayer,Shanice,43W4SFa3gwUMc37y9HArAd,False,85,31,17,0.466,0.405,9,-13.259,0,0.0365,0.136,0,0.102,0.159,141.758,303867,3
1992-08-15,93,Victim Of The Ghetto,The College Boyz,43W4SFa3gwUMc37y9HArAd,False,98,68,13,0.673,0.649,1,-9.695,1,0.212,0.0282,0,0.0969,0.693,178.108,293440,4
1992-08-15,94,Get With U,Lidell Townsell & M.T.F.,0WyopkKhqsZBxYrzx6nIGT,True,0,94,1,0.832,0.727,8,-10.017,1,0.0662,0.0586,0.112,0.116,0.556,120.966,239933,4
1992-08-15,95,Helluva,Brotherhood Creed,0WyopkKhqsZBxYrzx6nIGT,False,83,53,18,0.804,0.864,6,-7.148,1,0.125,0.0658,0,0.0609,0.765,105.414,249827,4
1992-08-15,96,Everything About You,Ugly Kid Joe,0WyopkKhqsZBxYrzx6nIGT,False,76,9,20,0.501,0.803,1,-8.449,1,0.0547,0.00881,1.78e-06,0.107,0.738,122.458,255160,4
1992-08-15,97,Sexy MF,Prince And The N.P.G.,0WyopkKhqsZBxYrzx6nIGT,False,79,66,4,0.77,0.744,2,-8.133,1,0.0938,0.169,0.00224,0.0537,0.547,106.147,326093,4
1992-08-15,98,Always The Last To Know,Del Amitri,5R5uHoaeNY1MN3yRzc2q1Q,True,0,98,1,0.571,0.698,9,-9.153,1,0.0281,0.229,6.36e-05,0.0825,0.62,122.944,262840,4
1992-08-15,99,Who's Got Your Love,Nyasia,5R5uHoaeNY1MN3yRzc2q1Q,False,97,95,6,0.721,0.923,1,-8.19,1,0.0881,0.0498,0.000224,0.286,0.882,122.865,294800,4
1992-08-15,100,Galileo,Indigo Girls,5R5uHoaeNY1MN3yRzc2q1Q,False,89,89,2,0.49,0.701,5,-7.94,1,0.0394,0.708,0,0.119,0.785,102.504,252960,4
