date,position,title,artist,spotify_id,is_new,last_pos,peak_pos,weeks,danceability,energy,key,loudness,mode,speechiness,acousticness,instrumentalness,liveness,valence,tempo,duration_ms,time_signature
1997-11-22,1,Candle In The Wind 1997/Something About The Way You Look Tonight,Elton John,,False,1,1,7,0.48,0.628,6,-7.643,1,0.0262,0.174,3.28e-05,0.0753,0.541,143.412,240547,4
1997-11-22,2,You Make Me Wanna...,Usher,,False,2,2,14,0.761,0.639,5,-7.577,0,0.0539,0.0359,0,0.0945,0.922,164.088,219120,4
1997-11-22,3,How Do I Live,LeAnn Rimes,,False,3,3,23,0.577,0.462,2,-7.989,1,0.0279,0.128,0,0.0822,0.258,128.303,266973,4
1997-11-22,4,All Cried Out,Allure Featuring 112,,False,5,4,13,0.613,0.464,1,-8.918,1,0.0241,0.176,0,0.103,0.176,139.802,275773,4
1997-11-22,5,My Body,LSG,,False,8,5,4,0.721,0.431,1,-6.633,1,0.045,0.244,0,0.0886,0.318,119.76,247133,4
1997-11-22,6,My Love Is The Shhh!,Somethin' For The People Featuring Trina & Tamara,,False,6,6,13,0.779,0.715,2,-5.886,0,0.0368,0.297,0,0.157,0.621,126.036,281747,4
1997-11-22,7,4 Seasons Of Loneliness,Boyz II Men,,False,4,1,9,0.583,0.488,6,-10.494,1,0.0444,0.821,1.71e-05,0.115,0.191,98.497,292400,4
1997-11-22,8,Tubthumping,Chumbawamba,,False,7,7,11,0.263,0.871,2,-7.496,1,0.131,0.106,0,0.363,0.622,206.68,278960,4
1997-11-22,9,The One I Gave My Heart To,Aaliyah,,False,9,9,8,0.562,0.467,7,-7.509,1,0.0515,0.136,1.89e-06,0.2,0.251,125.956,264426,4
1997-11-22,10,Feel So Good,Mase,,False,12,10,4,0.821,0.703,11,-8.464,0,0.24,0.192,0,0.0816,0.536,105.154,203627,4
1997-11-22,13,Show Me Love,Robyn,,False,21,13,2,0.546,0.643,6,-4.069,0,0.0437,0.0746,0,0.213,0.706,181.838,229227,4
1997-11-22,14,Quit Playing Games (With My Heart),Backstreet Boys,,False,11,2,22,0.8,0.875,11,-4.952,0,0.0338,0.0615,2.79e-06,0.13,0.882,100.033,233533,4
1997-11-22,15,I Don't Want To Wait,Paula Cole,,False,15,15,4,0.41,0.468,11,-8.177,1,0.0553,0.298,1.19e-05,0.0426,0.475,177.508,320027,4
1997-11-22,16,What About Us,Total,,False,16,16,13,0.736,0.721,1,-6.188,1,0.0396,0.0143,0,0.0451,0.72,96.365,243783,4
1997-11-22,17,Butta Love,Next,,False,17,17,12,0.735,0.441,1,-8.412,0,0.0407,0.0972,0,0.0967,0.591,108.015,296400,4
1997-11-22,18,Semi-Charmed Life,Third Eye Blind,,False,13,4,21,0.64,0.864,7,-6.576,1,0.0315,0.00832,0,0.123,0.7,102.026,268360,4
1997-11-22,19,Spice Up Your Life,Spice Girls,,False,27,19,3,0.556,0.993,1,-5.067,1,0.0464,0.0105,0.0341,0.403,0.702,124.016,173667,4
1997-11-22,20,All For You,Sister Hazel,,False,20,11,20,0.633,0.754,8,-6.495,1,0.0382,0.0316,2.27e-05,0.091,0.641,137.047,218707,4
1997-11-22,21,Building A Mystery,Sarah McLachlan,,False,19,13,12,0.505,0.518,2,-8.601,1,0.023,0.403,0,0.129,0.472,81.019,247307,4
1997-11-22,22,Criminal,Fiona Apple,,False,22,22,8,0.595,0.804,7,-7.911,0,0.0326,0.0129,1.97e-05,0.299,0.586,89.846,341533,4
1997-11-22,23,Honey,Mariah Carey,,False,18,1,11,0.694,0.824,1,-6.756,1,0.0909,0.119,7.15e-06,0.152,0.675,95.833,299827,4
1997-11-22,24,Mo Money Mo Problems,The Notorious B.I.G. Featuring Puff Daddy & Mase,,False,23,1,17,0.845,0.884,6,-4.506,0,0.0759,0.0128,2.1e-06,0.203,0.904,104.536,257400,4
1997-11-22,25,Invisible Man,98 Degrees,,False,24,12,20,0.694,0.552,9,-10.452,0,0.0278,0.202,0,0.176,0.573,89.904,283267,4
1997-11-22,26,I'll Be Missing You,Puff Daddy & Faith Evans Featuring 112,,False,25,1,24,0.862,0.479,7,-9.199,1,0.0646,0.0522,0.00126,0.589,0.925,109.878,301520,4
1997-11-22,27,If I Could Teach The World,Bone Thugs-N-Harmony,,False,28,27,6,0.71,0.441,4,-10.116,1,0.098,0.191,0,0.0905,0.537,80.024,264227,4
1997-11-22,28,2 Become 1,Spice Girls,,False,26,4,15,0.646,0.665,6,-7.878,1,0.0268,0.326,1.97e-05,0.238,0.7,143.966,241027,4
1997-11-22,29,I Care 'Bout You,Milestone,,False,29,23,13,0.823,0.33,9,-9.313,1,0.0731,0.0217,0.571,0.105,0.423,153.014,283373,4
1997-11-22,30,I Miss My Homies,Master P Featuring Pimp C And The Shocker,,False,31,25,12,0.828,0.656,0,-6.958,1,0.202,0.0952,0,0.408,0.617,125.567,325760,4
1997-11-22,31,I Do,Lisa Loeb,,False,37,31,4,0.732,0.723,10,-6.659,1,0.0307,0.334,9.34e-05,0.194,0.731,110.173,221093,4
1997-11-22,32,Everything,Mary J. Blige,,False,30,24,9,0.586,0.572,5,-7.523,0,0.0398,0.137,0,0.57,0.563,81.893,299027,4
1997-11-22,33,Love Gets Me Every Time,Shania Twain,,False,32,25,7,0.737,0.693,2,-7.045,1,0.0273,0.264,1.1e-06,0.273,0.962,123.055,213827,4
1997-11-22,34,Sunny Came Home,Shawn Colvin,,False,34,7,20,0.554,0.58,11,-8.05,0,0.0322,0.344,0.00842,0.0989,0.402,167.83,264200,4
1997-11-22,35,They Like It Slow,H-Town,,False,35,35,7,0.619,0.501,1,-9.241,1,0.0356,0.112,0,0.0978,0.497,115.971,279458,4
1997-11-22,36,Do You Know (What It Takes),Robyn,,False,38,7,26,0.635,0.74,3,-4.439,0,0.0355,0.00465,0.0152,0.129,0.857,200.102,221293,4
1997-11-22,37,You Should Be Mine (Don't Waste Your Time),Brian McKnight Featuring Mase,,False,33,17,12,0.77,0.519,1,-7.594,1,0.035,0.00417,0.000431,0.285,0.65,94.774,287440,4
1997-11-22,38,Legend Of A Cowgirl,Imani Coppola,,False,39,36,11,0.745,0.608,6,-5.525,1,0.0373,0.0171,0,0.081,0.541,129.303,227667,4
1997-11-22,39,Heaven,Nu Flavor,,False,41,39,7,0.637,0.406,6,-12.1,1,0.0235,0.844,0.000176,0.0875,0.35,96.178,298133,4
1997-11-22,40,Breaking All The Rules,She Moves,,False,48,40,3,0.671,0.513,7,-11.321,0,0.0342,0.0319,0.00123,0.282,0.634,109.966,216115,4
1997-11-22,41,Barely Breathing,Duncan Sheik,,False,36,16,52,0.482,0.807,0,-6.976,1,0.0457,0.0281,0,0.177,0.516,187.918,254547,4
1997-11-22,42,Up Jumps Da Boogie,Magoo And Timbaland,,False,40,12,19,0.678,0.553,7,-11.737,1,0.232,0.00782,0.00439,0.451,0.717,74.956,298680,4
1997-11-22,43,Not Tonight,"Lil' Kim Feat. Da Brat, Left Eye, Missy Elliott & Angie Mar",,False,43,6,20,0.854,0.602,6,-10.162,0,0.32,0.0689,0,0.292,0.592,99.429,252520,4
1997-11-22,44,Backyard Boogie,Mack 10,,False,42,37,13,0.853,0.603,1,-7.85,1,0.226,0.14,0,0.0783,0.546,95.936,259181,4
1997-11-22,45,The Freshmen,The Verve Pipe,,False,45,5,40,0.571,0.505,1,-9.312,0,0.0238,0.0757,1.04e-05,0.109,0.276,99.562,269467,4
1997-11-22,46,Return Of The Mack,Mark Morrison,,False,47,2,39,0.715,0.833,2,-5.379,1,0.108,0.00631,0,0.164,0.612,95.487,213093,4
1997-11-22,47,"Too Gone, Too Long",En Vogue,,False,44,33,7,0.621,0.683,5,-7.488,0,0.0396,0.149,2.87e-06,0.0964,0.684,148.026,282693,4
1997-11-22,48,So Help Me Girl,Gary Barlow,,False,54,48,6,0.565,0.425,10,-12.036,1,0.0278,0.0154,0,0.16,0.562,169.937,268373,4
1997-11-22,49,No Tengo Dinero,Los Umbrellos,,False,49,49,13,0.831,0.697,1,-3.821,1,0.0339,0.0185,3.49e-05,0.277,0.848,109.344,216573,4
1997-11-22,50,Valentine,Martina McBride With Jim Brickman,,False,53,50,8,0.511,0.317,1,-10.252,1,0.0252,0.835,2.58e-05,0.125,0.164,95.084,192173,4
1997-11-22,51,Mourn You Til I Join You,Naughty By Nature,,False,51,51,2,0.811,0.697,10,-7.409,0,0.276,0.0834,0,0.0965,0.855,89.88,316760,4
1997-11-22,52,Coco Jamboo,Mr. President,,False,52,21,17,0.832,0.838,1,-5.414,0,0.0421,0.0791,0,0.152,0.965,100.021,218733,4
1997-11-22,53,Last Night's Letter,K-Ci & JoJo,,False,46,46,8,0.669,0.669,0,-3.759,0,0.032,0.295,0,0.322,0.401,131.971,278307,4
1997-11-22,54,I Don't Ever Want To See You Again,Uncle Sam,,False,62,54,3,0.607,0.497,11,-7.017,1,0.0374,0.38,0,0.0681,0.407,125.951,345133,3
1997-11-22,55,I Say A Little Prayer,Diana King,,False,60,38,19,0.69,0.889,4,-5.074,0,0.0595,0.00875,1.03e-05,0.0904,0.538,125.958,211533,4
1997-11-22,56,You Light Up My Life,LeAnn Rimes,,False,57,34,11,0.347,0.4,3,-7.359,1,0.0273,0.63,0,0.122,0.108,77.987,217533,3
1997-11-22,57,At The Beginning,Richard Marx & Donna Lewis,,False,67,57,3,0.548,0.289,1,-12.493,1,0.0385,0.159,0.631,0.0824,0.22,188.076,220027,4
1997-11-22,58,Phenomenon,LL Cool J,,False,55,55,4,0.862,0.606,7,-8.136,1,0.276,0.000331,4.87e-06,0.0706,0.485,105.972,244733,4
1997-11-22,59,You're Not Alone,Olive,,False,69,59,5,0.69,0.643,7,-10.855,0,0.0501,0.0525,0.0019,0.0992,0.592,134.261,271027,4
1997-11-22,60,Never Make A Promise,Dru Hill,,False,56,7,16,0.733,0.471,9,-8.157,0,0.0285,0.268,0,0.241,0.468,113.228,328400,4
1997-11-22,61,So Good,Davina,,False,65,61,4,0.78,0.342,1,-7.582,1,0.0685,0.0679,6.45e-05,0.21,0.711,82.979,274180,4
1997-11-22,62,Have A Little Mercy,4.0,,False,63,46,14,0.628,0.575,0,-8.511,1,0.0311,0.35,0,0.0891,0.269,102.021,282827,4
1997-11-22,63,I'm Not A Player,Big Punisher,,False,66,63,4,0.721,0.723,4,-4.429,0,0.239,0.0101,0.00108,0.4,0.542,94.744,221427,4
1997-11-22,64,Do You Like This,Rome,,False,70,31,17,0.76,0.284,9,-12.244,0,0.0297,0.00424,7.84e-06,0.0737,0.108,107.963,292160,4
1997-11-22,66,Don't Go,Le Click Featuring Kayo,,False,68,62,9,0.773,0.779,0,-8.04,1,0.0318,0.219,1.57e-06,0.0889,0.873,130.025,235667,4
1997-11-22,67,Please,The Kinleys,,False,71,67,8,0.562,0.54,4,-6.351,1,0.0259,0.557,0,0.0948,0.277,140.77,214827,4
1997-11-22,68,Avenues,Refugee Camp All Stars Featuring Pras (With Ky-mani),,False,58,35,10,0.92,0.411,8,-8.483,1,0.147,0.000164,0.869,0.0616,0.562,103.906,258867,4
1997-11-22,70,On My Own,Peach Union,,False,64,39,10,0.565,0.801,0,-11.409,1,0.0252,0.0868,0.786,0.135,0.83,103.961,240161,4
1997-11-22,71,Around The World,Daft Punk,,False,72,61,13,0.956,0.795,7,-5.311,1,0.15,0.00356,0.889,0.0906,0.841,121.294,429533,4
1997-11-22,72,Electric Barbarella,Duran Duran,,False,59,52,7,0.51,0.903,0,-6.811,1,0.045,7.37e-05,0.0358,0.34,0.559,129.092,257200,4
1997-11-22,73,Gotham City,R. Kelly,,False,73,9,19,0.725,0.634,8,-5.519,0,0.0483,0.0303,0,0.296,0.452,135.793,285680,4
1997-11-22,74,The Rest Of Mine,Trace Adkins,,False,76,70,6,0.579,0.477,7,-5.646,1,0.0247,0.378,8.97e-06,0.0776,0.297,85.445,193867,4
1997-11-22,75,"After 12, Before 6",Sam Salter,,False,74,51,14,0.783,0.36,4,-4.605,0,0.0314,0.00184,0,0.0512,0.421,118.04,267160,4
1997-11-22,76,Kiss The Rain,Billie Myers,,False,82,76,3,0.455,0.682,9,-6.996,1,0.041,0.00142,4.96e-05,0.162,0.283,177.997,270160,4
1997-11-22,77,Don't Say,Jon B,,False,78,68,13,0.79,0.562,6,-5.496,1,0.092,0.118,0,0.268,0.573,141.768,288573,4
1997-11-22,78,Baby You Know,The O'Jays,,False,85,78,3,0.68,0.454,10,-7.464,0,0.0376,0.457,0,0.258,0.315,109.798,281472,4
1997-11-22,79,Free,Ultra Nate,,False,81,75,14,0.756,0.915,8,-6.094,1,0.0371,0.00405,0.000171,0.0371,0.741,124.97,233293,4
1997-11-22,80,Kiss You All Over,No Mercy,,False,96,80,2,0.655,0.823,2,-10.03,1,0.0357,0.0276,0.00196,0.0578,0.768,110.924,274400,4
1997-11-22,81,I'm Afraid Of Americans,David Bowie,6ZUwzAFkFYHbe8dqqe2pB5,True,0,81,1,0.62,0.755,10,-7.896,1,0.0762,0.00184,0.244,0.225,0.75,160.027,300160,4
1997-11-22,82,Don't Stop The Music,Playa,6ZUwzAFkFYHbe8dqqe2pB5,False,93,82,2,0.54,0.868,11,-12.124,0,0.0432,0.251,0.00231,0.285,0.797,161.947,219990,4
1997-11-22,83,Barbie Girl,Aqua,6ZUwzAFkFYHbe8dqqe2pB5,False,77,7,12,0.81,0.957,1,-6.049,0,0.0364,0.0165,0.284,0.248,0.962,129.985,197773,4
1997-11-22,84,One More Night,Amber,6ZUwzAFkFYHbe8dqqe2pB5,False,89,84,6,0.757,0.923,2,-6.814,1,0.0456,0.249,0.0276,0.117,0.941,127.975,226773,4
1997-11-22,85,I Can Love You,Mary J. Blige,6ZUwzAFkFYHbe8dqqe2pB5,False,83,28,18,0.635,0.614,7,-7.165,1,0.197,0.0179,0.000201,0.415,0.736,174.213,286400,4
1997-11-22,86,To The Moon And Back,Savage Garden,6ZUwzAFkFYHbe8dqqe2pB5,False,86,37,18,0.584,0.76,0,-7.369,0,0.0359,0.0205,7.25e-06,0.1,0.325,104.101,341067,4
1997-11-22,87,Spin Spin Sugar,Sneaker Pimps,6ZUwzAFkFYHbe8dqqe2pB5,False,87,87,7,0.767,0.949,0,-6.796,1,0.0697,0.00274,0.38,0.331,0.484,128.989,544093,4
1997-11-22,88,All Of My Days,Changing Faces (Featuring Jay-Z),6ZUwzAFkFYHbe8dqqe2pB5,False,88,88,3,0.66,0.317,8,-14.861,0,0.0323,0.811,0,0.171,0.561,85.9,234907,4
1997-11-22,89,In Harm's Way,BeBe Winans,0tXSYsBNLm04TyMH6LrtcU,True,0,89,1,0.558,0.554,8,-6.7,1,0.0273,0.463,0,0.103,0.153,107.911,320333,4
1997-11-22,90,You're The Inspiration,Peter Cetera Featuring Az Yet,0tXSYsBNLm04TyMH6LrtcU,False,91,77,6,0.645,0.6,10,-7.605,1,0.0252,0.0834,0,0.0599,0.411,143.48,246880,4
1997-11-22,91,"Big Bad Mamma (From ""Def Jam's How To Be A Player"")",Foxy Brown Featuring Dru Hill,0tXSYsBNLm04TyMH6LrtcU,False,92,53,15,0.938,0.307,6,-14.769,1,0.126,0.165,0.0157,0.0586,0.816,108.055,237267,4
1997-11-22,92,Brian Wilson,Barenaked Ladies,2Eky0Rjbrv0YmNy3wrMtSM,True,0,92,1,0.633,0.701,5,-11.86,1,0.0398,0.365,5.16e-06,0.179,0.88,153.109,287773,4
1997-11-22,93,You Walked In,Lonestar,0DWAnPgkLR2X4ys9OJCaZT,True,0,93,1,0.733,0.798,0,-4.218,1,0.0292,0.0383,1.45e-06,0.22,0.692,108.434,270453,4
1997-11-22,94,The Joint,EPMD,0DWAnPgkLR2X4ys9OJCaZT,False,99,94,3,0.794,0.451,10,-6.251,0,0.152,0.31,0.000343,0.139,0.808,179.238,208640,4
1997-11-22,95,DJ Keep Playin' (Get Your Music On),Yvette Michele,0DWAnPgkLR2X4ys9OJCaZT,False,84,84,2,0.819,0.722,11,-3.926,1,0.0717,0.00238,0.00107,0.412,0.921,109.074,286200,4
1997-11-22,96,L-L-Lies,Diana King,2RXOXKIx5mOUgYWMYwoW1t,True,0,96,1,0.757,0.791,0,-6.706,1,0.049,0.0514,0.000186,0.0895,0.821,98.008,248160,4
1997-11-22,98,Me And My Crazy World,Lost Boyz,,False,79,52,10,0.769,0.539,0,-9.108,1,0.0781,0.00258,0,0.0739,0.573,92.172,311827,4
1997-11-22,99,Deja Vu [Uptown Baby],Lord Tariq & Peter Gunz,,False,90,90,2,0.861,0.622,1,-7.493,1,0.379,0.0816,0,0.123,0.664,96.911,284800,4
1997-11-22,100,Alright,Jamiroquai,,False,94,78,7,0.815,0.875,7,-7.822,0,0.0598,0.174,0.048,0.136,0.733,105.805,263920,4
