date,position,title,artist,spotify_id,is_new,last_pos,peak_pos,weeks,danceability,energy,key,loudness,mode,speechiness,acousticness,instrumentalness,liveness,valence,tempo,duration_ms,time_signature
2007-10-20,1,Crank That (Soulja Boy),Soulja Boy Tell'em,4eAwB5pnKFTmsgc3zWoYO0,False,1,1,13,0.736,0.74,0,-2.18,1,0.0786,0.515,0,0.0468,0.803,140.141,221933,4
2007-10-20,2,Stronger,Kanye West,4eAwB5pnKFTmsgc3zWoYO0,False,2,1,11,0.617,0.717,10,-7.858,0,0.153,0.00564,0,0.408,0.49,103.992,311867,4
2007-10-20,3,Gimme More,Britney Spears,4eAwB5pnKFTmsgc3zWoYO0,False,3,3,5,0.788,0.844,2,-3.131,1,0.0334,0.25,0.000678,0.0723,0.382,113.324,251240,4
2007-10-20,4,Apologize,Timbaland Featuring OneRepublic,4eAwB5pnKFTmsgc3zWoYO0,False,6,4,10,0.657,0.609,8,-6.025,1,0.0291,0.0357,0,0.0973,0.0893,118.013,184400,4
2007-10-20,5,The Way I Are,Timbaland Featuring Keri Hilson,4eAwB5pnKFTmsgc3zWoYO0,False,4,3,19,0.731,0.807,3,-6.492,0,0.1,0.181,0.751,0.319,0.765,114.759,179120,4
2007-10-20,6,Bed,J. Holiday,4eAwB5pnKFTmsgc3zWoYO0,False,7,5,12,0.684,0.606,5,-7.268,0,0.0504,0.17,0,0.058,0.723,127.901,275107,4
2007-10-20,7,Bubbly,Colbie Caillat,4eAwB5pnKFTmsgc3zWoYO0,False,10,7,15,0.697,0.474,9,-6.663,1,0.0351,0.603,0,0.11,0.249,127.904,196280,4
2007-10-20,8,No One,Alicia Keys,4eAwB5pnKFTmsgc3zWoYO0,False,12,8,5,0.644,0.548,1,-5.416,0,0.0286,0.0209,8.68e-06,0.134,0.166,90.042,253813,4
2007-10-20,9,Big Girls Don't Cry,Fergie,4eAwB5pnKFTmsgc3zWoYO0,False,5,1,25,0.708,0.641,7,-4.296,1,0.0335,0.205,0,0.0945,0.253,113.082,268120,4
2007-10-20,10,Good Life,Kanye West Featuring T-Pain,4eAwB5pnKFTmsgc3zWoYO0,False,18,10,4,0.439,0.808,1,-6.881,1,0.346,0.00305,0,0.439,0.487,82.962,207000,4
2007-10-20,11,Ayo Technology,50 Cent Featuring Justin Timberlake & Timbaland,4eAwB5pnKFTmsgc3zWoYO0,False,13,5,9,0.63,0.782,8,-5.44,0,0.132,0.0828,0,0.034,0.418,140.144,247947,4
2007-10-20,12,Rockstar,Nickelback,4eAwB5pnKFTmsgc3zWoYO0,False,11,6,35,0.616,0.91,0,-3.004,1,0.0386,0.0459,0,0.343,0.693,144.072,252040,4
2007-10-20,13,Cyclone,Baby Bash Featuring T-Pain,4eAwB5pnKFTmsgc3zWoYO0,False,17,13,11,0.644,0.725,11,-4.622,1,0.0701,0.0112,0,0.146,0.584,77.977,222053,4
2007-10-20,14,Who Knew,P!nk,4eAwB5pnKFTmsgc3zWoYO0,False,14,9,18,0.688,0.734,9,-4.569,1,0.0274,0.00462,0,0.0756,0.46,140.004,208493,4
2007-10-20,15,How Far We've Come,matchbox twenty,4eAwB5pnKFTmsgc3zWoYO0,False,15,11,6,0.566,0.906,0,-5.092,1,0.0642,0.00452,0,0.21,0.787,83.0,212253,4
2007-10-20,16,Let It Go,Keyshia Cole Featuring Missy Elliott & Lil Kim,4eAwB5pnKFTmsgc3zWoYO0,False,9,7,16,0.806,0.721,10,-5.167,0,0.215,0.197,0,0.209,0.781,94.967,238333,4
2007-10-20,17,Shawty,Plies Featuring T-Pain,4eAwB5pnKFTmsgc3zWoYO0,False,16,9,17,0.444,0.708,4,-5.926,0,0.126,0.0419,0,0.0775,0.26,105.412,255413,5
2007-10-20,18,Hate That I Love You,Rihanna Featuring Ne-Yo,4eAwB5pnKFTmsgc3zWoYO0,False,26,18,6,0.637,0.73,5,-5.38,0,0.0874,0.323,0,0.0981,0.732,93.867,218947,4
2007-10-20,19,LoveStoned,Justin Timberlake,4eAwB5pnKFTmsgc3zWoYO0,False,20,17,14,0.859,0.681,1,-6.247,1,0.0549,0.34,0.000161,0.213,0.852,121.243,444333,4
2007-10-20,20,Hey There Delilah,Plain White T's,4eAwB5pnKFTmsgc3zWoYO0,False,22,1,28,0.656,0.291,2,-10.572,1,0.0293,0.872,0,0.114,0.298,103.971,232533,4
2007-10-20,21,Bartender,T-Pain Featuring Akon,4eAwB5pnKFTmsgc3zWoYO0,False,21,5,19,0.675,0.394,8,-8.539,1,0.133,0.0611,0,0.214,0.405,104.987,238800,4
2007-10-20,22,Take Me There,Rascal Flatts,4eAwB5pnKFTmsgc3zWoYO0,False,19,19,11,0.499,0.857,4,-4.501,1,0.0374,0.00476,0,0.102,0.324,83.977,266587,4
2007-10-20,23,Wake Up Call,Maroon 5,4eAwB5pnKFTmsgc3zWoYO0,False,25,19,9,0.632,0.949,4,-2.671,0,0.0593,0.0302,0,0.0871,0.969,164.118,201307,4
2007-10-20,24,Wait For You,Elliott Yamin,4eAwB5pnKFTmsgc3zWoYO0,False,24,13,25,0.764,0.487,0,-6.734,1,0.0281,0.25,0,0.184,0.352,116.027,261320,4
2007-10-20,25,Over You,Daughtry,4eAwB5pnKFTmsgc3zWoYO0,False,31,25,9,0.425,0.922,3,-2.6,1,0.0412,0.0174,0,0.104,0.564,156.045,204661,4
2007-10-20,26,Umbrella,Rihanna Featuring Jay-Z,4eAwB5pnKFTmsgc3zWoYO0,False,23,1,26,0.583,0.829,1,-4.603,1,0.134,0.00864,0,0.0426,0.575,174.028,275987,4
2007-10-20,27,1234,Feist,4eAwB5pnKFTmsgc3zWoYO0,False,8,8,4,0.71,0.484,2,-7.415,1,0.049,0.217,3.93e-06,0.0879,0.576,109.951,183667,4
2007-10-20,28,Until The End Of Time,Justin Timberlake Duet With Beyonce,4eAwB5pnKFTmsgc3zWoYO0,False,41,28,14,0.866,0.229,2,-14.31,1,0.0497,0.0884,0.0543,0.147,0.52,119.888,322794,4
2007-10-20,29,The Great Escape,Boys Like Girls,4eAwB5pnKFTmsgc3zWoYO0,False,29,23,21,0.423,0.94,1,-4.012,0,0.0635,0.00166,0,0.178,0.505,149.934,206520,4
2007-10-20,30,Don't Blink,Kenny Chesney,4eAwB5pnKFTmsgc3zWoYO0,False,34,30,5,0.604,0.605,4,-8.516,1,0.0352,0.115,1.22e-05,0.305,0.647,147.925,285280,4
2007-10-20,31,Baby Don't Go,Fabolous Featuring Jermaine Dupri,4eAwB5pnKFTmsgc3zWoYO0,False,46,31,6,0.834,0.687,1,-6.473,1,0.105,0.0885,0,0.144,0.491,99.752,216653,4
2007-10-20,32,Paralyzer,Finger Eleven,4eAwB5pnKFTmsgc3zWoYO0,False,40,32,18,0.644,0.939,11,-3.486,0,0.0456,0.157,0,0.233,0.861,106.031,208107,4
2007-10-20,33,Beautiful Girls,Sean Kingston,4eAwB5pnKFTmsgc3zWoYO0,False,27,1,20,0.762,0.661,1,-6.075,0,0.0687,0.15,0,0.256,0.769,130.009,225373,4
2007-10-20,34,Make Me Better,Fabolous Featuring Ne-Yo,4eAwB5pnKFTmsgc3zWoYO0,False,28,8,20,0.607,0.599,11,-6.886,1,0.0995,0.33,0,0.199,0.562,86.491,253573,4
2007-10-20,35,Kiss Kiss,Chris Brown Featuring T-Pain,4eAwB5pnKFTmsgc3zWoYO0,False,55,35,4,0.729,0.658,10,-3.386,0,0.225,0.0506,0,0.0693,0.551,140.043,250667,3
2007-10-20,36,When You're Gone,Avril Lavigne,4eAwB5pnKFTmsgc3zWoYO0,False,32,24,16,0.458,0.719,4,-3.921,0,0.0323,0.189,0,0.228,0.168,142.032,240493,4
2007-10-20,37,The Way I Am,Ingrid Michaelson,4eAwB5pnKFTmsgc3zWoYO0,False,80,37,2,0.877,0.259,5,-9.302,1,0.0427,0.771,8.98e-06,0.108,0.32,119.989,135387,4
2007-10-20,38,Me Love,Sean Kingston,4eAwB5pnKFTmsgc3zWoYO0,False,30,14,10,0.66,0.847,1,-3.25,1,0.191,0.0628,0,0.112,0.925,180.01,204293,4
2007-10-20,39,Home,Daughtry,4eAwB5pnKFTmsgc3zWoYO0,False,36,5,32,0.443,0.853,6,-3.885,1,0.0361,0.00217,1.77e-06,0.198,0.338,143.986,255652,4
2007-10-20,40,Duffle Bag Boy,Playaz Circle Featuring Lil Wayne,4eAwB5pnKFTmsgc3zWoYO0,False,48,40,3,0.613,0.835,3,-4.051,0,0.177,0.106,0,0.14,0.684,143.876,258273,4
2007-10-20,41,First Time,Lifehouse,4eAwB5pnKFTmsgc3zWoYO0,False,35,26,22,0.442,0.952,3,-2.214,1,0.0541,2.41e-05,0,0.205,0.505,130.682,203640,4
2007-10-20,42,I Get Money,50 Cent,4eAwB5pnKFTmsgc3zWoYO0,False,33,20,7,0.525,0.933,9,-4.673,1,0.356,0.159,0.000241,0.311,0.457,122.631,223720,5
2007-10-20,43,Online,Brad Paisley,4eAwB5pnKFTmsgc3zWoYO0,False,39,39,12,0.557,0.856,7,-5.294,1,0.0687,0.0882,0.0326,0.681,0.846,133.527,289413,4
2007-10-20,44,Thnks Fr Th Mmrs,Fall Out Boy,4eAwB5pnKFTmsgc3zWoYO0,False,47,11,26,0.459,0.891,10,-5.057,0,0.0623,0.00511,0,0.106,0.588,154.837,203507,4
2007-10-20,45,Hood Figga,Gorilla Zoe,4eAwB5pnKFTmsgc3zWoYO0,False,53,45,11,0.814,0.713,1,-5.089,1,0.107,0.0162,0,0.123,0.145,174.264,200933,4
2007-10-20,46,Before He Cheats,Carrie Underwood,4eAwB5pnKFTmsgc3zWoYO0,False,44,8,58,0.519,0.749,6,-3.318,0,0.0405,0.271,0,0.119,0.29,147.905,199947,4
2007-10-20,47,Shawty Is A 10,The-Dream,4eAwB5pnKFTmsgc3zWoYO0,False,57,47,5,0.742,0.441,7,-5.541,0,0.0403,0.0689,0,0.0715,0.39,74.987,232040,4
2007-10-20,48,Love Me If You Can,Toby Keith,4eAwB5pnKFTmsgc3zWoYO0,False,54,48,11,0.57,0.633,5,-6.26,1,0.0285,0.242,0.00176,0.0866,0.339,148.027,216867,4
2007-10-20,49,Buy U A Drank (Shawty Snappin'),T-Pain Featuring Yung Joc,4eAwB5pnKFTmsgc3zWoYO0,False,38,1,33,0.451,0.55,1,-8.137,1,0.262,0.0108,0,0.0737,0.594,80.001,227960,4
2007-10-20,50,Do It Well,Jennifer Lopez,4eAwB5pnKFTmsgc3zWoYO0,False,52,50,3,0.763,0.81,5,-5.118,0,0.0861,0.0311,0,0.316,0.437,108.004,185933,4
2007-10-20,51,So Small,Carrie Underwood,4eAwB5pnKFTmsgc3zWoYO0,False,49,17,8,0.426,0.784,3,-3.225,1,0.0421,0.306,0,0.0695,0.272,147.939,225213,3
2007-10-20,52,You Know What It Is,T.I. Featuring Wyclef Jean,4eAwB5pnKFTmsgc3zWoYO0,False,42,34,14,0.657,0.853,1,-4.757,0,0.252,0.17,0,0.0956,0.746,173.066,287133,4
2007-10-20,53,The Pretender,Foo Fighters,4eAwB5pnKFTmsgc3zWoYO0,False,37,37,9,0.433,0.959,9,-4.04,1,0.0431,0.000917,0,0.028,0.365,172.984,269373,4
2007-10-20,54,A Bay Bay,Hurricane Chris,4eAwB5pnKFTmsgc3zWoYO0,False,43,7,18,0.577,0.668,6,-4.884,1,0.514,0.105,0,0.0924,0.702,60.709,257120,3
2007-10-20,55,Blue Magic,JAY-Z,3E8mkgsexzpLBGd6o4iCGC,True,0,55,1,0.821,0.639,6,-6.249,1,0.423,0.172,0,0.755,0.549,87.021,248920,4
2007-10-20,56,Tattoo,Jordin Sparks,3E8mkgsexzpLBGd6o4iCGC,False,58,56,2,0.566,0.766,2,-5.036,1,0.0399,0.431,0,0.101,0.547,168.005,233467,4
2007-10-20,57,If You're Reading This,Tim McGraw,3E8mkgsexzpLBGd6o4iCGC,False,50,43,9,0.305,0.304,11,-8.383,1,0.0285,0.823,0,0.67,0.341,145.49,252720,4
2007-10-20,58,Proud Of The House We Built,Brooks & Dunn,3E8mkgsexzpLBGd6o4iCGC,False,59,57,11,0.617,0.789,6,-4.973,1,0.0445,0.0638,0.00481,0.11,0.546,119.982,226187,4
2007-10-20,59,"Sorry, Blame It On Me",Akon,3E8mkgsexzpLBGd6o4iCGC,False,51,7,12,0.709,0.65,7,-7.371,1,0.273,0.251,2.32e-05,0.0731,0.543,176.141,295720,4
2007-10-20,60,Bleed It Out,Linkin Park,3E8mkgsexzpLBGd6o4iCGC,False,60,52,10,0.529,0.967,1,-3.647,0,0.0508,0.114,0,0.61,0.596,140.127,166373,4
2007-10-20,61,I'm So Hood,"DJ Khaled Featuring T-Pain, Trick Daddy, Rick Ross & Plies",3E8mkgsexzpLBGd6o4iCGC,False,75,61,4,0.721,0.88,9,-3.18,0,0.0792,0.0189,0,0.246,0.518,130.975,255400,4
2007-10-20,62,Free And Easy (Down The Road I Go),Dierks Bentley,3E8mkgsexzpLBGd6o4iCGC,False,61,61,10,0.557,0.825,6,-4.657,1,0.0283,0.00525,0.00164,0.177,0.841,120.017,201120,4
2007-10-20,63,I Don't Wanna Be In Love (Dance Floor Anthem),Good Charlotte,3E8mkgsexzpLBGd6o4iCGC,False,69,63,5,0.64,0.884,6,-2.609,1,0.0428,0.0226,0,0.187,0.573,124.968,244000,4
2007-10-20,64,Shut Up And Drive,Rihanna,3E8mkgsexzpLBGd6o4iCGC,False,56,15,18,0.735,0.826,1,-4.902,1,0.0349,0.00101,0.129,0.197,0.74,132.964,212280,4
2007-10-20,65,Do You,Ne-Yo,3E8mkgsexzpLBGd6o4iCGC,False,63,26,19,0.588,0.614,5,-5.857,0,0.0726,0.31,0,0.321,0.59,121.299,228267,5
2007-10-20,66,Whine Up,Kat DeLuna Featuring Elephant Man,3E8mkgsexzpLBGd6o4iCGC,False,64,29,19,0.817,0.563,9,-6.276,1,0.055,0.0526,1.32e-06,0.154,0.488,125.02,205747,4
2007-10-20,67,Our Song,Taylor Swift,3E8mkgsexzpLBGd6o4iCGC,False,86,67,2,0.668,0.672,2,-4.931,1,0.0303,0.111,0,0.329,0.539,89.011,201107,4
2007-10-20,68,More Than A Memory,Garth Brooks,3E8mkgsexzpLBGd6o4iCGC,False,68,68,6,0.491,0.549,1,-4.252,1,0.0279,0.46,0,0.165,0.184,138.339,202664,4
2007-10-20,69,My Drink N' My 2 Step,Cassidy Featuring Swizz Beatz,3E8mkgsexzpLBGd6o4iCGC,False,77,69,4,0.642,0.835,1,-4.501,1,0.293,0.206,0,0.135,0.553,86.662,192867,4
2007-10-20,70,Misery Business,Paramore,3E8mkgsexzpLBGd6o4iCGC,False,76,34,12,0.517,0.906,1,-3.677,1,0.0735,0.00272,9.26e-06,0.113,0.731,172.977,211520,4
2007-10-20,71,Can't Help But Wait,Trey Songz,3E8mkgsexzpLBGd6o4iCGC,False,90,71,3,0.699,0.691,1,-5.565,0,0.0798,0.359,0,0.0912,0.6,94.982,206413,4
2007-10-20,72,Soulja Girl,Soulja Boy Tell'em Featuring I-15,0N9b7upoCixmvrsF0e4XN3,True,0,72,1,0.578,0.714,11,-3.551,0,0.0349,0.0846,0,0.139,0.145,73.007,187547,4
2007-10-20,73,Teenagers,My Chemical Romance,0N9b7upoCixmvrsF0e4XN3,False,73,67,17,0.463,0.857,4,-3.063,1,0.0632,0.0506,0,0.184,0.856,111.647,161920,4
2007-10-20,74,All My Friends Say,Luke Bryan,0N9b7upoCixmvrsF0e4XN3,False,62,59,10,0.683,0.9,9,-4.422,1,0.0333,0.0439,0,0.177,0.962,117.036,242800,4
2007-10-20,75,Can't Leave 'Em Alone,Ciara Featuring 50 Cent,0N9b7upoCixmvrsF0e4XN3,False,65,40,12,0.527,0.696,1,-6.015,0,0.361,0.209,0,0.0516,0.499,100.614,244760,4
2007-10-20,76,Livin' Our Love Song,Jason Michael Carroll,0N9b7upoCixmvrsF0e4XN3,False,78,76,6,0.488,0.855,7,-3.417,1,0.0399,0.287,0,0.132,0.799,148.971,231467,4
2007-10-20,77,Never Too Late,Three Days Grace,0N9b7upoCixmvrsF0e4XN3,False,71,71,10,0.433,0.778,2,-4.68,0,0.0371,0.00838,0,0.163,0.217,149.864,209333,4
2007-10-20,78,Freaky Gurl,Gucci Mane,0N9b7upoCixmvrsF0e4XN3,False,87,78,3,0.755,0.644,7,-2.464,1,0.0642,0.0172,0,0.193,0.742,147.019,226720,4
2007-10-20,79,Can't Tell Me Nothing,Kanye West,0N9b7upoCixmvrsF0e4XN3,False,72,41,14,0.596,0.62,5,-6.133,0,0.039,0.0122,0,0.82,0.102,80.029,271600,4
2007-10-20,80,S.O.S.,Jonas Brothers,0N9b7upoCixmvrsF0e4XN3,False,79,17,9,0.584,0.696,7,-3.836,1,0.0694,0.000728,0,0.184,0.699,137.112,153347,4
2007-10-20,81,How 'Bout Them Cowgirls,George Strait,0N9b7upoCixmvrsF0e4XN3,False,85,81,5,0.616,0.812,4,-4.618,1,0.036,0.377,0,0.304,0.399,117.033,235800,4
2007-10-20,82,Fall,Clay Walker,0N9b7upoCixmvrsF0e4XN3,False,88,82,5,0.55,0.543,0,-6.986,1,0.0287,0.193,0,0.0994,0.208,138.003,217080,4
2007-10-20,83,Wadsyaname,Nelly,0N9b7upoCixmvrsF0e4XN3,False,66,43,6,0.778,0.79,10,-7.187,0,0.116,0.123,0,0.122,0.174,79.996,246427,4
2007-10-20,84,Firecracker,Josh Turner,0N9b7upoCixmvrsF0e4XN3,False,89,84,4,0.441,0.966,1,-5.887,0,0.092,0.0791,0.000509,0.0839,0.754,174.576,208787,3
2007-10-20,85,Never Wanted Nothing More,Kenny Chesney,0N9b7upoCixmvrsF0e4XN3,False,70,22,16,0.528,0.742,7,-7.044,1,0.0526,0.0412,1.99e-05,0.236,0.746,177.842,207720,4
2007-10-20,86,Sweetest Girl (Dollar Bill),"Wyclef Jean Featuring Akon, Lil Wayne & Niia",0N9b7upoCixmvrsF0e4XN3,False,92,86,4,0.733,0.744,1,-3.51,1,0.0553,0.0772,0,0.341,0.529,92.515,241133,4
2007-10-20,87,These Are My People,Rodney Atkins,0N9b7upoCixmvrsF0e4XN3,False,83,42,18,0.558,0.896,0,-3.687,1,0.0545,0.0316,0,0.528,0.63,90.064,213653,4
2007-10-20,88,Potential Breakup Song,Aly & AJ,0N9b7upoCixmvrsF0e4XN3,False,82,17,15,0.554,0.899,6,-4.149,0,0.0385,0.000469,0.000365,0.0867,0.556,157.995,218333,4
2007-10-20,90,Hypnotized,Plies Featuring Akon,,False,96,90,2,0.84,0.571,10,-7.421,1,0.0797,0.16,0,0.406,0.617,116.59,188493,4
2007-10-20,91,Int'l Players Anthem (I Choose You),UGK Featuring OutKast,,False,84,70,9,0.675,0.68,4,-5.01,0,0.256,0.0655,0,0.354,0.845,155.698,259040,4
2007-10-20,92,I Got It From My Mama,will.i.am,,False,67,31,9,0.888,0.777,6,-6.262,1,0.0505,0.0961,3.14e-05,0.0514,0.876,118.998,241520,4
2007-10-20,93,Nothin' Better To Do,LeAnn Rimes,,False,97,93,2,0.451,0.911,5,-3.668,0,0.143,0.254,0,0.17,0.455,198.075,266507,4
2007-10-20,94,Famous In A Small Town,Miranda Lambert,,False,93,93,3,0.509,0.932,11,-3.948,1,0.0667,0.268,0,0.0615,0.675,138.722,245333,4
2007-10-20,96,Me Enamora,Juanes,,False,94,86,4,0.675,0.855,4,-3.876,0,0.033,0.0134,0,0.0898,0.909,94.008,193627,4
2007-10-20,97,Into The Night,Santana Featuring Chad Kroeger,5Hv1QAbRWrUSUHaT0CmnMS,True,0,97,1,0.595,0.844,7,-4.678,1,0.0331,0.0137,0,0.234,0.603,127.981,222440,4
2007-10-20,98,Everybody,Keith Urban,6KCa9qGpQ8eCjjFDFwF1r6,True,0,98,1,0.417,0.488,2,-7.029,1,0.0292,0.0423,0,0.0959,0.206,188.209,237173,4
2007-10-20,99,What Do Ya Think About That,Montgomery Gentry,6u8phyrH4qbybaIyxtJ9RS,True,0,99,1,0.592,0.795,7,-6.13,1,0.0291,0.0504,6.35e-06,0.0852,0.705,157.067,217947,4
2007-10-20,100,1973,James Blunt,6u8phyrH4qbybaIyxtJ9RS,False,81,73,3,0.72,0.668,9,-7.928,1,0.0269,0.0652,0.00664,0.0789,0.768,123.007,280027,4
