date,position,title,artist,spotify_id,is_new,last_pos,peak_pos,weeks,danceability,energy,key,loudness,mode,speechiness,acousticness,instrumentalness,liveness,valence,tempo,duration_ms,time_signature
2017-08-12,1,Despacito,Luis Fonsi & Daddy Yankee Featuring Justin Bieber,1kJtfldK9F7XmsSiSNlbth,False,1,1,28,0.653,0.816,2,-4.353,1,0.167,0.228,0,0.0967,0.816,178.085,228827,4
2017-08-12,2,Wild Thoughts,DJ Khaled Featuring Rihanna & Bryson Tiller,1kJtfldK9F7XmsSiSNlbth,False,2,2,6,0.613,0.681,8,-3.089,1,0.0778,0.0287,0,0.126,0.619,97.621,204664,4
2017-08-12,3,That's What I Like,Bruno Mars,1kJtfldK9F7XmsSiSNlbth,False,3,1,28,0.853,0.56,1,-4.961,1,0.0406,0.013,0,0.0944,0.86,134.066,206693,4
2017-08-12,4,I'm The One,"DJ Khaled Featuring Justin Bieber, Quavo, Chance The Rapper & Lil Wayne",1kJtfldK9F7XmsSiSNlbth,False,4,1,13,0.599,0.667,7,-4.267,1,0.0367,0.0533,0,0.134,0.817,80.984,288877,4
2017-08-12,5,Believer,Imagine Dragons,1kJtfldK9F7XmsSiSNlbth,False,7,5,25,0.776,0.78,10,-4.374,0,0.128,0.0622,0,0.081,0.666,124.949,204347,4
2017-08-12,6,Unforgettable,French Montana Featuring Swae Lee,1kJtfldK9F7XmsSiSNlbth,False,5,5,16,0.726,0.769,6,-5.043,1,0.123,0.0293,0.0101,0.104,0.733,97.985,233902,4
2017-08-12,7,Shape Of You,Ed Sheeran,1kJtfldK9F7XmsSiSNlbth,False,6,1,29,0.825,0.652,1,-3.183,0,0.0802,0.581,0,0.0931,0.931,95.977,233713,4
2017-08-12,8,There's Nothing Holdin' Me Back,Shawn Mendes,1kJtfldK9F7XmsSiSNlbth,False,8,8,14,0.866,0.811,11,-4.063,0,0.0553,0.375,0,0.078,0.969,121.995,199440,4
2017-08-12,9,Attention,Charlie Puth,1kJtfldK9F7XmsSiSNlbth,False,10,9,14,0.775,0.613,3,-4.586,0,0.0542,0.109,2.33e-05,0.134,0.797,100.066,208787,4
2017-08-12,10,Body Like A Back Road,Sam Hunt,1kJtfldK9F7XmsSiSNlbth,False,9,6,26,0.732,0.458,5,-7.225,1,0.0311,0.447,0,0.136,0.661,98.938,165387,4
2017-08-12,11,Congratulations,Post Malone Featuring Quavo,1kJtfldK9F7XmsSiSNlbth,False,12,8,31,0.63,0.804,6,-4.183,1,0.0363,0.215,0,0.253,0.492,123.146,220293,4
2017-08-12,12,Humble.,Kendrick Lamar,1kJtfldK9F7XmsSiSNlbth,False,11,1,17,0.908,0.621,1,-6.638,0,0.102,0.000282,5.39e-05,0.0958,0.421,150.011,177000,4
2017-08-12,13,Redbone,Childish Gambino,1kJtfldK9F7XmsSiSNlbth,False,13,13,34,0.743,0.347,1,-11.174,1,0.121,0.167,0.00951,0.103,0.572,160.143,326933,4
2017-08-12,14,Stay,Zedd & Alessia Cara,1kJtfldK9F7XmsSiSNlbth,False,14,7,22,0.69,0.622,5,-5.025,0,0.0622,0.253,0,0.116,0.544,102.04,210091,4
2017-08-12,15,Something Just Like This,The Chainsmokers & Coldplay,1kJtfldK9F7XmsSiSNlbth,False,15,3,23,0.617,0.635,11,-6.769,0,0.0317,0.0498,1.44e-05,0.164,0.446,103.019,247160,4
2017-08-12,16,Strip That Down,Liam Payne Featuring Quavo,1kJtfldK9F7XmsSiSNlbth,False,25,16,10,0.874,0.497,6,-5.484,1,0.0562,0.22,0,0.0761,0.542,106.023,204502,4
2017-08-12,17,XO TOUR Llif3,Lil Uzi Vert,1kJtfldK9F7XmsSiSNlbth,False,16,7,18,0.732,0.75,11,-6.366,0,0.231,0.00264,0,0.109,0.401,155.096,182707,4
2017-08-12,18,Slow Hands,Niall Horan,1kJtfldK9F7XmsSiSNlbth,False,19,18,13,0.735,0.425,0,-6.648,1,0.0464,0.011,0,0.055,0.848,85.896,188174,4
2017-08-12,19,Now Or Never,Halsey,1kJtfldK9F7XmsSiSNlbth,False,17,17,16,0.67,0.585,6,-4.861,0,0.0354,0.107,1.11e-06,0.131,0.447,110.03,214802,4
2017-08-12,20,Mask Off,Future,1kJtfldK9F7XmsSiSNlbth,False,18,5,23,0.833,0.434,2,-8.795,1,0.431,0.0102,0.0219,0.165,0.281,150.062,204600,4
2017-08-12,21,Bank Account,21 Savage,1kJtfldK9F7XmsSiSNlbth,False,34,21,3,0.884,0.346,8,-8.228,0,0.351,0.0151,7.04e-06,0.0871,0.376,75.016,220307,4
2017-08-12,22,It Ain't Me,Kygo x Selena Gomez,1kJtfldK9F7XmsSiSNlbth,False,21,10,24,0.713,0.658,0,-5.362,1,0.0748,0.0161,0.000138,0.0607,0.539,115.024,192000,4
2017-08-12,23,Feels,"Calvin Harris Featuring Pharrell Williams, Katy Perry & Big Sean",1kJtfldK9F7XmsSiSNlbth,False,26,23,6,0.893,0.745,11,-3.105,0,0.0571,0.0642,0,0.0943,0.872,101.018,223413,4
2017-08-12,24,Say You Won't Let Go,James Arthur,1kJtfldK9F7XmsSiSNlbth,False,20,11,40,0.358,0.557,10,-7.398,1,0.059,0.695,0,0.0902,0.494,85.043,211467,4
2017-08-12,25,Castle On The Hill,Ed Sheeran,1kJtfldK9F7XmsSiSNlbth,False,22,6,29,0.461,0.834,2,-4.868,1,0.0989,0.0232,1.14e-05,0.14,0.471,135.007,261154,4
2017-08-12,26,Sorry Not Sorry,Demi Lovato,1kJtfldK9F7XmsSiSNlbth,False,23,23,3,0.705,0.64,11,-6.928,0,0.225,0.0237,0,0.262,0.887,144.077,203760,4
2017-08-12,27,Location,Khalid,1kJtfldK9F7XmsSiSNlbth,False,24,16,29,0.736,0.449,1,-11.462,0,0.425,0.33,0.000162,0.0898,0.326,80.126,219080,4
2017-08-12,28,Bodak Yellow (Money Moves),Cardi B,1kJtfldK9F7XmsSiSNlbth,False,49,28,4,0.926,0.703,11,-6.337,0,0.103,0.0659,0,0.231,0.485,125.022,223713,4
2017-08-12,29,2U,David Guetta Featuring Justin Bieber,1kJtfldK9F7XmsSiSNlbth,False,32,16,7,0.551,0.651,8,-5.828,0,0.0594,0.225,0,0.224,0.562,144.875,194907,4
2017-08-12,30,Mi Gente,J Balvin & Willy William Featuring Beyonce,1kJtfldK9F7XmsSiSNlbth,False,42,30,4,0.76,0.716,11,-6.36,0,0.0817,0.0223,0,0.231,0.469,105.007,209733,4
2017-08-12,31,Slippery,Migos Featuring Gucci Mane,1kJtfldK9F7XmsSiSNlbth,False,35,29,18,0.92,0.674,1,-5.662,0,0.264,0.307,0,0.104,0.741,141.967,304041,4
2017-08-12,32,Rake It Up,Yo Gotti Featuring Nicki Minaj,1kJtfldK9F7XmsSiSNlbth,False,41,32,4,0.91,0.444,1,-8.126,0,0.344,0.022,0,0.137,0.53,149.953,276333,4
2017-08-12,33,Magnolia,Playboi Carti,1kJtfldK9F7XmsSiSNlbth,False,29,29,13,0.791,0.582,11,-7.323,0,0.286,0.0114,0,0.35,0.443,162.991,181812,4
2017-08-12,34,Numb,Linkin Park,1kJtfldK9F7XmsSiSNlbth,False,0,11,33,0.496,0.863,9,-4.153,1,0.0381,0.0046,0,0.639,0.243,110.018,185587,4
2017-08-12,35,Issues,Julia Michaels,1kJtfldK9F7XmsSiSNlbth,False,28,11,27,0.728,0.415,8,-6.852,1,0.0639,0.401,0,0.0616,0.455,114.145,176320,4
2017-08-12,36,Everyday We Lit,YFN Lucci Featuring PnB Rock,1kJtfldK9F7XmsSiSNlbth,False,33,33,16,0.712,0.383,2,-15.116,1,0.0966,0.12,0,0.0746,0.245,156.116,206211,4
2017-08-12,37,In The End,Linkin Park,1kJtfldK9F7XmsSiSNlbth,False,0,2,39,0.556,0.864,3,-5.87,0,0.0584,0.00958,0,0.209,0.4,105.143,216880,4
2017-08-12,38,Praying,Kesha,1kJtfldK9F7XmsSiSNlbth,False,40,25,3,0.543,0.39,10,-7.202,1,0.0322,0.489,0,0.111,0.303,73.415,230267,4
2017-08-12,39,Closer,The Chainsmokers Featuring Halsey,1kJtfldK9F7XmsSiSNlbth,False,36,1,52,0.748,0.524,8,-5.599,1,0.0338,0.414,0,0.111,0.661,95.01,244960,4
2017-08-12,40,Back To You,Louis Tomlinson Featuring Bebe Rexha & Digital Farm Animals,7F9vK8hNFMml4GtHsaXui6,True,0,40,1,0.683,0.53,5,-4.918,0,0.142,0.207,0,0.394,0.645,75.016,190428,4
2017-08-12,41,Fetish,Selena Gomez Featuring Gucci Mane,7F9vK8hNFMml4GtHsaXui6,False,27,27,3,0.708,0.618,2,-4.424,1,0.0592,0.0204,6.81e-06,0.062,0.265,123.013,186113,4
2017-08-12,42,Malibu,Miley Cyrus,7F9vK8hNFMml4GtHsaXui6,False,31,10,12,0.573,0.781,8,-6.406,1,0.0555,0.0767,2.64e-05,0.0813,0.343,139.934,231907,4
2017-08-12,43,Drowning,A Boogie Wit da Hoodie Featuring Kodak Black,7F9vK8hNFMml4GtHsaXui6,False,38,38,17,0.839,0.81,5,-5.274,0,0.0568,0.501,0,0.117,0.814,129.014,209269,4
2017-08-12,44,In Case You Didn't Know,Brett Young,7F9vK8hNFMml4GtHsaXui6,False,37,19,25,0.607,0.536,10,-7.306,1,0.0305,0.386,0,0.102,0.434,147.986,224853,4
2017-08-12,45,Heavy,Linkin Park Featuring Kiiara,7F9vK8hNFMml4GtHsaXui6,False,0,45,18,0.59,0.671,9,-6.098,1,0.0706,0.0484,0,0.0604,0.438,149.982,169801,4
2017-08-12,46,Love Galore,SZA Featuring Travis Scott,7F9vK8hNFMml4GtHsaXui6,False,53,46,7,0.795,0.594,0,-6.2,1,0.0748,0.112,0,0.162,0.409,135.002,275080,4
2017-08-12,47,The Fighter,Keith Urban Featuring Carrie Underwood,7F9vK8hNFMml4GtHsaXui6,False,0,38,23,0.681,0.845,11,-5.147,0,0.0525,0.0304,0,0.197,0.761,132.023,184040,4
2017-08-12,48,Craving You,Thomas Rhett Featuring Maren Morris,7F9vK8hNFMml4GtHsaXui6,False,44,39,17,0.613,0.839,9,-3.799,0,0.0352,0.000854,0,0.341,0.526,104.975,223627,4
2017-08-12,49,Small Town Boy,Dustin Lynch,7F9vK8hNFMml4GtHsaXui6,False,52,49,8,0.554,0.743,9,-6.016,1,0.0287,0.0251,0,0.359,0.673,72.997,205733,4
2017-08-12,50,Rolex,Ayo & Teo,7F9vK8hNFMml4GtHsaXui6,False,43,20,24,0.804,0.886,1,-2.512,1,0.04,0.0837,0,0.266,0.789,144.946,238587,4
2017-08-12,51,Whatever You Need,Meek Mill Featuring Chris Brown & Ty Dolla $ign,7F9vK8hNFMml4GtHsaXui6,False,89,51,3,0.519,0.57,1,-7.366,1,0.202,0.0254,0,0.0821,0.317,164.155,205373,4
2017-08-12,52,My Girl,Dylan Scott,7F9vK8hNFMml4GtHsaXui6,False,39,39,14,0.652,0.719,1,-7.251,1,0.033,0.0353,0,0.108,0.24,94.969,197640,4
2017-08-12,53,Versace On The Floor,Bruno Mars,7F9vK8hNFMml4GtHsaXui6,False,47,47,7,0.578,0.574,2,-6.209,1,0.0454,0.196,0,0.083,0.301,174.152,261240,4
2017-08-12,54,Bad Liar,Selena Gomez,7F9vK8hNFMml4GtHsaXui6,False,30,20,11,0.965,0.414,1,-6.408,1,0.0713,0.189,0,0.0767,0.728,121.032,214648,4
2017-08-12,55,Feel It Still,Portugal. The Man,7F9vK8hNFMml4GtHsaXui6,False,63,55,6,0.801,0.795,1,-5.115,0,0.0504,0.0417,0.000113,0.0717,0.754,79.028,163253,4
2017-08-12,56,Felices Los 4,Maluma,7F9vK8hNFMml4GtHsaXui6,False,48,48,11,0.766,0.756,5,-5.861,1,0.132,0.213,0,0.349,0.716,94.027,230000,4
2017-08-12,57,1-800-273-8255,Logic Featuring Alessia Cara & Khalid,7F9vK8hNFMml4GtHsaXui6,False,55,47,13,0.62,0.574,5,-7.788,0,0.0479,0.569,0,0.19,0.357,100.023,250173,4
2017-08-12,58,Do I Make You Wanna,Billy Currington,7F9vK8hNFMml4GtHsaXui6,False,57,57,7,0.553,0.747,9,-5.432,1,0.0279,0.106,0,0.154,0.521,90.012,234307,4
2017-08-12,59,DNA.,Kendrick Lamar,7F9vK8hNFMml4GtHsaXui6,False,51,4,15,0.638,0.523,1,-6.664,1,0.357,0.00454,0,0.0842,0.422,139.913,185947,4
2017-08-12,60,Drinkin' Problem,Midland,7F9vK8hNFMml4GtHsaXui6,False,54,54,12,0.622,0.763,9,-6.4,1,0.0263,0.055,8.91e-06,0.313,0.621,102.0,220800,4
2017-08-12,61,What's My Name,"China Anne McClain, Thomas Doherty & Dylan Playfair",53xAT6jud1w0NqlBjSW4VB,True,0,61,1,0.727,0.932,1,-4.931,1,0.16,0.098,0,0.211,0.662,114.032,190720,4
2017-08-12,62,It's A Vibe,"2 Chainz Featuring Ty Dolla $ign, Trey Songz & Jhene Aiko",53xAT6jud1w0NqlBjSW4VB,False,56,56,7,0.822,0.502,7,-7.38,1,0.148,0.0312,0.000887,0.114,0.525,73.003,210200,4
2017-08-12,63,What Ifs,Kane Brown Featuring Lauren Alaina,53xAT6jud1w0NqlBjSW4VB,False,65,63,7,0.612,0.799,10,-4.603,1,0.0275,0.00898,0,0.172,0.687,125.976,188253,4
2017-08-12,64,Loyalty.,Kendrick Lamar Featuring Rihanna,53xAT6jud1w0NqlBjSW4VB,False,62,14,15,0.658,0.535,9,-8.983,0,0.0573,0.0265,0,0.2,0.419,110.684,227360,4
2017-08-12,65,Butterfly Effect,Travis Scott,53xAT6jud1w0NqlBjSW4VB,False,60,60,9,0.763,0.628,11,-5.85,1,0.05,0.0531,0,0.114,0.193,140.958,190557,4
2017-08-12,66,No Such Thing As A Broken Heart,Old Dominion,53xAT6jud1w0NqlBjSW4VB,False,64,64,9,0.651,0.782,8,-4.295,1,0.0718,0.295,0,0.107,0.945,171.987,176893,4
2017-08-12,67,Flatliner,Cole Swindell,53xAT6jud1w0NqlBjSW4VB,False,66,66,14,0.555,0.896,0,-3.295,1,0.0388,0.00434,0,0.145,0.578,114.995,177067,4
2017-08-12,68,No Promises,Cheat Codes Featuring Demi Lovato,53xAT6jud1w0NqlBjSW4VB,False,68,68,11,0.739,0.619,10,-6.669,1,0.162,0.0572,0,0.105,0.58,112.961,222787,4
2017-08-12,69,Thunder,Imagine Dragons,53xAT6jud1w0NqlBjSW4VB,False,59,54,13,0.605,0.822,0,-4.833,1,0.0438,0.00671,0.134,0.147,0.288,167.997,187147,4
2017-08-12,70,You Look Good,Lady Antebellum,53xAT6jud1w0NqlBjSW4VB,False,67,59,16,0.656,0.917,0,-4.652,1,0.0495,0.045,0.000732,0.0878,0.961,152.067,181000,4
2017-08-12,71,Escapate Conmigo,Wisin Featuring Ozuna,53xAT6jud1w0NqlBjSW4VB,False,70,70,7,0.744,0.859,11,-3.166,1,0.0795,0.0256,6.27e-05,0.0881,0.787,91.977,232787,4
2017-08-12,72,Most Girls,Hailee Steinfeld,53xAT6jud1w0NqlBjSW4VB,False,58,58,10,0.756,0.572,9,-7.019,1,0.0763,0.0478,0,0.0853,0.417,102.986,204400,4
2017-08-12,73,Heartache On The Dance Floor,Jon Pardi,53xAT6jud1w0NqlBjSW4VB,False,81,73,4,0.596,0.834,9,-4.308,1,0.0474,0.0563,0,0.0866,0.618,116.0,205200,4
2017-08-12,74,Crew,GoldLink Featuring Brent Faiyaz & Shy Glizzy,53xAT6jud1w0NqlBjSW4VB,False,82,74,5,0.728,0.607,1,-8.417,0,0.132,0.133,0,0.0864,0.445,129.938,176702,4
2017-08-12,75,Love.,Kendrick Lamar Featuring Zacari,53xAT6jud1w0NqlBjSW4VB,False,77,18,15,0.8,0.585,10,-7.343,1,0.0924,0.264,0,0.153,0.779,126.058,213400,4
2017-08-12,76,Somebody Else Will,Justin Moore,53xAT6jud1w0NqlBjSW4VB,False,84,76,8,0.488,0.744,2,-4.284,0,0.131,0.0353,0,0.0952,0.59,180.007,165173,4
2017-08-12,77,Issues,Meek Mill,1GOuHB20lqVyxv3GdxovPY,True,0,77,1,0.784,0.608,7,-5.885,1,0.245,0.167,0,0.0871,0.382,90.713,211685,4
2017-08-12,78,Privacy,Chris Brown,1GOuHB20lqVyxv3GdxovPY,False,76,62,13,0.741,0.58,0,-7.741,1,0.378,0.153,0,0.109,0.428,97.092,220964,4
2017-08-12,79,Wins & Losses,Meek Mill,0hjLM1wMtk27Qd4ZihyHmi,True,0,79,1,0.683,0.854,2,-3.915,1,0.196,0.0948,0,0.267,0.131,92.006,189057,4
2017-08-12,80,Passionfruit,Drake,0hjLM1wMtk27Qd4ZihyHmi,False,74,8,19,0.809,0.463,11,-11.377,1,0.0396,0.256,0.085,0.109,0.364,111.98,298941,4
2017-08-12,81,It's Goin' Down,Descendants 2 Cast,56V4lnkkgjEGkl7rS0R6Jk,True,0,81,1,0.57,0.642,9,-12.419,1,0.0505,0.109,0.927,0.09,0.697,153.586,249482,4
2017-08-12,82,Young Dumb & Broke,Khalid,56V4lnkkgjEGkl7rS0R6Jk,False,91,82,2,0.798,0.539,1,-6.351,1,0.0421,0.199,1.66e-05,0.165,0.394,136.949,202547,4
2017-08-12,83,1942 Flows,Meek Mill,7sLDnUauivS2vN6Z9EfUJT,True,0,83,1,0.63,0.628,2,-4.016,1,0.327,0.0515,0,0.091,0.266,121.307,282667,5
2017-08-12,84,First Day Out,Tee Grizzley,7sLDnUauivS2vN6Z9EfUJT,False,69,48,17,0.587,0.711,1,-6.33,1,0.42,0.171,0,0.125,0.381,98.008,254694,4
2017-08-12,85,Glorious,Macklemore Featuring Skylar Grey,7sLDnUauivS2vN6Z9EfUJT,False,99,85,3,0.731,0.794,0,-5.126,0,0.0522,0.0323,2.59e-05,0.112,0.356,139.994,220454,4
2017-08-12,86,Swalla,Jason Derulo Featuring Nicki Minaj & Ty Dolla $ign,7sLDnUauivS2vN6Z9EfUJT,False,79,29,19,0.696,0.817,1,-3.862,1,0.109,0.075,0,0.187,0.782,98.064,216409,4
2017-08-12,87,Yours If You Want It,Rascal Flatts,7sLDnUauivS2vN6Z9EfUJT,False,71,71,10,0.554,0.903,8,-3.152,1,0.0515,0.0103,0,0.107,0.419,112.998,206827,4
2017-08-12,88,4 AM,2 Chainz Featuring Travis Scott,7sLDnUauivS2vN6Z9EfUJT,False,83,55,8,0.796,0.5,1,-7.21,1,0.425,0.118,0,0.155,0.227,75.012,255560,4
2017-08-12,89,"God, Your Mama, And Me",Florida Georgia Line Featuring Backstreet Boys,7sLDnUauivS2vN6Z9EfUJT,False,80,46,18,0.443,0.817,7,-3.729,1,0.0511,0.318,0,0.374,0.652,168.1,183413,4
2017-08-12,90,Down,Fifth Harmony Featuring Gucci Mane,7sLDnUauivS2vN6Z9EfUJT,False,78,42,7,0.53,0.512,8,-7.094,1,0.133,0.0162,7.04e-05,0.128,0.401,196.121,165200,4
2017-08-12,91,Imitadora,Romeo Santos,6r46lnXFbE9fr2d3KNaGbe,True,0,91,1,0.737,0.709,8,-6.889,0,0.045,0.333,0,0.289,0.556,125.997,234829,4
2017-08-12,92,Subeme La Radio,"Enrique Iglesias Featuring Descemer Bueno, Zion & Lennox Or Sean Paul",6r46lnXFbE9fr2d3KNaGbe,False,95,81,8,0.684,0.823,9,-3.297,0,0.0773,0.0744,0,0.111,0.647,91.048,208163,4
2017-08-12,93,It Ain't My Fault,Brothers Osborne,6r46lnXFbE9fr2d3KNaGbe,False,94,93,6,0.735,0.831,9,-5.898,1,0.0332,0.00166,0.217,0.291,0.756,123.017,216800,4
2017-08-12,94,El Amante,Nicky Jam,6r46lnXFbE9fr2d3KNaGbe,False,92,92,12,0.683,0.691,8,-5.535,1,0.0432,0.243,0,0.14,0.732,179.91,219507,4
2017-08-12,95,The Story Of O.J.,JAY-Z,6r46lnXFbE9fr2d3KNaGbe,False,72,23,3,0.741,0.718,7,-5.823,1,0.415,0.283,2.21e-06,0.23,0.576,165.848,231760,4
2017-08-12,96,We Ball,Meek Mill Featuring Young Thug,4iDtAYDLJWM2TrTERKPvFq,True,0,96,1,0.624,0.728,0,-6.39,1,0.465,0.141,0,0.106,0.599,152.088,227957,4
2017-08-12,97,F**k That Check Up,Meek Mill Featuring Lil Uzi Vert,7KmguHS8eVmZOpdpg0gnv2,True,0,97,1,0.86,0.717,11,-4.614,0,0.297,0.00246,0,0.159,0.528,148.955,257854,4
2017-08-12,98,Signs,Drake,7KmguHS8eVmZOpdpg0gnv2,False,88,36,5,0.794,0.735,0,-4.204,1,0.054,0.108,0.00578,0.112,0.223,107.374,234373,4
2017-08-12,99,Heavy Heart,Meek Mill,1QiwdLAzAnzmiwvoGMXM7b,True,0,99,1,0.472,0.695,10,-5.008,0,0.443,0.239,0,0.0942,0.351,73.031,250467,3
2017-08-12,100,Reminder,The Weeknd,1QiwdLAzAnzmiwvoGMXM7b,False,90,31,12,0.706,0.505,8,-6.923,1,0.193,0.142,0,0.164,0.388,160.053,218880,4
