date,position,title,artist,spotify_id,is_new,last_pos,peak_pos,weeks,danceability,energy,key,loudness,mode,speechiness,acousticness,instrumentalness,liveness,valence,tempo,duration_ms,time_signature
2004-11-27,1,My Boo,Usher And Alicia Keys,5h3xoQzVec6OCtzFuuafw7,False,1,1,12,0.662,0.507,5,-8.238,1,0.118,0.257,0,0.0465,0.676,86.412,223440,4
2004-11-27,2,Drop It Like It's Hot,Snoop Dogg Featuring Pharrell,5h3xoQzVec6OCtzFuuafw7,False,2,2,9,0.888,0.622,1,-3.875,1,0.213,0.16,0,0.101,0.664,91.977,266707,4
2004-11-27,3,Lose My Breath,Destiny's Child,5h3xoQzVec6OCtzFuuafw7,False,3,3,10,0.814,0.899,1,-5.958,1,0.0637,0.00727,0.219,0.0979,0.545,119.011,242013,4
2004-11-27,4,Over And Over,Nelly Featuring Tim McGraw,5h3xoQzVec6OCtzFuuafw7,False,4,4,7,0.644,0.517,7,-10.02,1,0.0803,0.0065,1.37e-06,0.158,0.464,169.799,253933,4
2004-11-27,5,Wonderful,Ja Rule Featuring R. Kelly & Ashanti,5h3xoQzVec6OCtzFuuafw7,False,9,5,7,0.663,0.777,11,-4.954,0,0.109,0.277,0,0.0466,0.758,92.68,270507,4
2004-11-27,6,Goodies,Ciara Featuring Petey Pablo,5h3xoQzVec6OCtzFuuafw7,False,5,1,23,0.826,0.647,5,-6.306,0,0.0491,0.0277,1.52e-06,0.298,0.872,102.017,223000,4
2004-11-27,7,Let's Go,Trick Daddy Featuring Lil Jon & Twista,5h3xoQzVec6OCtzFuuafw7,False,8,7,11,0.748,0.767,11,-7.806,0,0.172,0.0267,0,0.334,0.519,133.929,222200,4
2004-11-27,8,Breakaway,Kelly Clarkson,5h3xoQzVec6OCtzFuuafw7,False,6,6,14,0.446,0.701,9,-4.179,0,0.0295,0.0298,8.89e-06,0.0931,0.394,159.958,237000,3
2004-11-27,9,Let Me Love You,Mario,5h3xoQzVec6OCtzFuuafw7,False,15,9,6,0.656,0.578,7,-8.97,0,0.0922,0.235,0,0.118,0.556,94.514,256733,4
2004-11-27,10,Breathe,Fabolous,5h3xoQzVec6OCtzFuuafw7,False,11,10,11,0.716,0.889,10,-6.325,0,0.268,0.223,0,0.337,0.503,82.992,270533,4
2004-11-27,11,She Will Be Loved,Maroon 5,5h3xoQzVec6OCtzFuuafw7,False,7,5,19,0.618,0.504,11,-9.328,0,0.0319,0.496,4.73e-06,0.698,0.58,98.119,276787,4
2004-11-27,12,Oye Mi Canto,"N.O.R.E. Featuring Daddy Yankee, Nina Sky, Gem Star & Big Mato",5h3xoQzVec6OCtzFuuafw7,False,12,12,14,0.677,0.946,6,-2.887,1,0.0553,0.185,3.56e-06,0.274,0.948,96.011,240973,4
2004-11-27,13,"1, 2 Step",Ciara Featuring Missy Elliott,5h3xoQzVec6OCtzFuuafw7,False,16,13,5,0.805,0.896,7,-2.53,0,0.0414,0.0176,0.00293,0.336,0.776,98.738,231773,4
2004-11-27,14,Go D.J.,Lil Wayne,5h3xoQzVec6OCtzFuuafw7,False,14,14,9,0.662,0.763,1,-8.455,1,0.377,0.0389,0,0.103,0.566,170.031,225307,4
2004-11-27,15,Just Lose It,Eminem,5h3xoQzVec6OCtzFuuafw7,False,10,6,8,0.94,0.633,8,-3.56,1,0.0467,0.0581,4.04e-05,0.281,0.962,121.003,248680,4
2004-11-27,16,I Don't Want To Be,Gavin DeGraw,5h3xoQzVec6OCtzFuuafw7,False,24,16,6,0.423,0.862,0,-5.13,0,0.0695,0.00791,0,0.133,0.462,154.746,217760,4
2004-11-27,17,Shorty Wanna Ride,Young Buck,5h3xoQzVec6OCtzFuuafw7,False,22,17,7,0.582,0.621,11,-6.183,0,0.283,0.00317,0,0.111,0.331,179.458,261320,4
2004-11-27,18,Lean Back,Terror Squad,5h3xoQzVec6OCtzFuuafw7,False,13,1,23,0.783,0.916,1,-3.344,1,0.415,0.11,0,0.0746,0.695,95.321,247427,4
2004-11-27,19,My Happy Ending,Avril Lavigne,5h3xoQzVec6OCtzFuuafw7,False,17,9,18,0.414,0.936,2,-2.407,1,0.0758,0.00136,0,0.369,0.74,170.229,242413,4
2004-11-27,20,Dare You To Move,Switchfoot,5h3xoQzVec6OCtzFuuafw7,False,28,20,9,0.426,0.881,4,-4.526,1,0.0404,0.00573,0.0693,0.389,0.259,139.986,247893,4
2004-11-27,21,Charlene,Anthony Hamilton,5h3xoQzVec6OCtzFuuafw7,False,21,19,13,0.556,0.346,0,-9.809,0,0.311,0.536,0,0.106,0.451,123.869,246773,4
2004-11-27,22,Balla Baby,Chingy,5h3xoQzVec6OCtzFuuafw7,False,20,20,8,0.928,0.643,11,-5.48,0,0.0759,0.0527,0,0.0988,0.895,93.006,215907,4
2004-11-27,23,Broken,Seether Featuring Amy Lee,5h3xoQzVec6OCtzFuuafw7,False,25,23,13,0.448,0.61,3,-2.695,0,0.0342,0.0102,0.000491,0.135,0.214,123.762,258333,4
2004-11-27,24,Diary,Alicia Keys Featuring Tony! Toni! Tone!,5h3xoQzVec6OCtzFuuafw7,False,19,8,24,0.664,0.465,8,-9.711,0,0.0317,0.559,0.00174,0.125,0.281,127.932,284160,4
2004-11-27,25,One Thing,Finger Eleven,5h3xoQzVec6OCtzFuuafw7,False,26,16,19,0.588,0.555,1,-9.401,1,0.0334,0.447,0,0.0806,0.445,151.991,279573,4
2004-11-27,26,Baby It's You,JoJo Featuring Bow Wow,5h3xoQzVec6OCtzFuuafw7,False,30,26,8,0.858,0.607,1,-4.199,1,0.118,0.0169,3.97e-05,0.0777,0.821,119.986,188293,3
2004-11-27,27,Hush,LL Cool J Featuring 7 Aurelius,5h3xoQzVec6OCtzFuuafw7,False,27,27,10,0.768,0.725,11,-6.543,1,0.292,0.128,0,0.122,0.794,98.963,214560,4
2004-11-27,28,On The Way Down,Ryan Cabrera,5h3xoQzVec6OCtzFuuafw7,False,23,15,18,0.5,0.845,1,-5.015,1,0.0369,0.00184,0,0.106,0.539,95.199,212045,4
2004-11-27,29,1985,Bowling For Soup,5h3xoQzVec6OCtzFuuafw7,False,29,23,12,0.606,0.887,4,-4.404,1,0.0598,0.000242,0,0.337,0.903,119.974,193000,4
2004-11-27,30,Locked Up,Akon Featuring Styles P.,5h3xoQzVec6OCtzFuuafw7,False,18,8,25,0.828,0.58,7,-4.395,1,0.0941,0.0255,0,0.103,0.407,89.973,235067,4
2004-11-27,31,Vertigo,U2,5h3xoQzVec6OCtzFuuafw7,False,32,31,8,0.416,0.819,9,-3.974,1,0.0613,0.000138,0.00108,0.122,0.632,140.083,194520,4
2004-11-27,32,Heaven,Los Lonely Boys,5h3xoQzVec6OCtzFuuafw7,False,34,16,29,0.653,0.818,11,-6.375,1,0.0638,0.376,1.64e-06,0.0754,0.798,91.896,226960,4
2004-11-27,33,Mr. Mom,Lonestar,5h3xoQzVec6OCtzFuuafw7,False,35,33,11,0.505,0.842,10,-3.316,1,0.0475,0.0576,0,0.111,0.671,172.136,208693,4
2004-11-27,34,The Reason,Hoobastank,5h3xoQzVec6OCtzFuuafw7,False,36,2,37,0.472,0.671,4,-4.649,1,0.029,0.0129,0,0.159,0.0681,82.952,232800,4
2004-11-27,35,Nothing On But The Radio,Gary Allan,5h3xoQzVec6OCtzFuuafw7,False,37,35,11,0.679,0.736,9,-5.954,1,0.026,0.0572,9.25e-06,0.139,0.664,109.444,212027,4
2004-11-27,36,Lovers And Friends,Lil Jon & The East Side Boyz Featuring Usher & Ludacris,41PWz0hAiU9FqsmjR9Wh62,True,0,36,1,0.675,0.501,10,-6.183,1,0.22,0.0541,0,0.429,0.532,139.861,260600,4
2004-11-27,37,The Woman With You,Kenny Chesney,41PWz0hAiU9FqsmjR9Wh62,False,41,37,7,0.55,0.664,7,-7.161,1,0.0348,0.0672,4.31e-05,0.114,0.273,139.933,270000,4
2004-11-27,38,Back When,Tim McGraw,41PWz0hAiU9FqsmjR9Wh62,False,40,38,6,0.604,0.759,7,-4.822,1,0.0279,0.0627,0,0.321,0.663,136.045,269893,4
2004-11-27,39,If I Ain't Got You,Alicia Keys,41PWz0hAiU9FqsmjR9Wh62,False,31,4,39,0.609,0.445,7,-9.129,1,0.106,0.603,6.77e-06,0.104,0.166,118.393,228707,3
2004-11-27,40,Daughters,John Mayer,41PWz0hAiU9FqsmjR9Wh62,False,45,40,4,0.674,0.413,2,-7.816,1,0.0274,0.837,1.91e-05,0.098,0.503,124.895,237907,3
2004-11-27,41,Soldier,Destiny's Child Featuring T.I. & Lil Wayne,4FTOpNYcGxnQdGNWSxIcio,True,0,41,1,0.878,0.417,7,-6.799,1,0.361,0.0444,0,0.0833,0.904,77.49,325573,4
2004-11-27,42,Some Beach,Blake Shelton,4FTOpNYcGxnQdGNWSxIcio,False,44,42,5,0.787,0.765,0,-6.331,1,0.0265,0.231,1.79e-05,0.323,0.964,115.979,204827,4
2004-11-27,43,That's What It's All About,Brooks & Dunn,4FTOpNYcGxnQdGNWSxIcio,False,38,38,14,0.515,0.901,9,-3.063,1,0.0384,0.0437,1.78e-05,0.0585,0.289,118.378,239853,4
2004-11-27,44,What U Gon' Do,Lil Jon & The East Side Boyz Featuring Lil Scrappy,4FTOpNYcGxnQdGNWSxIcio,False,53,44,4,0.838,0.724,1,-6.9,0,0.242,7.68e-05,1.02e-06,0.162,0.537,150.192,320187,4
2004-11-27,45,Tempted To Touch,Rupee,4FTOpNYcGxnQdGNWSxIcio,False,39,39,8,0.819,0.825,2,-7.012,0,0.0549,0.061,0,0.0904,0.939,105.988,207547,4
2004-11-27,46,This Love,Maroon 5,4FTOpNYcGxnQdGNWSxIcio,False,42,5,42,0.712,0.868,5,-4.098,0,0.038,0.0606,0,0.0897,0.758,95.041,205747,4
2004-11-27,47,What You Waiting For?,Gwen Stefani,4FTOpNYcGxnQdGNWSxIcio,False,52,47,7,0.676,0.948,5,-2.557,1,0.0628,0.0509,8.19e-06,0.384,0.731,136.027,221227,4
2004-11-27,48,Get Back,Ludacris,4FTOpNYcGxnQdGNWSxIcio,False,66,48,2,0.555,0.639,1,-5.16,1,0.263,0.0594,0,0.118,0.184,171.609,270747,4
2004-11-27,49,Welcome To My Life,Simple Plan,4FTOpNYcGxnQdGNWSxIcio,False,56,49,3,0.421,0.858,1,-4.535,1,0.0963,0.0134,0,0.067,0.491,173.255,206773,4
2004-11-27,50,Let's Get It Started,The Black Eyed Peas,4FTOpNYcGxnQdGNWSxIcio,False,50,21,17,0.726,0.769,2,-3.474,1,0.188,0.114,0,0.238,0.771,104.9,218993,4
2004-11-27,51,Somebody Told Me,The Killers,4FTOpNYcGxnQdGNWSxIcio,False,54,51,13,0.509,0.987,10,-3.198,0,0.0886,8.05e-05,0.000928,0.119,0.647,138.039,197160,4
2004-11-27,52,My Place,Nelly Featuring Jaheim,4FTOpNYcGxnQdGNWSxIcio,False,33,4,19,0.6,0.641,1,-4.237,0,0.0423,0.0498,1.49e-06,0.0982,0.642,163.153,336507,4
2004-11-27,53,Nolia Clap,"Juvenile, Wacko & Skip",4FTOpNYcGxnQdGNWSxIcio,False,43,31,14,0.838,0.942,5,-2.353,1,0.395,0.0718,0,0.142,0.961,79.935,270333,4
2004-11-27,54,In A Real Love,Phil Vassar,4FTOpNYcGxnQdGNWSxIcio,False,46,38,13,0.575,0.797,9,-5.2,1,0.0305,0.154,0,0.282,0.744,90.907,214827,4
2004-11-27,55,Only U,Ashanti,4FTOpNYcGxnQdGNWSxIcio,False,63,55,2,0.601,0.621,6,-5.576,0,0.0434,0.0374,1.75e-06,0.188,0.278,94.547,186307,4
2004-11-27,56,Karma,Lloyd Banks Featuring Avant,4FTOpNYcGxnQdGNWSxIcio,False,71,56,2,0.605,0.829,10,-2.377,0,0.444,0.0392,0,0.196,0.708,176.103,278533,4
2004-11-27,57,How Am I Doin',Dierks Bentley,4FTOpNYcGxnQdGNWSxIcio,False,57,57,6,0.528,0.871,9,-8.01,1,0.122,0.125,0,0.23,0.675,181.903,228438,4
2004-11-27,58,Encore,"Eminem, Dr. Dre & 50 Cent",4FTOpNYcGxnQdGNWSxIcio,False,60,58,2,0.664,0.66,8,-6.108,1,0.321,0.0544,0,0.799,0.54,174.23,312947,4
2004-11-27,60,"Awful, Beautiful Life",Darryl Worley,,False,65,60,3,0.627,0.777,2,-6.91,1,0.0322,0.0189,1.09e-06,0.173,0.643,112.599,232800,4
2004-11-27,62,Breaking The Habit,Linkin Park,,False,58,20,19,0.579,0.849,4,-5.218,0,0.0303,0.108,0,0.0909,0.581,100.021,196907,4
2004-11-27,63,Suds In The Bucket,Sara Evans,,False,55,33,17,0.511,0.903,10,-3.163,1,0.0397,0.052,0.000529,0.304,0.898,161.992,227267,4
2004-11-27,64,No Problem,Lil Scrappy,,False,59,29,20,0.858,0.731,1,-7.224,1,0.237,0.053,0,0.15,0.139,85.984,214213,4
2004-11-27,65,How We Do,The Game Featuring 50 Cent,4PmMVdIFpJTB9WQbmILf4p,True,0,65,1,0.862,0.648,4,-7.401,0,0.251,0.0455,0,0.0332,0.637,98.012,235533,4
2004-11-27,66,U Make Me Wanna,Jadakiss Featuring Mariah Carey,4PmMVdIFpJTB9WQbmILf4p,False,75,66,2,0.686,0.818,5,-5.111,0,0.241,0.0374,0,0.329,0.633,83.182,293800,4
2004-11-27,67,Nothin 'Bout Love Makes Sense,LeAnn Rimes,4PmMVdIFpJTB9WQbmILf4p,False,70,67,3,0.656,0.802,9,-3.244,1,0.0369,0.566,0,0.13,0.796,121.933,177307,4
2004-11-27,68,Days Go By,Keith Urban,4PmMVdIFpJTB9WQbmILf4p,False,64,31,19,0.589,0.892,2,-3.197,1,0.0365,0.0633,0,0.149,0.76,131.951,224630,4
2004-11-27,69,Fall To Pieces,Velvet Revolver,4PmMVdIFpJTB9WQbmILf4p,False,68,67,10,0.464,0.887,6,-4.65,1,0.0499,0.000429,0.333,0.126,0.23,132.759,271240,4
2004-11-27,70,Take Me Home,Terror Squad,4PmMVdIFpJTB9WQbmILf4p,False,79,70,6,0.81,0.794,11,-4.848,0,0.205,0.129,0,0.0524,0.834,131.06,210840,4
2004-11-27,71,Boulevard Of Broken Dreams,Green Day,5GorCbAP4aL0EJ16frG2hd,True,0,71,1,0.496,0.682,8,-4.095,1,0.0294,0.00552,2.94e-05,0.0589,0.474,167.06,262333,4
2004-11-27,72,I Changed My Mind,Keyshia Cole Featuring Shyne,4w4RaMGPl2qnjSdPlp1KAE,True,0,72,1,0.507,0.686,4,-4.074,1,0.102,0.226,0,0.387,0.618,93.615,198680,4
2004-11-27,73,Vitamin R (Leading Us Along),Chevelle,4w4RaMGPl2qnjSdPlp1KAE,False,77,73,2,0.481,0.88,4,-4.55,1,0.0717,0.00465,6.02e-05,0.204,0.289,95.023,223173,3
2004-11-27,74,Give A Little Bit,Goo Goo Dolls,35Ms8xegBwsiqlz630Io13,True,0,74,1,0.557,0.951,0,-3.003,1,0.033,0.00194,0.000172,0.157,0.528,93.974,214400,4
2004-11-27,75,New York,Ja Rule Featuring Fat Joe & Jadakiss,35Ms8xegBwsiqlz630Io13,False,72,72,2,0.546,0.795,11,-5.825,0,0.444,0.253,0,0.0775,0.572,93.221,258213,4
2004-11-27,76,Knuck If You Buck,Crime Mob Featuring Lil Scrappy,35Ms8xegBwsiqlz630Io13,False,80,76,15,0.865,0.844,8,-4.946,1,0.311,0.0582,0,0.373,0.755,150.09,205120,4
2004-11-27,77,Getting Away With Murder,Papa Roach,35Ms8xegBwsiqlz630Io13,False,73,69,6,0.564,0.968,1,-3.75,1,0.0631,0.000116,3.97e-05,0.226,0.352,103.885,191373,4
2004-11-27,78,"Breathe, Stretch, Shake",Mase Featuring P. Diddy,35Ms8xegBwsiqlz630Io13,False,61,28,14,0.531,0.712,9,-4.887,1,0.336,0.0666,0,0.399,0.648,101.43,197277,4
2004-11-27,79,So Cold,Breaking Benjamin,35Ms8xegBwsiqlz630Io13,False,84,76,12,0.49,0.774,0,-5.436,0,0.0604,0.00305,8.16e-05,0.12,0.297,153.048,273440,4
2004-11-27,80,I Hate Everything,George Strait,35Ms8xegBwsiqlz630Io13,False,67,35,16,0.582,0.542,10,-10.041,1,0.0294,0.396,0.00114,0.123,0.45,90.918,235427,4
2004-11-27,81,Dangerously In Love,Beyonce,35Ms8xegBwsiqlz630Io13,False,83,57,11,0.609,0.407,6,-8.026,1,0.0808,0.345,0,0.19,0.459,99.982,293133,4
2004-11-27,82,Used To Love U,John Legend,35Ms8xegBwsiqlz630Io13,False,74,74,9,0.661,0.794,7,-4.776,1,0.0839,0.0349,0,0.396,0.652,87.983,210867,4
2004-11-27,83,Stays In Mexico,Toby Keith,35Ms8xegBwsiqlz630Io13,False,51,51,14,0.655,0.902,9,-3.419,1,0.0779,0.108,0,0.302,0.686,122.975,214800,4
2004-11-27,84,"I Smoke, I Drank",Body Head Bangerz Featuring YoungBloodz,35Ms8xegBwsiqlz630Io13,False,81,81,5,0.435,0.766,0,-5.219,1,0.371,0.128,0,0.384,0.455,74.589,219768,1
2004-11-27,85,American Idiot,Green Day,35Ms8xegBwsiqlz630Io13,False,76,61,15,0.38,0.988,1,-2.042,1,0.0639,2.64e-05,7.86e-05,0.368,0.769,186.113,176346,4
2004-11-27,86,Numb/Encore,Jay-Z/Linkin Park,5sNESr6pQfIhL3krM8CtZn,True,0,86,1,0.687,0.793,2,-4.254,1,0.166,0.0603,0,0.582,0.751,107.045,205733,4
2004-11-27,87,Why?,Jadakiss Featuring Anthony Hamilton,5sNESr6pQfIhL3krM8CtZn,False,78,11,20,0.602,0.938,1,-3.378,0,0.238,0.0164,0,0.0612,0.562,168.417,240000,4
2004-11-27,88,Bring Em Out,T.I.,3CcvahnsiArpTHYQEWV2Au,True,0,88,1,0.759,0.891,11,-2.983,1,0.257,0.0298,0,0.141,0.587,98.579,216707,4
2004-11-27,89,Just Like You,Three Days Grace,3CcvahnsiArpTHYQEWV2Au,False,85,55,18,0.373,0.737,1,-5.282,1,0.0297,9.4e-06,0,0.0696,0.565,177.9,186893,4
2004-11-27,90,Cold,Crossfade,3CcvahnsiArpTHYQEWV2Au,False,88,84,17,0.451,0.815,2,-5.55,0,0.0368,6.06e-05,0,0.27,0.618,147.974,194227,4
2004-11-27,91,Gasolina,Daddy Yankee,3CcvahnsiArpTHYQEWV2Au,False,91,91,3,0.669,0.865,1,-4.251,1,0.27,0.153,0,0.154,0.0814,96.007,306720,4
2004-11-27,92,Real Big,Mannie Fresh,3CcvahnsiArpTHYQEWV2Au,False,82,79,7,0.724,0.86,7,-3.544,1,0.0872,0.0139,0,0.254,0.553,96.956,228827,4
2004-11-27,93,Karma,Alicia Keys,588RGyR1f4Plc8nm7SrdCa,True,0,93,1,0.727,0.736,10,-6.203,1,0.0615,0.0743,0.00311,0.0347,0.687,85.1,256000,4
2004-11-27,94,Bridging The Gap,Nas Featuring Olu Dara,588RGyR1f4Plc8nm7SrdCa,False,94,94,2,0.549,0.693,7,-7.139,1,0.427,0.0325,0,0.62,0.475,93.864,236653,4
2004-11-27,95,Call My Name,Prince,588RGyR1f4Plc8nm7SrdCa,False,93,75,15,0.622,0.574,5,-5.068,0,0.155,0.685,0,0.111,0.405,113.984,315773,4
2004-11-27,96,(Reach Up For The) Sunrise,Duran Duran,588RGyR1f4Plc8nm7SrdCa,False,89,89,4,0.691,0.812,0,-7.772,1,0.0558,0.0433,1.16e-06,0.299,0.685,127.568,220627,4
2004-11-27,97,White Tee's,Dem Franchize Boyz,588RGyR1f4Plc8nm7SrdCa,False,87,79,13,0.875,0.63,7,-5.974,1,0.0871,0.00418,0,0.0759,0.695,161.978,278867,4
2004-11-27,98,You're My Everything,Anita Baker,588RGyR1f4Plc8nm7SrdCa,False,92,74,15,0.762,0.621,8,-6.221,0,0.0298,0.737,0.192,0.299,0.317,91.01,230067,4
2004-11-27,99,You're The One,Guerilla Black Featuring Mario Winans,4dE56AhNEZC6nESs78HsQ3,True,0,99,1,0.85,0.57,6,-6.489,1,0.234,0.491,0,0.078,0.832,100.404,218440,4
2004-11-27,100,Here For The Party,Gretchen Wilson,4dE56AhNEZC6nESs78HsQ3,False,95,39,17,0.656,0.717,0,-4.871,1,0.0279,0.0127,1.22e-05,0.904,0.809,123.988,196760,4
