date,position,title,artist,spotify_id,is_new,last_pos,peak_pos,weeks,danceability,energy,key,loudness,mode,speechiness,acousticness,instrumentalness,liveness,valence,tempo,duration_ms,time_signature
1997-04-26,2,Hypnotize,The Notorious B.I.G.,7KwZNVEaqikRSBSpyhXK2j,True,0,2,1,0.901,0.697,9,-3.439,1,0.28,0.145,0,0.287,0.67,93.941,229827,4
1997-04-26,4,"For You I Will (From ""Space Jam"")",Monica,,False,4,4,7,0.652,0.473,0,-7.981,0,0.0313,0.243,0,0.134,0.368,123.208,294867,4
1997-04-26,5,Wannabe,Spice Girls,,False,3,1,14,0.768,0.864,11,-6.145,1,0.0324,0.101,0,0.162,0.891,110.008,173027,4
1997-04-26,6,I Want You,Savage Garden,,False,6,6,9,0.628,0.871,7,-6.44,1,0.0363,0.0077,1.64e-06,0.392,0.615,106.101,232067,4
1997-04-26,7,All By Myself,Celine Dion,,False,5,4,5,0.344,0.325,11,-10.005,0,0.0287,0.35,0.0223,0.0686,0.0775,118.515,312307,4
1997-04-26,8,Return Of The Mack,Mark Morrison,,False,12,8,9,0.715,0.833,2,-5.379,1,0.108,0.00631,0,0.164,0.612,95.487,213093,4
1997-04-26,9,Hard To Say I'm Sorry,Az Yet Featuring Peter Cetera,,False,11,9,10,0.537,0.413,5,-9.949,0,0.0366,0.604,0,0.16,0.22,127.77,195693,4
1997-04-26,10,Where Have All The Cowboys Gone?,Paula Cole,,False,16,10,3,0.588,0.826,11,-6.182,0,0.0569,0.0351,0,0.454,0.621,129.021,263653,4
1997-04-26,11,I'll Be,Foxy Brown Featuring Jay-Z,,False,8,7,11,0.855,0.614,11,-8.984,0,0.41,0.015,0,0.307,0.495,105.986,178600,4
1997-04-26,12,Un-Break My Heart,Toni Braxton,,False,9,1,27,0.625,0.426,2,-8.392,0,0.0271,0.413,0,0.116,0.112,110.018,270333,4
1997-04-26,13,Every Time I Close My Eyes,Babyface,,False,10,6,13,0.654,0.417,5,-7.699,1,0.025,0.0624,0,0.0963,0.279,143.676,296267,4
1997-04-26,14,In My Bed,Dru Hill,,False,7,4,16,0.828,0.654,10,-7.674,0,0.226,0.106,0,0.0689,0.817,95.254,242360,4
1997-04-26,15,My Baby Daddy,B-Rock & The Bizz,,False,24,15,2,0.384,0.924,9,-7.424,1,0.0527,0.000105,0.911,0.1,0.583,134.006,152560,4
1997-04-26,16,Everyday Is A Winding Road,Sheryl Crow,,False,14,11,5,0.629,0.673,6,-8.285,1,0.0406,0.0419,3.64e-05,0.1,0.717,112.955,256000,4
1997-04-26,17,"I Believe I Can Fly (From ""Space Jam"")",R. Kelly,,False,13,2,20,0.572,0.538,7,-5.241,1,0.0279,0.151,0,0.0754,0.0584,120.455,284800,4
1997-04-26,18,I Belong To You (Every Time I See Your Face),Rome,,False,29,18,7,0.759,0.337,0,-11.034,0,0.035,0.026,0,0.0753,0.335,117.845,273267,4
1997-04-26,19,Get It Together,702,,False,15,10,11,0.791,0.186,10,-11.367,1,0.0333,0.625,2.67e-06,0.0574,0.317,114.061,291400,4
1997-04-26,20,Barely Breathing,Duncan Sheik,,False,19,18,22,0.482,0.807,0,-6.976,1,0.0457,0.0281,0,0.177,0.516,187.918,254547,4
1997-04-26,21,Cupid,112,,False,22,21,9,0.685,0.38,8,-11.219,1,0.112,0.373,0,0.0371,0.87,175.562,252267,4
1997-04-26,23,Secret Garden,Bruce Springsteen,,False,28,23,13,0.52,0.329,0,-14.224,1,0.0266,0.576,0.0418,0.12,0.118,86.857,266613,4
1997-04-26,24,Don't Let Go (Love),En Vogue,,False,17,2,25,0.618,0.688,5,-5.867,0,0.0477,0.409,6.32e-06,0.3,0.561,78.311,291880,4
1997-04-26,25,Your Woman,White Town,,False,26,25,5,0.815,0.605,5,-9.118,0,0.0368,0.033,0.684,0.114,0.795,102.643,259893,4
1997-04-26,26,Da' Dip,Freak Nasty,,False,23,19,17,0.953,0.428,8,-17.199,1,0.298,0.0079,0.0302,0.224,0.723,131.737,237000,4
1997-04-26,27,One More Time,Real McCoy,,False,27,27,5,0.671,0.862,5,-11.367,1,0.0351,0.000889,0.7,0.167,0.855,133.117,238707,3
1997-04-26,29,I Shot The Sheriff,Warren G,,False,20,20,6,0.859,0.68,10,-9.213,0,0.159,0.0289,1.09e-05,0.261,0.753,91.444,250240,4
1997-04-26,30,Staring At The Sun,U2,3fsTb3a8l5kJrtzpl04Ljr,True,0,30,1,0.533,0.702,9,-8.504,0,0.0265,0.0549,0.0221,0.27,0.515,140.201,276800,4
1997-04-26,31,What's On Tonight,Montell Jordan,3fsTb3a8l5kJrtzpl04Ljr,False,21,21,11,0.826,0.447,5,-11.535,1,0.0442,0.33,3.2e-06,0.126,0.434,111.806,276653,4
1997-04-26,32,You Don't Have To Hurt No More,Mint Condition,3fsTb3a8l5kJrtzpl04Ljr,False,34,32,5,0.769,0.449,8,-6.757,0,0.0282,0.0717,5.25e-05,0.0851,0.481,113.89,323027,4
1997-04-26,33,The Freshmen,The Verve Pipe,3fsTb3a8l5kJrtzpl04Ljr,False,39,33,10,0.571,0.505,1,-9.312,0,0.0238,0.0757,1.04e-05,0.109,0.276,99.562,269467,4
1997-04-26,34,Ooh Aah... Just A Little Bit,Gina G,3fsTb3a8l5kJrtzpl04Ljr,False,33,12,22,0.647,0.942,1,-7.101,1,0.0341,0.626,0.168,0.0411,0.937,130.978,203120,4
1997-04-26,35,"Let It Go (From ""Set It Off"")",Ray J,3fsTb3a8l5kJrtzpl04Ljr,False,25,25,8,0.626,0.922,9,-2.037,1,0.0714,0.00789,0.000598,0.277,0.554,139.987,184811,4
1997-04-26,36,Naked Eye,Luscious Jackson,3fsTb3a8l5kJrtzpl04Ljr,False,36,36,19,0.737,0.657,4,-10.962,0,0.0284,0.0863,0.0339,0.0953,0.76,131.022,280693,4
1997-04-26,37,"Step By Step (From ""The Preacher's Wife"")",Whitney Houston,3fsTb3a8l5kJrtzpl04Ljr,False,31,15,7,0.752,0.79,2,-8.648,1,0.0507,0.0797,5.78e-05,0.284,0.202,115.976,252533,4
1997-04-26,38,Let Me Clear My Throat,DJ Kool,3fsTb3a8l5kJrtzpl04Ljr,False,37,30,13,0.697,0.901,7,-7.154,1,0.259,0.169,0,0.356,0.535,103.145,290160,4
1997-04-26,39,Nobody,Keith Sweat Featuring Athena Cage,3fsTb3a8l5kJrtzpl04Ljr,False,38,3,30,0.699,0.492,9,-9.449,0,0.0318,0.484,0,0.0482,0.388,117.907,264773,4
1997-04-26,40,Gangstas Make The World Go Round,Westside Connection,3fsTb3a8l5kJrtzpl04Ljr,False,40,40,8,0.754,0.575,9,-8.22,1,0.366,0.0977,0,0.474,0.561,180.389,272834,4
1997-04-26,41,No Diggity,BLACKstreet (Featuring Dr. Dre),3fsTb3a8l5kJrtzpl04Ljr,False,41,1,29,0.849,0.379,1,-10.546,0,0.0614,0.139,0.0917,0.0448,0.44,89.007,267053,4
1997-04-26,42,Ghetto Love,Da Brat Featuring T-Boz,3fsTb3a8l5kJrtzpl04Ljr,False,32,16,6,0.778,0.611,4,-8.796,0,0.111,0.00451,0,0.336,0.247,93.926,204000,4
1997-04-26,43,Here's Your Sign (Get The Picture),Bill Engvall With Special Guest Travis Tritt,3fsTb3a8l5kJrtzpl04Ljr,False,43,43,10,0.586,0.936,7,-6.605,1,0.549,0.337,0,0.928,0.732,178.068,220173,4
1997-04-26,44,"Too Late, Too Soon",Jon Secada,3fsTb3a8l5kJrtzpl04Ljr,False,44,44,7,0.642,0.45,8,-9.53,1,0.0382,0.452,0.00152,0.107,0.187,160.651,255267,4
1997-04-26,45,Head Over Heels,Allure Featuring NAS,3fsTb3a8l5kJrtzpl04Ljr,False,42,35,7,0.848,0.577,10,-10.07,0,0.103,0.08,0,0.369,0.674,96.045,251707,4
1997-04-26,46,For You,Kenny Lattimore,3fsTb3a8l5kJrtzpl04Ljr,False,49,46,5,0.633,0.42,4,-11.784,1,0.0352,0.737,0,0.0727,0.482,137.693,236147,4
1997-04-26,47,Falling In Love (Is Hard On The Knees),Aerosmith,3fsTb3a8l5kJrtzpl04Ljr,False,35,35,9,0.612,0.861,7,-4.571,0,0.0293,0.0144,0,0.119,0.888,116.663,205800,4
1997-04-26,48,I'm Not Feeling You,Yvette Michele,3fsTb3a8l5kJrtzpl04Ljr,False,51,44,10,0.796,0.638,7,-3.923,1,0.11,0.00356,0.000209,0.0811,0.583,96.507,205600,4
1997-04-26,49,I Like It,The Blackout Allstars,3fsTb3a8l5kJrtzpl04Ljr,False,46,25,21,0.71,0.927,5,-6.433,0,0.0447,3.69e-05,0.203,0.651,0.616,128.069,291027,4
1997-04-26,50,Change The World,Eric Clapton,3fsTb3a8l5kJrtzpl04Ljr,False,47,5,41,0.721,0.558,9,-8.8,1,0.0246,0.492,0.00563,0.113,0.542,96.887,234867,4
1997-04-26,51,Talk To Me,Wild Orchid,3fsTb3a8l5kJrtzpl04Ljr,False,48,48,9,0.726,0.829,8,-5.042,1,0.04,0.0389,4.49e-05,0.33,0.778,119.634,288800,4
1997-04-26,52,Please Don't Go,No Mercy,3fsTb3a8l5kJrtzpl04Ljr,False,45,21,12,0.715,0.838,7,-10.541,0,0.0341,0.169,3.67e-05,0.395,0.962,124.625,240093,4
1997-04-26,53,Jazzy Belle,OutKast,3fsTb3a8l5kJrtzpl04Ljr,False,55,53,3,0.878,0.65,11,-8.08,0,0.252,0.0178,0,0.0408,0.101,92.03,251667,4
1997-04-26,54,"I Believe In You And Me (From ""The Preacher's Wife"")",Whitney Houston,3fsTb3a8l5kJrtzpl04Ljr,False,52,4,18,0.434,0.268,1,-11.52,0,0.0355,0.785,0,0.0881,0.121,119.804,241960,4
1997-04-26,55,Request Line,Zhane,3fsTb3a8l5kJrtzpl04Ljr,False,50,39,7,0.852,0.494,9,-9.48,0,0.0457,0.0151,0.00436,0.141,0.789,99.935,236000,4
1997-04-26,56,Say... If You Feel Alright,Crystal Waters,3fsTb3a8l5kJrtzpl04Ljr,False,56,40,10,0.757,0.843,1,-7.222,1,0.0332,0.0424,0.377,0.0742,0.717,113.21,236133,4
1997-04-26,57,Bitch,Meredith Brooks,3i6qNxyVgIdUZTTi5m25EM,True,0,57,1,0.617,0.886,9,-5.953,1,0.055,0.0112,9.63e-05,0.0523,0.629,96.328,252760,4
1997-04-26,58,Sho Nuff,Tela Featuring Eightball & MJG,3i6qNxyVgIdUZTTi5m25EM,False,58,58,5,0.776,0.468,0,-8.35,1,0.144,0.00138,0,0.162,0.233,146.149,308027,4
1997-04-26,59,If Tomorrow Never Comes,Joose,3i6qNxyVgIdUZTTi5m25EM,False,60,59,6,0.6,0.223,6,-13.81,1,0.027,0.649,0.297,0.0832,0.218,141.001,244846,4
1997-04-26,60,Firestarter,The Prodigy,3i6qNxyVgIdUZTTi5m25EM,False,57,30,15,0.545,0.948,11,-5.098,1,0.0779,0.00335,0.364,0.226,0.355,141.507,279800,4
1997-04-26,61,The Theme (It's Party Time),Tracey Lee,3i6qNxyVgIdUZTTi5m25EM,False,59,55,11,0.75,0.658,6,-8.658,0,0.305,0.0108,0,0.125,0.427,99.113,272800,4
1997-04-26,62,Just Another Day,John Mellencamp,3i6qNxyVgIdUZTTi5m25EM,False,61,46,10,0.715,0.738,0,-5.674,1,0.0325,0.096,0.000136,0.0978,0.896,144.145,207893,4
1997-04-26,63,On & On,Erykah Badu,3i6qNxyVgIdUZTTi5m25EM,False,54,12,14,0.762,0.403,11,-10.423,0,0.158,0.0396,0.0113,0.256,0.346,80.476,226133,4
1997-04-26,64,Call Me,Le Click,3i6qNxyVgIdUZTTi5m25EM,False,64,64,8,0.674,0.849,1,-11.271,0,0.029,0.0126,1.37e-05,0.357,0.791,136.033,225400,4
1997-04-26,65,Precious Declaration,Collective Soul,3i6qNxyVgIdUZTTi5m25EM,False,65,65,4,0.529,0.866,11,-5.053,1,0.0391,0.0321,0.00117,0.148,0.759,107.544,221187,4
1997-04-26,66,Havana,Kenny G,3i6qNxyVgIdUZTTi5m25EM,False,69,66,8,0.403,0.328,0,-12.372,0,0.033,0.807,0.785,0.228,0.291,113.075,440400,4
1997-04-26,67,Come On,Billy Lawrence Featuring MC Lyte,3i6qNxyVgIdUZTTi5m25EM,False,67,67,3,0.758,0.495,7,-8.252,1,0.0566,0.133,2.68e-06,0.698,0.733,94.414,248027,4
1997-04-26,68,"Don't Cry For Me Argentina (From ""Evita"")",Madonna,3i6qNxyVgIdUZTTi5m25EM,False,53,8,10,0.217,0.146,11,-13.9,1,0.0373,0.901,4.49e-06,0.222,0.0847,75.922,331467,4
1997-04-26,69,"It's Alright, It's Ok",Leah Andreone,3i6qNxyVgIdUZTTi5m25EM,False,62,57,14,0.734,0.67,0,-5.838,0,0.0321,0.0113,1.25e-06,0.224,0.656,110.022,265133,4
1997-04-26,70,Insomnia,Faithless,3i6qNxyVgIdUZTTi5m25EM,False,71,70,5,0.711,0.756,7,-10.637,1,0.0302,0.0352,0.00313,0.138,0.493,127.108,213547,4
1997-04-26,71,Don't Stop Movin',Livin' Joy,3i6qNxyVgIdUZTTi5m25EM,False,74,67,14,0.703,0.723,2,-10.816,0,0.0445,0.0287,0.00337,0.297,0.867,129.992,215227,4
1997-04-26,72,Do G's Get To Go To Heaven?,Richie Rich,3i6qNxyVgIdUZTTi5m25EM,False,63,57,9,0.673,0.427,2,-10.131,1,0.248,0.602,0.000663,0.096,0.444,84.127,359493,4
1997-04-26,73,Until I Find You Again,Richard Marx,3i6qNxyVgIdUZTTi5m25EM,False,73,73,2,0.535,0.112,0,-18.323,1,0.0654,0.993,0.913,0.106,0.312,72.913,276867,4
1997-04-26,74,"Space Jam (From ""Space Jam"")",Quad City DJ's,3i6qNxyVgIdUZTTi5m25EM,False,66,37,19,0.798,0.952,11,-4.78,0,0.0401,0.064,0.000513,0.287,0.843,132.031,304960,4
1997-04-26,75,Whateva Man,Redman,3i6qNxyVgIdUZTTi5m25EM,False,68,42,13,0.581,0.712,6,-7.803,0,0.476,0.27,0,0.895,0.709,172.573,188547,4
1997-04-26,76,One Night At A Time,George Strait,3i6qNxyVgIdUZTTi5m25EM,False,76,76,4,0.696,0.482,4,-11.811,1,0.0258,0.439,0.0023,0.0651,0.513,113.001,230933,4
1997-04-26,77,It's In Your Eyes,Phil Collins,3i6qNxyVgIdUZTTi5m25EM,False,77,77,11,0.707,0.741,5,-6.423,1,0.0261,0.0837,8.46e-05,0.229,0.658,121.774,182960,4
1997-04-26,78,Desperately Wanting,Better Than Ezra,3i6qNxyVgIdUZTTi5m25EM,False,72,48,19,0.494,0.913,0,-5.289,1,0.0378,0.000165,0.00898,0.247,0.478,99.92,277493,4
1997-04-26,79,A Little Bit Of Ecstasy,Jocelyn Enriquez,3i6qNxyVgIdUZTTi5m25EM,False,79,79,4,0.496,0.762,6,-7.64,0,0.0628,0.036,0.00199,0.315,0.674,130.004,248000,4
1997-04-26,80,Silent All These Years,Tori Amos,3i6qNxyVgIdUZTTi5m25EM,False,70,70,6,0.484,0.158,4,-14.687,1,0.0374,0.94,1.64e-05,0.109,0.296,128.06,251226,4
1997-04-26,82,Step Into A World (Rapture's Delight),KRS-One,,False,84,82,4,0.803,0.806,0,-7.805,1,0.265,0.00761,0.00544,0.101,0.624,94.994,289907,4
1997-04-26,83,Sweet Sexy Thing,Nu Flavor Featuring Roger,,False,87,83,2,0.824,0.574,1,-7.541,0,0.0324,0.308,0,0.0668,0.781,103.179,285760,4
1997-04-26,84,"Fly Like An Eagle (From ""Space Jam"")",Seal,,False,75,10,19,0.623,0.836,7,-4.729,1,0.0595,0.00697,3.41e-06,0.0687,0.631,97.14,254773,4
1997-04-26,85,I Always Feel Like (Somebody's Watching Me),Tru Featuring Ice Cream Man (Master P),,False,80,71,12,0.832,0.456,6,-10.108,0,0.193,0.00201,0.00351,0.366,0.285,93.585,306480,4
1997-04-26,86,That's Right,DJ Taz Featuring Raheem The Dream,,False,88,86,4,0.827,0.678,6,-12.854,0,0.0738,0.00319,0,0.108,0.896,135.09,372493,4
1997-04-26,87,Without Your Love,Angelina,,False,89,82,11,0.732,0.891,3,-7.476,0,0.0298,0.0678,0.446,0.089,0.943,134.034,231760,4
1997-04-26,88,Full Of Smoke,Christion,00FR9VQ0uzF4NNxVKKiMz2,True,0,88,1,0.389,0.616,1,-8.747,0,0.284,0.453,0,0.916,0.716,145.461,289227,3
1997-04-26,91,Fired Up!,Funky Green Dogs,,False,86,80,12,0.878,0.912,0,-7.716,1,0.0458,0.0601,0.00268,0.0707,0.966,122.953,485160,4
1997-04-26,92,"Watch Me Do My Thing (From ""All That"")",Immature Featuring Smooth And Ed From Good Burger,,False,82,32,13,0.697,0.853,8,-6.264,1,0.0528,0.00189,1.37e-06,0.243,0.765,93.799,231533,4
1997-04-26,94,Get Up,Lost Boyz,,False,90,60,17,0.813,0.572,9,-6.469,1,0.162,0.0266,0,0.0372,0.655,94.825,243760,4
1997-04-26,95,"Nothin' But The Cavi Hit (From ""Rhyme & Reason"")",Mack 10 & Tha Dogg Pound,,False,81,38,20,0.852,0.741,1,-5.435,0,0.134,0.0247,0.00106,0.0974,0.535,97.894,241360,4
1997-04-26,96,Discotheque,U2,,False,85,10,10,0.581,0.825,4,-9.689,0,0.0373,0.000859,0.095,0.11,0.663,120.362,318667,4
1997-04-26,98,Luchini aka (This Is It),Camp Lo,,False,83,50,17,0.721,0.949,6,-5.685,1,0.278,0.0495,0,0.327,0.835,83.028,240093,4
1997-04-26,99,It's All About U,SWV,,False,94,61,15,0.838,0.401,0,-9.808,1,0.0506,0.111,0.00811,0.0478,0.74,93.49,224800,4
1997-04-26,100,Under The Water,Merril Bainbridge,,False,91,91,6,0.625,0.641,6,-9.244,1,0.0249,0.611,3.83e-05,0.121,0.608,103.92,253267,4
