date,position,title,artist,spotify_id,is_new,last_pos,peak_pos,weeks,danceability,energy,key,loudness,mode,speechiness,acousticness,instrumentalness,liveness,valence,tempo,duration_ms,time_signature
2017-07-29,1,Despacito,Luis Fonsi & Daddy Yankee Featuring Justin Bieber,1tlBuoIRrtqFs9bE9dmli5,False,1,1,26,0.653,0.816,2,-4.353,1,0.167,0.228,0,0.0967,0.816,178.085,228827,4
2017-07-29,2,Wild Thoughts,DJ Khaled Featuring Rihanna & Bryson Tiller,1tlBuoIRrtqFs9bE9dmli5,False,4,2,4,0.613,0.681,8,-3.089,1,0.0778,0.0287,0,0.126,0.619,97.621,204664,4
2017-07-29,3,I'm The One,"DJ Khaled Featuring Justin Bieber, Quavo, Chance The Rapper & Lil Wayne",1tlBuoIRrtqFs9bE9dmli5,False,2,1,11,0.599,0.667,7,-4.267,1,0.0367,0.0533,0,0.134,0.817,80.984,288877,4
2017-07-29,4,That's What I Like,Bruno Mars,1tlBuoIRrtqFs9bE9dmli5,False,3,1,26,0.853,0.56,1,-4.961,1,0.0406,0.013,0,0.0944,0.86,134.066,206693,4
2017-07-29,5,Shape Of You,Ed Sheeran,1tlBuoIRrtqFs9bE9dmli5,False,5,1,27,0.825,0.652,1,-3.183,0,0.0802,0.581,0,0.0931,0.931,95.977,233713,4
2017-07-29,6,Humble.,Kendrick Lamar,1tlBuoIRrtqFs9bE9dmli5,False,6,1,15,0.908,0.621,1,-6.638,0,0.102,0.000282,5.39e-05,0.0958,0.421,150.011,177000,4
2017-07-29,7,Believer,Imagine Dragons,1tlBuoIRrtqFs9bE9dmli5,False,7,6,23,0.776,0.78,10,-4.374,0,0.128,0.0622,0,0.081,0.666,124.949,204347,4
2017-07-29,8,There's Nothing Holdin' Me Back,Shawn Mendes,1tlBuoIRrtqFs9bE9dmli5,False,14,8,12,0.866,0.811,11,-4.063,0,0.0553,0.375,0,0.078,0.969,121.995,199440,4
2017-07-29,9,Unforgettable,French Montana Featuring Swae Lee,1tlBuoIRrtqFs9bE9dmli5,False,10,9,14,0.726,0.769,6,-5.043,1,0.123,0.0293,0.0101,0.104,0.733,97.985,233902,4
2017-07-29,10,Body Like A Back Road,Sam Hunt,1tlBuoIRrtqFs9bE9dmli5,False,8,6,24,0.732,0.458,5,-7.225,1,0.0311,0.447,0,0.136,0.661,98.938,165387,4
2017-07-29,11,Congratulations,Post Malone Featuring Quavo,1tlBuoIRrtqFs9bE9dmli5,False,9,8,29,0.63,0.804,6,-4.183,1,0.0363,0.215,0,0.253,0.492,123.146,220293,4
2017-07-29,12,Stay,Zedd & Alessia Cara,1tlBuoIRrtqFs9bE9dmli5,False,11,7,20,0.69,0.622,5,-5.025,0,0.0622,0.253,0,0.116,0.544,102.04,210091,4
2017-07-29,13,Attention,Charlie Puth,1tlBuoIRrtqFs9bE9dmli5,False,15,13,12,0.775,0.613,3,-4.586,0,0.0542,0.109,2.33e-05,0.134,0.797,100.066,208787,4
2017-07-29,14,Redbone,Childish Gambino,1tlBuoIRrtqFs9bE9dmli5,False,16,14,32,0.743,0.347,1,-11.174,1,0.121,0.167,0.00951,0.103,0.572,160.143,326933,4
2017-07-29,15,Something Just Like This,The Chainsmokers & Coldplay,1tlBuoIRrtqFs9bE9dmli5,False,13,3,21,0.617,0.635,11,-6.769,0,0.0317,0.0498,1.44e-05,0.164,0.446,103.019,247160,4
2017-07-29,16,XO TOUR Llif3,Lil Uzi Vert,1tlBuoIRrtqFs9bE9dmli5,False,17,7,16,0.732,0.75,11,-6.366,0,0.231,0.00264,0,0.109,0.401,155.096,182707,4
2017-07-29,17,Now Or Never,Halsey,1tlBuoIRrtqFs9bE9dmli5,False,18,17,14,0.67,0.585,6,-4.861,0,0.0354,0.107,1.11e-06,0.131,0.447,110.03,214802,4
2017-07-29,18,Mask Off,Future,1tlBuoIRrtqFs9bE9dmli5,False,12,5,21,0.833,0.434,2,-8.795,1,0.431,0.0102,0.0219,0.165,0.281,150.062,204600,4
2017-07-29,19,Slow Hands,Niall Horan,1tlBuoIRrtqFs9bE9dmli5,False,22,19,11,0.735,0.425,0,-6.648,1,0.0464,0.011,0,0.055,0.848,85.896,188174,4
2017-07-29,20,Issues,Julia Michaels,1tlBuoIRrtqFs9bE9dmli5,False,19,11,25,0.728,0.415,8,-6.852,1,0.0639,0.401,0,0.0616,0.455,114.145,176320,4
2017-07-29,21,Say You Won't Let Go,James Arthur,1tlBuoIRrtqFs9bE9dmli5,False,20,11,38,0.358,0.557,10,-7.398,1,0.059,0.695,0,0.0902,0.494,85.043,211467,4
2017-07-29,22,It Ain't Me,Kygo x Selena Gomez,1tlBuoIRrtqFs9bE9dmli5,False,21,10,22,0.713,0.658,0,-5.362,1,0.0748,0.0161,0.000138,0.0607,0.539,115.024,192000,4
2017-07-29,23,The Story Of O.J.,JAY-Z,6JpN5w95em8SODPiM7W2PH,True,0,23,1,0.741,0.718,7,-5.823,1,0.415,0.283,2.21e-06,0.23,0.576,165.848,231760,4
2017-07-29,24,Castle On The Hill,Ed Sheeran,6JpN5w95em8SODPiM7W2PH,False,23,6,27,0.461,0.834,2,-4.868,1,0.0989,0.0232,1.14e-05,0.14,0.471,135.007,261154,4
2017-07-29,25,Praying,Kesha,0jdny0dhgjUwoIp5GkqEaA,True,0,25,1,0.543,0.39,10,-7.202,1,0.0322,0.489,0,0.111,0.303,73.415,230267,4
2017-07-29,26,Location,Khalid,0jdny0dhgjUwoIp5GkqEaA,False,24,16,27,0.736,0.449,1,-11.462,0,0.425,0.33,0.000162,0.0898,0.326,80.126,219080,4
2017-07-29,27,Bad Liar,Selena Gomez,0jdny0dhgjUwoIp5GkqEaA,False,25,20,9,0.965,0.414,1,-6.408,1,0.0713,0.189,0,0.0767,0.728,121.032,214648,4
2017-07-29,28,Strip That Down,Liam Payne Featuring Quavo,0jdny0dhgjUwoIp5GkqEaA,False,28,28,8,0.874,0.497,6,-5.484,1,0.0562,0.22,0,0.0761,0.542,106.023,204502,4
2017-07-29,29,Magnolia,Playboi Carti,0jdny0dhgjUwoIp5GkqEaA,False,30,29,11,0.791,0.582,11,-7.323,0,0.286,0.0114,0,0.35,0.443,162.991,181812,4
2017-07-29,30,Feels,"Calvin Harris Featuring Pharrell Williams, Katy Perry & Big Sean",0jdny0dhgjUwoIp5GkqEaA,False,26,26,4,0.893,0.745,11,-3.105,0,0.0571,0.0642,0,0.0943,0.872,101.018,223413,4
2017-07-29,31,Malibu,Miley Cyrus,0jdny0dhgjUwoIp5GkqEaA,False,31,10,10,0.573,0.781,8,-6.406,1,0.0555,0.0767,2.64e-05,0.0813,0.343,139.934,231907,4
2017-07-29,32,2U,David Guetta Featuring Justin Bieber,0jdny0dhgjUwoIp5GkqEaA,False,27,16,5,0.551,0.651,8,-5.828,0,0.0594,0.225,0,0.224,0.562,144.875,194907,4
2017-07-29,33,Bank Account,21 Savage,2fQrGHiQOvpL9UgPvtYy6G,True,0,33,1,0.884,0.346,8,-8.228,0,0.351,0.0151,7.04e-06,0.0871,0.376,75.016,220307,4
2017-07-29,34,Slippery,Migos Featuring Gucci Mane,2fQrGHiQOvpL9UgPvtYy6G,False,29,29,16,0.92,0.674,1,-5.662,0,0.264,0.307,0,0.104,0.741,141.967,304041,4
2017-07-29,35,4:44,JAY-Z,1gT5TGwbkkkUliNzHRIGi1,True,0,35,1,0.261,0.852,9,-4.965,1,0.158,0.139,4.26e-05,0.477,0.431,177.997,284493,4
2017-07-29,36,Everyday We Lit,YFN Lucci Featuring PnB Rock,1gT5TGwbkkkUliNzHRIGi1,False,35,35,14,0.712,0.383,2,-15.116,1,0.0966,0.12,0,0.0746,0.245,156.116,206211,4
2017-07-29,37,Closer,The Chainsmokers Featuring Halsey,1gT5TGwbkkkUliNzHRIGi1,False,36,1,50,0.748,0.524,8,-5.599,1,0.0338,0.414,0,0.111,0.661,95.01,244960,4
2017-07-29,38,In Case You Didn't Know,Brett Young,1gT5TGwbkkkUliNzHRIGi1,False,37,19,23,0.607,0.536,10,-7.306,1,0.0305,0.386,0,0.102,0.434,147.986,224853,4
2017-07-29,39,iSpy,KYLE Featuring Lil Yachty,1gT5TGwbkkkUliNzHRIGi1,False,34,4,29,0.746,0.653,7,-6.745,1,0.289,0.378,0,0.229,0.672,75.016,253107,4
2017-07-29,40,Rolex,Ayo & Teo,1gT5TGwbkkkUliNzHRIGi1,False,33,20,22,0.804,0.886,1,-2.512,1,0.04,0.0837,0,0.266,0.789,144.946,238587,4
2017-07-29,41,Craving You,Thomas Rhett Featuring Maren Morris,1gT5TGwbkkkUliNzHRIGi1,False,39,39,15,0.613,0.839,9,-3.799,0,0.0352,0.000854,0,0.341,0.526,104.975,223627,4
2017-07-29,42,Drowning,A Boogie Wit da Hoodie Featuring Kodak Black,1gT5TGwbkkkUliNzHRIGi1,False,41,39,15,0.839,0.81,5,-5.274,0,0.0568,0.501,0,0.117,0.814,129.014,209269,4
2017-07-29,43,Bad And Boujee,Migos Featuring Lil Uzi Vert,1gT5TGwbkkkUliNzHRIGi1,False,38,1,35,0.927,0.665,11,-5.313,1,0.244,0.061,0,0.123,0.175,127.076,343150,4
2017-07-29,44,My Girl,Dylan Scott,1gT5TGwbkkkUliNzHRIGi1,False,43,43,12,0.652,0.719,1,-7.251,1,0.033,0.0353,0,0.108,0.24,94.969,197640,4
2017-07-29,45,Slide,Calvin Harris Featuring Frank Ocean & Migos,1gT5TGwbkkkUliNzHRIGi1,False,32,25,20,0.736,0.795,1,-3.299,0,0.0545,0.498,1.21e-06,0.254,0.511,104.066,230813,4
2017-07-29,46,DNA.,Kendrick Lamar,1gT5TGwbkkkUliNzHRIGi1,False,42,4,13,0.638,0.523,1,-6.664,1,0.357,0.00454,0,0.0842,0.422,139.913,185947,4
2017-07-29,47,Bam,"JAY-Z Featuring Damian ""Jr. Gong"" Marely",6Iuh3vNjpWhSeHM3RZgzQL,True,0,47,1,0.639,0.788,6,-2.879,1,0.35,0.455,0,0.058,0.847,155.913,234973,4
2017-07-29,48,24K Magic,Bruno Mars,6Iuh3vNjpWhSeHM3RZgzQL,False,40,4,40,0.818,0.803,1,-4.282,1,0.0797,0.034,0,0.153,0.632,106.97,225983,4
2017-07-29,49,Felices Los 4,Maluma,6Iuh3vNjpWhSeHM3RZgzQL,False,61,49,9,0.766,0.756,5,-5.861,1,0.132,0.213,0,0.349,0.716,94.027,230000,4
2017-07-29,50,Hurricane,Luke Combs,6Iuh3vNjpWhSeHM3RZgzQL,False,46,31,22,0.464,0.813,10,-6.185,1,0.0416,0.0153,0,0.254,0.515,75.977,222533,4
2017-07-29,51,Family Feud,JAY-Z Featuring Beyonce,6ku4gCfjdxmYpajNONAciN,True,0,51,1,0.543,0.721,1,-6.805,1,0.317,0.17,1.06e-06,0.59,0.499,82.992,251413,4
2017-07-29,52,Sorry Not Sorry,Demi Lovato,7gvd8xj4QgPqbQSsn5pV7d,True,0,52,1,0.705,0.64,11,-6.928,0,0.225,0.0237,0,0.262,0.887,144.077,203760,4
2017-07-29,53,Mi Gente,J Balvin & Willy William Featuring Beyonce,7gvd8xj4QgPqbQSsn5pV7d,False,70,53,2,0.76,0.716,11,-6.36,0,0.0817,0.0223,0,0.231,0.469,105.007,209733,4
2017-07-29,54,Small Town Boy,Dustin Lynch,7gvd8xj4QgPqbQSsn5pV7d,False,60,54,6,0.554,0.743,9,-6.016,1,0.0287,0.0251,0,0.359,0.673,72.997,205733,4
2017-07-29,55,Kill Jay Z,JAY-Z,2kh78Yka2tkYOx3XF9DVpu,True,0,55,1,0.542,0.821,10,-6.458,0,0.32,0.133,1.34e-06,0.57,0.286,84.425,178067,4
2017-07-29,56,Smile,JAY-Z Featuring Gloria Carter,2tqoJQbv6dNNOi0PCCjuse,True,0,56,1,0.779,0.57,5,-8.752,0,0.469,0.303,0,0.218,0.467,99.878,289853,4
2017-07-29,57,Versace On The Floor,Bruno Mars,2tqoJQbv6dNNOi0PCCjuse,False,56,56,5,0.578,0.574,2,-6.209,1,0.0454,0.196,0,0.083,0.301,174.152,261240,4
2017-07-29,58,Do I Make You Wanna,Billy Currington,2tqoJQbv6dNNOi0PCCjuse,False,62,58,5,0.553,0.747,9,-5.432,1,0.0279,0.106,0,0.154,0.521,90.012,234307,4
2017-07-29,59,First Day Out,Tee Grizzley,2tqoJQbv6dNNOi0PCCjuse,False,49,48,15,0.587,0.711,1,-6.33,1,0.42,0.171,0,0.125,0.381,98.008,254694,4
2017-07-29,60,Drinkin' Problem,Midland,2tqoJQbv6dNNOi0PCCjuse,False,58,58,10,0.622,0.763,9,-6.4,1,0.0263,0.055,8.91e-06,0.313,0.621,102.0,220800,4
2017-07-29,61,1-800-273-8255,Logic Featuring Alessia Cara & Khalid,2tqoJQbv6dNNOi0PCCjuse,False,64,47,11,0.62,0.574,5,-7.788,0,0.0479,0.569,0,0.19,0.357,100.023,250173,4
2017-07-29,62,Love Galore,SZA Featuring Travis Scott,2tqoJQbv6dNNOi0PCCjuse,False,71,62,5,0.795,0.594,0,-6.2,1,0.0748,0.112,0,0.162,0.409,135.002,275080,4
2017-07-29,63,Caught Their Eyes,JAY-Z Featuring Frank Ocean,71oM9w2BbJxzTpxzWIE0lw,True,0,63,1,0.813,0.837,1,-6.356,1,0.298,0.166,0,0.0835,0.744,84.965,206133,4
2017-07-29,64,It's A Vibe,"2 Chainz Featuring Ty Dolla $ign, Trey Songz & Jhene Aiko",71oM9w2BbJxzTpxzWIE0lw,False,63,58,5,0.822,0.502,7,-7.38,1,0.148,0.0312,0.000887,0.114,0.525,73.003,210200,4
2017-07-29,65,Swalla,Jason Derulo Featuring Nicki Minaj & Ty Dolla $ign,71oM9w2BbJxzTpxzWIE0lw,False,44,29,17,0.696,0.817,1,-3.862,1,0.109,0.075,0,0.187,0.782,98.064,216409,4
2017-07-29,66,Most Girls,Hailee Steinfeld,71oM9w2BbJxzTpxzWIE0lw,False,92,66,8,0.756,0.572,9,-7.019,1,0.0763,0.0478,0,0.0853,0.417,102.986,204400,4
2017-07-29,67,Passionfruit,Drake,71oM9w2BbJxzTpxzWIE0lw,False,51,8,17,0.809,0.463,11,-11.377,1,0.0396,0.256,0.085,0.109,0.364,111.98,298941,4
2017-07-29,68,Rake It Up,Yo Gotti Featuring Nicki Minaj,71oM9w2BbJxzTpxzWIE0lw,False,78,68,2,0.91,0.444,1,-8.126,0,0.344,0.022,0,0.137,0.53,149.953,276333,4
2017-07-29,69,"God, Your Mama, And Me",Florida Georgia Line Featuring Backstreet Boys,71oM9w2BbJxzTpxzWIE0lw,False,52,46,16,0.443,0.817,7,-3.729,1,0.0511,0.318,0,0.374,0.652,168.1,183413,4
2017-07-29,70,Thunder,Imagine Dragons,71oM9w2BbJxzTpxzWIE0lw,False,59,54,11,0.605,0.822,0,-4.833,1,0.0438,0.00671,0.134,0.147,0.288,167.997,187147,4
2017-07-29,71,Crying In The Club,Camila Cabello,71oM9w2BbJxzTpxzWIE0lw,False,53,47,8,0.334,0.617,6,-5.834,0,0.383,0.334,0,0.163,0.603,85.227,216391,4
2017-07-29,72,Escapate Conmigo,Wisin Featuring Ozuna,71oM9w2BbJxzTpxzWIE0lw,False,84,72,5,0.744,0.859,11,-3.166,1,0.0795,0.0256,6.27e-05,0.0881,0.787,91.977,232787,4
2017-07-29,73,No Such Thing As A Broken Heart,Old Dominion,71oM9w2BbJxzTpxzWIE0lw,False,74,73,7,0.651,0.782,8,-4.295,1,0.0718,0.295,0,0.107,0.945,171.987,176893,4
2017-07-29,74,Loyalty.,Kendrick Lamar Featuring Rihanna,71oM9w2BbJxzTpxzWIE0lw,False,72,14,13,0.658,0.535,9,-8.983,0,0.0573,0.0265,0,0.2,0.419,110.684,227360,4
2017-07-29,75,Flatliner,Cole Swindell,71oM9w2BbJxzTpxzWIE0lw,False,67,67,12,0.555,0.896,0,-3.295,1,0.0388,0.00434,0,0.145,0.578,114.995,177067,4
2017-07-29,76,4 AM,2 Chainz Featuring Travis Scott,71oM9w2BbJxzTpxzWIE0lw,False,65,55,6,0.796,0.5,1,-7.21,1,0.425,0.118,0,0.155,0.227,75.012,255560,4
2017-07-29,77,Privacy,Chris Brown,71oM9w2BbJxzTpxzWIE0lw,False,66,62,11,0.741,0.58,0,-7.741,1,0.378,0.153,0,0.109,0.428,97.092,220964,4
2017-07-29,78,Bodak Yellow (Money Moves),Cardi B,71oM9w2BbJxzTpxzWIE0lw,False,85,78,2,0.926,0.703,11,-6.337,0,0.103,0.0659,0,0.231,0.485,125.022,223713,4
2017-07-29,79,Every Time I Hear That Song,Blake Shelton,71oM9w2BbJxzTpxzWIE0lw,False,57,56,10,0.523,0.725,2,-5.448,1,0.0339,0.0558,6.96e-06,0.0937,0.528,155.855,214800,4
2017-07-29,80,Feel It Still,Portugal. The Man,71oM9w2BbJxzTpxzWIE0lw,False,81,80,4,0.801,0.795,1,-5.115,0,0.0504,0.0417,0.000113,0.0717,0.754,79.028,163253,4
2017-07-29,81,Yours If You Want It,Rascal Flatts,71oM9w2BbJxzTpxzWIE0lw,False,75,75,8,0.554,0.903,8,-3.152,1,0.0515,0.0103,0,0.107,0.419,112.998,206827,4
2017-07-29,82,Love.,Kendrick Lamar Featuring Zacari,71oM9w2BbJxzTpxzWIE0lw,False,69,18,13,0.8,0.585,10,-7.343,1,0.0924,0.264,0,0.153,0.779,126.058,213400,4
2017-07-29,83,Signs,Drake,71oM9w2BbJxzTpxzWIE0lw,False,54,36,3,0.794,0.735,0,-4.204,1,0.054,0.108,0.00578,0.112,0.223,107.374,234373,4
2017-07-29,84,The Cure,Lady Gaga,71oM9w2BbJxzTpxzWIE0lw,False,50,39,13,0.696,0.506,8,-4.863,1,0.0325,0.0799,0,0.0893,0.516,100.003,211364,4
2017-07-29,85,What Ifs,Kane Brown Featuring Lauren Alaina,71oM9w2BbJxzTpxzWIE0lw,False,79,79,5,0.612,0.799,10,-4.603,1,0.0275,0.00898,0,0.172,0.687,125.976,188253,4
2017-07-29,86,Moonlight,JAY-Z,39ukbGu3UVWs74ba83T68c,True,0,86,1,0.758,0.633,5,-8.373,0,0.391,0.236,0,0.272,0.516,88.17,143987,4
2017-07-29,87,You Look Good,Lady Antebellum,39ukbGu3UVWs74ba83T68c,False,68,59,14,0.656,0.917,0,-4.652,1,0.0495,0.045,0.000732,0.0878,0.961,152.067,181000,4
2017-07-29,88,No Promises,Cheat Codes Featuring Demi Lovato,39ukbGu3UVWs74ba83T68c,False,82,74,9,0.739,0.619,10,-6.669,1,0.162,0.0572,0,0.105,0.58,112.961,222787,4
2017-07-29,89,Glorious,Macklemore Featuring Skylar Grey,0CokSRCu5hZgPxcZBaEzVE,True,0,89,1,0.731,0.794,0,-5.126,0,0.0522,0.0323,2.59e-05,0.112,0.356,139.994,220454,4
2017-07-29,90,Marcy Me,JAY-Z,5oynsOy80DnodTslgaj3cr,True,0,90,1,0.518,0.678,10,-6.76,1,0.331,0.542,0,0.108,0.604,81.951,174427,4
2017-07-29,91,Get Low,Zedd & Liam Payne,2syQ0f4SAQdzvlAewPl1DJ,True,0,91,1,0.718,0.926,1,-3.511,1,0.0494,0.027,1.76e-05,0.0513,0.54,108.018,204583,4
2017-07-29,92,Fetish,Selena Gomez Featuring Gucci Mane,4lnAN2S1fcI0SjxEbksZVr,True,0,92,1,0.708,0.618,2,-4.424,1,0.0592,0.0204,6.81e-06,0.062,0.265,123.013,186113,4
2017-07-29,93,Somebody Else Will,Justin Moore,4lnAN2S1fcI0SjxEbksZVr,False,83,83,6,0.488,0.744,2,-4.284,0,0.131,0.0353,0,0.0952,0.59,180.007,165173,4
2017-07-29,94,Famous,21 Savage,6g0TAJ1grweRwBMLQyiZFb,True,0,94,1,0.779,0.597,9,-9.652,0,0.434,0.723,4.47e-05,0.0508,0.646,173.986,234280,4
2017-07-29,95,Weak,AJR,6g0TAJ1grweRwBMLQyiZFb,False,80,73,10,0.67,0.643,5,-4.553,1,0.0465,0.118,0,0.192,0.703,123.979,201159,4
2017-07-29,96,Heartache On The Dance Floor,Jon Pardi,6g0TAJ1grweRwBMLQyiZFb,False,89,89,2,0.596,0.834,9,-4.308,1,0.0474,0.0563,0,0.0866,0.618,116.0,205200,4
2017-07-29,97,Butterfly Effect,Travis Scott,6g0TAJ1grweRwBMLQyiZFb,False,93,81,7,0.763,0.628,11,-5.85,1,0.05,0.0531,0,0.114,0.193,140.958,190557,4
2017-07-29,98,Crew,GoldLink Featuring Brent Faiyaz & Shy Glizzy,6g0TAJ1grweRwBMLQyiZFb,False,98,94,3,0.728,0.607,1,-8.417,0,0.132,0.133,0,0.0864,0.445,129.938,176702,4
2017-07-29,99,Reminder,The Weeknd,6g0TAJ1grweRwBMLQyiZFb,False,91,31,10,0.706,0.505,8,-6.923,1,0.193,0.142,0,0.164,0.388,160.053,218880,4
2017-07-29,100,Element.,Kendrick Lamar,6g0TAJ1grweRwBMLQyiZFb,False,96,16,10,0.748,0.705,4,-4.547,0,0.485,0.204,0,0.246,0.483,189.891,208733,4
