date,position,title,artist,spotify_id,is_new,last_pos,peak_pos,weeks,danceability,energy,key,loudness,mode,speechiness,acousticness,instrumentalness,liveness,valence,tempo,duration_ms,time_signature
2014-11-01,1,All About That Bass,Meghan Trainor,1rN55j78K87LEfRKZsSFYm,False,1,1,15,0.807,0.887,9,-3.726,1,0.0503,0.0573,2.87e-06,0.124,0.961,134.052,187920,4
2014-11-01,2,Shake It Off,Taylor Swift,1rN55j78K87LEfRKZsSFYm,False,2,1,9,0.648,0.785,7,-5.414,1,0.165,0.0561,0,0.148,0.943,160.02,219200,4
2014-11-01,3,Bang Bang,"Jessie J, Ariana Grande & Nicki Minaj",1rN55j78K87LEfRKZsSFYm,False,5,3,12,0.706,0.786,0,-3.417,0,0.091,0.26,0,0.38,0.751,150.028,199387,4
2014-11-01,4,Black Widow,Iggy Azalea Featuring Rita Ora,1rN55j78K87LEfRKZsSFYm,False,3,3,16,0.743,0.72,11,-3.753,1,0.124,0.192,0.000386,0.109,0.519,163.99,209423,4
2014-11-01,5,Habits (Stay High),Tove Lo,1rN55j78K87LEfRKZsSFYm,False,4,4,21,0.729,0.65,5,-3.539,1,0.0313,0.0702,6.69e-05,0.0829,0.347,110.02,209160,4
2014-11-01,6,Don't Tell 'Em,Jeremih Featuring YG,1rN55j78K87LEfRKZsSFYm,False,6,6,17,0.856,0.527,2,-5.225,1,0.0997,0.392,0,0.11,0.386,98.052,266840,4
2014-11-01,7,Animals,Maroon 5,1rN55j78K87LEfRKZsSFYm,False,7,7,9,0.279,0.742,4,-6.46,0,0.0898,0.000185,0,0.593,0.328,189.868,231013,4
2014-11-01,8,Stay With Me,Sam Smith,1rN55j78K87LEfRKZsSFYm,False,9,2,28,0.418,0.42,0,-6.444,1,0.0414,0.588,6.39e-05,0.11,0.184,84.094,172724,4
2014-11-01,9,Hot Boy,Bobby Shmurda,1rN55j78K87LEfRKZsSFYm,False,10,9,12,0.859,0.5,9,-7.628,1,0.347,0.042,1.6e-05,0.0616,0.186,83.981,194561,4
2014-11-01,10,Don't,Ed Sheeran,1rN55j78K87LEfRKZsSFYm,False,13,10,19,0.806,0.608,1,-7.008,1,0.0659,0.0113,0,0.635,0.849,95.049,219840,4
2014-11-01,11,Anaconda,Nicki Minaj,1rN55j78K87LEfRKZsSFYm,False,8,2,11,0.964,0.605,9,-6.223,1,0.179,0.0668,7.78e-06,0.214,0.646,129.994,260240,4
2014-11-01,12,Rather Be,Clean Bandit Featuring Jess Glynne,1rN55j78K87LEfRKZsSFYm,False,12,10,19,0.799,0.586,11,-6.735,1,0.0377,0.162,2.03e-06,0.193,0.549,120.97,227833,4
2014-11-01,13,Cool Kids,Echosmith,1rN55j78K87LEfRKZsSFYm,False,16,13,15,0.719,0.671,8,-6.279,1,0.0336,0.0372,8.21e-06,0.12,0.786,130.027,237627,4
2014-11-01,14,Chandelier,Sia,1rN55j78K87LEfRKZsSFYm,False,14,8,24,0.399,0.787,1,-2.88,1,0.0499,0.0197,6.07e-05,0.0685,0.572,117.089,216120,5
2014-11-01,15,Trumpets,Jason Derulo,1rN55j78K87LEfRKZsSFYm,False,18,15,21,0.635,0.691,0,-4.862,1,0.258,0.555,0,0.097,0.638,82.142,217419,4
2014-11-01,16,Break Free,Ariana Grande Featuring Zedd,1rN55j78K87LEfRKZsSFYm,False,11,4,16,0.687,0.702,7,-5.324,0,0.0455,0.0064,4.35e-05,0.204,0.284,129.956,214840,4
2014-11-01,17,Rude,MAGIC!,1rN55j78K87LEfRKZsSFYm,False,15,1,26,0.774,0.756,1,-4.995,1,0.0389,0.0423,0,0.305,0.931,144.032,224840,4
2014-11-01,18,Out Of The Woods,Taylor Swift,5OndtwLGA9O6XHFcGm2H7r,True,0,18,1,0.552,0.841,7,-6.938,1,0.0372,0.00103,1.23e-05,0.337,0.342,91.993,235800,4
2014-11-01,19,Lifestyle,Rich Gang Featuring Young Thug & Rich Homie Quan,5OndtwLGA9O6XHFcGm2H7r,False,23,19,14,0.546,0.667,1,-5.236,1,0.274,0.0152,0,0.0895,0.471,87.666,269693,4
2014-11-01,20,I'm Not The Only One,Sam Smith,5OndtwLGA9O6XHFcGm2H7r,False,25,20,7,0.677,0.485,5,-5.795,1,0.0361,0.529,2.04e-05,0.0766,0.493,82.001,239317,4
2014-11-01,21,Boom Clap,Charli XCX,5OndtwLGA9O6XHFcGm2H7r,False,17,8,20,0.659,0.911,4,-2.28,1,0.0786,0.154,0.000304,0.191,0.576,91.999,169866,4
2014-11-01,22,Maps,Maroon 5,5OndtwLGA9O6XHFcGm2H7r,False,19,6,18,0.742,0.713,1,-5.522,0,0.0303,0.0205,0,0.059,0.879,120.032,189960,4
2014-11-01,23,Burnin' It Down,Jason Aldean,5OndtwLGA9O6XHFcGm2H7r,False,20,12,13,0.681,0.795,6,-6.652,1,0.049,0.305,9.41e-06,0.109,0.64,135.939,219160,4
2014-11-01,24,Bailando,Enrique Iglesias Featuring Descemer Bueno & Gente de Zona,5OndtwLGA9O6XHFcGm2H7r,False,22,12,25,0.723,0.777,7,-3.503,1,0.108,0.0426,3.68e-06,0.0451,0.961,91.017,243413,4
2014-11-01,25,Am I Wrong,Nico & Vinz,5OndtwLGA9O6XHFcGm2H7r,False,21,4,27,0.729,0.675,8,-6.003,1,0.0312,0.175,1.58e-06,0.55,0.779,119.968,245867,4
2014-11-01,26,Blame,Calvin Harris Featuring John Newman,5OndtwLGA9O6XHFcGm2H7r,False,31,26,6,0.414,0.857,0,-4.078,0,0.0808,0.0287,0.00574,0.343,0.348,128.024,212960,4
2014-11-01,27,Waves,Mr. Probz,5OndtwLGA9O6XHFcGm2H7r,False,32,27,9,0.829,0.51,5,-9.334,0,0.0369,0.00821,0.00143,0.0829,0.45,119.994,208133,4
2014-11-01,28,All Of Me,John Legend,5OndtwLGA9O6XHFcGm2H7r,False,24,1,54,0.422,0.264,8,-7.064,1,0.0322,0.922,0,0.132,0.331,119.93,269560,4
2014-11-01,29,New Flame,Chris Brown Featuring Usher & Rick Ross,5OndtwLGA9O6XHFcGm2H7r,False,27,27,14,0.702,0.629,1,-4.292,1,0.041,0.0506,0,0.0963,0.446,141.967,244227,4
2014-11-01,30,Jealous,Nick Jonas,5OndtwLGA9O6XHFcGm2H7r,False,28,28,6,0.684,0.71,11,-3.614,0,0.0779,0.0132,0,0.444,0.451,93.007,222187,4
2014-11-01,31,Dirt,Florida Georgia Line,5OndtwLGA9O6XHFcGm2H7r,False,29,11,15,0.547,0.878,2,-4.224,1,0.0451,0.0638,7.08e-06,0.106,0.592,121.973,230587,4
2014-11-01,32,Fireball,Pitbull Featuring John Ryan,5OndtwLGA9O6XHFcGm2H7r,False,34,30,11,0.69,0.937,10,-5.393,1,0.0642,0.0894,0.000104,0.0532,0.794,122.951,235012,4
2014-11-01,33,Take Me To Church,Hozier,5OndtwLGA9O6XHFcGm2H7r,False,49,33,10,0.566,0.664,4,-5.303,0,0.0464,0.634,0,0.116,0.437,128.945,241693,4
2014-11-01,34,Centuries,Fall Out Boy,5OndtwLGA9O6XHFcGm2H7r,False,42,22,6,0.393,0.858,4,-2.868,0,0.0729,0.00359,0,0.102,0.56,176.042,228360,4
2014-11-01,35,Fancy,Iggy Azalea Featuring Charli XCX,5OndtwLGA9O6XHFcGm2H7r,False,33,1,33,0.912,0.716,10,-4.141,0,0.0697,0.0904,0,0.0491,0.377,94.981,199938,4
2014-11-01,36,0 To 100 / The Catch Up,Drake,5OndtwLGA9O6XHFcGm2H7r,False,37,35,13,0.559,0.716,11,-3.964,0,0.39,0.737,0,0.252,0.504,176.618,275227,4
2014-11-01,37,A Sky Full Of Stars,Coldplay,5OndtwLGA9O6XHFcGm2H7r,False,30,10,25,0.545,0.675,6,-6.474,1,0.0279,0.00617,0.00197,0.209,0.162,124.97,267867,4
2014-11-01,38,Leave The Night On,Sam Hunt,5OndtwLGA9O6XHFcGm2H7r,False,41,38,17,0.514,0.951,9,-3.813,1,0.0603,0.0951,0,0.349,0.838,171.96,192160,4
2014-11-01,39,Latch,Disclosure Featuring Sam Smith,5OndtwLGA9O6XHFcGm2H7r,False,38,7,31,0.729,0.735,1,-5.455,1,0.0919,0.0178,0.000193,0.089,0.544,121.986,255867,4
2014-11-01,40,Steal My Girl,One Direction,5OndtwLGA9O6XHFcGm2H7r,False,46,13,3,0.536,0.768,10,-5.948,0,0.0347,0.00433,0,0.114,0.545,77.217,228133,4
2014-11-01,41,Happy,Pharrell Williams,5OndtwLGA9O6XHFcGm2H7r,False,35,1,42,0.647,0.822,5,-4.662,0,0.183,0.219,0,0.0908,0.962,160.019,232720,4
2014-11-01,42,Amnesia,5 Seconds Of Summer,5OndtwLGA9O6XHFcGm2H7r,False,39,16,16,0.572,0.499,2,-5.237,1,0.0311,0.0283,0,0.213,0.108,101.593,237248,4
2014-11-01,43,2 On,Tinashe Featuring ScHoolboy Q,5OndtwLGA9O6XHFcGm2H7r,False,36,24,24,0.742,0.595,9,-7.51,1,0.107,0.15,0,0.111,0.431,101.013,227000,4
2014-11-01,44,Problem,Ariana Grande Featuring Iggy Azalea,5OndtwLGA9O6XHFcGm2H7r,False,40,2,25,0.66,0.805,1,-5.352,0,0.153,0.0192,8.83e-06,0.159,0.625,103.008,193920,4
2014-11-01,45,No Type,Rae Sremmurd,5OndtwLGA9O6XHFcGm2H7r,False,51,45,4,0.891,0.486,6,-7.803,1,0.159,0.0158,3.78e-06,0.0925,0.239,125.01,200080,4
2014-11-01,46,Neon Light,Blake Shelton,5OndtwLGA9O6XHFcGm2H7r,False,44,43,9,0.666,0.78,2,-5.847,1,0.048,0.0189,1.01e-06,0.0635,0.923,154.056,221402,4
2014-11-01,47,Riptide,Vance Joy,5OndtwLGA9O6XHFcGm2H7r,False,50,47,17,0.484,0.731,1,-6.694,1,0.0379,0.431,0,0.151,0.51,101.654,204280,4
2014-11-01,48,I Don't F**k With You,Big Sean Featuring E-40,5OndtwLGA9O6XHFcGm2H7r,False,68,48,4,0.815,0.724,1,-5.658,1,0.0712,0.0385,0,0.334,0.366,97.957,284413,4
2014-11-01,49,Dark Horse,Katy Perry Featuring Juicy J,5OndtwLGA9O6XHFcGm2H7r,False,43,1,57,0.645,0.585,6,-6.122,1,0.0513,0.00314,0,0.165,0.353,131.931,215672,4
2014-11-01,50,No Flex Zone,Rae Sremmurd,5OndtwLGA9O6XHFcGm2H7r,False,45,36,12,0.925,0.518,8,-5.831,1,0.106,0.00433,0,0.0976,0.241,120.064,231067,4
2014-11-01,51,i,Kendrick Lamar,5OndtwLGA9O6XHFcGm2H7r,False,54,39,4,0.755,0.884,10,-5.296,0,0.0638,0.0208,2.97e-06,0.248,0.897,121.927,231933,4
2014-11-01,52,About The Money,T.I. Featuring Young Thug,5OndtwLGA9O6XHFcGm2H7r,False,58,52,11,0.81,0.721,9,-4.964,0,0.265,0.0487,0,0.0886,0.552,101.997,270120,4
2014-11-01,53,Hold You Down,"DJ Khaled Featuring Chris Brown, August Alsina, Future & Jeremih",5OndtwLGA9O6XHFcGm2H7r,False,59,53,7,0.525,0.681,6,-4.158,0,0.0683,0.195,0,0.141,0.437,151.875,293120,3
2014-11-01,54,Stolen Dance,Milky Chance,5OndtwLGA9O6XHFcGm2H7r,False,56,54,13,0.885,0.581,11,-8.813,1,0.0378,0.427,0.000204,0.0759,0.728,114.016,313684,4
2014-11-01,55,"Touchin, Lovin",Trey Songz Featuring Nicki Minaj,5OndtwLGA9O6XHFcGm2H7r,False,60,55,7,0.813,0.58,11,-6.724,1,0.0746,0.0405,8.45e-06,0.349,0.443,100.045,221972,4
2014-11-01,56,No Mediocre,T.I. Featuring Iggy Azalea,5OndtwLGA9O6XHFcGm2H7r,False,47,33,18,0.78,0.45,1,-9.539,1,0.0465,0.0826,0,0.0809,0.178,95.486,201600,4
2014-11-01,57,Love Me Harder,Ariana Grande & The Weeknd,5OndtwLGA9O6XHFcGm2H7r,False,79,57,2,0.468,0.707,1,-4.39,0,0.0327,0.0103,0,0.0766,0.221,99.083,236041,4
2014-11-01,58,Ready Set Roll,Chase Rice,5OndtwLGA9O6XHFcGm2H7r,False,57,54,21,0.513,0.803,0,-4.45,1,0.0777,0.0161,0,0.667,0.746,156.038,190587,4
2014-11-01,59,Roller Coaster,Luke Bryan,5OndtwLGA9O6XHFcGm2H7r,False,53,43,14,0.602,0.79,8,-4.46,1,0.0355,0.026,7.43e-05,0.162,0.274,108.008,259080,4
2014-11-01,60,This Is How We Do,Katy Perry,5OndtwLGA9O6XHFcGm2H7r,False,48,24,12,0.69,0.636,9,-6.028,0,0.0457,0.0203,0,0.147,0.8,96.0,204285,4
2014-11-01,61,Shower,Becky G,5OndtwLGA9O6XHFcGm2H7r,False,55,16,20,0.699,0.529,2,-7.548,1,0.0487,0.0317,3.59e-05,0.285,0.121,119.987,206167,4
2014-11-01,62,Tuesday,I LOVE MAKONNEN Featuring Drake,5OndtwLGA9O6XHFcGm2H7r,False,73,62,4,0.77,0.664,0,-5.604,1,0.211,0.215,0.000118,0.105,0.472,140.163,321987,4
2014-11-01,63,Something In The Water,Carrie Underwood,5OndtwLGA9O6XHFcGm2H7r,False,52,24,3,0.451,0.893,7,-2.721,1,0.0627,0.0243,0,0.0813,0.0971,139.763,238173,4
2014-11-01,64,Girl In A Country Song,Maddie & Tae,5OndtwLGA9O6XHFcGm2H7r,False,66,62,11,0.59,0.908,8,-3.789,1,0.084,0.285,0,0.36,0.874,160.028,217840,4
2014-11-01,65,Sunshine & Whiskey,Frankie Ballard,5OndtwLGA9O6XHFcGm2H7r,False,67,61,15,0.67,0.737,9,-6.794,1,0.0434,0.223,0,0.325,0.754,92.983,182400,4
2014-11-01,66,V. 3005,Childish Gambino,5OndtwLGA9O6XHFcGm2H7r,False,64,64,20,0.676,0.446,6,-7.153,0,0.329,0.119,0,0.112,0.655,82.912,234215,4
2014-11-01,67,Somewhere In My Car,Keith Urban,5OndtwLGA9O6XHFcGm2H7r,False,70,66,8,0.588,0.861,10,-5.531,1,0.0395,0.00546,1.38e-05,0.0797,0.525,118.008,195973,4
2014-11-01,68,Studio,ScHoolboy Q Featuring BJ The Chicago Kid,5OndtwLGA9O6XHFcGm2H7r,False,63,38,20,0.709,0.589,8,-7.776,0,0.0433,0.0507,0,0.0585,0.58,133.922,278067,3
2014-11-01,69,American Kids,Kenny Chesney,5OndtwLGA9O6XHFcGm2H7r,False,61,23,18,0.733,0.589,7,-7.37,1,0.1,0.0476,5.85e-06,0.0366,0.867,170.097,182960,4
2014-11-01,70,Day Drinking,Little Big Town,5OndtwLGA9O6XHFcGm2H7r,False,72,70,13,0.591,0.959,9,-2.515,1,0.057,0.103,0,0.779,0.86,163.883,178840,4
2014-11-01,71,Secrets,Mary Lambert,5OndtwLGA9O6XHFcGm2H7r,False,75,71,7,0.789,0.555,0,-5.9,1,0.041,0.026,0.000135,0.215,0.713,93.229,223405,4
2014-11-01,72,Small Town Throwdown,Brantley Gilbert Featuring Justin Moore & Thomas Rhett,5OndtwLGA9O6XHFcGm2H7r,False,71,67,19,0.555,0.863,7,-3.867,1,0.0379,0.0246,0,0.0563,0.699,98.006,201680,4
2014-11-01,73,Try,Colbie Caillat,5OndtwLGA9O6XHFcGm2H7r,False,65,55,9,0.603,0.376,1,-9.77,1,0.0288,0.807,0,0.108,0.538,139.995,224573,4
2014-11-01,74,Hope You Get Lonely Tonight,Cole Swindell,5OndtwLGA9O6XHFcGm2H7r,False,74,50,18,0.45,0.795,10,-4.249,1,0.0355,0.103,0,0.166,0.364,151.884,227987,4
2014-11-01,75,Superheroes,The Script,5OndtwLGA9O6XHFcGm2H7r,False,77,75,5,0.491,0.885,3,-4.121,1,0.0395,0.00219,0,0.0741,0.641,166.992,245467,4
2014-11-01,76,Shotgun Rider,Tim McGraw,5OndtwLGA9O6XHFcGm2H7r,False,84,76,3,0.468,0.904,7,-4.574,1,0.0494,0.126,3.89e-06,0.165,0.7,167.998,235387,4
2014-11-01,77,***Flawless,Beyonce Featuring Nicki Minaj Or Chimamanda Ngozi Adichie,5OndtwLGA9O6XHFcGm2H7r,False,76,76,8,0.639,0.659,8,-7.273,1,0.215,0.241,8.33e-06,0.484,0.457,136.801,234413,4
2014-11-01,78,Heroes (We Could Be),Alesso Featuring Tove Lo,5OndtwLGA9O6XHFcGm2H7r,False,80,78,3,0.503,0.748,5,-4.124,1,0.0619,0.0305,0,0.343,0.356,125.896,210013,4
2014-11-01,79,Thinking Out Loud,Ed Sheeran,5OndtwLGA9O6XHFcGm2H7r,False,69,69,2,0.781,0.445,2,-6.061,1,0.0295,0.474,0,0.184,0.591,78.998,281560,4
2014-11-01,80,Handsome And Wealthy,Migos,5OndtwLGA9O6XHFcGm2H7r,False,83,80,4,0.858,0.665,2,-2.907,1,0.101,0.00348,0,0.094,0.237,146.031,210557,4
2014-11-01,81,L.A.LOVE (la la),Fergie,5OndtwLGA9O6XHFcGm2H7r,False,97,81,2,0.509,0.482,7,-6.965,1,0.176,0.0186,0,0.238,0.301,101.042,211512,4
2014-11-01,82,In Your Arms,Nico & Vinz,0LH5xRQz5D36FpIkYUFv2e,True,0,82,1,0.431,0.81,7,-6.051,1,0.0958,0.299,0,0.249,0.674,110.118,205800,4
2014-11-01,83,Perfect Storm,Brad Paisley,0LH5xRQz5D36FpIkYUFv2e,False,85,83,2,0.53,0.753,0,-5.551,1,0.0346,0.365,4.19e-05,0.269,0.38,123.979,234840,4
2014-11-01,84,Look At You,Big & Rich,0LH5xRQz5D36FpIkYUFv2e,False,82,82,7,0.503,0.822,11,-4.941,1,0.0506,0.0681,0,0.145,0.714,164.013,223707,4
2014-11-01,85,Booty,Jennifer Lopez Featuring Iggy Azalea Or Pitbull,0LH5xRQz5D36FpIkYUFv2e,False,81,18,5,0.709,0.949,0,-4.155,1,0.0509,0.00296,0.00022,0.26,0.398,128.966,209700,4
2014-11-01,86,Burnin' Up,Jessie J Featuring 2 Chainz,2f8FHYOkBjxnNxBWXWBpsG,True,0,86,1,0.757,0.814,1,-2.969,0,0.0459,0.0442,3.54e-06,0.687,0.414,124.023,220547,4
2014-11-01,87,Close Your Eyes,Parmalee,2f8FHYOkBjxnNxBWXWBpsG,False,89,87,4,0.551,0.863,11,-3.506,1,0.0322,0.0158,0,0.0843,0.817,143.952,214933,4
2014-11-01,88,You And Your Friends,Wiz Khalifa Featuring Snoop Dogg & Ty Dolla $ign,2f8FHYOkBjxnNxBWXWBpsG,False,88,88,5,0.783,0.662,7,-6.124,1,0.0415,0.126,0,0.101,0.523,96.987,186373,4
2014-11-01,89,EW!,Jimmy Fallon Featuring will.i.am,2f8FHYOkBjxnNxBWXWBpsG,False,26,26,2,0.95,0.721,7,-5.825,1,0.138,0.0326,0,0.0912,0.867,129.988,134667,4
2014-11-01,90,I'm Not Gonna Miss You,Glen Campbell,6G5NsbGQlLQx4xjZE69Lnt,True,0,90,1,0.449,0.356,7,-9.373,1,0.0286,0.59,2.83e-06,0.0824,0.177,126.472,177347,4
2014-11-01,91,No Love,August Alsina,6G5NsbGQlLQx4xjZE69Lnt,False,92,73,5,0.462,0.615,0,-7.982,0,0.153,0.00543,0,0.856,0.344,130.967,276080,4
2014-11-01,92,Fight Night,Migos,6G5NsbGQlLQx4xjZE69Lnt,False,86,69,15,0.874,0.706,1,-5.132,1,0.207,0.182,0,0.334,0.895,89.968,216248,4
2014-11-01,93,Feelin' It,Scotty McCreery,6G5NsbGQlLQx4xjZE69Lnt,False,95,93,4,0.586,0.759,7,-5.338,1,0.0457,0.1,0,0.084,0.687,184.031,198227,4
2014-11-01,94,U Guessed It,OG Maco Featuring 2 Chainz,6G5NsbGQlLQx4xjZE69Lnt,False,90,90,3,0.843,0.286,1,-10.575,1,0.352,0.0125,1.69e-06,0.0681,0.265,120.06,146064,4
2014-11-01,95,Hookah,Tyga Featuring Young Thug,6G5NsbGQlLQx4xjZE69Lnt,False,93,85,10,0.678,0.484,1,-6.647,0,0.43,0.735,0,0.117,0.219,190.04,202320,4
2014-11-01,96,Bobby Bitch,Bobby Shmurda,6j8lAie0mdUNreql5d5Ejz,True,0,96,1,0.921,0.525,11,-8.186,1,0.413,0.0136,0,0.313,0.794,130.747,160383,4
2014-11-01,97,Often,The Weeknd,67HlBRWRSjAHY2ujn6eOan,True,0,97,1,0.57,0.624,5,-9.829,0,0.0462,0.241,0,0.125,0.0778,133.981,249109,4
2014-11-01,98,Bo$$,Fifth Harmony,67HlBRWRSjAHY2ujn6eOan,False,91,43,15,0.813,0.872,9,-5.224,1,0.107,0.00621,0,0.0498,0.736,103.016,171413,4
2014-11-01,99,Drinking Class,Lee Brice,4QAXLB2Hkx3n7LbOFxD34h,True,0,99,1,0.663,0.53,1,-9.763,1,0.0301,0.0886,0,0.154,0.269,109.003,207347,4
2014-11-01,100,Body Language,Kid Ink Featuring Usher & Tinashe,4QAXLB2Hkx3n7LbOFxD34h,False,100,100,2,0.882,0.53,5,-5.771,0,0.0379,0.0187,0,0.097,0.256,99.015,206280,4
