date,position,title,artist,spotify_id,is_new,last_pos,peak_pos,weeks,danceability,energy,key,loudness,mode,speechiness,acousticness,instrumentalness,liveness,valence,tempo,duration_ms,time_signature
1998-07-11,1,The Boy Is Mine,Brandy & Monica,,False,1,1,7,0.704,0.707,1,-6.537,0,0.0391,0.539,0.00106,0.318,0.761,93.145,294787,4
1998-07-11,2,You're Still The One,Shania Twain,,False,2,2,22,0.585,0.494,3,-8.751,1,0.0353,0.363,0,0.0886,0.634,133.822,212200,4
1998-07-11,3,Too Close,Next,,False,3,1,22,0.847,0.402,7,-9.952,1,0.0641,0.0118,0,0.283,0.752,99.693,259440,4
1998-07-11,4,My Way,Usher,,False,5,4,4,0.815,0.521,5,-8.178,0,0.136,0.0105,0,0.0509,0.887,90.079,214853,4
1998-07-11,5,Ray Of Light,Madonna,4Fpsa3pYc3gozrxHRRPvR6,True,0,5,1,0.561,0.909,3,-7.878,1,0.0312,0.00118,0.46,0.0713,0.71,127.172,320693,4
1998-07-11,6,Adia,Sarah McLachlan,4Fpsa3pYc3gozrxHRRPvR6,False,7,6,7,0.526,0.37,3,-10.535,1,0.025,0.722,0,0.157,0.251,76.002,244667,4
1998-07-11,7,Come With Me,Puff Daddy Featuring Jimmy Page,4Fpsa3pYc3gozrxHRRPvR6,False,6,6,3,0.549,0.847,0,-3.918,1,0.0462,0.047,4.66e-06,0.19,0.765,164.147,364173,3
1998-07-11,8,My All,Mariah Carey,4Fpsa3pYc3gozrxHRRPvR6,False,4,1,10,0.607,0.317,7,-10.244,0,0.029,0.732,4.53e-05,0.086,0.111,108.122,230933,4
1998-07-11,9,They Don't Know,Jon B,4Fpsa3pYc3gozrxHRRPvR6,False,9,7,24,0.699,0.388,6,-10.722,1,0.0531,0.588,1.98e-06,0.0658,0.566,125.858,274667,4
1998-07-11,10,Everybody [Backstreet's Back],Backstreet Boys,4Fpsa3pYc3gozrxHRRPvR6,False,8,4,13,0.735,0.873,10,-3.493,0,0.0402,0.025,3.27e-06,0.265,0.586,108.021,224960,4
1998-07-11,11,Make It Hot,"Nicole Featuring Missy ""Misdemeanor"" Elliott & Mocha",4Fpsa3pYc3gozrxHRRPvR6,False,13,11,3,0.76,0.458,7,-8.834,1,0.19,0.376,0.000229,0.143,0.581,84.08,267093,4
1998-07-11,12,All My Life,K-Ci & JoJo,4Fpsa3pYc3gozrxHRRPvR6,False,11,1,16,0.629,0.511,1,-8.651,1,0.0326,0.114,3.91e-06,0.0588,0.181,128.038,331240,4
1998-07-11,13,Say It,Voices Of Theory,4Fpsa3pYc3gozrxHRRPvR6,False,12,12,15,0.381,0.415,0,-10.298,1,0.0691,0.675,0,0.0795,0.257,61.908,269467,3
1998-07-11,14,Truly Madly Deeply,Savage Garden,4Fpsa3pYc3gozrxHRRPvR6,False,14,1,32,0.555,0.698,0,-8.874,1,0.0287,0.403,0,0.0851,0.816,168.12,277267,4
1998-07-11,15,Sex And Candy,Marcy Playground,4Fpsa3pYc3gozrxHRRPvR6,False,15,8,14,0.55,0.702,11,-5.693,0,0.0281,0.046,1.4e-06,0.119,0.515,159.968,172486,4
1998-07-11,16,I Get Lonely,Janet Featuring BLACKstreet,4Fpsa3pYc3gozrxHRRPvR6,False,10,3,8,0.799,0.514,7,-6.794,0,0.0478,0.291,0,0.518,0.455,125.104,317560,4
1998-07-11,17,Ghetto Supastar (That Is What You Are),Pras Michel Feat. Ol' Dirty Bastard & Introducing Mya,4Fpsa3pYc3gozrxHRRPvR6,False,19,17,3,0.795,0.639,1,-8.805,0,0.23,0.0479,1.49e-06,0.135,0.588,100.027,265333,4
1998-07-11,18,I Got The Hook Up!,Master P Featuring Sons Of Funk,4Fpsa3pYc3gozrxHRRPvR6,False,18,16,14,0.706,0.632,1,-7.017,1,0.192,0.026,0,0.362,0.277,148.015,182938,4
1998-07-11,19,When The Lights Go Out,Five,4Fpsa3pYc3gozrxHRRPvR6,False,29,19,6,0.854,0.827,5,-6.424,1,0.0335,0.0636,0,0.123,0.961,104.001,249600,4
1998-07-11,20,Looking Through Your Eyes,LeAnn Rimes,4Fpsa3pYc3gozrxHRRPvR6,False,20,18,13,0.487,0.271,10,-11.566,1,0.0283,0.618,0,0.16,0.194,80.126,245467,4
1998-07-11,21,Stop,Spice Girls,4Fpsa3pYc3gozrxHRRPvR6,False,16,16,4,0.722,0.845,2,-4.446,0,0.0308,0.287,0,0.0561,0.965,130.13,204754,4
1998-07-11,22,The Arms Of The One Who Loves You,Xscape,4Fpsa3pYc3gozrxHRRPvR6,False,17,7,11,0.657,0.456,0,-8.917,1,0.0345,0.311,0,0.0922,0.182,115.4,260427,4
1998-07-11,23,Whatcha Gone Do?,Link,4Fpsa3pYc3gozrxHRRPvR6,False,23,23,6,0.765,0.613,11,-7.935,1,0.0319,0.171,2.19e-05,0.163,0.937,93.811,259162,4
1998-07-11,24,Gettin' Jiggy Wit It,Will Smith,4Fpsa3pYc3gozrxHRRPvR6,False,30,1,20,0.881,0.874,6,-4.505,1,0.139,0.0175,1.14e-06,0.154,0.858,107.891,227933,4
1998-07-11,25,Shorty (You Keep Playin' With My Mind),Imajin Featuring Keith Murray,4Fpsa3pYc3gozrxHRRPvR6,False,28,25,7,0.848,0.698,11,-4.885,0,0.241,0.0181,4.07e-06,0.203,0.895,101.074,294960,4
1998-07-11,26,Still Not A Player,Big Punisher Featuring Joe,4Fpsa3pYc3gozrxHRRPvR6,False,34,26,5,0.9,0.619,4,-6.518,0,0.312,0.203,0.00156,0.0647,0.864,94.121,236800,4
1998-07-11,27,How's It Going To Be,Third Eye Blind,4Fpsa3pYc3gozrxHRRPvR6,False,27,9,32,0.562,0.593,5,-9.362,1,0.0263,0.00327,0.00139,0.0967,0.574,80.289,253413,4
1998-07-11,28,Let's Ride,Montell Jordan Feat. Master P & Silkk The Shocker,4Fpsa3pYc3gozrxHRRPvR6,False,21,2,19,0.59,0.538,1,-5.949,1,0.247,0.0272,0,0.17,0.578,121.929,294600,4
1998-07-11,29,How Do I Live,LeAnn Rimes,4Fpsa3pYc3gozrxHRRPvR6,False,32,2,56,0.577,0.462,2,-7.989,1,0.0279,0.128,0,0.0822,0.258,128.303,266973,4
1998-07-11,30,Turn It Up [Remix]/Fire It Up,Busta Rhymes,4Fpsa3pYc3gozrxHRRPvR6,False,24,10,10,0.817,0.84,2,-8.598,1,0.0922,0.00506,0.00034,0.288,0.89,104.295,237907,4
1998-07-11,31,This Kiss,Faith Hill,4Fpsa3pYc3gozrxHRRPvR6,False,26,26,17,0.398,0.804,11,-5.559,1,0.0451,0.175,0,0.181,0.709,186.752,194307,4
1998-07-11,32,I Want You Back,'N Sync,4Fpsa3pYc3gozrxHRRPvR6,False,25,13,19,0.758,0.93,8,-3.22,0,0.0425,0.0503,0.000226,0.325,0.853,112.042,202107,4
1998-07-11,33,"No, No, No",Destiny's Child,4Fpsa3pYc3gozrxHRRPvR6,False,31,3,33,0.67,0.582,1,-3.574,1,0.224,0.3,0,0.0845,0.675,181.841,207467,4
1998-07-11,34,Body Bumpin' Yippie-Yi-Yo,Public Announcement,4Fpsa3pYc3gozrxHRRPvR6,False,22,5,21,0.782,0.363,2,-7.744,1,0.0441,0.0472,0,0.149,0.27,121.986,273667,4
1998-07-11,35,Together Again,Janet,4Fpsa3pYc3gozrxHRRPvR6,False,36,1,30,0.873,0.593,7,-8.942,1,0.103,0.078,0.00697,0.104,0.495,123.091,301200,4
1998-07-11,36,I Don't Want To Wait,Paula Cole,4Fpsa3pYc3gozrxHRRPvR6,False,38,11,37,0.41,0.468,11,-8.177,1,0.0553,0.298,1.19e-05,0.0426,0.475,177.508,320027,4
1998-07-11,37,Make Em' Say Uhh!,"Master P Feat. Fiend, Silkk The Shocker, Mia X & Mystikal",4Fpsa3pYc3gozrxHRRPvR6,False,35,16,24,0.711,0.729,6,-5.432,0,0.49,0.00513,0,0.0615,0.488,169.845,302507,4
1998-07-11,38,It's All About Me,Mya & Sisqo,4Fpsa3pYc3gozrxHRRPvR6,False,33,6,18,0.812,0.5,2,-6.842,1,0.084,0.209,0,0.174,0.521,137.041,264933,4
1998-07-11,39,Heaven's What I Feel,Gloria Estefan,4Fpsa3pYc3gozrxHRRPvR6,False,37,27,8,0.62,0.903,5,-5.045,1,0.0383,0.18,0,0.12,0.427,130.992,301600,4
1998-07-11,40,Raise The Roof,Luke Featuring No Good But So Good,4Fpsa3pYc3gozrxHRRPvR6,False,39,26,16,0.737,0.892,2,-5.607,1,0.358,0.0436,0,0.0798,0.662,173.786,310827,4
1998-07-11,41,Who Am I,Beenie Man,4Fpsa3pYc3gozrxHRRPvR6,False,43,40,18,0.628,0.753,11,-8.778,1,0.468,0.211,0,0.12,0.559,86.194,196000,4
1998-07-11,42,Ava Adore,The Smashing Pumpkins,4Fpsa3pYc3gozrxHRRPvR6,False,42,42,2,0.604,0.844,8,-6.003,1,0.0597,0.000401,0.214,0.0484,0.791,160.318,270893,4
1998-07-11,43,Cheers 2 U,Playa,4Fpsa3pYc3gozrxHRRPvR6,False,41,38,16,0.728,0.334,0,-11.11,1,0.0725,0.177,1.31e-06,0.103,0.478,127.053,311427,4
1998-07-11,44,Frozen,Madonna,4Fpsa3pYc3gozrxHRRPvR6,False,40,2,17,0.602,0.616,1,-10.917,1,0.0353,0.662,0.0153,0.149,0.31,108.017,367333,4
1998-07-11,45,Ooh La La,Rod Stewart,4Fpsa3pYc3gozrxHRRPvR6,False,48,45,2,0.405,0.681,5,-8.755,0,0.0359,0.0213,0,0.0748,0.598,151.235,256133,4
1998-07-11,46,To The Moon And Back,Savage Garden,4Fpsa3pYc3gozrxHRRPvR6,False,0,37,21,0.584,0.76,0,-7.369,0,0.0359,0.0205,7.25e-06,0.1,0.325,104.101,341067,4
1998-07-11,47,Candle In The Wind 1997/Something About The Way You Look Tonight,Elton John,4Fpsa3pYc3gozrxHRRPvR6,False,44,1,40,0.48,0.628,6,-7.643,1,0.0262,0.174,3.28e-05,0.0753,0.541,143.412,240547,4
1998-07-11,48,Crush,Jennifer Paige,4Fpsa3pYc3gozrxHRRPvR6,False,69,48,2,0.733,0.706,1,-5.652,0,0.0292,0.0262,0,0.0881,0.598,115.04,199960,4
1998-07-11,49,You Make Me Wanna...,Usher,4Fpsa3pYc3gozrxHRRPvR6,False,50,2,47,0.761,0.639,5,-7.577,0,0.0539,0.0359,0,0.0945,0.922,164.088,219120,4
1998-07-11,50,What You Want,Mase Featuring Total,4Fpsa3pYc3gozrxHRRPvR6,False,47,6,24,0.838,0.72,10,-6.593,0,0.384,0.0312,1.11e-05,0.422,0.845,93.76,242947,4
1998-07-11,51,Cleopatra's Theme,Cleopatra,4Fpsa3pYc3gozrxHRRPvR6,False,60,51,2,0.705,0.673,6,-8.347,1,0.0502,0.137,0,0.423,0.814,103.809,249200,4
1998-07-11,52,Victory,Puff Daddy & The Family Featuring The Notorious B.I.G. & Busta Rh,4Fpsa3pYc3gozrxHRRPvR6,False,45,19,17,0.609,0.731,9,-6.846,1,0.322,0.397,0,0.664,0.685,91.778,296267,4
1998-07-11,53,My Heart Will Go On,Celine Dion,4Fpsa3pYc3gozrxHRRPvR6,False,51,1,20,0.428,0.276,4,-11.729,1,0.0312,0.732,5.33e-06,0.117,0.0382,99.195,280000,1
1998-07-11,54,Nobody Does It Better,Nate Dogg Featuring Warren G,7miy73aP7NFhj8PL7V4VqM,True,0,54,1,0.736,0.561,0,-8.16,1,0.05,0.446,0,0.128,0.122,92.06,274440,4
1998-07-11,55,You Won't Forget Me,La Bouche,7miy73aP7NFhj8PL7V4VqM,False,52,48,6,0.722,0.91,1,-4.135,1,0.032,0.0182,1.17e-06,0.0872,0.687,133.045,196347,4
1998-07-11,56,Get At Me Dog,DMX Featuring Sheek Of The Lox,7miy73aP7NFhj8PL7V4VqM,False,53,39,20,0.596,0.623,1,-8.444,1,0.496,0.0399,0,0.729,0.476,97.002,243240,4
1998-07-11,57,There's Your Trouble,Dixie Chicks,7miy73aP7NFhj8PL7V4VqM,False,55,55,9,0.737,0.869,2,-5.433,1,0.0267,0.481,0,0.308,0.898,126.628,193065,4
1998-07-11,58,Spark,Tori Amos,7miy73aP7NFhj8PL7V4VqM,False,49,49,3,0.351,0.738,4,-4.309,0,0.038,0.0797,5.21e-05,0.0829,0.475,138.025,253413,3
1998-07-11,59,Black Ice (Sky High),Goodie Mob Featuring Outkast,7miy73aP7NFhj8PL7V4VqM,False,63,59,3,0.927,0.678,11,-5.41,0,0.362,0.0471,0,0.0479,0.374,101.18,205107,4
1998-07-11,60,Do Your Thing,7 Mile,7miy73aP7NFhj8PL7V4VqM,False,56,56,12,0.7,0.216,3,-8.921,0,0.0402,0.0193,0.836,0.0577,0.416,59.994,291107,4
1998-07-11,62,"The Cup Of Life (The Official Song Of The World Cup, France '98)",Ricky Martin,,False,62,62,3,0.709,0.911,5,-6.945,0,0.0433,0.0387,0.000132,0.391,0.661,126.984,279920,4
1998-07-11,63,Freak Out,Nutta Butta Featuring Teddy Riley And Anonymous,,False,68,63,4,0.834,0.948,6,-4.022,1,0.157,0.0947,5.68e-06,0.326,0.738,99.53,295373,4
1998-07-11,64,I'm Alright,Jo Dee Messina,,False,64,43,18,0.676,0.733,0,-7.745,1,0.0294,0.191,0,0.192,0.591,98.234,199040,3
1998-07-11,66,Push It,Garbage,,False,54,52,10,0.564,0.909,0,-6.471,1,0.0311,0.00034,0.11,0.0746,0.892,123.895,242533,4
1998-07-11,67,Wishlist,Pearl Jam,,False,57,47,8,0.623,0.342,0,-8.694,1,0.038,0.0134,0.00412,0.106,0.101,115.032,206587,4
1998-07-11,68,Imagination,Tamia,,False,58,37,17,0.895,0.495,9,-7.186,0,0.178,0.0998,6.28e-05,0.0583,0.593,99.233,213973,4
1998-07-11,69,Ninety Nine [Flash The Message],John Forte,,False,66,59,7,0.882,0.52,4,-10.899,0,0.315,0.0589,0,0.313,0.447,96.846,223533,4
1998-07-11,70,There You Are,Sam Salter,,False,70,70,4,0.63,0.52,11,-8.162,0,0.0289,0.257,0,0.0577,0.375,137.792,258400,4
1998-07-11,71,One Heart At A Time,Various Artists,,False,61,56,7,0.669,0.487,10,-9.823,1,0.0264,0.0975,0.191,0.292,0.475,104.688,242655,4
1998-07-11,72,Recover Your Soul,Elton John,,False,65,55,13,0.725,0.653,7,-9.365,1,0.0238,0.134,0.00675,0.272,0.582,103.003,318040,4
1998-07-11,73,Can't We Try,Rockell [Duet With Collage],,False,78,73,2,0.744,0.769,0,-8.674,1,0.0395,0.0355,0.00142,0.113,0.95,132.074,257107,4
1998-07-11,74,Bitter Sweet Symphony,The Verve,,False,59,12,16,0.356,0.917,9,-6.006,1,0.0479,0.0335,0,0.406,0.518,171.176,357267,4
1998-07-11,75,If You Ever Have Forever In Mind,Vince Gill,,False,75,75,2,0.293,0.251,5,-10.808,1,0.0281,0.854,0.000266,0.0963,0.297,182.237,279827,3
1998-07-11,77,Money Ain't A Thang,JD Featuring Jay-Z,,False,77,77,2,0.843,0.734,6,-7.348,0,0.248,0.0496,0,0.124,0.849,100.016,253827,4
1998-07-11,78,I Honestly Love You (David Foster Vers.),Olivia Newton-John,,False,76,67,7,0.637,0.329,10,-11.362,1,0.0272,0.613,2.36e-06,0.14,0.152,112.075,246147,4
1998-07-11,79,Now That I Found You,Terri Clark,,False,72,72,8,0.593,0.461,2,-7.549,1,0.0236,0.356,0,0.183,0.27,90.399,217360,4
1998-07-11,80,I Do [Cherish You],Mark Wills,,False,80,72,10,0.586,0.477,6,-8.136,1,0.0243,0.593,0,0.0935,0.308,82.991,199707,4
1998-07-11,81,Second Round K.O.,Canibus,,False,71,28,14,0.74,0.537,7,-11.337,1,0.457,0.0159,0,0.564,0.686,94.025,277533,4
1998-07-11,82,Do For Love,2Pac Featuring Eric Williams,,False,79,21,17,0.874,0.63,1,-3.585,1,0.298,0.0578,0.00479,0.0582,0.717,95.0,281600,4
1998-07-11,83,I Just Want To Dance With You,George Strait,,False,74,61,12,0.715,0.469,0,-8.674,1,0.0279,0.439,8.69e-05,0.104,0.502,113.991,210867,4
1998-07-11,84,A Man Holdin' On (To A Woman Lettin' Go),Ty Herndon,,False,81,81,6,0.606,0.403,9,-7.95,1,0.0288,0.555,1.23e-06,0.0954,0.202,128.122,217160,4
1998-07-11,86,Clock Strikes,Timbaland & Magoo,,False,73,37,11,0.787,0.714,6,-8.63,0,0.131,0.0641,0.436,0.273,0.81,165.465,291120,4
1998-07-11,87,The Actual,All City,4LhfMta18ZrujxsPZiPK9m,True,0,87,1,0.905,0.809,2,-3.751,1,0.225,0.128,0,0.096,0.74,90.522,251933,4
1998-07-11,88,You Only Have To Say You Love Me,Hannah Jones,4LhfMta18ZrujxsPZiPK9m,False,98,88,5,0.737,0.957,2,-6.877,0,0.0421,0.00216,0.000819,0.353,0.961,130.005,360160,4
1998-07-11,90,The Mummers' Dance,Loreena McKennitt,,False,84,18,19,0.548,0.456,0,-11.53,0,0.0289,0.425,0.116,0.0892,0.294,120.274,367440,4
1998-07-11,92,The Unforgiven II,Metallica,,False,83,59,15,0.49,0.884,8,-4.533,0,0.0428,0.000514,0.00177,0.27,0.254,132.978,396440,4
1998-07-11,93,Sin So Well,Rebekah,,False,95,80,4,0.727,0.629,6,-5.022,0,0.0331,0.288,0,0.107,0.518,119.663,219360,4
1998-07-11,94,Stepping Stone,Lari White,4fVqsTSHG6FAuFpRCRsLP1,True,0,94,1,0.639,0.667,7,-6.005,1,0.0272,0.226,0,0.123,0.744,79.181,209040,4
1998-07-11,95,Party Ain't A Party,"Queen Pen Featuring Teddy Riley, Nutta Butta, Markell & Jesse Wes",4fVqsTSHG6FAuFpRCRsLP1,False,89,74,4,0.744,0.803,7,-6.445,1,0.202,0.0259,0,0.555,0.574,94.088,250200,4
1998-07-11,97,I'm From The Country,Tracy Byrd,,False,88,63,15,0.687,0.898,2,-3.93,1,0.042,0.206,0,0.284,0.952,129.542,213973,4
1998-07-11,99,A Rose Is Still A Rose,Aretha Franklin,,False,87,26,18,0.631,0.793,8,-7.551,0,0.251,0.212,0,0.0441,0.826,175.814,266667,4
1998-07-11,100,Baby Be There,Nu Flavor,,False,92,83,5,0.615,0.516,4,-8.31,0,0.0238,0.601,3.33e-05,0.0524,0.329,83.75,255840,4
