date,position,title,artist,spotify_id,is_new,last_pos,peak_pos,weeks,danceability,energy,key,loudness,mode,speechiness,acousticness,instrumentalness,liveness,valence,tempo,duration_ms,time_signature
1998-06-27,1,The Boy Is Mine,Brandy & Monica,,False,1,1,5,0.704,0.707,1,-6.537,0,0.0391,0.539,0.00106,0.318,0.761,93.145,294787,4
1998-06-27,2,You're Still The One,Shania Twain,,False,2,2,20,0.585,0.494,3,-8.751,1,0.0353,0.363,0,0.0886,0.634,133.822,212200,4
1998-06-27,3,Too Close,Next,,False,3,1,20,0.847,0.402,7,-9.952,1,0.0641,0.0118,0,0.283,0.752,99.693,259440,4
1998-06-27,4,My All,Mariah Carey,,False,4,1,8,0.607,0.317,7,-10.244,0,0.029,0.732,4.53e-05,0.086,0.111,108.122,230933,4
1998-06-27,5,Everybody [Backstreet's Back],Backstreet Boys,,False,6,4,11,0.735,0.873,10,-3.493,0,0.0402,0.025,3.27e-06,0.265,0.586,108.021,224960,4
1998-06-27,6,I Get Lonely,Janet Featuring BLACKstreet,,False,5,3,6,0.799,0.514,7,-6.794,0,0.0478,0.291,0,0.518,0.455,125.104,317560,4
1998-06-27,7,Adia,Sarah McLachlan,,False,9,7,5,0.526,0.37,3,-10.535,1,0.025,0.722,0,0.157,0.251,76.002,244667,4
1998-06-27,8,They Don't Know,Jon B,,False,7,7,22,0.699,0.388,6,-10.722,1,0.0531,0.588,1.98e-06,0.0658,0.566,125.858,274667,4
1998-06-27,9,My Way,Usher,,False,13,9,2,0.815,0.521,5,-8.178,0,0.136,0.0105,0,0.0509,0.887,90.079,214853,4
1998-06-27,10,Come With Me,Puff Daddy Featuring Jimmy Page,4SCnjFSNQ56BmeamHqcOMA,True,0,10,1,0.549,0.847,0,-3.918,1,0.0462,0.047,4.66e-06,0.19,0.765,164.147,364173,3
1998-06-27,11,All My Life,K-Ci & JoJo,4SCnjFSNQ56BmeamHqcOMA,False,8,1,14,0.629,0.511,1,-8.651,1,0.0326,0.114,3.91e-06,0.0588,0.181,128.038,331240,4
1998-06-27,12,Truly Madly Deeply,Savage Garden,4SCnjFSNQ56BmeamHqcOMA,False,10,1,30,0.555,0.698,0,-8.874,1,0.0287,0.403,0,0.0851,0.816,168.12,277267,4
1998-06-27,13,Sex And Candy,Marcy Playground,4SCnjFSNQ56BmeamHqcOMA,False,12,8,12,0.55,0.702,11,-5.693,0,0.0281,0.046,1.4e-06,0.119,0.515,159.968,172486,4
1998-06-27,14,The Arms Of The One Who Loves You,Xscape,4SCnjFSNQ56BmeamHqcOMA,False,11,7,9,0.657,0.456,0,-8.917,1,0.0345,0.311,0,0.0922,0.182,115.4,260427,4
1998-06-27,15,Say It,Voices Of Theory,4SCnjFSNQ56BmeamHqcOMA,False,15,15,13,0.381,0.415,0,-10.298,1,0.0691,0.675,0,0.0795,0.257,61.908,269467,3
1998-06-27,16,I Got The Hook Up!,Master P Featuring Sons Of Funk,4SCnjFSNQ56BmeamHqcOMA,False,18,16,12,0.706,0.632,1,-7.017,1,0.192,0.026,0,0.362,0.277,148.015,182938,4
1998-06-27,17,Body Bumpin' Yippie-Yi-Yo,Public Announcement,4SCnjFSNQ56BmeamHqcOMA,False,14,5,19,0.782,0.363,2,-7.744,1,0.0441,0.0472,0,0.149,0.27,121.986,273667,4
1998-06-27,18,Let's Ride,Montell Jordan Feat. Master P & Silkk The Shocker,4SCnjFSNQ56BmeamHqcOMA,False,17,2,17,0.59,0.538,1,-5.949,1,0.247,0.0272,0,0.17,0.578,121.929,294600,4
1998-06-27,19,Stop,Spice Girls,4SCnjFSNQ56BmeamHqcOMA,False,36,19,2,0.722,0.845,2,-4.446,0,0.0308,0.287,0,0.0561,0.965,130.13,204754,4
1998-06-27,20,Make It Hot,"Nicole Featuring Missy ""Misdemeanor"" Elliott & Mocha",74nsOZqzZzyvFVvBy12I7Y,True,0,20,1,0.76,0.458,7,-8.834,1,0.19,0.376,0.000229,0.143,0.581,84.08,267093,4
1998-06-27,21,Looking Through Your Eyes,LeAnn Rimes,74nsOZqzZzyvFVvBy12I7Y,False,21,18,11,0.487,0.271,10,-11.566,1,0.0283,0.618,0,0.16,0.194,80.126,245467,4
1998-06-27,22,It's All About Me,Mya & Sisqo,74nsOZqzZzyvFVvBy12I7Y,False,16,6,16,0.812,0.5,2,-6.842,1,0.084,0.209,0,0.174,0.521,137.041,264933,4
1998-06-27,23,Ghetto Supastar (That Is What You Are),Pras Michel Feat. Ol' Dirty Bastard & Introducing Mya,0tIG1vFpmO37RDRvcjQRg0,True,0,23,1,0.795,0.639,1,-8.805,0,0.23,0.0479,1.49e-06,0.135,0.588,100.027,265333,4
1998-06-27,24,Gettin' Jiggy Wit It,Will Smith,0tIG1vFpmO37RDRvcjQRg0,False,23,1,18,0.881,0.874,6,-4.505,1,0.139,0.0175,1.14e-06,0.154,0.858,107.891,227933,4
1998-06-27,25,Turn It Up [Remix]/Fire It Up,Busta Rhymes,0tIG1vFpmO37RDRvcjQRg0,False,20,10,8,0.817,0.84,2,-8.598,1,0.0922,0.00506,0.00034,0.288,0.89,104.295,237907,4
1998-06-27,26,I Want You Back,'N Sync,0tIG1vFpmO37RDRvcjQRg0,False,19,13,17,0.758,0.93,8,-3.22,0,0.0425,0.0503,0.000226,0.325,0.853,112.042,202107,4
1998-06-27,27,How's It Going To Be,Third Eye Blind,0tIG1vFpmO37RDRvcjQRg0,False,28,9,30,0.562,0.593,5,-9.362,1,0.0263,0.00327,0.00139,0.0967,0.574,80.289,253413,4
1998-06-27,28,"No, No, No",Destiny's Child,0tIG1vFpmO37RDRvcjQRg0,False,25,3,31,0.67,0.582,1,-3.574,1,0.224,0.3,0,0.0845,0.675,181.841,207467,4
1998-06-27,29,Make Em' Say Uhh!,"Master P Feat. Fiend, Silkk The Shocker, Mia X & Mystikal",0tIG1vFpmO37RDRvcjQRg0,False,24,16,22,0.711,0.729,6,-5.432,0,0.49,0.00513,0,0.0615,0.488,169.845,302507,4
1998-06-27,30,Heaven's What I Feel,Gloria Estefan,0tIG1vFpmO37RDRvcjQRg0,False,27,27,6,0.62,0.903,5,-5.045,1,0.0383,0.18,0,0.12,0.427,130.992,301600,4
1998-06-27,31,This Kiss,Faith Hill,0tIG1vFpmO37RDRvcjQRg0,False,31,31,15,0.398,0.804,11,-5.559,1,0.0451,0.175,0,0.181,0.709,186.752,194307,4
1998-06-27,32,Shorty (You Keep Playin' With My Mind),Imajin Featuring Keith Murray,0tIG1vFpmO37RDRvcjQRg0,False,30,30,5,0.848,0.698,11,-4.885,0,0.241,0.0181,4.07e-06,0.203,0.895,101.074,294960,4
1998-06-27,33,How Do I Live,LeAnn Rimes,0tIG1vFpmO37RDRvcjQRg0,False,26,2,54,0.577,0.462,2,-7.989,1,0.0279,0.128,0,0.0822,0.258,128.303,266973,4
1998-06-27,34,Together Again,Janet,0tIG1vFpmO37RDRvcjQRg0,False,29,1,28,0.873,0.593,7,-8.942,1,0.103,0.078,0.00697,0.104,0.495,123.091,301200,4
1998-06-27,35,I Don't Want To Wait,Paula Cole,0tIG1vFpmO37RDRvcjQRg0,False,33,11,35,0.41,0.468,11,-8.177,1,0.0553,0.298,1.19e-05,0.0426,0.475,177.508,320027,4
1998-06-27,36,Whatcha Gone Do?,Link,0tIG1vFpmO37RDRvcjQRg0,False,37,36,4,0.765,0.613,11,-7.935,1,0.0319,0.171,2.19e-05,0.163,0.937,93.811,259162,4
1998-06-27,37,Raise The Roof,Luke Featuring No Good But So Good,0tIG1vFpmO37RDRvcjQRg0,False,32,26,14,0.737,0.892,2,-5.607,1,0.358,0.0436,0,0.0798,0.662,173.786,310827,4
1998-06-27,38,Cheers 2 U,Playa,0tIG1vFpmO37RDRvcjQRg0,False,38,38,14,0.728,0.334,0,-11.11,1,0.0725,0.177,1.31e-06,0.103,0.478,127.053,311427,4
1998-06-27,39,Still Not A Player,Big Punisher Featuring Joe,0tIG1vFpmO37RDRvcjQRg0,False,39,39,3,0.9,0.619,4,-6.518,0,0.312,0.203,0.00156,0.0647,0.864,94.121,236800,4
1998-06-27,40,Frozen,Madonna,0tIG1vFpmO37RDRvcjQRg0,False,22,2,15,0.602,0.616,1,-10.917,1,0.0353,0.662,0.0153,0.149,0.31,108.017,367333,4
1998-06-27,41,Who Am I,Beenie Man,0tIG1vFpmO37RDRvcjQRg0,False,43,40,16,0.628,0.753,11,-8.778,1,0.468,0.211,0,0.12,0.559,86.194,196000,4
1998-06-27,42,Victory,Puff Daddy & The Family Featuring The Notorious B.I.G. & Busta Rh,0tIG1vFpmO37RDRvcjQRg0,False,35,19,15,0.609,0.731,9,-6.846,1,0.322,0.397,0,0.664,0.685,91.778,296267,4
1998-06-27,43,Candle In The Wind 1997/Something About The Way You Look Tonight,Elton John,0tIG1vFpmO37RDRvcjQRg0,False,45,1,38,0.48,0.628,6,-7.643,1,0.0262,0.174,3.28e-05,0.0753,0.541,143.412,240547,4
1998-06-27,44,When The Lights Go Out,Five,0tIG1vFpmO37RDRvcjQRg0,False,52,44,4,0.854,0.827,5,-6.424,1,0.0335,0.0636,0,0.123,0.961,104.001,249600,4
1998-06-27,45,Nice & Slow,Usher,0tIG1vFpmO37RDRvcjQRg0,False,40,1,23,0.819,0.299,5,-11.964,0,0.122,0.153,0,0.3,0.515,121.913,227907,4
1998-06-27,47,What You Want,Mase Featuring Total,,False,41,6,22,0.838,0.72,10,-6.593,0,0.384,0.0312,1.11e-05,0.422,0.845,93.76,242947,4
1998-06-27,48,You Make Me Wanna...,Usher,,False,42,2,45,0.761,0.639,5,-7.577,0,0.0539,0.0359,0,0.0945,0.922,164.088,219120,4
1998-06-27,49,Get At Me Dog,DMX Featuring Sheek Of The Lox,,False,47,39,18,0.596,0.623,1,-8.444,1,0.496,0.0399,0,0.729,0.476,97.002,243240,4
1998-06-27,50,My Heart Will Go On,Celine Dion,,False,44,1,18,0.428,0.276,4,-11.729,1,0.0312,0.732,5.33e-06,0.117,0.0382,99.195,280000,1
1998-06-27,51,Imagination,Tamia,,False,46,37,15,0.895,0.495,9,-7.186,0,0.178,0.0998,6.28e-05,0.0583,0.593,99.233,213973,4
1998-06-27,52,You Won't Forget Me,La Bouche,,False,48,48,4,0.722,0.91,1,-4.135,1,0.032,0.0182,1.17e-06,0.0872,0.687,133.045,196347,4
1998-06-27,53,Spark,Tori Amos,7bG5NDhlrDel1aNofKPNf6,True,0,53,1,0.351,0.738,4,-4.309,0,0.038,0.0797,5.21e-05,0.0829,0.475,138.025,253413,3
1998-06-27,54,Wishlist,Pearl Jam,7bG5NDhlrDel1aNofKPNf6,False,53,47,6,0.623,0.342,0,-8.694,1,0.038,0.0134,0.00412,0.106,0.101,115.032,206587,4
1998-06-27,55,Push It,Garbage,7bG5NDhlrDel1aNofKPNf6,False,55,52,8,0.564,0.909,0,-6.471,1,0.0311,0.00034,0.11,0.0746,0.892,123.895,242533,4
1998-06-27,56,Bitter Sweet Symphony,The Verve,7bG5NDhlrDel1aNofKPNf6,False,54,12,14,0.356,0.917,9,-6.006,1,0.0479,0.0335,0,0.406,0.518,171.176,357267,4
1998-06-27,57,There's Your Trouble,Dixie Chicks,7bG5NDhlrDel1aNofKPNf6,False,60,57,7,0.737,0.869,2,-5.433,1,0.0267,0.481,0,0.308,0.898,126.628,193065,4
1998-06-27,58,Do Your Thing,7 Mile,7bG5NDhlrDel1aNofKPNf6,False,66,58,10,0.7,0.216,3,-8.921,0,0.0402,0.0193,0.836,0.0577,0.416,59.994,291107,4
1998-06-27,59,Ninety Nine [Flash The Message],John Forte,7bG5NDhlrDel1aNofKPNf6,False,62,59,5,0.882,0.52,4,-10.899,0,0.315,0.0589,0,0.313,0.447,96.846,223533,4
1998-06-27,60,Romeo And Juliet,Sylk-E. Fyne Featuring Chill,7bG5NDhlrDel1aNofKPNf6,False,51,6,20,0.801,0.424,10,-8.153,1,0.051,0.218,2.78e-05,0.127,0.91,75.967,310750,4
1998-06-27,61,One Heart At A Time,Various Artists,7bG5NDhlrDel1aNofKPNf6,False,58,56,5,0.669,0.487,10,-9.823,1,0.0264,0.0975,0.191,0.292,0.475,104.688,242655,4
1998-06-27,62,Second Round K.O.,Canibus,7bG5NDhlrDel1aNofKPNf6,False,56,28,12,0.74,0.537,7,-11.337,1,0.457,0.0159,0,0.564,0.686,94.025,277533,4
1998-06-27,63,Recover Your Soul,Elton John,7bG5NDhlrDel1aNofKPNf6,False,59,55,11,0.725,0.653,7,-9.365,1,0.0238,0.134,0.00675,0.272,0.582,103.003,318040,4
1998-06-27,64,I'm Alright,Jo Dee Messina,7bG5NDhlrDel1aNofKPNf6,False,61,43,16,0.676,0.733,0,-7.745,1,0.0294,0.191,0,0.192,0.591,98.234,199040,3
1998-06-27,65,Clock Strikes,Timbaland & Magoo,7bG5NDhlrDel1aNofKPNf6,False,57,37,9,0.787,0.714,6,-8.63,0,0.131,0.0641,0.436,0.273,0.81,165.465,291120,4
1998-06-27,66,Do For Love,2Pac Featuring Eric Williams,7bG5NDhlrDel1aNofKPNf6,False,70,21,15,0.874,0.63,1,-3.585,1,0.298,0.0578,0.00479,0.0582,0.717,95.0,281600,4
1998-06-27,68,I Just Want To Dance With You,George Strait,,False,72,61,10,0.715,0.469,0,-8.674,1,0.0279,0.439,8.69e-05,0.104,0.502,113.991,210867,4
1998-06-27,69,This Is How We Party,S.O.A.P.,,False,65,51,11,0.758,0.911,6,-4.192,0,0.0409,0.0467,0.00252,0.687,0.911,109.974,198067,4
1998-06-27,70,The Mummers' Dance,Loreena McKennitt,,False,63,18,17,0.548,0.456,0,-11.53,0,0.0289,0.425,0.116,0.0892,0.294,120.274,367440,4
1998-06-27,71,I Honestly Love You (David Foster Vers.),Olivia Newton-John,,False,67,67,5,0.637,0.329,10,-11.362,1,0.0272,0.613,2.36e-06,0.14,0.152,112.075,246147,4
1998-06-27,72,Now That I Found You,Terri Clark,,False,75,72,6,0.593,0.461,2,-7.549,1,0.0236,0.356,0,0.183,0.27,90.399,217360,4
1998-06-27,73,I Do [Cherish You],Mark Wills,,False,76,72,8,0.586,0.477,6,-8.136,1,0.0243,0.593,0,0.0935,0.308,82.991,199707,4
1998-06-27,74,Party Ain't A Party,"Queen Pen Featuring Teddy Riley, Nutta Butta, Markell & Jesse Wes",,False,83,74,2,0.744,0.803,7,-6.445,1,0.202,0.0259,0,0.555,0.574,94.088,250200,4
1998-06-27,75,The Unforgiven II,Metallica,,False,79,59,13,0.49,0.884,8,-4.533,0,0.0428,0.000514,0.00177,0.27,0.254,132.978,396440,4
1998-06-27,76,A Rose Is Still A Rose,Aretha Franklin,,False,69,26,16,0.631,0.793,8,-7.551,0,0.251,0.212,0,0.0441,0.826,175.814,266667,4
1998-06-27,78,I'm From The Country,Tracy Byrd,,False,77,63,13,0.687,0.898,2,-3.93,1,0.042,0.206,0,0.284,0.952,129.542,213973,4
1998-06-27,79,Freak Out,Nutta Butta Featuring Teddy Riley And Anonymous,,False,84,79,2,0.834,0.948,6,-4.022,1,0.157,0.0947,5.68e-06,0.326,0.738,99.53,295373,4
1998-06-27,80,Sin So Well,Rebekah,,False,80,80,2,0.727,0.629,6,-5.022,0,0.0331,0.288,0,0.107,0.518,119.663,219360,4
1998-06-27,81,A Man Holdin' On (To A Woman Lettin' Go),Ty Herndon,,False,81,81,4,0.606,0.403,9,-7.95,1,0.0288,0.555,1.23e-06,0.0954,0.202,128.122,217160,4
1998-06-27,83,Baby Be There,Nu Flavor,,False,89,83,3,0.615,0.516,4,-8.31,0,0.0238,0.601,3.33e-05,0.0524,0.329,83.75,255840,4
1998-06-27,84,There You Are,Sam Salter,,False,95,84,2,0.63,0.52,11,-8.162,0,0.0289,0.257,0,0.0577,0.375,137.792,258400,4
1998-06-27,85,Hooked On A Feeling (Ooga-Chaka),Baby Talk,,False,82,71,5,0.613,0.678,8,-7.85,1,0.106,0.542,0,0.0391,0.911,118.629,181107,4
1998-06-27,87,Just Be Straight With Me,"Silkk The Shocker Featuring Master P, Destiny's Child, O'Dell, Mo",,False,74,57,15,0.77,0.513,2,-10.7,1,0.099,0.193,0,0.315,0.48,92.89,261933,4
1998-06-27,88,One Of These Days,Tim McGraw,,False,86,74,9,0.478,0.267,3,-12.184,1,0.0305,0.88,0.00017,0.197,0.289,71.334,281960,4
1998-06-27,89,Too Much,Spice Girls,,False,87,9,20,0.333,0.631,2,-4.992,1,0.0461,0.484,0,0.332,0.342,80.14,271933,4
1998-06-27,90,"The Cup Of Life (The Official Song Of The World Cup, France '98)",Ricky Martin,68CzXNGAMmb3k5MhLu0xVb,True,0,90,1,0.709,0.911,5,-6.945,0,0.0433,0.0387,0.000132,0.391,0.661,126.984,279920,4
1998-06-27,91,Black Ice (Sky High),Goodie Mob Featuring Outkast,0Uu8BPsWQGZk5AiRN3uBwn,True,0,91,1,0.927,0.678,11,-5.41,0,0.362,0.0471,0,0.0479,0.374,101.18,205107,4
1998-06-27,92,You Only Have To Say You Love Me,Hannah Jones,0Uu8BPsWQGZk5AiRN3uBwn,False,92,92,3,0.737,0.957,2,-6.877,0,0.0421,0.00216,0.000819,0.353,0.961,130.005,360160,4
1998-06-27,93,Blue On Black,The Kenny Wayne Shepherd Band,0Uu8BPsWQGZk5AiRN3uBwn,False,94,78,9,0.472,0.525,7,-16.084,1,0.0407,0.00117,0.0027,0.304,0.524,156.059,325279,4
1998-06-27,94,Gitty Up,Salt-N-Pepa,0Uu8BPsWQGZk5AiRN3uBwn,False,73,50,14,0.884,0.553,11,-6.514,1,0.071,0.0284,6.3e-06,0.0859,0.884,104.931,240600,4
1998-06-27,95,Out Of My Bones,Randy Travis,0Uu8BPsWQGZk5AiRN3uBwn,False,91,64,10,0.522,0.732,3,-5.773,1,0.0277,0.427,0,0.134,0.587,144.962,164773,4
1998-06-27,96,My Heart Will Go On,Deja Vu,0Uu8BPsWQGZk5AiRN3uBwn,False,78,58,16,0.588,0.941,0,-5.254,0,0.0459,0.0573,0.002,0.0301,0.918,131.995,442851,4
1998-06-27,97,Rain,SWV,0Uu8BPsWQGZk5AiRN3uBwn,False,97,25,14,0.643,0.486,4,-10.443,0,0.0278,0.337,3.86e-06,0.702,0.146,138.151,264507,3
1998-06-27,98,I Wanna Get Next To You,Christion,0Uu8BPsWQGZk5AiRN3uBwn,False,93,86,4,0.652,0.485,0,-9.199,1,0.0275,0.198,0.000171,0.11,0.575,131.876,230133,4
1998-06-27,100,Still Po' Pimpin',Do Or Die Featuring Johnny P & Twista,,False,90,62,14,0.748,0.526,8,-10.896,0,0.065,0.292,0,0.0471,0.771,136.028,240000,4
