date,position,title,artist,spotify_id,is_new,last_pos,peak_pos,weeks,danceability,energy,key,loudness,mode,speechiness,acousticness,instrumentalness,liveness,valence,tempo,duration_ms,time_signature
2006-03-25,1,So Sick,Ne-Yo,5FXOEdfNW7nYQrBWtW49Cl,False,1,1,16,0.452,0.574,6,-8.336,1,0.31,0.246,0,0.189,0.58,92.791,207187,4
2006-03-25,2,Temperature,Sean Paul,5FXOEdfNW7nYQrBWtW49Cl,False,2,2,10,0.951,0.6,0,-4.675,0,0.0685,0.106,0,0.0712,0.822,125.04,218573,4
2006-03-25,3,You're Beautiful,James Blunt,5FXOEdfNW7nYQrBWtW49Cl,False,3,1,20,0.675,0.479,0,-9.87,0,0.0278,0.633,1.76e-05,0.088,0.454,81.998,209493,4
2006-03-25,4,Be Without You,Mary J. Blige,5FXOEdfNW7nYQrBWtW49Cl,False,4,3,18,0.724,0.705,2,-5.859,0,0.112,0.067,0,0.262,0.662,146.589,246333,4
2006-03-25,5,Bad Day,Daniel Powter,5FXOEdfNW7nYQrBWtW49Cl,False,14,5,5,0.599,0.785,3,-4.013,1,0.0309,0.448,0.00336,0.151,0.52,140.046,233640,4
2006-03-25,6,I'm N Luv (Wit A Stripper),T-Pain Featuring Mike Jones,5FXOEdfNW7nYQrBWtW49Cl,False,6,5,13,0.731,0.368,8,-10.38,1,0.0688,0.00544,0,0.193,0.512,145.171,265333,4
2006-03-25,7,Unwritten,Natasha Bedingfield,5FXOEdfNW7nYQrBWtW49Cl,False,10,7,16,0.706,0.8,5,-6.333,1,0.0399,0.00584,0,0.0822,0.629,100.011,259333,4
2006-03-25,8,Check On It,Beyonce Featuring Slim Thug,5FXOEdfNW7nYQrBWtW49Cl,False,5,1,19,0.705,0.796,7,-6.845,1,0.267,0.0708,0,0.388,0.864,166.042,210453,4
2006-03-25,9,"Lean Wit It, Rock Wit It",Dem Franchize Boyz Featuring Lil Peanut & Charlay,5FXOEdfNW7nYQrBWtW49Cl,False,9,9,10,0.886,0.62,5,-5.854,1,0.307,0.082,0,0.1,0.6,76.035,229813,4
2006-03-25,10,Yo (Excuse Me Miss),Chris Brown,5FXOEdfNW7nYQrBWtW49Cl,False,8,7,13,0.536,0.612,4,-5.847,1,0.272,0.119,0,0.209,0.57,86.768,229040,4
2006-03-25,11,Grillz,"Nelly Featuring Paul Wall, Ali & Gipp",5FXOEdfNW7nYQrBWtW49Cl,False,7,1,19,0.865,0.514,4,-7.251,0,0.241,0.0399,0,0.255,0.822,82.987,271240,4
2006-03-25,12,Everytime We Touch,Cascada,5FXOEdfNW7nYQrBWtW49Cl,False,11,10,15,0.633,0.976,8,-5.362,1,0.0519,0.00281,1.29e-05,0.382,0.493,142.027,197124,4
2006-03-25,13,Shake That,Eminem Featuring Nate Dogg,5FXOEdfNW7nYQrBWtW49Cl,False,12,6,14,0.963,0.643,1,-5.785,0,0.117,0.0507,4.94e-05,0.157,0.534,107.005,274440,4
2006-03-25,14,Ms. New Booty,Bubba Sparxxx Featuring Ying Yang Twins & Mr. ColliPark,5FXOEdfNW7nYQrBWtW49Cl,False,15,14,8,0.64,0.62,1,-5.931,1,0.416,0.016,0,0.0831,0.609,129.37,252653,5
2006-03-25,15,Unpredictable,Jamie Foxx Featuring Ludacris,5FXOEdfNW7nYQrBWtW49Cl,False,13,8,17,0.734,0.599,9,-8.462,1,0.197,0.206,0,0.0555,0.772,145.185,219867,4
2006-03-25,16,Beep,The Pussycat Dolls Featuring will.i.am,5FXOEdfNW7nYQrBWtW49Cl,False,25,16,8,0.935,0.745,7,-6.391,1,0.0431,0.00914,0,0.116,0.518,103.691,229360,4
2006-03-25,17,"Dance, Dance",Fall Out Boy,5FXOEdfNW7nYQrBWtW49Cl,False,16,9,21,0.622,0.961,11,-3.198,0,0.154,0.00523,0,0.0854,0.449,114.452,180267,4
2006-03-25,18,Touch It,Busta Rhymes,5FXOEdfNW7nYQrBWtW49Cl,False,17,16,14,0.658,0.551,1,-6.62,1,0.37,0.0043,0.000108,0.197,0.442,138.335,214960,5
2006-03-25,19,Walk Away,Kelly Clarkson,5FXOEdfNW7nYQrBWtW49Cl,False,26,19,10,0.75,0.888,0,-4.524,1,0.0426,0.0147,1.11e-06,0.0759,0.935,115.973,189307,4
2006-03-25,20,"Jesus, Take The Wheel",Carrie Underwood,5FXOEdfNW7nYQrBWtW49Cl,False,24,20,19,0.359,0.518,2,-3.537,1,0.0302,0.665,0,0.106,0.135,76.572,226493,4
2006-03-25,21,Dirty Little Secret,The All-American Rejects,5FXOEdfNW7nYQrBWtW49Cl,False,18,9,33,0.465,0.954,10,-4.251,1,0.044,0.000346,5.38e-06,0.573,0.458,143.85,193653,4
2006-03-25,22,Stupid Girls,P!nk,5FXOEdfNW7nYQrBWtW49Cl,False,19,13,5,0.683,0.886,4,-5.045,0,0.071,0.000738,0.00188,0.0524,0.566,100.04,197173,4
2006-03-25,23,Love,Keyshia Cole,5FXOEdfNW7nYQrBWtW49Cl,False,20,20,8,0.688,0.519,5,-4.285,1,0.0283,0.064,0,0.1,0.318,116.714,255333,4
2006-03-25,24,Pump It,The Black Eyed Peas,5FXOEdfNW7nYQrBWtW49Cl,False,21,18,16,0.89,0.57,6,-10.966,1,0.333,0.396,1.13e-06,0.443,0.56,95.037,84193,4
2006-03-25,25,My Humps,The Black Eyed Peas,5FXOEdfNW7nYQrBWtW49Cl,False,28,3,32,0.743,0.751,0,-5.216,1,0.0326,0.305,0.00082,0.0893,0.361,118.083,158653,4
2006-03-25,26,Because Of You,Kelly Clarkson,5FXOEdfNW7nYQrBWtW49Cl,False,22,7,30,0.583,0.584,5,-5.362,0,0.0314,0.254,0,0.123,0.136,140.039,219493,4
2006-03-25,27,Run It!,Chris Brown,5FXOEdfNW7nYQrBWtW49Cl,False,23,1,31,0.846,0.482,1,-6.721,0,0.129,0.0246,0,0.393,0.212,100.969,229867,4
2006-03-25,28,King Without A Crown,Matisyahu,5FXOEdfNW7nYQrBWtW49Cl,False,61,28,8,0.697,0.859,5,-5.306,0,0.19,0.0349,0,0.0931,0.696,93.78,222387,4
2006-03-25,29,Fresh Azimiz,Bow Wow Featuring J-Kwon & Jermaine Dupri,5FXOEdfNW7nYQrBWtW49Cl,False,32,29,14,0.768,0.602,10,-5.656,0,0.312,0.0701,0,0.232,0.506,160.133,271133,4
2006-03-25,30,Rompe,Daddy Yankee,5FXOEdfNW7nYQrBWtW49Cl,False,31,30,17,0.687,0.806,1,-6.019,0,0.0549,0.0358,5.83e-06,0.0569,0.534,176.064,189040,4
2006-03-25,31,Stickwitu,The Pussycat Dolls,5FXOEdfNW7nYQrBWtW49Cl,False,27,5,23,0.655,0.54,9,-6.482,1,0.0516,0.268,0,0.068,0.43,79.983,207507,4
2006-03-25,32,Who Says You Can't Go Home,Bon Jovi,5FXOEdfNW7nYQrBWtW49Cl,False,34,32,9,0.537,0.885,7,-3.641,1,0.0343,0.0437,0,0.274,0.802,131.698,230280,4
2006-03-25,33,Always On Your Side,Sheryl Crow & Sting,5FXOEdfNW7nYQrBWtW49Cl,False,35,33,2,0.519,0.553,5,-4.702,1,0.0264,0.543,0,0.139,0.251,140.164,251373,4
2006-03-25,34,Gold Digger,Kanye West Featuring Jamie Foxx,5FXOEdfNW7nYQrBWtW49Cl,False,29,1,35,0.629,0.696,1,-5.572,0,0.348,0.0195,0,0.0554,0.623,93.034,207627,4
2006-03-25,35,Photograph,Nickelback,5FXOEdfNW7nYQrBWtW49Cl,False,33,2,29,0.515,0.876,8,-3.756,1,0.0292,0.000932,0.000166,0.136,0.385,145.916,258920,4
2006-03-25,36,Ridin',Chamillionaire Featuring Krayzie Bone,5FXOEdfNW7nYQrBWtW49Cl,False,57,36,4,0.787,0.799,8,-4.68,0,0.0993,0.189,0,0.3,0.835,143.052,303053,4
2006-03-25,37,Tonight I Wanna Cry,Keith Urban,5FXOEdfNW7nYQrBWtW49Cl,False,36,36,13,0.579,0.385,7,-7.885,1,0.0256,0.88,2.17e-06,0.164,0.145,103.779,259507,4
2006-03-25,38,"Sugar, We're Goin' Down",Fall Out Boy,5FXOEdfNW7nYQrBWtW49Cl,False,39,8,39,0.494,0.842,7,-4.784,1,0.0843,0.00579,0,0.122,0.574,162.011,229093,4
2006-03-25,39,You And Me,Lifehouse,5FXOEdfNW7nYQrBWtW49Cl,False,37,5,58,0.459,0.427,7,-7.734,1,0.0267,0.114,0,0.168,0.354,139.902,195493,3
2006-03-25,40,One Wish,Ray J,5FXOEdfNW7nYQrBWtW49Cl,False,30,11,25,0.525,0.652,5,-7.042,0,0.28,0.278,0,0.339,0.602,127.673,337640,4
2006-03-25,41,Rodeo,Juvenile,5FXOEdfNW7nYQrBWtW49Cl,False,41,41,16,0.7,0.547,1,-7.907,1,0.156,0.0532,0,0.068,0.67,157.137,237947,3
2006-03-25,42,Touch The Sky,Kanye West Featuring Lupe Fiasco,5FXOEdfNW7nYQrBWtW49Cl,False,47,42,5,0.552,0.846,9,-4.912,1,0.342,0.0114,0,0.309,0.554,98.56,236600,1
2006-03-25,43,Feel Good Inc,Gorillaz,5FXOEdfNW7nYQrBWtW49Cl,False,44,14,44,0.818,0.705,6,-6.679,1,0.177,0.00836,0.00233,0.613,0.772,138.559,222640,4
2006-03-25,44,SOS,Rihanna,5FXOEdfNW7nYQrBWtW49Cl,False,46,44,5,0.677,0.671,7,-4.905,1,0.0361,0.004,5.07e-05,0.413,0.527,137.046,238920,4
2006-03-25,45,Your Man,Josh Turner,5FXOEdfNW7nYQrBWtW49Cl,False,38,38,13,0.744,0.637,6,-4.483,1,0.0241,0.337,0.000222,0.0696,0.785,100.511,211893,4
2006-03-25,46,When I Get Where I'm Going,Brad Paisley Featuring Dolly Parton,5FXOEdfNW7nYQrBWtW49Cl,False,40,39,17,0.52,0.379,0,-9.906,1,0.0279,0.619,1.85e-06,0.108,0.208,85.934,247053,4
2006-03-25,47,Laffy Taffy,D4L,5FXOEdfNW7nYQrBWtW49Cl,False,42,1,26,0.891,0.439,7,-7.994,0,0.428,0.0351,0,0.0932,0.622,77.499,224253,4
2006-03-25,48,We Be Burnin',Sean Paul,5FXOEdfNW7nYQrBWtW49Cl,False,45,6,28,0.95,0.803,1,-4.195,1,0.151,0.145,0,0.0748,0.86,117.0,213066,4
2006-03-25,49,What Hurts The Most,Rascal Flatts,5FXOEdfNW7nYQrBWtW49Cl,False,66,49,6,0.537,0.674,5,-5.134,0,0.0277,0.0088,0,0.265,0.33,136.002,214107,4
2006-03-25,50,There It Go! (The Whistle Song),Juelz Santana,5FXOEdfNW7nYQrBWtW49Cl,False,43,6,24,0.942,0.892,6,-6.363,0,0.196,0.023,0.000897,0.264,0.595,100.007,180493,4
2006-03-25,51,Move Along,The All-American Rejects,5FXOEdfNW7nYQrBWtW49Cl,False,75,51,7,0.518,0.916,3,-3.858,1,0.0454,0.000148,0,0.291,0.646,109.864,238880,4
2006-03-25,52,Poppin' My Collar,Three 6 Mafia,5FXOEdfNW7nYQrBWtW49Cl,False,72,52,4,0.729,0.795,7,-4.579,1,0.144,0.354,0,0.536,0.856,146.747,176880,4
2006-03-25,53,For You I Will (Confidence),Teddy Geiger,5FXOEdfNW7nYQrBWtW49Cl,False,55,53,6,0.375,0.539,1,-12.153,0,0.042,0.0363,0.000233,0.132,0.0772,178.801,227596,3
2006-03-25,54,Girl Next Door,Saving Jane,5FXOEdfNW7nYQrBWtW49Cl,False,54,54,5,0.627,0.81,2,-5.684,1,0.0437,0.0134,0,0.109,0.496,122.058,203253,4
2006-03-25,55,Living In Fast Forward,Kenny Chesney,5FXOEdfNW7nYQrBWtW49Cl,False,48,48,9,0.689,0.907,9,-5.587,1,0.037,0.0254,0.000732,0.138,0.912,116.968,211893,4
2006-03-25,56,Over My Head (Cable Car),The Fray,5FXOEdfNW7nYQrBWtW49Cl,False,64,56,5,0.592,0.729,8,-4.156,1,0.0448,0.022,0,0.0653,0.709,116.03,236267,4
2006-03-25,57,Ever The Same,Rob Thomas,5FXOEdfNW7nYQrBWtW49Cl,False,52,52,10,0.435,0.729,1,-4.818,0,0.0307,0.0152,2.63e-05,0.11,0.524,188.017,256600,4
2006-03-25,58,Tell Me When To Go,E-40 Featuring Keak Da Sneak,5FXOEdfNW7nYQrBWtW49Cl,False,73,58,4,0.857,0.751,1,-7.086,1,0.323,0.00642,0.000257,0.104,0.293,106.888,237667,4
2006-03-25,59,Upside Down,Jack Johnson,5FXOEdfNW7nYQrBWtW49Cl,False,51,38,9,0.787,0.655,6,-8.339,0,0.0431,0.238,0.000171,0.138,0.65,102.485,208653,4
2006-03-25,60,Best Friend,50 Cent & Olivia,5FXOEdfNW7nYQrBWtW49Cl,False,60,60,3,0.549,0.636,10,-3.923,0,0.376,0.395,0,0.0974,0.661,182.363,251547,4
2006-03-25,61,L.O.V.E.,Ashlee Simpson,5FXOEdfNW7nYQrBWtW49Cl,False,50,22,14,0.588,0.828,5,-3.309,0,0.0538,0.00298,0.00203,0.644,0.938,191.874,153053,4
2006-03-25,62,Rush,Aly & AJ,5FXOEdfNW7nYQrBWtW49Cl,False,62,59,4,0.548,0.815,2,-5.218,0,0.0409,0.0175,8.9e-06,0.127,0.212,129.963,191733,4
2006-03-25,63,Get Drunk And Be Somebody,Toby Keith,5FXOEdfNW7nYQrBWtW49Cl,False,68,63,10,0.628,0.896,2,-4.132,1,0.0557,0.229,0,0.365,0.666,128.06,178840,4
2006-03-25,64,In The Deep,Bird York,6op3sS07BxEMMdoWNcAH6o,True,0,64,1,0.126,0.793,6,-16.094,0,0.253,0.8,0.0048,0.0877,0.035,81.226,121000,3
2006-03-25,65,What You Know,T.I.,6op3sS07BxEMMdoWNcAH6o,False,83,65,2,0.551,0.81,11,-4.365,1,0.0344,0.0155,0,0.169,0.332,73.464,274333,4
2006-03-25,66,Goodbye My Lover,James Blunt,6op3sS07BxEMMdoWNcAH6o,False,0,66,2,0.5,0.259,4,-12.593,1,0.0491,0.952,0.00318,0.0903,0.268,91.089,258653,4
2006-03-25,67,Believe,Brooks & Dunn,6op3sS07BxEMMdoWNcAH6o,False,69,67,13,0.598,0.223,9,-9.842,1,0.0365,0.782,9.76e-05,0.102,0.211,117.308,338520,4
2006-03-25,68,She Don't Tell Me To,Montgomery Gentry,6op3sS07BxEMMdoWNcAH6o,False,65,65,11,0.459,0.703,5,-5.294,1,0.0338,0.0606,0,0.0889,0.39,159.856,187213,4
2006-03-25,69,Perfect Situation,Weezer,6op3sS07BxEMMdoWNcAH6o,False,59,51,14,0.47,0.806,6,-4.1,1,0.0328,0.0271,0.000142,0.2,0.403,93.853,254333,4
2006-03-25,70,Gotta Go,Trey Songz,6op3sS07BxEMMdoWNcAH6o,False,82,67,17,0.675,0.635,5,-5.356,0,0.0632,0.161,0,0.48,0.562,82.21,247053,4
2006-03-25,71,Looking For You,Kirk Franklin,6op3sS07BxEMMdoWNcAH6o,False,71,69,16,0.81,0.72,1,-4.793,1,0.0503,0.0138,0,0.221,0.805,121.984,246560,4
2006-03-25,72,Nobody But Me,Blake Shelton,6op3sS07BxEMMdoWNcAH6o,False,76,72,7,0.637,0.682,2,-4.632,1,0.0291,0.376,0,0.17,0.541,81.016,158707,4
2006-03-25,73,What's Left Of Me,Nick Lachey,6op3sS07BxEMMdoWNcAH6o,False,67,67,3,0.421,0.728,7,-5.644,1,0.035,0.136,0,0.136,0.311,150.12,244667,4
2006-03-25,74,Oh Yes (aka 'Postman'),Juelz Santana,6op3sS07BxEMMdoWNcAH6o,False,56,56,9,0.756,0.777,0,-5.1,1,0.233,0.21,0,0.329,0.654,147.865,181333,4
2006-03-25,75,Savin' Me,Nickelback,6op3sS07BxEMMdoWNcAH6o,False,94,75,2,0.441,0.815,3,-4.088,1,0.0276,0.000731,0,0.414,0.522,164.007,219320,4
2006-03-25,76,Cheatin',Sara Evans,6op3sS07BxEMMdoWNcAH6o,False,80,76,9,0.416,0.615,9,-4.984,1,0.039,0.0174,6.92e-05,0.233,0.266,157.671,206387,4
2006-03-25,77,Sorry,Madonna,6op3sS07BxEMMdoWNcAH6o,False,58,58,3,0.589,0.877,0,-6.229,0,0.046,0.00121,0.013,0.169,0.443,132.971,281880,4
2006-03-25,78,Lights And Sounds,Yellowcard,6op3sS07BxEMMdoWNcAH6o,False,77,50,8,0.344,0.972,11,-3.675,0,0.116,8.48e-05,0,0.293,0.387,167.819,208187,4
2006-03-25,80,Betcha Can't Do It Like Me,D4L,,False,79,72,6,0.901,0.359,10,-8.198,0,0.248,0.00956,0,0.0752,0.219,149.019,220467,4
2006-03-25,81,When You're Mad,Ne-Yo,,False,99,81,2,0.66,0.548,6,-7.127,1,0.215,0.364,0,0.108,0.436,86.947,222000,4
2006-03-25,82,I Write Sins Not Tragedies,Panic! At The Disco,,False,98,82,2,0.569,0.83,9,-4.106,0,0.14,0.0807,0,0.114,0.609,170.094,186635,4
2006-03-25,83,Girl,Paul Wall,,False,95,83,2,0.693,0.729,4,-8.281,0,0.0347,0.000107,1.9e-05,0.119,0.614,83.989,278453,4
2006-03-25,84,Crash,Gwen Stefani,,False,70,49,7,0.785,0.929,9,-1.635,1,0.0424,0.0192,0,0.873,0.93,126.23,246613,4
2006-03-25,85,Bring Out The Freak In You,Lil Rob,,False,90,85,5,0.95,0.504,4,-7.367,1,0.113,0.000745,5.3e-06,0.32,0.712,110.027,229560,4
2006-03-25,86,Can't Let Go,Anthony Hamilton,,False,93,86,2,0.65,0.501,10,-6.905,1,0.0963,0.582,0,0.112,0.374,127.984,232533,4
2006-03-25,87,Kerosene,Miranda Lambert,,False,81,61,14,0.628,0.92,7,-3.252,1,0.0287,0.00687,5.34e-05,0.337,0.808,126.998,185800,4
2006-03-25,88,Why,Jason Aldean,,False,96,88,2,0.568,0.695,9,-3.828,1,0.0294,0.0688,0,0.15,0.218,135.926,213733,4
2006-03-25,89,In My Mind,Heather Headley,,False,84,84,6,0.616,0.457,0,-6.761,1,0.034,0.148,0,0.125,0.208,119.646,245947,4
2006-03-25,90,Nasty Girl,"The Notorious B.I.G. Featuring Diddy, Nelly, Jagged Edge & Avery Storm",,False,78,44,15,0.833,0.628,2,-7.041,1,0.141,0.0949,1.6e-06,0.282,0.645,106.328,286187,4
2006-03-25,91,Black Horse & The Cherry Tree,KT Tunstall,0qAMjeQFyd1qD0LDiV8gWp,True,0,91,1,0.748,0.786,4,-7.788,0,0.0641,0.328,0,0.34,0.917,104.833,172373,4
2006-03-25,92,My Hood,Young Jeezy,0qAMjeQFyd1qD0LDiV8gWp,False,92,77,9,0.819,0.694,1,-7.472,0,0.0556,0.0192,0,0.0536,0.684,152.041,240187,4
2006-03-25,93,Kryptonite (I'm On It),Purple Ribbon All-Stars,0qAMjeQFyd1qD0LDiV8gWp,False,86,35,18,0.755,0.705,2,-7.105,1,0.216,0.00512,0.807,0.872,0.135,145.062,268267,4
2006-03-25,94,4 Minutes,Avant,3g6SuyjGaGyAXmjvdNI1IU,True,0,94,1,0.828,0.6,10,-5.429,1,0.162,0.0942,0,0.126,0.655,119.969,240320,4
2006-03-25,95,Control Myself,LL Cool J Featuring Jennifer Lopez,3g6SuyjGaGyAXmjvdNI1IU,False,89,89,3,0.825,0.876,10,-6.556,0,0.211,0.00928,1.2e-05,0.205,0.48,120.066,233973,4
2006-03-25,96,Dare,Gorillaz Featuring Shaun Ryder,3g6SuyjGaGyAXmjvdNI1IU,False,0,87,5,0.76,0.891,11,-5.852,0,0.0372,0.0226,0.0868,0.298,0.966,120.265,245000,4
2006-03-25,97,Wherever You Are,Jack Ingram,1uRvF355jFHDKrsUWEXkRF,True,0,97,1,0.572,0.81,2,-5.629,1,0.0315,0.058,0,0.101,0.575,107.906,215560,4
2006-03-25,98,The Real Thing,Bo Bice,3T3Epzn2xHawkZ7uzxR13p,True,0,98,1,0.494,0.87,2,-4.33,1,0.0413,0.0707,2.98e-05,0.0798,0.504,146.882,201667,4
2006-03-25,99,Talk,Coldplay,3T3Epzn2xHawkZ7uzxR13p,False,0,86,4,0.415,0.554,7,-10.839,0,0.0334,0.00541,0.00202,0.155,0.163,120.318,311292,4
2006-03-25,100,Something's Gotta Give,LeAnn Rimes,3Sg82C7qlmgQH9lyovH6AS,True,0,100,1,0.647,0.85,2,-3.464,1,0.0292,0.0771,0,0.0662,0.471,109.002,236840,4
