date,position,title,artist,spotify_id,is_new,last_pos,peak_pos,weeks,danceability,energy,key,loudness,mode,speechiness,acousticness,instrumentalness,liveness,valence,tempo,duration_ms,time_signature
2019-09-28,1,Truth Hurts,Lizzo,,False,1,1,20,0.715,0.624,4,-3.046,0,0.114,0.11,0,0.123,0.412,158.087,173325,4
2019-09-28,2,Senorita,Shawn Mendes & Camila Cabello,,False,2,1,13,0.759,0.54,9,-6.039,0,0.0287,0.037,0,0.0945,0.75,116.947,190960,4
2019-09-28,3,Bad Guy,Billie Eilish,,False,5,1,25,0.701,0.425,7,-10.965,1,0.375,0.328,0.13,0.1,0.562,135.128,194088,4
2019-09-28,4,Someone You Loved,Lewis Capaldi,,False,9,4,19,0.501,0.405,1,-5.679,1,0.0319,0.751,0,0.105,0.446,109.891,182161,4
2019-09-28,5,Panini,Lil Nas X,,False,14,5,13,0.717,0.598,5,-5.613,0,0.0809,0.22,0,0.122,0.496,153.905,151040,4
2019-09-28,6,Ran$om,Lil Tecca,,False,6,4,16,0.536,0.715,7,-6.577,1,0.287,0.571,0.000418,0.471,0.391,179.631,60070,4
2019-09-28,7,No Guidance,Chris Brown Featuring Drake,,False,7,6,15,0.696,0.454,1,-6.756,0,0.153,0.123,0,0.155,0.136,92.928,260640,4
2019-09-28,8,Goodbyes,Post Malone Featuring Young Thug,,False,3,3,11,0.548,0.653,5,-3.875,1,0.081,0.456,0,0.103,0.163,150.068,174853,4
2019-09-28,9,Circles,Post Malone,,False,4,4,3,0.695,0.762,0,-3.497,1,0.0395,0.192,0.00244,0.0863,0.553,120.042,215280,4
2019-09-28,10,Old Town Road,Lil Nas X Featuring Billy Ray Cyrus,,False,11,1,29,0.878,0.619,6,-5.56,1,0.102,0.0533,0,0.113,0.639,136.041,157067,4
2019-09-28,11,I Don't Care,Ed Sheeran & Justin Bieber,,False,13,2,19,0.798,0.675,6,-5.041,1,0.0442,0.0912,0,0.0894,0.842,101.956,219947,4
2019-09-28,12,Talk,Khalid,,False,12,3,32,0.901,0.4,0,-8.575,1,0.126,0.051,0,0.0599,0.346,135.984,197573,4
2019-09-28,13,Don't Call Me Angel (Charlie's Angels),"Ariana Grande, Miley Cyrus & Lana Del Rey",6zegtH6XXd2PDPLvy1Y0n2,True,0,13,1,0.644,0.755,1,-5.325,1,0.0448,0.00237,7.64e-06,0.0859,0.334,102.861,190067,4
2019-09-28,14,Sunflower (Spider-Man: Into The Spider-Verse),Post Malone & Swae Lee,6zegtH6XXd2PDPLvy1Y0n2,False,10,1,48,0.76,0.479,2,-5.574,1,0.0466,0.556,0,0.0703,0.913,89.911,158040,4
2019-09-28,15,Sucker,Jonas Brothers,6zegtH6XXd2PDPLvy1Y0n2,False,19,1,29,0.842,0.734,1,-5.065,0,0.0588,0.0427,0,0.106,0.952,137.958,181027,4
2019-09-28,16,Beautiful People,Ed Sheeran Featuring Khalid,6zegtH6XXd2PDPLvy1Y0n2,False,23,16,12,0.64,0.648,5,-8.113,0,0.187,0.124,0,0.0802,0.548,92.977,197867,4
2019-09-28,17,Take What You Want,Post Malone Featuring Ozzy Osbourne & Travis Scott,6zegtH6XXd2PDPLvy1Y0n2,False,8,8,2,0.499,0.8,1,-2.665,0,0.0502,0.0906,0,0.147,0.272,139.919,229573,4
2019-09-28,18,Money In The Grave,Drake Featuring Rick Ross,6zegtH6XXd2PDPLvy1Y0n2,False,21,7,14,0.831,0.502,10,-4.045,0,0.046,0.101,0,0.122,0.101,100.541,205427,4
2019-09-28,19,Boyfriend,Ariana Grande & Social House,6zegtH6XXd2PDPLvy1Y0n2,False,25,8,7,0.4,0.795,10,-3.731,0,0.461,0.119,0,0.159,0.702,190.097,186107,4
2019-09-28,20,Suge,DaBaby,6zegtH6XXd2PDPLvy1Y0n2,False,26,7,25,0.876,0.662,2,-6.482,0,0.426,0.0608,0,0.127,0.844,75.445,163320,4
2019-09-28,21,You Need To Calm Down,Taylor Swift,6zegtH6XXd2PDPLvy1Y0n2,False,24,2,14,0.771,0.671,2,-5.617,1,0.0553,0.00929,0,0.0637,0.714,85.026,171360,4
2019-09-28,22,Hot Girl Summer,"Megan Thee Stallion, Nicki Minaj & Ty Dolla $ign",6zegtH6XXd2PDPLvy1Y0n2,False,28,11,6,0.872,0.814,0,-4.568,1,0.155,0.00485,1.96e-06,0.214,0.57,98.985,199427,4
2019-09-28,23,If I Can't Have You,Shawn Mendes,6zegtH6XXd2PDPLvy1Y0n2,False,27,2,20,0.69,0.809,2,-4.198,1,0.0603,0.524,0,0.147,0.864,123.912,190800,4
2019-09-28,24,Wow.,Post Malone,6zegtH6XXd2PDPLvy1Y0n2,False,17,2,39,0.829,0.539,11,-7.359,0,0.208,0.136,1.78e-06,0.103,0.388,99.96,149547,4
2019-09-28,25,The Git Up,Blanco Brown,6zegtH6XXd2PDPLvy1Y0n2,False,31,14,15,0.847,0.678,9,-8.635,1,0.109,0.0669,0,0.274,0.811,97.984,200594,4
2019-09-28,26,Enemies,Post Malone Featuring DaBaby,6zegtH6XXd2PDPLvy1Y0n2,False,16,16,2,0.542,0.674,6,-4.169,1,0.21,0.0588,0,0.0955,0.667,76.388,196760,4
2019-09-28,27,Baby,Lil Baby & DaBaby,6zegtH6XXd2PDPLvy1Y0n2,False,32,24,9,0.97,0.463,10,-7.259,1,0.366,0.0957,0,0.151,0.46,108.003,142417,4
2019-09-28,28,My Type,Saweetie,6zegtH6XXd2PDPLvy1Y0n2,False,30,21,12,0.899,0.811,2,-6.294,1,0.258,0.000677,0,0.0672,0.587,105.038,126446,4
2019-09-28,29,How Do You Sleep?,Sam Smith,6zegtH6XXd2PDPLvy1Y0n2,False,39,29,9,0.477,0.682,1,-4.931,0,0.0925,0.153,0,0.0763,0.345,110.567,202205,5
2019-09-28,30,Dancing With A Stranger,Sam Smith & Normani,6zegtH6XXd2PDPLvy1Y0n2,False,35,7,36,0.741,0.52,8,-7.513,1,0.0656,0.45,1.97e-06,0.222,0.347,102.998,171030,4
2019-09-28,31,Hollywood's Bleeding,Post Malone,6zegtH6XXd2PDPLvy1Y0n2,False,15,15,2,0.405,0.646,4,-3.206,0,0.0476,0.331,0,0.103,0.17,130.218,156267,4
2019-09-28,32,Without Me,Halsey,6zegtH6XXd2PDPLvy1Y0n2,False,40,1,50,0.752,0.488,6,-7.05,1,0.0705,0.297,9.11e-06,0.0936,0.533,136.041,201661,4
2019-09-28,33,Saint-Tropez,Post Malone,6zegtH6XXd2PDPLvy1Y0n2,False,18,18,2,0.617,0.684,0,-3.618,1,0.0439,0.0545,0,0.104,0.295,132.113,150867,4
2019-09-28,34,Trampoline,SHAED,6zegtH6XXd2PDPLvy1Y0n2,False,42,34,16,0.689,0.412,7,-7.523,0,0.0301,0.488,0.00016,0.0659,0.537,126.754,184060,4
2019-09-28,35,On Chill,Wale Featuring Jeremih,6zegtH6XXd2PDPLvy1Y0n2,False,48,35,6,0.597,0.733,1,-6.017,1,0.41,0.134,0,0.159,0.639,171.016,214035,4
2019-09-28,36,The London,"Young Thug, J. Cole & Travis Scott",6zegtH6XXd2PDPLvy1Y0n2,False,36,12,17,0.796,0.586,4,-6.946,0,0.147,0.0247,0,0.132,0.179,97.981,200107,4
2019-09-28,37,Pop Out,Polo G Featuring Lil Tjay,6zegtH6XXd2PDPLvy1Y0n2,False,41,11,26,0.772,0.639,1,-7.119,1,0.467,0.15,0,0.0698,0.261,168.112,166560,4
2019-09-28,38,Only Human,Jonas Brothers,6zegtH6XXd2PDPLvy1Y0n2,False,47,35,14,0.795,0.496,0,-5.883,1,0.0722,0.108,0,0.0645,0.874,94.01,183000,4
2019-09-28,39,Hot,Young Thug Featuring Gunna,6zegtH6XXd2PDPLvy1Y0n2,False,43,26,5,0.855,0.651,0,-8.044,0,0.235,0.063,0,0.0772,0.559,111.997,193027,4
2019-09-28,40,Camelot,NLE Choppa,4sWuPniHClkInYAnzXAYUF,True,0,40,1,0.787,0.713,7,-5.252,1,0.401,0.0849,0,0.717,0.761,175.046,148759,4
2019-09-28,41,Knockin' Boots,Luke Bryan,4sWuPniHClkInYAnzXAYUF,False,38,31,21,0.739,0.682,2,-3.728,1,0.205,0.129,0,0.328,0.634,131.983,199382,4
2019-09-28,42,Die For Me,Post Malone Featuring Future & Halsey,4sWuPniHClkInYAnzXAYUF,False,20,20,2,0.614,0.66,0,-2.848,1,0.0441,0.19,0,0.211,0.452,145.01,245267,4
2019-09-28,43,Cash Shit,Megan Thee Stallion Featuring DaBaby,4sWuPniHClkInYAnzXAYUF,False,46,36,13,0.921,0.635,1,-4.904,1,0.416,0.0218,0,0.0946,0.549,130.028,192540,4
2019-09-28,44,Beer Never Broke My Heart,Luke Combs,4sWuPniHClkInYAnzXAYUF,False,44,21,20,0.538,0.863,1,-4.483,1,0.0481,0.0139,0,0.0874,0.637,77.001,186733,4
2019-09-28,45,Graveyard,Halsey,2ufmtcIFdFpuUYBPXK5f67,True,0,45,1,0.667,0.583,11,-5.127,0,0.0747,0.231,4.48e-05,0.181,0.187,92.043,181806,4
2019-09-28,46,Speechless,Dan + Shay,2ufmtcIFdFpuUYBPXK5f67,False,45,24,39,0.616,0.438,1,-5.968,1,0.0298,0.356,0,0.24,0.386,135.929,213387,4
2019-09-28,47,I Don't Know About You,Chris Lane,2ufmtcIFdFpuUYBPXK5f67,False,54,47,11,0.593,0.81,1,-5.733,1,0.0625,0.602,0,0.119,0.712,144.011,207933,4
2019-09-28,48,On The Road,Post Malone Featuring Meek Mill & Lil Baby,2ufmtcIFdFpuUYBPXK5f67,False,22,22,2,0.442,0.737,7,-5.046,1,0.109,0.0589,0,0.102,0.21,112.93,218320,5
2019-09-28,49,Lover,Taylor Swift,2ufmtcIFdFpuUYBPXK5f67,False,49,10,5,0.359,0.543,7,-7.582,1,0.0919,0.492,1.58e-05,0.118,0.453,68.534,221307,4
2019-09-28,50,Good As Hell,Lizzo,2ufmtcIFdFpuUYBPXK5f67,False,51,41,4,0.682,0.919,0,-3.18,0,0.0875,0.256,0,0.442,0.535,95.982,159736,4
2019-09-28,51,Living,Dierks Bentley,2ufmtcIFdFpuUYBPXK5f67,False,59,51,8,0.517,0.813,1,-6.325,1,0.0558,0.0153,0,0.106,0.444,83.005,222147,4
2019-09-28,52,One Thing Right,Marshmello & Kane Brown,2ufmtcIFdFpuUYBPXK5f67,False,55,42,13,0.659,0.623,4,-2.253,1,0.0451,0.0667,0,0.582,0.439,88.042,181824,4
2019-09-28,53,Time,NF,2ufmtcIFdFpuUYBPXK5f67,False,64,53,9,0.677,0.688,0,-4.058,0,0.0633,0.138,0,0.114,0.198,98.049,240429,4
2019-09-28,54,Liar,Camila Cabello,2ufmtcIFdFpuUYBPXK5f67,False,56,54,2,0.74,0.498,11,-6.684,0,0.0456,0.0169,0.00282,0.319,0.652,98.016,207039,4
2019-09-28,55,Ballin',Mustard & Roddy Ricch,2ufmtcIFdFpuUYBPXK5f67,False,69,55,9,0.809,0.545,7,-6.678,1,0.0735,0.392,0,0.151,0.244,97.008,180435,4
2019-09-28,56,China,"Anuel AA, Daddy Yankee, Karol G, Ozuna & J Balvin",2ufmtcIFdFpuUYBPXK5f67,False,57,43,9,0.786,0.808,7,-3.702,1,0.0882,0.0846,0.000289,0.0822,0.609,105.027,301714,4
2019-09-28,57,Prayed For You,Matt Stell,2ufmtcIFdFpuUYBPXK5f67,False,71,57,7,0.6,0.698,9,-5.86,1,0.0355,0.0724,1.64e-06,0.113,0.57,140.032,210373,4
2019-09-28,58,Motivation,Normani,2ufmtcIFdFpuUYBPXK5f67,False,61,33,5,0.599,0.887,4,-3.967,1,0.0984,0.0192,1.21e-06,0.3,0.881,170.918,193837,4
2019-09-28,59,223's,YNW Melly & 9lokknine,2ufmtcIFdFpuUYBPXK5f67,False,87,59,2,0.932,0.547,0,-7.787,0,0.333,0.0388,0,0.0924,0.695,94.998,176640,4
2019-09-28,60,A Thousand Bad Times,Post Malone,2ufmtcIFdFpuUYBPXK5f67,False,29,29,2,0.632,0.732,6,-3.498,1,0.092,0.105,1.15e-05,0.111,0.317,159.0,221173,4
2019-09-28,61,Heat,Chris Brown Featuring Gunna,2ufmtcIFdFpuUYBPXK5f67,False,70,61,3,0.619,0.613,0,-5.83,1,0.0796,0.0614,0,0.117,0.483,82.419,232733,4
2019-09-28,62,Even Though I'm Leaving,Luke Combs,2ufmtcIFdFpuUYBPXK5f67,False,92,62,3,0.554,0.755,2,-6.04,1,0.0319,0.225,0,0.301,0.624,77.962,225253,4
2019-09-28,63,Lalala,Y2K & bbno$,2ufmtcIFdFpuUYBPXK5f67,False,65,55,12,0.843,0.391,2,-7.899,1,0.0845,0.181,0,0.137,0.496,129.972,160627,4
2019-09-28,64,Otro Trago,"Sech, Darell, Nicky Jam, Ozuna & Anuel AA",2ufmtcIFdFpuUYBPXK5f67,False,63,34,15,0.725,0.79,0,-2.331,1,0.197,0.0711,1.14e-06,0.0602,0.763,175.988,287773,4
2019-09-28,65,Southbound,Carrie Underwood,2ufmtcIFdFpuUYBPXK5f67,False,74,65,10,0.614,0.884,0,-4.019,1,0.0402,0.00122,0,0.077,0.721,100.531,202853,4
2019-09-28,66,The Ones That Didn't Make It Back Home,Justin Moore,2ufmtcIFdFpuUYBPXK5f67,False,66,46,14,0.537,0.784,3,-4.869,1,0.034,0.0979,0,0.224,0.468,137.995,191018,4
2019-09-28,67,Callaita,Bad Bunny & Tainy,2ufmtcIFdFpuUYBPXK5f67,False,72,52,15,0.61,0.624,2,-4.773,1,0.309,0.6,2.12e-06,0.243,0.244,176.169,250534,4
2019-09-28,68,Love You Too Late,Cole Swindell,2ufmtcIFdFpuUYBPXK5f67,False,77,68,7,0.542,0.797,9,-4.45,0,0.0379,0.00111,0,0.0906,0.593,113.95,204720,4
2019-09-28,69,Bad Bad Bad,Young Thug Featuring Lil Baby,2ufmtcIFdFpuUYBPXK5f67,False,62,32,5,0.974,0.596,6,-8.888,1,0.184,0.0976,0,0.151,0.892,111.959,149040,4
2019-09-28,70,Staring At The Sun,Post Malone Featuring SZA,2ufmtcIFdFpuUYBPXK5f67,False,34,34,2,0.724,0.772,6,-4.389,0,0.184,0.25,0,0.308,0.347,95.074,168280,4
2019-09-28,71,I'm Gonna Be,Post Malone,2ufmtcIFdFpuUYBPXK5f67,False,33,33,2,0.746,0.559,5,-4.008,1,0.0316,0.703,0,0.148,0.368,117.943,200680,4
2019-09-28,72,One Man Band,Old Dominion,2ufmtcIFdFpuUYBPXK5f67,False,81,72,4,0.706,0.358,6,-8.331,1,0.0347,0.677,0,0.107,0.478,75.991,186240,4
2019-09-28,73,No Me Conoce,"Jhay Cortez, J Balvin & Bad Bunny",2ufmtcIFdFpuUYBPXK5f67,False,79,71,11,0.804,0.786,10,-3.837,0,0.0735,0.144,0,0.0928,0.575,91.992,309120,4
2019-09-28,74,Good Vibes,Chris Janson,2ufmtcIFdFpuUYBPXK5f67,False,85,74,3,0.582,0.846,0,-2.771,1,0.0451,0.022,0,0.133,0.736,92.004,165587,4
2019-09-28,75,Behind Barz,Drake,5r7WvQtyPfy1xch5zMgGRp,True,0,75,1,0.854,0.554,8,-4.684,1,0.172,0.769,1.84e-06,0.0749,0.272,142.069,163121,4
2019-09-28,76,Mood Swings,A Boogie Wit da Hoodie,0VZe8C7xgAIQC0E0qEVIEh,True,0,76,1,0.941,0.676,4,-5.54,0,0.0936,0.211,4.64e-06,0.0986,0.93,120.073,156960,4
2019-09-28,77,All To Myself,Dan + Shay,0VZe8C7xgAIQC0E0qEVIEh,False,67,31,20,0.646,0.781,1,-4.616,1,0.0313,0.208,0,0.125,0.565,94.975,169920,4
2019-09-28,78,Allergic,Post Malone,0VZe8C7xgAIQC0E0qEVIEh,False,37,37,2,0.665,0.741,0,-3.694,1,0.0787,0.154,3.02e-05,0.345,0.57,144.968,156893,4
2019-09-28,79,Queen Of Mean,Sarah Jeffery,0VZe8C7xgAIQC0E0qEVIEh,False,76,49,7,0.543,0.787,8,-6.52,1,0.241,0.248,0,0.0778,0.343,173.702,189397,4
2019-09-28,80,F.N,Lil Tjay,0VZe8C7xgAIQC0E0qEVIEh,False,80,68,6,0.567,0.515,6,-10.265,0,0.247,0.354,0,0.078,0.321,120.1,224000,1
2019-09-28,81,Baby Sitter,DaBaby Featuring Offset,0VZe8C7xgAIQC0E0qEVIEh,False,86,81,6,0.852,0.73,1,-5.803,1,0.0579,0.0219,0,0.336,0.394,92.506,157693,4
2019-09-28,82,Right Back,Khalid Featuring A Boogie Wit da Hoodie,0VZe8C7xgAIQC0E0qEVIEh,False,93,73,8,0.786,0.428,5,-10.011,0,0.31,0.0933,1.1e-06,0.156,0.556,97.001,255000,4
2019-09-28,83,Self Control,YoungBoy Never Broke Again,0VZe8C7xgAIQC0E0qEVIEh,False,68,68,2,0.82,0.697,6,-7.296,0,0.378,0.0349,0,0.197,0.629,154.992,185866,4
2019-09-28,84,Every Little Thing,Russell Dickerson,0VZe8C7xgAIQC0E0qEVIEh,False,91,84,3,0.637,0.853,1,-4.664,1,0.109,0.216,0,0.0357,0.861,93.87,190640,4
2019-09-28,85,Did It Again,Lil Tecca,0VZe8C7xgAIQC0E0qEVIEh,False,78,64,5,0.686,0.561,10,-9.929,0,0.191,0.185,0,0.114,0.186,148.775,116240,4
2019-09-28,86,Hate Me,Ellie Goulding & Juice WRLD,0VZe8C7xgAIQC0E0qEVIEh,False,83,72,9,0.657,0.768,8,-4.628,1,0.0507,0.108,0,0.144,0.759,75.025,186223,4
2019-09-28,87,What Happens In A Small Town,Brantley Gilbert + Lindsay Ell,0VZe8C7xgAIQC0E0qEVIEh,False,94,85,6,0.496,0.775,11,-5.304,1,0.0411,0.000927,0,0.14,0.478,138.165,202587,4
2019-09-28,88,Tip Of My Tongue,Kenny Chesney,0VZe8C7xgAIQC0E0qEVIEh,False,89,77,10,0.669,0.56,5,-5.003,1,0.0251,0.0821,0,0.0703,0.49,95.0,199413,4
2019-09-28,89,Slide Away,Miley Cyrus,0VZe8C7xgAIQC0E0qEVIEh,False,73,47,5,0.53,0.538,5,-6.672,1,0.0335,0.17,2.83e-06,0.248,0.288,148.051,233654,4
2019-09-28,90,Press,Cardi B,0VZe8C7xgAIQC0E0qEVIEh,False,84,16,16,0.888,0.525,1,-5.665,1,0.305,0.029,5.68e-06,0.137,0.243,133.983,143792,4
2019-09-28,91,Hot Girl Bummer,blackbear,2mt1IqcFyY1zmYZT8Q3xw9,True,0,91,1,0.782,0.559,6,-7.106,0,0.0767,0.125,0,0.385,0.685,129.992,188344,1
2019-09-28,92,Rearview Town,Jason Aldean,2mt1IqcFyY1zmYZT8Q3xw9,False,75,40,17,0.526,0.85,10,-4.47,0,0.0313,0.023,0,0.0948,0.338,141.973,184173,4
2019-09-28,93,It's You,Ali Gatie,2mt1IqcFyY1zmYZT8Q3xw9,False,97,70,14,0.732,0.463,11,-6.972,0,0.0287,0.374,0,0.194,0.397,95.971,212607,4
2019-09-28,94,Playing Games,Summer Walker,2mt1IqcFyY1zmYZT8Q3xw9,False,99,87,3,0.726,0.408,11,-6.606,0,0.0614,0.603,0,0.225,0.459,115.918,143227,4
2019-09-28,95,Shameless,Camila Cabello,2mt1IqcFyY1zmYZT8Q3xw9,False,60,60,2,0.377,0.651,4,-5.437,0,0.0589,0.0197,5.31e-05,0.174,0.0851,129.607,219742,4
2019-09-28,96,What If I Never Get Over You,Lady Antebellum,2mt1IqcFyY1zmYZT8Q3xw9,False,0,86,5,0.576,0.724,0,-5.147,1,0.0274,0.016,0,0.107,0.34,93.029,206598,4
2019-09-28,97,"1, 2 Many",Luke Combs & Brooks & Dunn,226le7T3p82reYWzsi9Hsz,True,0,97,1,0.54,0.821,6,-3.789,1,0.0873,0.0397,0,0.423,0.685,148.798,180907,4
2019-09-28,98,Wish Wish,DJ Khaled Featuring Cardi B & 21 Savage,226le7T3p82reYWzsi9Hsz,False,0,19,10,0.861,0.666,8,-5.18,0,0.343,0.00218,0,0.272,0.853,145.041,202625,4
2019-09-28,99,We Were,Keith Urban,226le7T3p82reYWzsi9Hsz,False,0,80,5,0.44,0.803,5,-6.162,1,0.0512,0.127,0,0.128,0.633,79.312,189104,4
2019-09-28,100,Remember You Young,Thomas Rhett,3LK6wDkhbTyg8GhJidU9oC,True,0,100,1,0.396,0.51,6,-6.274,1,0.0327,0.355,0,0.113,0.299,113.994,180467,4
