date,position,title,artist,spotify_id,is_new,last_pos,peak_pos,weeks,danceability,energy,key,loudness,mode,speechiness,acousticness,instrumentalness,liveness,valence,tempo,duration_ms,time_signature
2002-06-22,1,Foolish,Ashanti,5EjZXJ4nVpw7uI6eso1SFS,False,1,1,19,0.665,0.695,0,-5.763,1,0.0532,0.347,0,0.106,0.707,90.119,227387,4
2002-06-22,2,Hot In Herre,Nelly,5EjZXJ4nVpw7uI6eso1SFS,False,3,2,8,0.956,0.745,11,-4.753,0,0.12,0.206,0,0.0615,0.912,107.075,228240,4
2002-06-22,3,I Need A Girl (Part One),P. Diddy Featuring Usher & Loon,5EjZXJ4nVpw7uI6eso1SFS,False,2,2,15,0.713,0.471,1,-7.392,0,0.483,0.421,0,0.0308,0.781,199.765,285587,4
2002-06-22,4,Without Me,Eminem,5EjZXJ4nVpw7uI6eso1SFS,False,4,4,7,0.908,0.669,7,-2.827,1,0.0738,0.00286,0,0.237,0.662,112.238,290320,4
2002-06-22,5,The Middle,Jimmy Eat World,5EjZXJ4nVpw7uI6eso1SFS,False,7,5,15,0.643,0.849,2,-5.428,1,0.0526,0.0371,0,0.058,0.903,162.152,165853,4
2002-06-22,6,A Thousand Miles,Vanessa Carlton,5EjZXJ4nVpw7uI6eso1SFS,False,6,5,17,0.56,0.825,11,-3.862,1,0.0379,0.323,0,0.161,0.268,94.931,237493,4
2002-06-22,7,What's Luv?,Fat Joe Featuring Ashanti,5EjZXJ4nVpw7uI6eso1SFS,False,5,2,19,0.835,0.707,8,-5.074,1,0.0598,0.0219,2.19e-05,0.108,0.919,93.955,267093,4
2002-06-22,8,Oh Boy,Cam'Ron Featuring Juelz Santana,5EjZXJ4nVpw7uI6eso1SFS,False,9,8,10,0.754,0.767,6,-5.586,1,0.145,0.0216,0,0.172,0.828,83.014,204707,4
2002-06-22,9,Addictive,Truth Hurts Featuring Rakim,5EjZXJ4nVpw7uI6eso1SFS,False,10,9,10,0.505,0.876,5,-2.493,0,0.372,0.217,0,0.554,0.874,72.714,252373,4
2002-06-22,10,U Don't Have To Call,Usher,5EjZXJ4nVpw7uI6eso1SFS,False,8,3,20,0.793,0.568,1,-4.958,1,0.0459,0.0478,3.57e-05,0.0304,0.806,100.005,269400,4
2002-06-22,11,I'm Gonna Be Alright,Jennifer Lopez Featuring Nas,5EjZXJ4nVpw7uI6eso1SFS,False,14,11,9,0.843,0.612,10,-4.71,0,0.157,0.0573,0.000305,0.154,0.791,93.975,200200,4
2002-06-22,12,Hero,Chad Kroeger Featuring Josey Scott,5EjZXJ4nVpw7uI6eso1SFS,False,13,12,6,0.427,0.843,4,-4.54,1,0.0364,0.00216,0,0.179,0.304,147.387,200480,3
2002-06-22,13,Blurry,Puddle Of Mudd,5EjZXJ4nVpw7uI6eso1SFS,False,12,5,27,0.431,0.938,3,-4.507,0,0.0542,0.00805,0,0.138,0.523,157.462,304000,4
2002-06-22,14,Hella Good,No Doubt,5EjZXJ4nVpw7uI6eso1SFS,False,15,14,10,0.772,0.665,8,-3.947,1,0.0349,0.0136,0.012,0.0905,0.838,115.138,242587,4
2002-06-22,15,All You Wanted,Michelle Branch,5EjZXJ4nVpw7uI6eso1SFS,False,11,6,18,0.499,0.72,8,-9.101,1,0.0286,0.00466,0.00303,0.122,0.652,96.103,217680,4
2002-06-22,16,Days Go By,Dirty Vegas,5EjZXJ4nVpw7uI6eso1SFS,False,20,16,7,0.786,0.853,9,-8.274,0,0.0688,0.0499,0.0872,0.35,0.309,126.99,432147,4
2002-06-22,17,halfcrazy,Musiq,5EjZXJ4nVpw7uI6eso1SFS,False,19,17,14,0.412,0.77,11,-6.057,0,0.18,0.462,1.5e-06,0.0485,0.418,101.955,254493,3
2002-06-22,18,Rainy Dayz,Mary J. Blige Featuring Ja Rule,5EjZXJ4nVpw7uI6eso1SFS,False,17,12,13,0.476,0.663,6,-6.905,1,0.191,0.182,0,0.321,0.525,74.884,276360,4
2002-06-22,19,Still Fly,Big Tymers,5EjZXJ4nVpw7uI6eso1SFS,False,23,19,11,0.675,0.607,11,-3.538,1,0.162,0.0302,8.97e-06,0.339,0.56,177.928,335613,4
2002-06-22,20,Wasting My Time,Default,5EjZXJ4nVpw7uI6eso1SFS,False,16,13,25,0.449,0.776,2,-5.594,1,0.0322,0.00171,0,0.0698,0.198,148.11,269307,4
2002-06-22,21,Down A** Chick,"Ja Rule Featuring Charli ""Chuck"" Baltimore",5EjZXJ4nVpw7uI6eso1SFS,False,21,21,11,0.5,0.519,1,-12.489,0,0.449,0.322,0,0.622,0.63,115.634,126804,5
2002-06-22,22,Soak Up The Sun,Sheryl Crow,5EjZXJ4nVpw7uI6eso1SFS,False,27,22,11,0.717,0.733,4,-4.985,1,0.0427,0.0398,0,0.136,0.713,119.996,292307,4
2002-06-22,23,Don't Let Me Get Me,P!nk,5EjZXJ4nVpw7uI6eso1SFS,False,18,8,16,0.621,0.849,3,-4.754,1,0.0771,0.00234,0,0.0621,0.62,98.523,210693,4
2002-06-22,24,Full Moon,Brandy,5EjZXJ4nVpw7uI6eso1SFS,False,24,24,8,0.692,0.656,10,-4.81,0,0.151,0.358,0.0029,0.0929,0.629,105.994,248933,4
2002-06-22,25,More Than A Woman,Aaliyah,5EjZXJ4nVpw7uI6eso1SFS,False,25,25,21,0.482,0.872,4,-5.259,1,0.231,0.00515,1.83e-05,0.409,0.665,173.994,225270,4
2002-06-22,26,Wherever You Will Go,The Calling,5EjZXJ4nVpw7uI6eso1SFS,False,22,5,33,0.558,0.719,2,-5.113,1,0.0267,0.0367,0,0.115,0.371,112.027,208600,4
2002-06-22,27,Living And Living Well,George Strait,5EjZXJ4nVpw7uI6eso1SFS,False,31,27,12,0.602,0.683,1,-6.82,1,0.0304,0.347,0.00338,0.11,0.522,120.787,218307,4
2002-06-22,28,I Need A Girl (Part Two),"P. Diddy & Ginuwine Featuring Loon, Mario Winans & Tammy Ruggeri",5EjZXJ4nVpw7uI6eso1SFS,False,40,28,3,0.713,0.471,1,-7.392,0,0.483,0.421,0,0.0308,0.781,199.765,285587,4
2002-06-22,29,In The End,Linkin Park,5EjZXJ4nVpw7uI6eso1SFS,False,28,2,34,0.556,0.864,3,-5.87,0,0.0584,0.00958,0,0.209,0.4,105.143,216880,4
2002-06-22,30,Complicated,Avril Lavigne,5EjZXJ4nVpw7uI6eso1SFS,False,44,30,4,0.585,0.776,5,-5.898,1,0.0459,0.0572,7.74e-06,0.3,0.427,77.987,244507,4
2002-06-22,31,Drive (For Daddy Gene),Alan Jackson,5EjZXJ4nVpw7uI6eso1SFS,False,30,28,15,0.713,0.579,11,-8.066,1,0.0413,0.338,0,0.174,0.511,125.179,242733,4
2002-06-22,32,How You Remind Me,Nickelback,5EjZXJ4nVpw7uI6eso1SFS,False,32,1,42,0.446,0.764,10,-5.042,1,0.033,0.00135,0,0.099,0.543,172.094,223840,4
2002-06-22,33,Underneath Your Clothes,Shakira,5EjZXJ4nVpw7uI6eso1SFS,False,29,9,15,0.616,0.597,8,-5.328,1,0.0415,0.686,0,0.104,0.362,165.508,224067,4
2002-06-22,34,Makin' Good Love,Avant,5EjZXJ4nVpw7uI6eso1SFS,False,34,27,14,0.794,0.634,9,-3.819,0,0.0381,0.245,0,0.2,0.736,142.254,271387,4
2002-06-22,35,Ain't It Funny,Jennifer Lopez Featuring Ja Rule,5EjZXJ4nVpw7uI6eso1SFS,False,33,1,26,0.781,0.746,8,-2.686,1,0.17,0.364,0,0.098,0.786,89.43,229800,4
2002-06-22,36,Pass The Courvoisier Part II,Busta Rhymes Featuring P. Diddy & Pharrell,5EjZXJ4nVpw7uI6eso1SFS,False,26,11,17,0.697,0.793,6,-4.699,0,0.323,0.0844,0,0.0619,0.56,89.767,238600,4
2002-06-22,37,Gots Ta Be,B2K,5EjZXJ4nVpw7uI6eso1SFS,False,42,37,9,0.832,0.454,2,-4.252,1,0.0513,0.0402,0.000497,0.0723,0.69,131.784,321200,4
2002-06-22,38,I'm Gonna Miss Her (The Fishin' Song),Brad Paisley,5EjZXJ4nVpw7uI6eso1SFS,False,38,38,8,0.559,0.464,6,-9.687,1,0.0272,0.55,0,0.107,0.351,98.354,194307,4
2002-06-22,39,Call Me,Tweet,5EjZXJ4nVpw7uI6eso1SFS,False,53,39,4,0.552,0.706,1,-8.117,0,0.363,0.484,6.49e-05,0.074,0.721,167.468,177373,4
2002-06-22,40,I Don't Have To Be Me ('til Monday),Steve Azar,5EjZXJ4nVpw7uI6eso1SFS,False,36,35,12,0.497,0.717,8,-4.224,1,0.0303,0.201,0,0.0458,0.771,168.999,196952,4
2002-06-22,41,Don't Say Goodbye,Paulina Rubio,5EjZXJ4nVpw7uI6eso1SFS,False,45,41,8,0.654,0.833,6,-5.193,0,0.0459,0.00396,5.63e-06,0.231,0.696,119.874,289360,4
2002-06-22,42,Anything,Jaheim Featuring Next,5EjZXJ4nVpw7uI6eso1SFS,False,37,28,18,0.731,0.377,5,-7.907,1,0.0425,0.0516,0,0.137,0.452,105.743,287027,4
2002-06-22,43,Girlfriend,'N Sync Featuring Nelly,5EjZXJ4nVpw7uI6eso1SFS,False,39,5,20,0.748,0.811,0,-5.213,0,0.0907,0.0866,1.45e-05,0.0282,0.862,93.963,253600,4
2002-06-22,44,I Should Be Sleeping,Emerson Drive,5EjZXJ4nVpw7uI6eso1SFS,False,35,35,15,0.464,0.895,5,-4.16,0,0.145,0.243,0,0.0687,0.674,164.404,177000,4
2002-06-22,45,Not A Day Goes By,Lonestar,5EjZXJ4nVpw7uI6eso1SFS,False,47,45,7,0.53,0.305,6,-8.568,1,0.028,0.492,0,0.137,0.221,127.318,248040,4
2002-06-22,46,No Such Thing,John Mayer,5EjZXJ4nVpw7uI6eso1SFS,False,56,46,4,0.668,0.739,4,-4.919,1,0.0308,0.0383,0,0.13,0.571,131.918,231467,4
2002-06-22,47,Escape,Enrique Iglesias,5EjZXJ4nVpw7uI6eso1SFS,False,43,12,18,0.777,0.852,11,-5.329,1,0.0295,0.0299,0.000498,0.145,0.877,125.994,208040,4
2002-06-22,48,Here Is Gone,Goo Goo Dolls,5EjZXJ4nVpw7uI6eso1SFS,False,41,18,14,0.338,0.685,1,-5.178,1,0.0322,0.00052,0.000512,0.109,0.221,102.192,238173,4
2002-06-22,49,Someone To Love You,Ruff Endz,5EjZXJ4nVpw7uI6eso1SFS,False,54,49,7,0.637,0.678,8,-2.21,1,0.0345,0.0543,0,0.0961,0.426,77.928,297360,1
2002-06-22,50,Walking Away,Craig David,5EjZXJ4nVpw7uI6eso1SFS,False,50,50,5,0.596,0.686,9,-6.371,0,0.0345,0.196,0,0.121,0.815,172.835,204867,4
2002-06-22,51,Heaven,DJ Sammy & Yanou Featuring Do,5EjZXJ4nVpw7uI6eso1SFS,False,65,51,4,0.571,0.953,8,-5.601,1,0.0548,0.0011,0.000606,0.226,0.601,137.965,233600,4
2002-06-22,52,The One,Gary Allan,5EjZXJ4nVpw7uI6eso1SFS,False,52,52,6,0.594,0.601,8,-9.036,1,0.0312,0.54,0.004,0.0526,0.66,136.11,259760,4
2002-06-22,53,By The Way,Red Hot Chili Peppers,5EjZXJ4nVpw7uI6eso1SFS,False,55,53,2,0.451,0.97,0,-4.938,1,0.107,0.0264,0.00355,0.102,0.198,122.444,216933,4
2002-06-22,54,The Good Stuff,Kenny Chesney,5EjZXJ4nVpw7uI6eso1SFS,False,63,54,3,0.612,0.62,7,-9.785,1,0.0645,0.255,0,0.129,0.502,143.78,200440,4
2002-06-22,55,My List,Toby Keith,5EjZXJ4nVpw7uI6eso1SFS,False,51,26,19,0.629,0.737,1,-4.309,0,0.0323,0.332,0,0.147,0.341,87.068,199813,4
2002-06-22,56,Too Bad,Nickelback,5EjZXJ4nVpw7uI6eso1SFS,False,46,42,15,0.598,0.808,10,-5.209,1,0.0388,0.00304,0,0.147,0.288,128.025,232240,4
2002-06-22,57,Nothin',N.O.R.E.,5EjZXJ4nVpw7uI6eso1SFS,False,69,57,5,0.791,0.863,3,-6.118,0,0.151,0.317,1.13e-06,0.27,0.742,97.035,264653,4
2002-06-22,58,Just A Friend 2002,Mario,5EjZXJ4nVpw7uI6eso1SFS,False,72,58,5,0.538,0.677,0,-6.099,1,0.187,0.00541,0,0.236,0.913,132.346,214200,5
2002-06-22,59,My Heart Is Lost To You,Brooks & Dunn,5EjZXJ4nVpw7uI6eso1SFS,False,62,59,5,0.524,0.849,2,-4.634,1,0.0464,0.188,0,0.179,0.453,125.864,178707,4
2002-06-22,60,You Know That I Love You,Donell Jones,5EjZXJ4nVpw7uI6eso1SFS,False,61,54,9,0.767,0.494,6,-5.349,1,0.0421,0.136,0.000277,0.0603,0.801,96.003,260067,4
2002-06-22,61,One Last Breath,Creed,5EjZXJ4nVpw7uI6eso1SFS,False,68,61,3,0.386,0.677,2,-5.83,1,0.0346,0.00841,0.00366,0.341,0.195,126.602,238240,4
2002-06-22,62,Why Don't We Fall In Love,Amerie,5EjZXJ4nVpw7uI6eso1SFS,False,71,62,3,0.551,0.773,11,-6.578,0,0.101,0.0673,3.39e-05,0.0511,0.649,90.003,159293,4
2002-06-22,63,"Courtesy Of The Red, White And Blue (The Angry American)",Toby Keith,5EjZXJ4nVpw7uI6eso1SFS,False,70,63,3,0.424,0.661,2,-5.547,1,0.0425,0.521,1.62e-06,0.0719,0.384,111.762,195533,4
2002-06-22,64,When You Lie Next To Me,Kellie Coffey,5EjZXJ4nVpw7uI6eso1SFS,False,64,64,4,0.312,0.404,5,-10.014,1,0.0293,0.184,0,0.306,0.115,138.425,239827,4
2002-06-22,65,A New Day Has Come,Celine Dion,5EjZXJ4nVpw7uI6eso1SFS,False,48,22,17,0.691,0.64,8,-5.087,1,0.0384,0.0247,5.24e-06,0.2,0.452,101.991,210227,4
2002-06-22,66,Drift & Die,Puddle Of Mudd,5EjZXJ4nVpw7uI6eso1SFS,False,67,66,5,0.434,0.845,11,-4.316,1,0.0352,0.00554,0,0.11,0.332,96.073,265067,4
2002-06-22,67,Long Time Gone,Dixie Chicks,0JiX8NsRdCHm8GliFuf97V,True,0,67,1,0.549,0.693,2,-5.572,1,0.0311,0.18,1.75e-06,0.153,0.819,170.241,249412,4
2002-06-22,68,What If She's An Angel,Tommy Shane Steiner,0JiX8NsRdCHm8GliFuf97V,False,58,39,18,0.535,0.528,8,-7.453,1,0.0258,0.308,1.11e-06,0.0912,0.41,146.169,215533,4
2002-06-22,69,Saturday (Oooh! Ooooh!),Ludacris Featuring Sleepy Brown,0JiX8NsRdCHm8GliFuf97V,False,66,22,19,0.588,0.809,11,-6.327,0,0.412,0.0235,0,0.324,0.696,103.0,230533,4
2002-06-22,70,I Don't Want You To Go,Carolyn Dawn Johnson,0JiX8NsRdCHm8GliFuf97V,False,59,54,7,0.458,0.795,9,-4.714,1,0.0559,0.0464,0.000212,0.0315,0.512,168.316,279533,4
2002-06-22,71,Say I Yi Yi,Ying Yang Twins,0JiX8NsRdCHm8GliFuf97V,False,60,56,8,0.782,0.627,8,-6.509,0,0.115,0.00233,1.27e-05,0.201,0.485,94.967,272507,4
2002-06-22,72,I Miss My Friend,Darryl Worley,0JiX8NsRdCHm8GliFuf97V,False,73,72,2,0.554,0.474,4,-7.843,1,0.025,0.155,1.67e-05,0.0859,0.41,139.832,242927,4
2002-06-22,73,Where Are You Going,Dave Matthews Band,0JiX8NsRdCHm8GliFuf97V,False,76,73,2,0.444,0.583,7,-8.121,1,0.0259,0.5,0.15,0.105,0.258,97.492,231867,4
2002-06-22,74,Down 4 U,"Irv Gotti Presents The Inc. Featuring Ja Rule, Ashanti, Charli Baltimore & Vita",21iEEekDSvQjVARSQ4dpXY,True,0,74,1,0.64,0.59,7,-7.442,1,0.32,0.252,0,0.665,0.519,83.133,318213,4
2002-06-22,75,"My Neck, My Back",Khia Featuring DSD,21iEEekDSvQjVARSQ4dpXY,False,83,75,5,0.859,0.687,9,-2.089,0,0.12,0.0375,0,0.0542,0.73,102.068,222333,4
2002-06-22,76,Grindin',Clipse,21iEEekDSvQjVARSQ4dpXY,False,79,76,5,0.592,0.77,1,-3.402,1,0.318,0.122,1.22e-06,0.103,0.361,191.692,264760,4
2002-06-22,77,Happy,Ashanti,21iEEekDSvQjVARSQ4dpXY,False,77,77,4,0.727,0.515,2,-6.553,0,0.0289,0.241,3.74e-06,0.124,0.695,89.488,262227,4
2002-06-22,78,Here To Stay,Korn,21iEEekDSvQjVARSQ4dpXY,False,75,72,5,0.564,0.947,2,-4.998,1,0.0448,7.81e-06,0.828,0.373,0.351,100.002,270960,4
2002-06-22,79,One Mic,Nas,21iEEekDSvQjVARSQ4dpXY,False,57,43,10,0.783,0.608,0,-5.742,0,0.361,0.0574,0,0.102,0.429,91.672,268667,4
2002-06-22,80,Move B***h,Ludacris Featuring Mystikal & Infamous 2.0,21iEEekDSvQjVARSQ4dpXY,False,87,80,3,0.787,0.732,8,-5.466,1,0.129,0.183,0,0.1,0.15,177.653,271627,4
2002-06-22,81,For You,Staind,21iEEekDSvQjVARSQ4dpXY,False,80,63,17,0.318,0.958,10,-2.683,1,0.442,0.0603,4.68e-06,0.0981,0.3,163.089,206200,4
2002-06-22,82,That's When I Love You,Phil Vassar,21iEEekDSvQjVARSQ4dpXY,False,84,37,18,0.552,0.831,10,-4.819,1,0.0402,0.236,0,0.0907,0.604,111.061,208880,4
2002-06-22,83,What If A Woman,Joe,21iEEekDSvQjVARSQ4dpXY,False,78,63,7,0.645,0.582,10,-5.325,1,0.0451,0.0453,1.56e-05,0.131,0.359,140.028,254840,4
2002-06-22,84,Young,Kenny Chesney,21iEEekDSvQjVARSQ4dpXY,False,85,35,20,0.684,0.84,9,-5.753,1,0.0433,0.0278,0,0.329,0.682,125.801,235733,4
2002-06-22,85,Wish I Didn't Miss You,Angie Stone,21iEEekDSvQjVARSQ4dpXY,False,88,79,14,0.856,0.755,10,-5.691,1,0.0331,0.355,0.000621,0.145,0.842,123.883,270893,4
2002-06-22,86,Awnaw,Nappy Roots,21iEEekDSvQjVARSQ4dpXY,False,82,51,16,0.721,0.678,7,-3.703,1,0.258,0.00521,0,0.153,0.712,160.023,241373,4
2002-06-22,87,Feels Good (Don't Worry Bout A Thing),Naughty By Nature Featuring 3LW,21iEEekDSvQjVARSQ4dpXY,False,81,53,13,0.905,0.703,10,-2.345,1,0.176,0.0793,0,0.0554,0.865,94.999,253627,4
2002-06-22,88,Toxicity,System Of A Down,21iEEekDSvQjVARSQ4dpXY,False,86,70,8,0.413,0.873,8,-4.151,1,0.0535,0.000264,0.0025,0.204,0.481,116.681,218933,3
2002-06-22,89,Quitame Ese Hombre,Pilar Montenegro,21iEEekDSvQjVARSQ4dpXY,False,90,74,5,0.691,0.631,0,-4.423,0,0.044,0.201,0,0.246,0.966,156.007,240480,4
2002-06-22,90,The Impossible,Joe Nichols,21iEEekDSvQjVARSQ4dpXY,False,95,90,4,0.617,0.504,9,-6.702,1,0.0295,0.354,3.1e-06,0.0875,0.197,77.988,245573,4
2002-06-22,91,If I Could Go!,Angie Martinez Featuring Lil' Mo & Sacario,2iOQF6h0z7m7Tf0VENdFUY,True,0,91,1,0.791,0.649,9,-5.714,0,0.198,0.496,0,0.0566,0.645,97.874,263853,4
2002-06-22,92,Oops (Oh My),Tweet,2iOQF6h0z7m7Tf0VENdFUY,False,74,7,20,0.66,0.536,10,-8.786,0,0.29,0.233,0.00669,0.111,0.775,159.963,237800,4
2002-06-22,93,Guess Who's Back,Scarface Featuring Jay-Z & Beanie Sigel,2iOQF6h0z7m7Tf0VENdFUY,False,91,79,6,0.742,0.788,1,-9.197,1,0.31,0.00961,0.105,0.0864,0.848,85.835,241573,4
2002-06-22,94,Give It To Her,Tanto Metro & Devonte,2iOQF6h0z7m7Tf0VENdFUY,False,99,87,13,0.6,0.583,9,-6.617,0,0.281,0.0918,0,0.0992,0.763,126.517,209053,5
2002-06-22,95,"I Breathe In, I Breathe Out",Chris Cagle,2iOQF6h0z7m7Tf0VENdFUY,False,94,35,20,0.316,0.514,7,-7.048,1,0.0271,0.178,0,0.194,0.242,185.882,243947,4
2002-06-22,96,Roc The Mic,Beanie Sigel & Freeway,2iOQF6h0z7m7Tf0VENdFUY,False,93,55,18,0.869,0.555,11,-8.626,0,0.393,0.0883,0,0.0492,0.922,95.177,263187,4
2002-06-22,97,Gimme The Light,Sean Paul,2iOQF6h0z7m7Tf0VENdFUY,False,97,97,8,0.778,0.761,2,-5.529,1,0.0525,0.141,4.61e-05,0.0441,0.923,107.288,228000,4
2002-06-22,98,For All Time,Soluna,74FoFQHkUuGyjbmyLJ35fz,True,0,98,1,0.296,0.853,3,-4.121,1,0.106,0.474,0,0.108,0.169,190.062,242973,4
2002-06-22,99,Day + Night,Isyss Featuring Jadakiss,74FoFQHkUuGyjbmyLJ35fz,False,98,98,3,0.774,0.75,0,-7.499,1,0.0979,0.13,0,0.498,0.809,95.941,229274,4
2002-06-22,100,Crawling In The Dark,Hoobastank,74FoFQHkUuGyjbmyLJ35fz,False,100,68,17,0.57,0.915,6,-4.802,0,0.105,0.000273,8.48e-05,0.178,0.676,93.54,175227,4
