date,position,title,artist,spotify_id,is_new,last_pos,peak_pos,weeks,danceability,energy,key,loudness,mode,speechiness,acousticness,instrumentalness,liveness,valence,tempo,duration_ms,time_signature
2003-01-04,1,Lose Yourself,Eminem,0uKrhHBDUQ4w5fv4qwOubP,False,1,1,14,0.692,0.744,2,-4.565,1,0.257,0.00868,0.000423,0.359,0.0612,171.374,326467,4
2003-01-04,2,Work It,"Missy ""Misdemeanor"" Elliott",0uKrhHBDUQ4w5fv4qwOubP,False,2,2,17,0.869,0.735,10,-6.364,0,0.157,0.228,0,0.0874,0.463,101.909,254813,4
2003-01-04,3,Air Force Ones,"Nelly Featuring Kyjuan, Ali & Murphy Lee",0uKrhHBDUQ4w5fv4qwOubP,False,5,3,9,0.784,0.459,4,-9.74,0,0.317,0.0847,0,0.079,0.618,164.062,304000,4
2003-01-04,4,'03 Bonnie & Clyde,Jay-Z Featuring Beyonce Knowles,0uKrhHBDUQ4w5fv4qwOubP,False,4,4,11,0.759,0.678,9,-5.148,0,0.314,0.23,0,0.15,0.327,89.64,205560,4
2003-01-04,5,Jenny From The Block,Jennifer Lopez Featuring Styles & Jadakiss,0uKrhHBDUQ4w5fv4qwOubP,False,3,3,13,0.844,0.754,6,-5.46,1,0.207,0.00833,3.42e-06,0.0575,0.961,100.002,187840,4
2003-01-04,6,Beautiful,Christina Aguilera,0uKrhHBDUQ4w5fv4qwOubP,False,6,6,7,0.456,0.573,5,-3.866,0,0.0275,0.578,3.05e-06,0.114,0.0992,76.19,238560,4
2003-01-04,7,"Bump, Bump, Bump",B2K & P. Diddy,0uKrhHBDUQ4w5fv4qwOubP,False,7,7,6,0.833,0.681,1,-6.028,0,0.215,0.0956,0,0.0414,0.887,95.48,282533,4
2003-01-04,8,Don't Mess With My Man,Nivea Featuring Brian & Brandon Casey,0uKrhHBDUQ4w5fv4qwOubP,False,8,8,22,0.879,0.73,11,-4.369,0,0.164,0.114,0,0.241,0.885,99.925,213227,4
2003-01-04,9,Love Of My Life (An Ode To Hip Hop),Erykah Badu Featuring Common,0uKrhHBDUQ4w5fv4qwOubP,False,11,9,18,0.808,0.404,7,-9.27,1,0.348,0.118,0.000625,0.0913,0.487,87.461,337573,4
2003-01-04,10,Underneath It All,No Doubt Featuring Lady Saw,0uKrhHBDUQ4w5fv4qwOubP,False,9,3,19,0.729,0.731,4,-4.823,1,0.0682,0.235,1.35e-06,0.391,0.838,138.204,302720,4
2003-01-04,11,Miss You,Aaliyah,0uKrhHBDUQ4w5fv4qwOubP,False,15,11,6,0.515,0.305,1,-11.775,1,0.476,0.436,0,0.182,0.62,82.901,266600,4
2003-01-04,12,I'm With You,Avril Lavigne,0uKrhHBDUQ4w5fv4qwOubP,False,16,12,5,0.457,0.406,9,-7.462,1,0.0291,0.08,0,0.117,0.208,151.95,223067,3
2003-01-04,13,She Hates Me,Puddle Of Mudd,0uKrhHBDUQ4w5fv4qwOubP,False,13,13,13,0.58,0.748,4,-5.433,1,0.0323,0.00935,0,0.753,0.584,109.781,216760,4
2003-01-04,14,The Game Of Love,Santana Featuring Michelle Branch,0uKrhHBDUQ4w5fv4qwOubP,False,10,5,14,0.59,0.929,2,-3.236,1,0.0478,0.0714,0.000153,0.0598,0.674,119.818,254467,4
2003-01-04,15,All I Have,Jennifer Lopez Featuring LL Cool J,0uKrhHBDUQ4w5fv4qwOubP,False,25,15,2,0.699,0.668,1,-5.305,1,0.106,0.265,0,0.141,0.472,83.074,254467,4
2003-01-04,16,Landslide,Dixie Chicks,0uKrhHBDUQ4w5fv4qwOubP,False,14,13,16,0.571,0.438,2,-7.007,1,0.0279,0.534,1.56e-05,0.187,0.444,145.948,230549,4
2003-01-04,17,Cry Me A River,Justin Timberlake,0uKrhHBDUQ4w5fv4qwOubP,False,29,17,3,0.624,0.653,8,-6.582,0,0.176,0.575,0,0.104,0.565,73.884,288333,4
2003-01-04,18,Gimme The Light,Sean Paul,0uKrhHBDUQ4w5fv4qwOubP,False,12,7,36,0.778,0.761,2,-5.529,1,0.0525,0.141,4.61e-05,0.0441,0.923,107.288,228000,4
2003-01-04,19,Thugz Mansion,2Pac,0uKrhHBDUQ4w5fv4qwOubP,False,19,19,5,0.731,0.417,8,-8.708,1,0.168,0.657,0,0.115,0.704,88.161,252293,4
2003-01-04,20,Family Portrait,P!nk,0uKrhHBDUQ4w5fv4qwOubP,False,21,20,8,0.762,0.686,0,-5.26,0,0.049,0.0274,3.62e-06,0.572,0.733,91.816,296960,4
2003-01-04,21,Your Body Is A Wonderland,John Mayer,0uKrhHBDUQ4w5fv4qwOubP,False,22,21,10,0.647,0.729,5,-6.251,1,0.0236,0.0206,0.0489,0.134,0.687,94.01,249627,4
2003-01-04,22,When The Last Time,Clipse,0uKrhHBDUQ4w5fv4qwOubP,False,27,19,17,0.847,0.884,11,-3.326,1,0.245,0.514,0,0.303,0.845,99.036,254307,4
2003-01-04,23,dontchange,Musiq,0uKrhHBDUQ4w5fv4qwOubP,False,18,17,18,0.58,0.526,6,-6.664,0,0.0313,0.221,0,0.0959,0.2,101.89,304427,4
2003-01-04,24,Picture,Kid Rock Featuring Sheryl Crow Or Allison Moorer,0uKrhHBDUQ4w5fv4qwOubP,False,34,24,6,0.692,0.496,7,-7.332,1,0.0241,0.172,6.42e-06,0.107,0.376,97.945,298960,4
2003-01-04,25,Mesmerize,Ja Rule Featuring Ashanti,0uKrhHBDUQ4w5fv4qwOubP,False,67,25,2,0.764,0.648,1,-6.639,1,0.206,0.0563,0,0.414,0.391,90.1,278720,4
2003-01-04,26,I Should Be...,Dru Hill,0uKrhHBDUQ4w5fv4qwOubP,False,36,26,5,0.383,0.749,1,-3.931,0,0.084,0.199,0,0.204,0.466,122.141,297627,4
2003-01-04,27,One Last Breath,Creed,0uKrhHBDUQ4w5fv4qwOubP,False,24,6,31,0.386,0.677,2,-5.83,1,0.0346,0.00841,0.00366,0.341,0.195,126.602,238240,4
2003-01-04,28,19 Somethin',Mark Wills,0uKrhHBDUQ4w5fv4qwOubP,False,31,28,7,0.58,0.816,4,-5.165,1,0.0726,0.132,0,0.0776,0.814,89.938,200467,4
2003-01-04,29,Satisfaction,Eve,0uKrhHBDUQ4w5fv4qwOubP,False,45,29,6,0.843,0.553,11,-3.198,0,0.437,0.236,0,0.0523,0.631,93.384,258733,4
2003-01-04,30,Fabulous,Jaheim Featuring Tha Rayne,0uKrhHBDUQ4w5fv4qwOubP,False,37,30,8,0.657,0.464,4,-7.573,0,0.0614,0.548,0,0.161,0.598,75.982,227067,4
2003-01-04,31,Hey Ma,"Cam'Ron Featuring Juelz Santana, Freekey Zekey & Toya",0uKrhHBDUQ4w5fv4qwOubP,False,20,3,19,0.791,0.666,8,-5.484,1,0.341,0.0256,6.33e-06,0.0796,0.938,90.345,232533,4
2003-01-04,32,Ignition,R. Kelly,0uKrhHBDUQ4w5fv4qwOubP,False,32,32,9,0.795,0.523,1,-7.165,1,0.0423,0.061,0,0.0914,0.855,133.024,186067,4
2003-01-04,33,She'll Leave You With A Smile,George Strait,0uKrhHBDUQ4w5fv4qwOubP,False,23,23,14,0.635,0.6,4,-7.233,1,0.0229,0.59,0.000198,0.254,0.516,97.983,178773,4
2003-01-04,34,Who's Your Daddy?,Toby Keith,0uKrhHBDUQ4w5fv4qwOubP,False,28,22,14,0.684,0.872,9,-4.307,1,0.0402,0.283,0.0289,0.049,0.849,126.381,238013,4
2003-01-04,35,Luv U Better,LL Cool J,0uKrhHBDUQ4w5fv4qwOubP,False,17,4,20,0.668,0.806,6,-3.9,1,0.239,0.232,0,0.18,0.721,95.022,287000,4
2003-01-04,36,When I'm Gone,3 Doors Down,0uKrhHBDUQ4w5fv4qwOubP,False,38,36,7,0.53,0.768,7,-5.611,1,0.0284,0.00385,0,0.103,0.374,148.095,260333,4
2003-01-04,37,Dilemma,Nelly Featuring Kelly Rowland,0uKrhHBDUQ4w5fv4qwOubP,False,26,1,26,0.727,0.552,2,-8.074,0,0.14,0.227,0.000164,0.198,0.607,168.189,289160,4
2003-01-04,38,These Days,Rascal Flatts,0uKrhHBDUQ4w5fv4qwOubP,False,30,23,14,0.587,0.778,7,-4.233,1,0.0343,0.31,0,0.318,0.319,81.943,254493,4
2003-01-04,39,Made You Look,Nas,0uKrhHBDUQ4w5fv4qwOubP,False,39,39,3,0.658,0.936,5,-5.105,0,0.3,0.172,0,0.321,0.711,95.439,203000,4
2003-01-04,40,Do That...,Baby Featuring P. Diddy,0uKrhHBDUQ4w5fv4qwOubP,False,43,40,8,0.86,0.783,1,-4.821,1,0.248,0.358,0,0.248,0.71,101.992,301187,4
2003-01-04,41,Lifestyles Of The Rich And Famous,Good Charlotte,0uKrhHBDUQ4w5fv4qwOubP,False,47,41,4,0.62,0.93,1,-3.685,1,0.0374,0.00043,0,0.0686,0.609,106.22,190173,4
2003-01-04,42,Wanksta,50 Cent,0uKrhHBDUQ4w5fv4qwOubP,False,49,42,6,0.806,0.867,1,-3.538,1,0.157,0.02,0,0.131,0.904,81.033,219400,4
2003-01-04,43,Paradise,LL Cool J Featuring Amerie,0uKrhHBDUQ4w5fv4qwOubP,False,53,43,4,0.78,0.824,5,-2.988,0,0.2,0.0153,5.13e-05,0.15,0.845,97.884,275067,4
2003-01-04,44,Disease,matchbox twenty,0uKrhHBDUQ4w5fv4qwOubP,False,33,29,12,0.561,0.849,8,-3.913,0,0.0466,0.00289,0,0.288,0.829,115.04,220067,4
2003-01-04,45,Something,Lasgo,0uKrhHBDUQ4w5fv4qwOubP,False,61,45,10,0.643,0.981,7,-6.644,0,0.0439,0.0271,8.93e-05,0.11,0.38,140.01,220973,4
2003-01-04,46,Die Another Day,Madonna,0uKrhHBDUQ4w5fv4qwOubP,False,35,8,12,0.792,0.797,0,-5.166,0,0.0901,0.062,0.00325,0.0896,0.491,123.993,276360,4
2003-01-04,47,Like I Love You,Justin Timberlake,0uKrhHBDUQ4w5fv4qwOubP,False,42,11,18,0.853,0.811,6,-4.926,0,0.0646,0.0439,0.000304,0.0703,0.901,114.961,283627,4
2003-01-04,48,All My Life,Foo Fighters,0uKrhHBDUQ4w5fv4qwOubP,False,50,43,10,0.577,0.604,5,-5.703,1,0.0495,0.000218,0.000579,0.477,0.637,167.719,263440,4
2003-01-04,49,Fall Into Me,Emerson Drive,0uKrhHBDUQ4w5fv4qwOubP,False,44,44,8,0.501,0.813,2,-5.01,1,0.0342,0.238,0,0.39,0.595,96.986,168867,4
2003-01-04,50,Make It Clap,Busta Rhymes Featuring Spliff Star,0uKrhHBDUQ4w5fv4qwOubP,False,62,50,9,0.736,0.741,1,-4.458,0,0.392,0.0691,0,0.053,0.95,121.328,243040,5
2003-01-04,51,Talkin' To Me,Amerie,0uKrhHBDUQ4w5fv4qwOubP,False,51,51,5,0.744,0.406,8,-6.378,0,0.0722,0.113,0,0.0316,0.725,89.942,234707,4
2003-01-04,52,Gossip Folks,"Missy ""Misdemeanor"" Elliott Featuring Ludacris",0uKrhHBDUQ4w5fv4qwOubP,False,75,52,2,0.928,0.457,0,-10.443,1,0.524,0.502,1.19e-06,0.188,0.67,122.006,210373,4
2003-01-04,53,Always,Saliva,0uKrhHBDUQ4w5fv4qwOubP,False,63,53,4,0.363,0.906,1,-4.415,1,0.0615,0.0122,0,0.172,0.371,181.964,231200,4
2003-01-04,54,The Baby,Blake Shelton,0uKrhHBDUQ4w5fv4qwOubP,False,57,54,5,0.502,0.533,4,-6.983,1,0.0263,0.312,0,0.277,0.281,86.406,234733,4
2003-01-04,55,I Just Wanna Be Mad,Terri Clark,0uKrhHBDUQ4w5fv4qwOubP,False,59,55,9,0.574,0.896,10,-4.478,1,0.0393,0.0654,0,0.31,0.731,99.974,206400,4
2003-01-04,56,The Red,Chevelle,0uKrhHBDUQ4w5fv4qwOubP,False,64,56,6,0.509,0.843,1,-3.318,0,0.0488,0.000671,0.000803,0.348,0.332,140.055,238400,3
2003-01-04,57,You Know You're Right,Nirvana,0uKrhHBDUQ4w5fv4qwOubP,False,58,45,12,0.289,0.716,5,-6.53,0,0.106,0.0407,0.00123,0.135,0.344,168.049,217000,4
2003-01-04,58,React,Erick Sermon Featuring Redman,0uKrhHBDUQ4w5fv4qwOubP,False,48,36,12,0.584,0.894,9,-1.605,0,0.429,0.176,0,0.169,0.786,94.383,217840,4
2003-01-04,59,I Care 4 U,Aaliyah,0uKrhHBDUQ4w5fv4qwOubP,False,54,16,20,0.384,0.496,0,-9.203,0,0.0482,0.345,0.000224,0.119,0.223,133.891,286699,3
2003-01-04,60,A Lot Of Things Different,Kenny Chesney,0uKrhHBDUQ4w5fv4qwOubP,False,60,55,6,0.589,0.279,2,-13.693,1,0.0285,0.129,0.0192,0.149,0.212,74.847,283867,4
2003-01-04,61,Stole,Kelly Rowland,0uKrhHBDUQ4w5fv4qwOubP,False,40,27,15,0.649,0.718,7,-4.984,0,0.0594,0.00676,4.26e-06,0.174,0.477,79.993,249293,4
2003-01-04,62,Red Rag Top,Tim McGraw,0uKrhHBDUQ4w5fv4qwOubP,False,52,40,13,0.484,0.463,7,-11.98,1,0.0279,0.0677,0.598,0.246,0.247,77.009,244051,4
2003-01-04,63,Sk8er Boi,Avril Lavigne,0uKrhHBDUQ4w5fv4qwOubP,False,56,10,17,0.487,0.9,0,-4.417,1,0.0482,6.79e-05,0,0.358,0.484,149.937,204000,4
2003-01-04,64,Fine Again,Seether,0uKrhHBDUQ4w5fv4qwOubP,False,72,64,2,0.442,0.855,6,-2.985,0,0.0288,0.00049,0.0137,0.273,0.363,175.543,243640,4
2003-01-04,65,Don't Know Why,Norah Jones,0uKrhHBDUQ4w5fv4qwOubP,False,65,52,15,0.732,0.198,5,-11.775,1,0.028,0.883,1.1e-05,0.0659,0.618,88.174,186147,4
2003-01-04,66,Tell Me (What's Goin' On),Smilez & Southstar,7aXXjA800sXYKpM8D9pCVT,True,0,66,1,0.693,0.88,11,-3.228,0,0.0661,0.0901,0,0.211,0.397,88.088,278800,4
2003-01-04,67,You Can't Hide Beautiful,Aaron Lines,7aXXjA800sXYKpM8D9pCVT,False,68,67,2,0.448,0.572,5,-9.351,1,0.0292,0.186,0,0.151,0.303,157.979,230800,4
2003-01-04,68,Bother,Stone Sour,7aXXjA800sXYKpM8D9pCVT,False,73,56,10,0.272,0.281,1,-7.634,1,0.0287,0.388,2.29e-05,0.158,0.141,89.914,240400,4
2003-01-04,69,No One Knows,Queens Of The Stone Age,7aXXjA800sXYKpM8D9pCVT,False,78,69,2,0.507,0.588,0,-4.881,1,0.0641,0.0359,0.000129,0.373,0.637,170.889,278707,4
2003-01-04,70,Sick Of Being Lonely,Field Mob,7aXXjA800sXYKpM8D9pCVT,False,79,70,4,0.692,0.921,8,-4.853,1,0.105,0.0016,2.05e-05,0.299,0.856,173.837,229160,4
2003-01-04,71,Spin,Lifehouse,7aXXjA800sXYKpM8D9pCVT,False,71,71,8,0.467,0.893,1,-3.514,1,0.0556,0.00027,0.000147,0.0541,0.328,134.772,291600,4
2003-01-04,72,Prayer,Disturbed,7aXXjA800sXYKpM8D9pCVT,False,74,58,15,0.65,0.914,9,-4.672,1,0.0716,0.000642,1.23e-06,0.0251,0.586,99.107,218973,4
2003-01-04,73,How You Gonna Act Like That,Tyrese,3OUApyz3jDB3syGUNGqB1d,True,0,73,1,0.733,0.521,3,-3.657,0,0.0457,0.107,0,0.0692,0.525,112.913,294693,4
2003-01-04,74,Dirrty,Christina Aguilera Featuring Redman,3OUApyz3jDB3syGUNGqB1d,False,66,48,16,0.64,0.889,2,-3.073,1,0.322,0.107,0,0.339,0.436,99.931,298853,4
2003-01-04,75,Cochise,Audioslave,3OUApyz3jDB3syGUNGqB1d,False,69,69,7,0.452,0.873,9,-4.867,1,0.0613,0.000519,0,0.0592,0.433,80.473,222027,4
2003-01-04,76,Thug Lovin',Ja Rule Featuring Bobby Brown,3OUApyz3jDB3syGUNGqB1d,False,55,42,7,0.769,0.685,1,-5.648,1,0.177,0.133,0,0.667,0.771,93.043,290387,4
2003-01-04,77,The Zephyr Song,Red Hot Chili Peppers,3OUApyz3jDB3syGUNGqB1d,False,80,49,9,0.725,0.803,2,-4.083,1,0.0337,0.013,3.66e-05,0.0891,0.403,117.391,231933,4
2003-01-04,78,Man To Man,Gary Allan,38fsEI7slIZAAFc4E1JEo0,True,0,78,1,0.578,0.779,10,-8.908,1,0.0384,0.00479,6.47e-06,0.284,0.695,111.653,220960,4
2003-01-04,79,A Moment Like This,Kelly Clarkson,38fsEI7slIZAAFc4E1JEo0,False,77,1,16,0.414,0.572,8,-3.918,1,0.0311,0.163,0,0.115,0.16,145.184,228280,4
2003-01-04,80,One Of Those Days,Whitney Houston,38fsEI7slIZAAFc4E1JEo0,False,85,80,8,0.679,0.708,0,-3.844,1,0.0818,0.312,0,0.0878,0.82,91.983,255733,4
2003-01-04,81,In A Little While,Uncle Kracker,38fsEI7slIZAAFc4E1JEo0,False,81,59,10,0.596,0.935,2,-2.412,1,0.0741,0.127,0,0.294,0.912,205.984,249760,4
2003-01-04,82,Come Close To Me,Common Featuring Mary J. Blige,38fsEI7slIZAAFc4E1JEo0,False,89,82,3,0.6,0.407,5,-14.738,0,0.0657,0.0437,0.000281,0.068,0.797,83.893,219221,4
2003-01-04,83,Through The Rain,Mariah Carey,38fsEI7slIZAAFc4E1JEo0,False,84,83,2,0.508,0.318,8,-9.911,1,0.0365,0.759,0,0.184,0.141,122.04,288640,4
2003-01-04,84,Somewhere Out There,Our Lady Peace,38fsEI7slIZAAFc4E1JEo0,False,88,44,20,0.388,0.746,1,-5.306,1,0.0318,0.000563,0,0.0719,0.458,159.675,251333,4
2003-01-04,85,All The Things She Said,t.A.T.u.,4bJygwUKrRgq1stlNXcgMg,True,0,85,1,0.603,0.834,5,-5.766,0,0.0417,0.0411,0.00609,0.105,0.376,89.957,214440,4
2003-01-04,86,Cry,Faith Hill,4bJygwUKrRgq1stlNXcgMg,False,83,33,19,0.512,0.645,8,-5.631,1,0.029,0.141,0,0.0987,0.283,111.015,226307,3
2003-01-04,87,Thug Holiday,Trick Daddy Featuring LaTocha Scott,4bJygwUKrRgq1stlNXcgMg,False,94,87,3,0.767,0.654,1,-9.088,0,0.289,0.372,0,0.147,0.546,138.062,294067,4
2003-01-04,88,Girl Talk,TLC,4bJygwUKrRgq1stlNXcgMg,False,82,28,11,0.882,0.671,2,-5.161,1,0.126,0.171,0,0.0988,0.34,95.018,214760,4
2003-01-04,89,Rock The Party,Benzino,4bJygwUKrRgq1stlNXcgMg,False,93,82,13,0.843,0.871,10,-5.796,0,0.142,0.29,0,0.0934,0.723,101.03,227933,4
2003-01-04,90,From Tha Chuuuch To Da Palace,Snoop Dogg,4bJygwUKrRgq1stlNXcgMg,False,86,77,9,0.799,0.679,2,-6.13,1,0.246,0.28,0,0.201,0.648,96.957,280560,4
2003-01-04,91,Come Into My World,Kylie Minogue,4bJygwUKrRgq1stlNXcgMg,False,92,91,4,0.448,0.278,1,-9.38,0,0.0368,0.953,3.2e-06,0.0959,0.164,128.835,213373,4
2003-01-04,92,I'm Gonna Getcha Good!,Shania Twain,4bJygwUKrRgq1stlNXcgMg,False,76,34,12,0.723,0.789,1,-4.813,1,0.0302,0.0441,0,0.0612,0.946,124.013,269400,4
2003-01-04,93,Hit The Freeway,Toni Braxton Featuring Loon,4bJygwUKrRgq1stlNXcgMg,False,95,86,9,0.799,0.708,7,-3.833,1,0.114,0.0208,8.69e-06,0.115,0.82,96.954,228560,4
2003-01-04,94,Blowin' Me Up (With Her Love),JC Chasez,5nOMJVZ4rsY5PpYiKD15BS,True,0,94,1,0.785,0.783,2,-3.982,1,0.187,0.00877,0.00454,0.072,0.592,98.132,290200,4
2003-01-04,95,Single For The Rest Of My Life,Isyss,5nOMJVZ4rsY5PpYiKD15BS,False,91,71,11,0.721,0.717,6,-8.095,1,0.0394,0.0796,0.00411,0.334,0.805,147.655,235636,4
2003-01-04,96,Breathe,Telepopmusik,5nOMJVZ4rsY5PpYiKD15BS,False,98,96,2,0.684,0.684,1,-13.337,1,0.0418,0.385,0.29,0.106,0.616,113.988,282240,4
2003-01-04,97,Goodbye To You,Michelle Branch,5nOMJVZ4rsY5PpYiKD15BS,False,99,21,19,0.504,0.556,8,-6.19,1,0.0263,0.288,0.000246,0.173,0.276,81.008,251200,4
2003-01-04,98,These Are The Days,O-Town,5nOMJVZ4rsY5PpYiKD15BS,False,70,64,5,0.598,0.627,9,-6.323,1,0.038,0.000968,0,0.0626,0.432,119.991,263933,4
2003-01-04,99,Every River,Brooks & Dunn,5nOMJVZ4rsY5PpYiKD15BS,False,87,75,5,0.553,0.903,6,-6.131,1,0.0807,0.132,0.000716,0.422,0.312,124.984,209027,4
2003-01-04,100,My Town,Montgomery Gentry,5nOMJVZ4rsY5PpYiKD15BS,False,96,40,15,0.511,0.846,2,-6.677,1,0.0531,0.00258,0,0.0777,0.528,93.848,285587,4
