date,position,title,artist,spotify_id,is_new,last_pos,peak_pos,weeks,danceability,energy,key,loudness,mode,speechiness,acousticness,instrumentalness,liveness,valence,tempo,duration_ms,time_signature
2011-02-26,1,Born This Way,Lady Gaga,7cotUG9b1iodz8NoWIN2er,True,0,1,1,0.586,0.835,11,-5.117,1,0.146,0.00387,0,0.304,0.492,123.936,260413,4
2011-02-26,2,Firework,Katy Perry,7cotUG9b1iodz8NoWIN2er,False,3,1,17,0.638,0.826,8,-4.968,1,0.0479,0.139,0,0.0803,0.649,124.072,227880,4
2011-02-26,3,Grenade,Bruno Mars,7cotUG9b1iodz8NoWIN2er,False,2,1,20,0.706,0.558,2,-7.237,0,0.0593,0.146,0,0.118,0.227,110.443,223253,4
2011-02-26,4,Black And Yellow,Wiz Khalifa,7cotUG9b1iodz8NoWIN2er,False,1,1,19,0.684,0.834,2,-4.524,0,0.0675,0.0646,0,0.271,0.538,164.02,217667,4
2011-02-26,5,F**kin' Perfect,P!nk,7cotUG9b1iodz8NoWIN2er,False,4,2,7,0.57,0.646,7,-4.748,1,0.0331,0.0412,0,0.362,0.485,91.954,213413,4
2011-02-26,6,Tonight (I'm Lovin' You),Enrique Iglesias Featuring Ludacris & DJ Frank E,7cotUG9b1iodz8NoWIN2er,False,6,4,12,0.666,0.877,0,-4.657,0,0.0446,0.0277,1.15e-05,0.142,0.272,125.989,231653,4
2011-02-26,7,F**k You! (Forget You),CeeLo Green,7cotUG9b1iodz8NoWIN2er,False,16,7,25,0.689,0.836,0,-6.058,1,0.0559,0.187,0,0.162,0.749,127.411,223067,4
2011-02-26,8,S&M,Rihanna Featuring Britney Spears,7cotUG9b1iodz8NoWIN2er,False,31,8,5,0.769,0.684,1,-5.019,1,0.0411,0.0105,0.000125,0.0887,0.835,127.972,243600,4
2011-02-26,9,The Time (Dirty Bit),The Black Eyed Peas,7cotUG9b1iodz8NoWIN2er,False,19,4,14,0.816,0.813,6,-7.798,0,0.0664,0.0662,2.77e-06,0.602,0.436,127.979,307640,4
2011-02-26,10,Hold It Against Me,Britney Spears,7cotUG9b1iodz8NoWIN2er,False,10,1,5,0.648,0.722,0,-4.813,0,0.0427,0.0103,0,0.24,0.389,132.973,228827,4
2011-02-26,11,What The Hell,Avril Lavigne,7cotUG9b1iodz8NoWIN2er,False,23,11,5,0.578,0.926,6,-3.689,0,0.0548,0.00472,0.0127,0.14,0.877,149.976,220707,4
2011-02-26,12,Hey Baby (Drop It To The Floor),Pitbull Featuring T-Pain,7cotUG9b1iodz8NoWIN2er,False,9,7,20,0.595,0.912,10,-3.428,0,0.0884,0.0434,0,0.259,0.762,128.024,234453,4
2011-02-26,13,What's My Name?,Rihanna Featuring Drake,7cotUG9b1iodz8NoWIN2er,False,8,1,17,0.689,0.784,2,-2.972,1,0.074,0.182,0,0.0843,0.561,99.954,263173,4
2011-02-26,14,Rocketeer,Far*East Movement Featuring Ryan Tedder,7cotUG9b1iodz8NoWIN2er,False,7,7,11,0.664,0.845,4,-6.115,0,0.0461,0.181,0,0.267,0.357,96.005,211253,4
2011-02-26,15,Just The Way You Are,Bruno Mars,7cotUG9b1iodz8NoWIN2er,False,15,1,30,0.641,0.188,5,-9.954,1,0.0339,0.918,0,0.0857,0.294,109.317,219178,4
2011-02-26,16,6 Foot 7 Foot,Lil Wayne Featuring Cory Gunz,7cotUG9b1iodz8NoWIN2er,False,18,9,9,0.365,0.751,2,-5.429,1,0.304,0.000707,0,0.318,0.604,79.119,248587,4
2011-02-26,17,Raise Your Glass,P!nk,7cotUG9b1iodz8NoWIN2er,False,13,1,19,0.7,0.709,7,-5.006,1,0.0839,0.0048,0,0.0289,0.625,122.019,202960,4
2011-02-26,18,Hit The Lights,Jay Sean Featuring Lil Wayne,3usL7eu7kTW0MLOujOuUSs,True,0,18,1,0.709,0.727,2,-6.135,0,0.0429,0.0288,0,0.158,0.353,128.024,221933,4
2011-02-26,19,Moment 4 Life,Nicki Minaj Featuring Drake,3usL7eu7kTW0MLOujOuUSs,False,22,19,9,0.475,0.882,11,-3.883,1,0.351,0.406,0,0.241,0.369,98.001,279307,4
2011-02-26,20,We R Who We R,Ke$ha,3usL7eu7kTW0MLOujOuUSs,False,12,1,16,0.736,0.817,8,-4.9,1,0.0407,0.00987,0.00167,0.117,0.653,119.95,204760,4
2011-02-26,21,More,Usher,3usL7eu7kTW0MLOujOuUSs,False,26,21,10,0.551,0.893,7,-2.628,1,0.0543,0.00166,0,0.348,0.794,125.083,219987,4
2011-02-26,22,Yeah 3X,Chris Brown,3usL7eu7kTW0MLOujOuUSs,False,17,15,16,0.705,0.882,11,-3.201,0,0.0445,0.000369,1.16e-06,0.0934,0.7,130.0,241667,4
2011-02-26,23,I Do,Colbie Caillat,42loEE51UDcecom9K8K4ei,True,0,23,1,0.655,0.877,9,-5.656,1,0.0329,0.22,0,0.0785,0.958,144.877,173360,4
2011-02-26,24,Back To December,Taylor Swift,42loEE51UDcecom9K8K4ei,False,20,6,16,0.529,0.67,2,-4.663,1,0.0303,0.117,0,0.334,0.286,141.893,293027,4
2011-02-26,25,Never Say Never,Justin Bieber Featuring Jaden Smith,42loEE51UDcecom9K8K4ei,False,49,25,9,0.739,0.807,0,-5.063,1,0.0652,0.0181,0,0.295,0.632,97.048,227853,4
2011-02-26,26,Coming Home,Diddy - Dirty Money Featuring Skylar Grey,42loEE51UDcecom9K8K4ei,False,14,12,12,0.392,0.839,7,-1.921,1,0.193,0.158,0,0.3,0.232,168.001,238693,4
2011-02-26,27,Jar Of Hearts,Christina Perri,42loEE51UDcecom9K8K4ei,False,25,22,20,0.349,0.348,3,-6.142,1,0.0316,0.726,0,0.12,0.0886,74.541,246587,4
2011-02-26,28,No Hands,Waka Flocka Flame Featuring Roscoe Dash & Wale,42loEE51UDcecom9K8K4ei,False,21,13,23,0.76,0.595,1,-6.366,1,0.0391,0.00544,0,0.241,0.361,131.497,263773,4
2011-02-26,29,Look At Me Now,Chris Brown Featuring Lil Wayne & Busta Rhymes,42loEE51UDcecom9K8K4ei,False,11,11,2,0.767,0.677,11,-6.128,0,0.184,0.0339,5.51e-06,0.144,0.538,146.155,222587,4
2011-02-26,30,Higher,Taio Cruz Featuring Travie McCoy,42loEE51UDcecom9K8K4ei,False,24,24,9,0.528,0.9,8,-4.301,0,0.0759,0.0349,0,0.144,0.558,127.986,188133,4
2011-02-26,31,Down On Me,Jeremih Featuring 50 Cent,42loEE51UDcecom9K8K4ei,False,29,28,14,0.7,0.598,2,-7.783,1,0.114,0.0369,0,0.111,0.594,160.041,228453,4
2011-02-26,32,I Need A Doctor,Dr. Dre Featuring Eminem & Skylar Grey,42loEE51UDcecom9K8K4ei,False,5,5,2,0.594,0.946,3,-4.521,1,0.452,0.0869,0,0.306,0.397,155.826,283733,4
2011-02-26,33,Only Girl (In The World),Rihanna,42loEE51UDcecom9K8K4ei,False,27,1,23,0.789,0.706,11,-4.233,0,0.0429,0.112,1.71e-05,0.0586,0.638,125.911,235493,4
2011-02-26,34,Firework,Glee Cast,6F55MQrSDrsmsTH50WCGrk,True,0,34,1,0.619,0.888,8,-5.198,1,0.0719,0.011,0,0.101,0.442,124.029,227507,4
2011-02-26,35,Stereo Love,Edward Maya & Vika Jigulina,6F55MQrSDrsmsTH50WCGrk,False,28,16,19,0.773,0.736,9,-5.589,1,0.0383,0.0335,0.0184,0.104,0.212,127.056,184000,4
2011-02-26,36,Pretty Girl Rock,Keri Hilson,6F55MQrSDrsmsTH50WCGrk,False,32,31,12,0.666,0.87,11,-5.004,0,0.246,0.203,0,0.0851,0.9,160.014,243920,4
2011-02-26,37,Dynamite,Taio Cruz,6F55MQrSDrsmsTH50WCGrk,False,30,2,37,0.754,0.804,4,-3.177,1,0.0853,0.00332,0,0.0329,0.818,119.968,203867,4
2011-02-26,38,Thriller / Heads Will Roll,Glee Cast,6F55MQrSDrsmsTH50WCGrk,False,75,38,2,0.633,0.822,10,-5.011,0,0.0723,0.00846,0,0.141,0.633,122.994,216560,4
2011-02-26,39,Don't You Wanna Stay,Jason Aldean With Kelly Clarkson,6F55MQrSDrsmsTH50WCGrk,False,36,35,15,0.445,0.631,11,-4.798,1,0.0304,0.129,0,0.0911,0.152,143.846,256440,4
2011-02-26,40,DJ Got Us Fallin' In Love,Usher Featuring Pitbull,6F55MQrSDrsmsTH50WCGrk,False,33,4,31,0.663,0.861,7,-3.398,0,0.109,0.0338,0,0.082,0.654,119.963,220800,4
2011-02-26,41,Rolling In The Deep,Adele,6F55MQrSDrsmsTH50WCGrk,False,64,41,6,0.73,0.769,8,-5.114,1,0.0298,0.138,0,0.0473,0.507,104.948,228093,4
2011-02-26,42,Marry Me,Train,6F55MQrSDrsmsTH50WCGrk,False,34,34,13,0.461,0.267,0,-8.514,1,0.0278,0.834,2.03e-05,0.107,0.481,87.918,205453,4
2011-02-26,43,Just A Dream,Nelly,6F55MQrSDrsmsTH50WCGrk,False,35,3,26,0.531,0.752,1,-6.161,1,0.0305,0.0421,0,0.12,0.103,89.917,237800,4
2011-02-26,44,"Bills, Bills, Bills",Glee Cast,6F55MQrSDrsmsTH50WCGrk,False,79,44,2,0.833,0.441,11,-6.172,0,0.152,0.392,0,0.149,0.762,127.659,180280,4
2011-02-26,45,Silly Love Songs,Glee Cast,3YrUnNAeONiku0Zk0chHIW,True,0,45,1,0.643,0.585,0,-6.724,1,0.0289,0.584,4.81e-06,0.278,0.563,124.935,230160,4
2011-02-26,46,Teenage Dream,Katy Perry,3YrUnNAeONiku0Zk0chHIW,False,41,1,30,0.719,0.798,10,-4.582,1,0.0361,0.0162,2.34e-06,0.134,0.591,120.011,227741,4
2011-02-26,47,When I Get You Alone,Glee Cast,63dHVDt4TXudnl2K1eziJT,True,0,47,1,0.738,0.763,7,-6.002,0,0.0615,0.211,0,0.0697,0.483,108.075,151987,4
2011-02-26,48,Roll Up,Wiz Khalifa,53DB6LJV9B8sz0p1s6tlGS,True,0,48,1,0.523,0.805,3,-5.473,1,0.192,0.0524,0,0.0914,0.602,125.358,227773,5
2011-02-26,49,Colder Weather,Zac Brown Band,53DB6LJV9B8sz0p1s6tlGS,False,55,49,4,0.667,0.381,3,-7.494,1,0.0294,0.455,0,0.116,0.199,135.975,273893,4
2011-02-26,50,Somewhere With You,Kenny Chesney,53DB6LJV9B8sz0p1s6tlGS,False,37,31,15,0.68,0.849,1,-6.475,0,0.0376,0.0862,0.00013,0.174,0.536,111.969,243520,4
2011-02-26,51,Blow,Ke$ha,53DB6LJV9B8sz0p1s6tlGS,False,66,51,4,0.753,0.729,11,-3.862,0,0.0392,0.00334,5.66e-05,0.073,0.812,120.013,219973,4
2011-02-26,52,Waiting For The End,Linkin Park,53DB6LJV9B8sz0p1s6tlGS,False,42,42,19,0.487,0.961,4,-4.139,1,0.132,0.0415,1.15e-06,0.553,0.323,170.005,231680,4
2011-02-26,53,Are You Gonna Kiss Me Or Not,Thompson Square,53DB6LJV9B8sz0p1s6tlGS,False,45,42,9,0.485,0.701,8,-3.807,1,0.0288,0.039,0,0.0977,0.613,151.948,184920,4
2011-02-26,54,Who Dat Girl,Flo Rida Featuring Akon,53DB6LJV9B8sz0p1s6tlGS,False,40,29,11,0.719,0.616,1,-3.951,1,0.0395,0.00683,3.11e-05,0.0742,0.625,124.963,200880,4
2011-02-26,55,Who Are You When I'm Not Looking,Blake Shelton,53DB6LJV9B8sz0p1s6tlGS,False,46,46,15,0.412,0.457,4,-9.142,1,0.0288,0.409,0.0187,0.0978,0.202,74.824,187733,4
2011-02-26,56,Fat Bottomed Girls,Glee Cast,3CozB1UhpMXQEdcdz9C6ze,True,0,56,1,0.514,0.711,2,-5.774,1,0.0433,0.0206,0,0.172,0.424,91.007,252173,4
2011-02-26,57,The Show Goes On,Lupe Fiasco,3CozB1UhpMXQEdcdz9C6ze,False,51,51,7,0.591,0.889,7,-3.839,1,0.115,0.0189,0,0.155,0.65,143.067,239613,4
2011-02-26,58,P.Y.T. (Pretty Young Thing),Glee Cast,57xW8NlNhWLdW78w25R3tb,True,0,58,1,0.846,0.77,9,-4.768,0,0.0692,0.162,0,0.205,0.896,127.362,236427,4
2011-02-26,59,All Of The Lights,Kanye West,57xW8NlNhWLdW78w25R3tb,False,58,55,7,0.531,0.803,1,-3.284,1,0.0717,0.0796,1.71e-05,0.176,0.221,142.113,299613,4
2011-02-26,60,Let Me Down Easy,Billy Currington,57xW8NlNhWLdW78w25R3tb,False,52,48,12,0.606,0.497,1,-5.005,1,0.0278,0.361,0,0.106,0.18,125.059,228493,4
2011-02-26,61,Fall For Your Type,Jamie Foxx Featuring Drake,57xW8NlNhWLdW78w25R3tb,False,50,50,10,0.593,0.393,1,-11.736,1,0.0827,0.394,3.24e-06,0.11,0.193,136.866,269533,4
2011-02-26,62,Need You Now,Glee Cast,57xW8NlNhWLdW78w25R3tb,False,72,62,2,0.55,0.674,4,-5.248,1,0.0277,0.0881,0,0.0873,0.248,108.037,217413,4
2011-02-26,63,Buzzin',Mann,57xW8NlNhWLdW78w25R3tb,False,61,61,5,0.724,0.951,7,-4.294,0,0.226,0.127,0,0.307,0.593,103.988,196147,4
2011-02-26,64,For The First Time,The Script,57xW8NlNhWLdW78w25R3tb,False,56,45,7,0.396,0.629,9,-4.78,1,0.0287,0.0328,0,0.183,0.358,173.794,252853,4
2011-02-26,65,Someone Else Calling You Baby,Luke Bryan,57xW8NlNhWLdW78w25R3tb,False,59,56,16,0.498,0.915,8,-3.729,1,0.0662,0.0509,1.36e-06,0.0734,0.353,115.044,229253,4
2011-02-26,66,Felt Good On My Lips,Tim McGraw,57xW8NlNhWLdW78w25R3tb,False,53,26,15,0.56,0.869,3,-3.804,1,0.0387,0.024,2.94e-06,0.136,0.519,136.001,277400,4
2011-02-26,67,Voices,Chris Young,57xW8NlNhWLdW78w25R3tb,False,57,53,15,0.552,0.788,0,-4.112,1,0.0525,0.38,0,0.15,0.641,76.528,186107,4
2011-02-26,68,The Cave,Mumford & Sons,57xW8NlNhWLdW78w25R3tb,False,99,68,2,0.595,0.506,4,-9.682,1,0.0388,0.0464,0.000138,0.107,0.346,141.981,217987,4
2011-02-26,69,This Is Country Music,Brad Paisley,57xW8NlNhWLdW78w25R3tb,False,65,65,8,0.507,0.669,2,-5.104,1,0.0275,0.126,0.000263,0.111,0.484,88.525,311640,4
2011-02-26,70,You Be Killin Em,Fabolous,57xW8NlNhWLdW78w25R3tb,False,67,64,7,0.664,0.909,6,-3.552,0,0.22,0.444,0,0.525,0.557,93.977,209693,4
2011-02-26,71,What Do You Want,Jerrod Niemann,57xW8NlNhWLdW78w25R3tb,False,71,69,8,0.555,0.496,4,-10.12,1,0.143,0.657,1.14e-06,0.106,0.543,153.301,214573,4
2011-02-26,72,Aston Martin Music,Rick Ross Featuring Drake & Chrisette Michele,57xW8NlNhWLdW78w25R3tb,False,54,30,20,0.57,0.58,1,-5.547,1,0.21,0.0124,0,0.0498,0.404,171.812,270627,4
2011-02-26,73,Bass Down Low,Dev Featuring The Cataracs,57xW8NlNhWLdW78w25R3tb,False,62,61,9,0.798,0.627,0,-8.086,1,0.0602,0.0778,0,0.0472,0.84,113.029,210600,4
2011-02-26,74,A Little Bit Stronger,Sara Evans,57xW8NlNhWLdW78w25R3tb,False,74,73,7,0.536,0.65,2,-5.603,1,0.0337,0.282,1.16e-06,0.0876,0.288,147.93,301987,4
2011-02-26,75,I Won't Give Up,Jana Kramer,3ALUfg1ISMMi1c38tOKk9E,True,0,75,1,0.612,0.369,2,-6.767,1,0.0253,0.621,0,0.103,0.309,83.004,198053,4
2011-02-26,76,Hello World,Lady Antebellum,3ALUfg1ISMMi1c38tOKk9E,False,73,58,14,0.427,0.531,8,-6.985,1,0.0297,0.0555,0.00106,0.0835,0.145,111.079,326107,4
2011-02-26,77,Maybe,Sick Puppies,3ALUfg1ISMMi1c38tOKk9E,False,68,56,12,0.437,0.913,7,-4.315,1,0.0972,0.0171,0,0.284,0.537,167.861,206120,4
2011-02-26,78,No BS,Chris Brown,3ALUfg1ISMMi1c38tOKk9E,False,70,62,10,0.426,0.612,1,-6.359,0,0.0567,0.12,0,0.119,0.106,172.171,247933,4
2011-02-26,79,This,Darius Rucker,3ALUfg1ISMMi1c38tOKk9E,False,77,76,7,0.625,0.826,4,-5.037,1,0.0325,0.121,0,0.158,0.699,99.919,218867,4
2011-02-26,80,Love Faces,Trey Songz,3ALUfg1ISMMi1c38tOKk9E,False,90,80,3,0.654,0.599,11,-6.699,1,0.0561,0.0599,0,0.161,0.333,119.782,243800,4
2011-02-26,81,Wildflower,The JaneDear Girls,3ALUfg1ISMMi1c38tOKk9E,False,60,60,5,0.692,0.858,6,-4.354,0,0.03,0.00217,4.85e-05,0.358,0.69,125.944,163453,4
2011-02-26,82,Who's That Chick?,David Guetta Featuring Rihanna,3ALUfg1ISMMi1c38tOKk9E,False,69,51,7,0.675,0.601,11,-4.733,0,0.116,0.00372,0,0.0458,0.931,127.938,201040,4
2011-02-26,83,Put You In A Song,Keith Urban,3ALUfg1ISMMi1c38tOKk9E,False,63,53,20,0.621,0.78,2,-8.502,1,0.0333,0.0174,0,0.0681,0.822,134.022,220387,4
2011-02-26,84,From A Table Away,Sunny Sweeney,3ALUfg1ISMMi1c38tOKk9E,False,78,78,6,0.547,0.805,8,-4.34,1,0.0293,0.0393,1.75e-05,0.332,0.557,110.027,215333,4
2011-02-26,85,I Won't Let Go,Rascal Flatts,3ALUfg1ISMMi1c38tOKk9E,False,93,72,3,0.557,0.406,4,-7.083,1,0.0278,0.742,0,0.113,0.222,131.96,227760,4
2011-02-26,86,I Just Had Sex,The Lonely Island Featuring Akon,3ALUfg1ISMMi1c38tOKk9E,False,80,30,8,0.615,0.811,6,-4.316,1,0.144,0.0188,0,0.196,0.808,167.995,166560,4
2011-02-26,87,She's Not There,Glee Cast,0lxbX5lDQzd10UIF7F9qQN,True,0,87,1,0.647,0.874,2,-4.483,0,0.0295,0.0262,0.00308,0.203,0.653,131.02,148027,4
2011-02-26,88,Little Miss,Sugarland,0lxbX5lDQzd10UIF7F9qQN,False,91,80,5,0.351,0.797,11,-4.286,1,0.0379,0.0959,4.12e-05,0.157,0.243,129.14,271267,5
2011-02-26,89,Words I Never Said,Lupe Fiasco Featuring Skylar Grey,5AcOdoDOQOKtPlAM1FqBO8,True,0,89,1,0.445,0.928,10,-3.532,0,0.304,0.0746,0,0.343,0.37,107.576,256960,3
2011-02-26,90,Kush,Dr. Dre Featuring Snoop Dogg & Akon,5AcOdoDOQOKtPlAM1FqBO8,False,76,34,13,0.444,0.866,7,-6.217,1,0.111,0.000622,4.72e-05,0.105,0.375,94.968,235120,4
2011-02-26,91,Pray,Justin Bieber,3O5zp6tOdGFWi0NdzC0frI,True,0,91,1,0.569,0.797,11,-7.674,1,0.0599,0.124,1.14e-06,0.105,0.664,163.972,212320,4
2011-02-26,92,Sing,My Chemical Romance,1mX6SYJ1ZpcoxQUiER8wOI,True,0,92,1,0.606,0.942,2,-3.618,1,0.0357,0.000233,7.07e-06,0.106,0.373,110.98,270387,4
2011-02-26,93,H*A*M,Kanye West Jay Z,1mX6SYJ1ZpcoxQUiER8wOI,False,86,23,5,0.657,0.524,8,-4.907,1,0.061,0.0462,0,0.322,0.0383,140.021,275733,4
2011-02-26,94,Make A Movie,Twista Featuring Chris Brown,1mX6SYJ1ZpcoxQUiER8wOI,False,85,71,14,0.846,0.774,1,-5.131,1,0.0509,0.00752,0,0.207,0.375,120.012,202000,4
2011-02-26,95,Heart Like Mine,Miranda Lambert,4EDeBzhZMcHEx7A8IcDiaL,True,0,95,1,0.437,0.844,8,-3.394,1,0.0381,0.0642,1.42e-06,0.124,0.493,155.066,177867,4
2011-02-26,97,Make It Rain,Travis Porter,,False,94,92,6,0.926,0.69,1,-4.327,0,0.175,0.078,0,0.228,0.387,128.952,239493,4
2011-02-26,98,Lay It Down,Lloyd,,False,84,64,17,0.527,0.796,1,-5.111,0,0.062,0.017,0,0.0798,0.534,155.99,240107,4
2011-02-26,99,Bleed Red,Ronnie Dunn,6s9GPlGYAUK6Nq5WlSuHuU,True,0,99,1,0.487,0.668,10,-4.251,1,0.0321,0.346,4.56e-05,0.107,0.184,90.083,229840,4
2011-02-26,100,Price Tag,Jessie J Featuring B.o.B,6s9GPlGYAUK6Nq5WlSuHuU,False,88,88,2,0.638,0.831,5,-3.944,1,0.182,0.0281,3.06e-06,0.277,0.685,175.038,223053,4
