date,position,title,artist,spotify_id,is_new,last_pos,peak_pos,weeks,danceability,energy,key,loudness,mode,speechiness,acousticness,instrumentalness,liveness,valence,tempo,duration_ms,time_signature
1991-11-30,1,Set Adrift On Memory Bliss,P.M. Dawn,,False,3,1,7,0.795,0.705,5,-8.552,0,0.0715,0.00118,0.00658,0.136,0.482,100.025,235800,4
1991-11-30,2,When A Man Loves A Woman,Michael Bolton,,False,1,1,8,0.476,0.363,1,-10.706,1,0.0296,0.2,0,0.055,0.243,164.555,231067,3
1991-11-30,3,Black Or White,Michael Jackson,,False,35,3,2,0.741,0.894,4,-3.826,1,0.0496,0.0814,0.0527,0.089,0.96,114.879,202853,4
1991-11-30,4,It's So Hard To Say Goodbye To Yesterday,Boyz II Men,,False,4,4,11,0.3,0.225,4,-11.079,1,0.0264,0.915,0,0.159,0.294,87.698,168627,4
1991-11-30,5,Cream,Prince And The N.P.G.,,False,2,1,10,0.861,0.604,5,-8.44,0,0.0719,0.0974,0.366,0.0467,0.853,115.589,253067,4
1991-11-30,6,Blowing Kisses In The Wind,Paula Abdul,,False,8,6,7,0.524,0.544,6,-9.059,0,0.0337,0.574,0,0.236,0.261,147.674,281840,4
1991-11-30,7,All 4 Love,Color Me Badd,,False,21,7,4,0.807,0.75,2,-8.29,1,0.0315,0.0346,0.000179,0.149,0.797,106.389,211493,4
1991-11-30,8,O.P.P.,Naughty By Nature,,False,11,6,13,0.848,0.838,4,-11.949,0,0.0723,0.0326,4.63e-06,0.124,0.774,97.735,271067,4
1991-11-30,9,Do Anything,Natural Selection,,False,24,2,17,0.654,0.749,11,-9.221,0,0.0537,0.0746,0,0.114,0.663,93.847,237373,4
1991-11-30,10,Can't Stop This Thing We Started,Bryan Adams,,False,5,2,12,0.497,0.93,9,-3.902,1,0.0444,0.0112,0,0.354,0.47,113.086,195933,4
1991-11-30,11,That's What Love Is For,Amy Grant,,False,7,7,10,0.544,0.699,9,-4.148,1,0.0341,0.258,0,0.144,0.293,141.844,257293,4
1991-11-30,12,Don't Cry,Guns N' Roses,,False,10,10,11,0.456,0.59,11,-8.638,1,0.0327,0.00182,0.00379,0.104,0.243,124.635,283733,4
1991-11-30,13,Let's Talk About Sex,Salt-N-Pepa,,False,13,13,15,0.863,0.543,6,-13.497,1,0.13,0.0507,0,0.241,0.799,106.929,213267,4
1991-11-30,14,Romantic,Karyn White,,False,15,1,16,0.68,0.941,1,-7.509,0,0.0374,0.484,7.43e-05,0.0656,0.823,110.264,247160,4
1991-11-30,15,Emotions,Mariah Carey,,False,33,1,14,0.74,0.752,9,-7.008,0,0.0359,0.0409,0.00125,0.0233,0.939,114.851,248093,4
1991-11-30,16,Set The Night To Music,Roberta Flack With Maxi Priest,,False,6,6,11,0.678,0.37,5,-16.073,1,0.0301,0.38,3.5e-05,0.128,0.622,121.595,323880,4
1991-11-30,17,Can't Let Go,Mariah Carey,,False,30,17,3,0.478,0.533,10,-11.048,1,0.0404,0.591,0.00704,0.139,0.181,162.369,266560,4
1991-11-30,18,Keep Coming Back,Richard Marx,,False,16,16,5,0.72,0.478,9,-11.074,1,0.0239,0.115,2.27e-05,0.104,0.672,97.073,409360,4
1991-11-30,19,2 Legit 2 Quit,M.C. Hammer,,False,36,19,4,0.853,0.884,1,-6.771,1,0.0836,0.0394,6.83e-06,0.0313,0.668,124.542,333624,4
1991-11-30,20,Street Of Dreams,Nia Peeples,,False,12,12,8,0.753,0.628,0,-10.54,0,0.0466,0.00747,0.000123,0.263,0.94,110.516,263533,4
1991-11-30,21,Wildside,Marky Mark & The Funky Bunch,,False,26,21,4,0.767,0.356,8,-15.502,0,0.106,0.166,0.309,0.101,0.271,105.404,307267,4
1991-11-30,22,No Son Of Mine,Genesis,,False,22,22,5,0.658,0.595,4,-8.704,0,0.0251,0.133,0.000358,0.0978,0.256,103.975,399107,4
1991-11-30,23,Hole Hearted,Extreme,,False,31,4,18,0.4,0.747,6,-9.438,1,0.045,0.163,0,0.0774,0.674,203.396,219289,4
1991-11-30,24,Finally,CeCe Peniston,,False,25,24,10,0.791,0.658,7,-11.128,1,0.0445,0.00653,0,0.0472,0.842,120.066,245000,4
1991-11-30,25,With You,Tony Terry,,False,19,14,23,0.619,0.492,8,-9.532,1,0.0328,0.455,0,0.106,0.553,131.888,305827,4
1991-11-30,26,I Wonder Why,Curtis Stigers,,False,9,9,13,0.549,0.62,0,-8.971,1,0.0306,0.0573,0,0.591,0.288,135.112,267240,3
1991-11-30,27,Good Vibrations,Marky Mark & The Funky Bunch Featuring Loleatta Holloway,,False,67,1,20,0.711,0.951,1,-8.406,1,0.0537,0.00189,0.366,0.0229,0.903,121.656,269307,4
1991-11-30,28,The One And Only,Chesney Hawkes,,False,17,10,18,0.681,0.697,4,-11.063,1,0.0327,0.357,0,0.388,0.775,119.956,223667,4
1991-11-30,29,Live For Loving You,Gloria Estefan,,False,28,28,8,0.728,0.613,7,-12.704,1,0.0369,0.093,0.00419,0.0448,0.521,114.926,276893,4
1991-11-30,30,Forever My Lady,Jodeci,,False,29,29,6,0.707,0.5,9,-15.198,0,0.0387,0.136,0,0.237,0.77,117.997,320360,4
1991-11-30,31,Enter Sandman,Metallica,,False,38,16,15,0.579,0.824,6,-8.71,0,0.03,0.00206,0.00903,0.059,0.635,123.331,331573,4
1991-11-30,32,Something To Talk About,Bonnie Raitt,,False,49,5,20,0.795,0.64,1,-13.478,1,0.0294,0.0631,2.13e-06,0.0692,0.954,102.633,227573,4
1991-11-30,33,Mind Playing Tricks On Me,Geto Boys,,False,37,33,9,0.886,0.512,10,-11.825,0,0.237,0.207,0,0.0991,0.454,93.997,308733,4
1991-11-30,34,Broken Arrow,Rod Stewart,,False,34,34,7,0.569,0.486,2,-10.64,1,0.0248,0.364,0.000326,0.267,0.509,83.213,261093,4
1991-11-30,35,Angel Baby,Angelica,,False,43,35,7,0.866,0.391,0,-7.632,1,0.0453,0.197,0.000377,0.0822,0.462,126.434,240867,4
1991-11-30,36,I Adore Mi Amor,Color Me Badd,,False,90,1,19,0.683,0.476,3,-9.995,0,0.027,0.243,0,0.0787,0.725,91.99,289200,4
1991-11-30,37,Running Back To You,Vanessa Williams,,False,56,18,17,0.723,0.865,5,-10.517,1,0.0451,0.0358,0.51,0.335,0.875,115.303,280000,4
1991-11-30,38,Ring My Bell,D.J. Jazzy Jeff & The Fresh Prince,,False,20,20,8,0.808,0.612,10,-12.453,0,0.0726,0.00548,0.00145,0.456,0.701,118.121,284867,4
1991-11-30,39,Don't Want To Be A Fool,Luther Vandross,,False,47,9,18,0.632,0.576,7,-8.345,1,0.0234,0.482,0,0.151,0.323,95.321,275133,4
1991-11-30,40,Get A Leg Up,John Mellencamp,,False,14,14,9,0.6,0.914,2,-4.748,1,0.0468,0.00518,1.84e-06,0.0649,0.736,138.586,227200,4
1991-11-30,41,Top Of The World,Van Halen,,False,27,27,8,0.546,0.785,9,-8.788,1,0.0297,0.0354,3.6e-06,0.0935,0.804,127.957,232867,4
1991-11-30,43,Something Got Me Started,Simply Red,,False,23,23,10,0.698,0.91,2,-6.563,1,0.0459,0.019,7.73e-05,0.11,0.715,112.112,240706,4
1991-11-30,44,Change,Lisa Stansfield,,False,32,32,5,0.677,0.845,2,-8.27,0,0.0379,0.0253,0.00102,0.325,0.639,105.893,274747,4
1991-11-30,45,Spending My Time,Roxette,,False,40,40,6,0.42,0.574,4,-5.149,1,0.0292,0.238,0.000115,0.127,0.218,170.549,275667,4
1991-11-30,46,Tell Me What You Want Me To Do,Tevin Campbell,,False,60,46,4,0.609,0.551,6,-7.93,1,0.0291,0.0233,0,0.234,0.512,127.956,256040,4
1991-11-30,47,Tender Kisses,Tracie Spencer,,False,44,44,7,0.594,0.521,0,-11.033,1,0.0417,0.161,0.00556,0.0382,0.789,167.569,328240,4
1991-11-30,48,Groovy Train,The Farm,,False,42,41,10,0.663,0.663,7,-16.943,1,0.0351,0.00286,1.78e-05,0.0233,0.782,115.858,244467,4
1991-11-30,49,Save Up All Your Tears,Cher,,False,48,48,7,0.609,0.773,5,-9.166,1,0.0389,0.075,0,0.188,0.352,113.443,238160,4
1991-11-30,50,Can't Truss It,Public Enemy,,False,53,50,7,0.802,0.872,11,-7.651,1,0.139,0.00196,0,0.132,0.607,101.664,321573,4
1991-11-30,51,I Love Your Smile,Shanice,,False,93,51,2,0.713,0.827,10,-9.759,0,0.113,0.0108,5.74e-06,0.134,0.738,93.934,259627,4
1991-11-30,52,A Day In My Life (Without You),Lisette Melendez,,False,62,49,10,0.606,0.947,6,-4.446,0,0.0371,0.000874,0.314,0.0514,0.789,119.104,235040,4
1991-11-30,53,Real Real Real,Jesus Jones,,False,50,4,15,0.596,0.547,0,-13.136,1,0.0331,0.0478,4.92e-05,0.157,0.697,110.209,188760,4
1991-11-30,54,Just Want To Hold You,Jasmine Guy,,False,66,34,18,0.611,0.368,8,-13.701,1,0.0362,0.3,4.05e-05,0.0567,0.451,161.986,251867,4
1991-11-30,55,Love Me All Up,Stacy Earl,,False,69,55,3,0.702,0.859,11,-10.922,1,0.0467,0.0468,0.0928,0.245,0.657,122.879,297360,4
1991-11-30,57,Is It Good To You,Heavy D & The Boyz,,False,78,57,2,0.711,0.595,1,-12.99,1,0.036,0.0484,0.0327,0.208,0.836,107.473,292227,4
1991-11-30,58,Everybody Plays The Fool,Aaron Neville,,False,64,8,20,0.789,0.352,10,-14.022,1,0.143,0.224,0.00147,0.0536,0.431,87.894,266107,4
1991-11-30,59,Too Blind To See It,Kym Sims,,False,81,59,3,0.773,0.668,11,-8.678,0,0.117,0.00187,9.17e-06,0.308,0.698,95.27,227699,4
1991-11-30,60,Home Sweet Home,Motley Crue,,False,52,52,4,0.403,0.777,5,-6.416,1,0.0354,0.0999,3.28e-06,0.124,0.149,76.329,240933,4
1991-11-30,61,Kiss You Back,Digital Underground,,False,70,61,3,0.844,0.648,9,-10.685,0,0.113,0.0386,0,0.223,0.794,113.074,221467,4
1991-11-30,62,I've Got A Lot To Learn About Love,The Storm,,False,54,54,6,0.583,0.742,9,-8.621,0,0.0255,0.00532,1.08e-06,0.0752,0.57,110.671,265467,4
1991-11-30,63,The Fly,U2,,False,61,61,4,0.507,0.934,11,-8.888,0,0.0553,3.52e-05,0.0253,0.161,0.417,108.345,269053,4
1991-11-30,64,Shot Of Poison,Lita Ford,,False,45,45,5,0.578,0.855,5,-8.057,1,0.0414,0.0388,5.56e-06,0.345,0.732,126.264,210733,4
1991-11-30,65,Rush,Big Audio,,False,39,32,11,0.791,0.768,9,-9.348,1,0.0957,0.137,3.85e-06,0.307,0.722,124.077,257133,4
1991-11-30,66,Lies,EMF,,False,18,18,10,0.543,0.864,8,-9.874,1,0.0381,0.000611,0.00223,0.207,0.759,113.952,259667,4
1991-11-30,68,Send Me An Angel,Scorpions,,False,63,63,4,0.153,0.417,1,-11.587,1,0.0318,0.434,0.000622,0.211,0.166,80.87,273333,3
1991-11-30,69,Ain't Gonna Hurt Nobody,Kid 'N Play,,False,73,69,3,0.776,0.735,6,-14.78,0,0.183,0.0532,0.00687,0.286,0.619,110.105,298814,4
1991-11-30,70,Pop That Coochie,The 2 Live Crew,,False,58,58,5,0.904,0.89,7,-6.708,1,0.176,0.000246,0.00174,0.113,0.647,127.811,257800,4
1991-11-30,72,Whispers,Corina,,False,89,51,10,0.652,0.803,4,-12.688,0,0.0546,0.00942,0.00183,0.349,0.441,122.699,287893,4
1991-11-30,73,In My Dreams,The Party,,False,82,73,3,0.615,0.955,1,-8.336,0,0.0587,0.0355,0.00273,0.427,0.58,121.883,217038,4
1991-11-30,74,Mysterious Ways,U2,,False,77,74,2,0.674,0.659,8,-8.049,1,0.0277,0.00156,0.00765,0.108,0.697,99.768,243587,4
1991-11-30,75,Keep It Comin',Keith Sweat,5DcIkTnThkzh1fTnF6juFx,True,0,75,1,0.667,0.899,11,-7.084,0,0.0809,0.0371,4.12e-06,0.541,0.738,101.477,246373,4
1991-11-30,76,All She Wrote,Firehouse,5DcIkTnThkzh1fTnF6juFx,False,72,72,3,0.603,0.759,8,-10.393,1,0.0322,3.85e-05,0.0162,0.148,0.376,121.214,267427,4
1991-11-30,78,Word To The Badd!!,Jermaine Jackson,3xYVVQ0to8V6mJSvX1pkgg,True,0,78,1,0.709,0.804,11,-9.903,0,0.069,0.00469,0.125,0.243,0.593,109.975,317600,4
1991-11-30,79,I Can't Make You Love Me,Bonnie Raitt,3xYVVQ0to8V6mJSvX1pkgg,False,87,79,2,0.588,0.149,7,-16.728,0,0.0319,0.846,9.65e-05,0.236,0.113,124.689,332960,4
1991-11-30,80,Conviction Of The Heart,Kenny Loggins,3xYVVQ0to8V6mJSvX1pkgg,False,65,65,6,0.491,0.5,7,-12.097,0,0.0377,0.439,5.63e-06,0.114,0.406,96.7,411267,4
1991-11-30,81,No More Tears,Ozzy Osbourne,7w6PJe5KBPyvuRYxFkPssC,True,0,81,1,0.346,0.749,6,-6.506,1,0.035,0.00167,8.86e-05,0.648,0.315,102.591,443240,4
1991-11-30,82,Love Crazy,Atlantic Starr,7w6PJe5KBPyvuRYxFkPssC,False,95,82,2,0.59,0.681,10,-9.642,0,0.11,0.00217,0.0197,0.064,0.846,188.186,286760,4
1991-11-30,83,Walk Through Fire,Bad Company,7w6PJe5KBPyvuRYxFkPssC,False,84,28,15,0.626,0.698,7,-10.311,1,0.0325,0.00316,0.0211,0.331,0.72,122.965,288560,4
1991-11-30,84,The Way I Feel About You,Karyn White,5LLRxnEQAbnQNzLK0mAC2R,True,0,84,1,0.673,0.888,1,-7.056,1,0.0364,0.261,0.000134,0.234,0.801,110.772,275467,4
1991-11-30,85,On A Sunday Afternoon,Lighter Shade Of Brown,1cM25iyn6zKOfnywTNtvyb,True,0,85,1,0.784,0.765,1,-3.545,1,0.212,0.095,0,0.182,0.845,94.812,212880,4
1991-11-30,86,My Heart Belongs To You,Russ Irwin,1cM25iyn6zKOfnywTNtvyb,False,55,28,12,0.491,0.34,3,-12.18,1,0.0293,0.645,1.46e-06,0.112,0.226,133.305,240933,4
1991-11-30,87,What Time Is Love?,The KLF,1cM25iyn6zKOfnywTNtvyb,False,57,57,6,0.642,0.88,6,-5.216,1,0.134,0.00233,3.07e-05,0.916,0.576,120.099,235852,4
1991-11-30,89,Within My Heart,Voyce,1yJXPIBKWICGZOP62KKOTe,True,0,89,1,0.69,0.942,1,-5.798,0,0.0729,0.00231,3.38e-05,0.199,0.575,120.533,240824,4
1991-11-30,91,Then Came You,T.P.E.,62P5C3fXhFl3PkNMWzGcoK,True,0,91,1,0.656,0.784,7,-10.145,1,0.0955,0.00344,0.000113,0.384,0.732,118.761,277027,4
1991-11-30,92,I Want You,Jody Watley,6Hyzt4sNpLIh7tJkRCCAha,True,0,92,1,0.76,0.611,9,-8.862,0,0.0661,0.000178,0.0157,0.0685,0.646,110.006,260533,4
1991-11-30,93,Monsters And Angels,Voice Of The Beehive,6Hyzt4sNpLIh7tJkRCCAha,False,74,74,5,0.573,0.557,9,-9.778,1,0.0283,0.000247,2.26e-05,0.271,0.519,81.536,218146,4
1991-11-30,94,Stand By My Woman,Lenny Kravitz,6Hyzt4sNpLIh7tJkRCCAha,False,76,76,7,0.505,0.409,2,-10.726,1,0.0307,0.14,0.233,0.106,0.252,122.261,260400,4
1991-11-30,95,Into The Great Wide Open,Tom Petty And The Heartbreakers,6Hyzt4sNpLIh7tJkRCCAha,False,92,92,3,0.651,0.766,0,-9.935,1,0.0299,0.206,0.00103,0.362,0.949,116.74,242107,4
1991-11-30,96,Groovin',UB40,6Hyzt4sNpLIh7tJkRCCAha,False,98,96,2,0.817,0.561,2,-13.311,1,0.0539,0.00204,0.00879,0.0421,0.904,99.02,229973,4
1991-11-30,97,Thinking Of You,Grandmaster Slice,6Hyzt4sNpLIh7tJkRCCAha,False,85,85,6,0.755,0.347,2,-13.853,0,0.0792,0.154,2.99e-05,0.115,0.634,138.673,240067,4
1991-11-30,98,True Companion,Marc Cohn,6Hyzt4sNpLIh7tJkRCCAha,False,80,80,5,0.465,0.16,9,-18.027,1,0.0407,0.813,1.08e-06,0.109,0.292,114.589,249960,4
1991-11-30,99,Do You Feel Like I Feel?,Belinda Carlisle,6Hyzt4sNpLIh7tJkRCCAha,False,83,73,6,0.579,0.895,2,-6.603,1,0.0395,7.22e-05,1.72e-05,0.293,0.695,122.98,273333,4
1991-11-30,100,The Devil Came Up To Michigan,K.M.C. KRU,6Hyzt4sNpLIh7tJkRCCAha,False,100,46,14,0.86,0.636,2,-15.511,1,0.145,0.172,4.9e-05,0.368,0.842,128.012,226933,4
