date,position,title,artist,spotify_id,is_new,last_pos,peak_pos,weeks,danceability,energy,key,loudness,mode,speechiness,acousticness,instrumentalness,liveness,valence,tempo,duration_ms,time_signature
2007-05-12,1,Makes Me Wonder,Maroon 5,5wvYib82q05wiNjLElD8GJ,False,64,1,4,0.799,0.856,7,-2.427,1,0.0352,0.00383,0.00062,0.0621,0.892,113.994,212227,4
2007-05-12,2,Girlfriend,Avril Lavigne,5wvYib82q05wiNjLElD8GJ,False,1,1,9,0.56,0.959,7,-2.433,1,0.102,0.000738,0.000206,0.209,0.67,163.983,216600,4
2007-05-12,3,Give It To Me,Timbaland Featuring Nelly Furtado & Justin Timberlake,5wvYib82q05wiNjLElD8GJ,False,2,1,12,0.975,0.711,8,-3.904,1,0.0632,0.168,0.000552,0.0799,0.815,110.621,234027,4
2007-05-12,4,Buy U A Drank (Shawty Snappin'),T-Pain Featuring Yung Joc,5wvYib82q05wiNjLElD8GJ,False,5,4,10,0.451,0.55,1,-8.137,1,0.262,0.0108,0,0.0737,0.594,80.001,227960,4
2007-05-12,5,Because Of You,Ne-Yo,5wvYib82q05wiNjLElD8GJ,False,39,5,9,0.81,0.538,0,-5.784,0,0.0356,0.528,0,0.0951,0.828,109.97,266840,4
2007-05-12,6,I'll Stand By You,Carrie Underwood,2qAcnCP9xtJdAZ3oXc0hNv,True,0,6,1,0.715,0.148,4,-13.954,0,0.0373,0.472,0.211,0.123,0.403,123.992,229893,4
2007-05-12,7,Glamorous,Fergie Featuring Ludacris,2qAcnCP9xtJdAZ3oXc0hNv,False,4,1,16,0.81,0.755,0,-6.408,1,0.201,0.288,0,0.0857,0.623,130.99,246573,4
2007-05-12,8,Never Again,Kelly Clarkson,24y3tSyLdRbpVsKhQrR2oj,True,0,8,1,0.514,0.91,7,-2.978,0,0.0714,0.00168,0.00187,0.224,0.472,145.907,217293,4
2007-05-12,9,Don't Matter,Akon,24y3tSyLdRbpVsKhQrR2oj,False,3,1,15,0.798,0.443,2,-6.062,1,0.0403,0.244,0,0.326,0.354,125.232,293053,4
2007-05-12,10,The Sweet Escape,Gwen Stefani Featuring Akon,24y3tSyLdRbpVsKhQrR2oj,False,6,2,20,0.756,0.77,1,-3.502,1,0.0343,0.191,0,0.178,0.73,119.961,246467,4
2007-05-12,11,I Tried,Bone Thugs-N-Harmony Featuring Akon,24y3tSyLdRbpVsKhQrR2oj,False,7,7,5,0.727,0.71,4,-6.142,1,0.0742,0.0104,0,0.107,0.378,81.995,287480,4
2007-05-12,12,"Pop, Lock & Drop It",Huey,24y3tSyLdRbpVsKhQrR2oj,False,15,12,10,0.723,0.644,11,-6.863,0,0.222,0.00308,0,0.352,0.645,144.09,261027,4
2007-05-12,13,Last Night,Diddy Featuring Keyshia Cole,24y3tSyLdRbpVsKhQrR2oj,False,13,10,15,0.916,0.849,3,-5.034,0,0.0639,0.166,0.000193,0.0859,0.974,121.002,255773,4
2007-05-12,14,Before He Cheats,Carrie Underwood,24y3tSyLdRbpVsKhQrR2oj,False,11,11,35,0.519,0.749,6,-3.318,0,0.0405,0.271,0,0.119,0.29,147.905,199947,4
2007-05-12,15,Cupid's Chokehold/Breakfast In America,Gym Class Heroes Featuring Patrick Stump,24y3tSyLdRbpVsKhQrR2oj,False,10,4,17,0.72,0.744,1,-6.938,0,0.12,0.237,0,0.255,0.619,78.953,243773,4
2007-05-12,16,U + Ur Hand,P!nk,24y3tSyLdRbpVsKhQrR2oj,False,9,9,18,0.709,0.891,0,-3.688,1,0.0528,0.00144,0,0.034,0.886,141.04,214387,4
2007-05-12,17,This Is Why I'm Hot,Mims,24y3tSyLdRbpVsKhQrR2oj,False,8,1,15,0.621,0.6,8,-6.349,1,0.576,0.277,0,0.495,0.485,80.021,253707,4
2007-05-12,19,Beautiful Liar,Beyonce & Shakira,,False,12,3,7,0.764,0.751,8,-3.74,1,0.0703,0.00554,0.000237,0.164,0.418,91.977,199853,4
2007-05-12,20,Like A Boy,Ciara,,False,19,19,9,0.701,0.724,0,-5.751,0,0.145,0.267,0,0.0867,0.425,132.035,237053,4
2007-05-12,21,Home,Daughtry,,False,23,21,9,0.443,0.853,6,-3.885,1,0.0361,0.00217,1.77e-06,0.198,0.338,143.986,255652,4
2007-05-12,22,Summer Love,Justin Timberlake,,False,34,22,3,0.606,0.591,0,-7.228,0,0.087,0.0756,0,0.328,0.477,95.802,252973,4
2007-05-12,23,The Way I Live,Baby Boy Da Prince Featuring Lil Boosie,,False,21,21,20,0.88,0.438,0,-7.562,1,0.248,0.0147,0,0.0907,0.714,90.02,324907,4
2007-05-12,24,Get It Shawty,Lloyd,,False,27,24,7,0.822,0.905,5,-4.032,0,0.241,0.123,0,0.0496,0.674,128.014,209533,4
2007-05-12,25,What I've Done,Linkin Park,,False,17,7,4,0.623,0.93,5,-5.285,1,0.0324,0.0141,1.64e-06,0.138,0.287,120.119,205613,4
2007-05-12,26,If Everyone Cared,Nickelback,,False,18,17,15,0.519,0.85,6,-4.678,0,0.0354,0.000246,0.014,0.279,0.211,132.022,218013,4
2007-05-12,27,Lost Without U,Robin Thicke,,False,16,14,20,0.664,0.351,0,-12.136,1,0.118,0.226,2.38e-06,0.106,0.816,113.204,254147,5
2007-05-12,28,Icky Thump,The White Stripes,2LMq1O0NiqGhPOlXo3McYQ,True,0,28,1,0.417,0.63,9,-7.24,1,0.0898,0.0209,0.0134,0.0543,0.341,94.214,254533,4
2007-05-12,29,It's Not Over,Daughtry,2LMq1O0NiqGhPOlXo3McYQ,False,20,4,23,0.428,0.919,10,-3.245,0,0.0618,0.0503,0,0.245,0.294,145.927,214831,4
2007-05-12,30,Say It Right,Nelly Furtado,2LMq1O0NiqGhPOlXo3McYQ,False,22,1,25,0.871,0.869,1,-6.308,1,0.139,0.0409,0.00111,0.053,0.834,116.95,223080,4
2007-05-12,31,Outta My System,Bow Wow Featuring T-Pain & Johnta Austin,2LMq1O0NiqGhPOlXo3McYQ,False,28,28,9,0.772,0.59,6,-6.957,1,0.183,0.0917,0,0.101,0.743,83.998,238267,4
2007-05-12,32,Face Down,The Red Jumpsuit Apparatus,2LMq1O0NiqGhPOlXo3McYQ,False,26,24,38,0.545,0.932,7,-2.189,0,0.0399,0.000665,0,0.127,0.464,92.956,192000,4
2007-05-12,33,What Goes Around...Comes Around,Justin Timberlake,2LMq1O0NiqGhPOlXo3McYQ,False,24,1,21,0.687,0.723,7,-4.751,1,0.0709,0.122,0.00102,0.573,0.432,76.0,448573,4
2007-05-12,34,2 Step,Unk,2LMq1O0NiqGhPOlXo3McYQ,False,29,29,12,0.763,0.797,11,-2.274,0,0.0977,0.0583,0,0.299,0.645,77.003,195787,4
2007-05-12,35,Go Getta,Young Jeezy Featuring R. Kelly,2LMq1O0NiqGhPOlXo3McYQ,False,25,18,15,0.392,0.751,3,-6.586,0,0.155,0.105,0,0.15,0.438,173.825,229347,4
2007-05-12,36,Rock Yo Hips,Crime Mob Featuring Lil Scrappy,2LMq1O0NiqGhPOlXo3McYQ,False,30,30,12,0.847,0.667,6,-5.7,1,0.17,0.0869,0,0.443,0.707,77.492,226547,4
2007-05-12,37,Better Than Me,Hinder,2LMq1O0NiqGhPOlXo3McYQ,False,31,31,9,0.449,0.682,2,-5.295,0,0.029,0.205,0,0.175,0.254,139.924,223533,4
2007-05-12,38,We Takin' Over,"DJ Khaled Featuring T.I., Akon, Rick Ross, Fat Joe, Lil' Wayne & Baby",2LMq1O0NiqGhPOlXo3McYQ,False,36,36,5,0.765,0.872,10,-4.241,0,0.0775,0.143,0,0.495,0.578,112.607,263280,4
2007-05-12,39,How To Save A Life,The Fray,2LMq1O0NiqGhPOlXo3McYQ,False,37,3,55,0.64,0.743,10,-4.08,1,0.0379,0.269,0,0.101,0.361,122.035,262533,4
2007-05-12,40,Wasted,Carrie Underwood,2LMq1O0NiqGhPOlXo3McYQ,False,40,37,13,0.548,0.775,8,-3.285,1,0.0306,0.0936,0,0.0721,0.311,94.998,274267,4
2007-05-12,41,Thnks Fr Th Mmrs,Fall Out Boy,2LMq1O0NiqGhPOlXo3McYQ,False,51,41,3,0.459,0.891,10,-5.057,0,0.0623,0.00511,0,0.106,0.588,154.837,203507,4
2007-05-12,42,Irreplaceable,Beyonce,2LMq1O0NiqGhPOlXo3McYQ,False,35,1,28,0.447,0.694,7,-4.637,0,0.382,0.0293,5.46e-06,0.167,0.509,175.868,227853,4
2007-05-12,43,Walk It Out,Unk,2LMq1O0NiqGhPOlXo3McYQ,False,42,10,34,0.794,0.777,1,-3.696,0,0.0813,0.0982,0,0.202,0.706,160.022,173040,4
2007-05-12,44,Hey There Delilah,Plain White T's,2LMq1O0NiqGhPOlXo3McYQ,False,53,44,5,0.656,0.291,2,-10.572,1,0.0293,0.872,0,0.114,0.298,103.971,232533,4
2007-05-12,45,Throw Some D's,Rich Boy Featuring Polow Da Don,2LMq1O0NiqGhPOlXo3McYQ,False,33,6,21,0.697,0.86,11,-5.181,1,0.43,0.0368,0,0.0721,0.433,160.895,263920,4
2007-05-12,46,Stand,Rascal Flatts,2LMq1O0NiqGhPOlXo3McYQ,False,50,46,11,0.603,0.761,0,-4.753,1,0.0314,0.0238,0,0.235,0.526,93.858,208133,4
2007-05-12,47,Last Dollar (Fly Away),Tim McGraw,2LMq1O0NiqGhPOlXo3McYQ,False,43,13,9,0.48,0.621,4,-4.814,1,0.0372,0.206,0,0.134,0.713,207.676,237120,4
2007-05-12,48,Ticks,Brad Paisley,2LMq1O0NiqGhPOlXo3McYQ,False,52,40,5,0.623,0.79,4,-6.316,1,0.0283,0.0312,3.77e-05,0.106,0.718,94.433,273160,4
2007-05-12,49,Good Directions,Billy Currington,2LMq1O0NiqGhPOlXo3McYQ,False,54,49,8,0.716,0.72,5,-2.183,1,0.0319,0.307,0,0.135,0.464,122.512,215853,4
2007-05-12,50,Big Girls Don't Cry,Fergie,2LMq1O0NiqGhPOlXo3McYQ,False,41,41,2,0.708,0.641,7,-4.296,1,0.0335,0.205,0,0.0945,0.253,113.082,268120,4
2007-05-12,51,Buddy,Musiq Soulchild,2LMq1O0NiqGhPOlXo3McYQ,False,47,36,14,0.735,0.839,6,-4.705,0,0.271,0.0534,0,0.0942,0.834,89.942,223813,4
2007-05-12,52,Over It,Katharine McPhee,2LMq1O0NiqGhPOlXo3McYQ,False,46,29,13,0.462,0.801,8,-4.191,1,0.0664,0.0415,0,0.0523,0.491,84.541,215200,4
2007-05-12,53,Teardrops On My Guitar,Taylor Swift,2LMq1O0NiqGhPOlXo3McYQ,False,56,52,8,0.621,0.417,10,-6.941,1,0.0231,0.288,0,0.119,0.289,99.953,203040,4
2007-05-12,54,Settlin',Sugarland,2LMq1O0NiqGhPOlXo3McYQ,False,57,54,13,0.624,0.934,3,-1.825,1,0.0479,0.112,0.000221,0.127,0.573,122.056,207067,4
2007-05-12,55,Forever,Papa Roach,2LMq1O0NiqGhPOlXo3McYQ,False,62,55,5,0.575,0.591,2,-5.916,0,0.028,0.0173,0,0.173,0.332,107.967,246333,4
2007-05-12,56,Up To The Mountain,Kelly Clarkson Featuring Jeff Beck,3VGK66soPqpSxxFPk6oasH,True,0,56,1,0.364,0.347,11,-7.267,1,0.0329,0.843,4.94e-05,0.104,0.194,145.019,197515,4
2007-05-12,57,"This Ain't A Scene, It's An Arms Race",Fall Out Boy,3VGK66soPqpSxxFPk6oasH,False,49,2,15,0.435,0.887,9,-4.07,1,0.0636,0.000747,0,0.0327,0.408,199.935,212040,4
2007-05-12,58,Anyway,Martina McBride,3VGK66soPqpSxxFPk6oasH,False,32,32,13,0.527,0.503,5,-6.769,1,0.0252,0.0971,1.98e-05,0.107,0.305,137.021,280867,4
2007-05-12,59,With Love,Hilary Duff,3VGK66soPqpSxxFPk6oasH,False,45,24,7,0.852,0.896,6,-5.465,0,0.0681,0.00887,6.03e-05,0.0216,0.961,121.978,181000,4
2007-05-12,60,Little Wonders,Rob Thomas,3VGK66soPqpSxxFPk6oasH,False,58,58,5,0.163,0.616,9,-9.996,1,0.044,0.0286,0,0.0826,0.33,81.993,224720,4
2007-05-12,61,Stolen,Dashboard Confessional,3VGK66soPqpSxxFPk6oasH,False,60,60,4,0.636,0.838,3,-3.988,1,0.0329,0.00143,1.22e-05,0.0573,0.318,101.584,199107,4
2007-05-12,62,Like This,Kelly Rowland Featuring Eve,3VGK66soPqpSxxFPk6oasH,False,69,62,6,0.676,0.73,1,-5.963,1,0.267,0.00193,0,0.0627,0.489,178.117,215853,4
2007-05-12,63,Umbrella,Rihanna Featuring Jay-Z,3VGK66soPqpSxxFPk6oasH,False,72,63,3,0.583,0.829,1,-4.603,1,0.134,0.00864,0,0.0426,0.575,174.028,275987,4
2007-05-12,64,Candyman,Christina Aguilera,3VGK66soPqpSxxFPk6oasH,False,55,25,13,0.686,0.789,8,-4.713,0,0.23,0.0125,0.0147,0.142,0.72,172.976,194213,4
2007-05-12,65,Signal Fire,Snow Patrol,2Lq7i05pUA4ZJpadB1zzhO,True,0,65,1,0.535,0.673,9,-7.699,1,0.0358,0.206,6.61e-06,0.117,0.148,134.493,235985,4
2007-05-12,66,Moments,Emerson Drive,2Lq7i05pUA4ZJpadB1zzhO,False,70,66,6,0.498,0.481,9,-8.04,1,0.0278,0.193,0,0.0868,0.303,141.911,298027,4
2007-05-12,67,Party Like A Rockstar,Shop Boyz,2Lq7i05pUA4ZJpadB1zzhO,False,80,67,2,0.656,0.92,6,-4.133,0,0.0441,0.00495,0.00633,0.347,0.784,150.068,214640,4
2007-05-12,68,High Maintenance Woman,Toby Keith,2Lq7i05pUA4ZJpadB1zzhO,False,68,68,11,0.648,0.912,2,-3.879,1,0.0336,0.0313,0,0.38,0.799,123.024,201333,4
2007-05-12,69,Lost In This Moment,Big & Rich,2Lq7i05pUA4ZJpadB1zzhO,False,65,60,6,0.599,0.574,11,-7.363,1,0.0434,0.32,0,0.226,0.677,147.751,210843,4
2007-05-12,70,Long Trip Alone,Dierks Bentley,2Lq7i05pUA4ZJpadB1zzhO,False,66,66,10,0.324,0.514,7,-6.228,1,0.0338,0.239,4.97e-06,0.107,0.216,184.975,223200,4
2007-05-12,71,Doe Boy Fresh,Three 6 Mafia Featuring Chamillionaire,2Lq7i05pUA4ZJpadB1zzhO,False,59,54,8,0.8,0.619,4,-5.728,1,0.131,0.263,0,0.0624,0.75,152.329,258733,4
2007-05-12,72,Please Don't Go,Tank,2Lq7i05pUA4ZJpadB1zzhO,False,81,72,8,0.718,0.455,10,-9.614,0,0.116,0.755,0,0.553,0.402,125.123,286507,3
2007-05-12,73,Read My Mind,The Killers,2Lq7i05pUA4ZJpadB1zzhO,False,71,62,11,0.543,0.917,1,-3.391,1,0.0444,0.00572,7.76e-05,0.104,0.329,132.246,246840,4
2007-05-12,74,A Woman's Love,Alan Jackson,2Lq7i05pUA4ZJpadB1zzhO,False,78,74,5,0.592,0.555,4,-8.868,1,0.0316,0.506,0.0527,0.14,0.39,139.404,253640,4
2007-05-12,75,When I See U,Fantasia,2Lq7i05pUA4ZJpadB1zzhO,False,86,75,4,0.569,0.596,8,-6.486,1,0.171,0.457,8.99e-05,0.205,0.757,93.134,217347,4
2007-05-12,76,Find Out Who Your Friends Are,Tracy Lawrence,2Lq7i05pUA4ZJpadB1zzhO,False,79,76,4,0.524,0.797,2,-4.777,1,0.0329,0.209,0,0.286,0.783,159.859,227840,4
2007-05-12,77,She's Like The Wind,Lumidee Featuring Tony Sunshine,2Lq7i05pUA4ZJpadB1zzhO,False,61,43,15,0.4,0.646,9,-8.066,0,0.259,0.0871,0,0.126,0.267,208.078,257533,4
2007-05-12,78,You Raise Me Up,Josh Groban & The African Children's Choir,4TbNLKRLKlxZDlS0pu7Lsy,True,0,78,1,0.25,0.136,10,-12.162,1,0.037,0.673,0.000157,0.107,0.0981,118.086,292333,4
2007-05-12,79,Beer In Mexico,Kenny Chesney,4TbNLKRLKlxZDlS0pu7Lsy,False,74,61,14,0.58,0.906,2,-6.976,1,0.0405,0.00119,0.000579,0.0933,0.476,137.97,271813,4
2007-05-12,80,A Different World,Bucky Covington,4TbNLKRLKlxZDlS0pu7Lsy,False,63,63,2,0.62,0.686,9,-5.027,1,0.0276,0.0327,0,0.101,0.464,128.962,208573,4
2007-05-12,81,Grace Kelly,MIKA,4TbNLKRLKlxZDlS0pu7Lsy,False,76,57,13,0.671,0.82,0,-5.796,1,0.048,0.0194,0.0133,0.361,0.685,122.361,187733,4
2007-05-12,82,You Know I'm No Good,Amy Winehouse,4TbNLKRLKlxZDlS0pu7Lsy,False,91,82,5,0.705,0.806,9,-3.607,1,0.0309,0.0132,0.00428,0.0701,0.734,103.383,256947,4
2007-05-12,83,Look After You,The Fray,4TbNLKRLKlxZDlS0pu7Lsy,False,75,59,9,0.447,0.592,6,-3.015,0,0.0319,0.0575,4.47e-06,0.13,0.283,78.039,266773,4
2007-05-12,84,If I Was Your Man,Joe,5PH2eU6P5LdnwDezBu8334,True,0,84,1,0.71,0.477,1,-7.44,1,0.0397,0.167,1.24e-06,0.128,0.143,94.932,232533,4
2007-05-12,85,On The Hotline,Pretty Ricky,5PH2eU6P5LdnwDezBu8334,False,77,12,18,0.704,0.854,10,-5.477,0,0.183,0.0185,0,0.148,0.688,92.988,242587,4
2007-05-12,86,Lucky Man,Montgomery Gentry,5PH2eU6P5LdnwDezBu8334,False,88,86,2,0.578,0.471,4,-7.27,1,0.0289,0.368,0,0.159,0.532,133.061,196707,4
2007-05-12,87,Breath,Breaking Benjamin,5PH2eU6P5LdnwDezBu8334,False,84,84,5,0.347,0.868,5,-4.145,0,0.0467,0.00012,0.000273,0.0845,0.313,182.851,218467,4
2007-05-12,88,Wrapped,George Strait,5PH2eU6P5LdnwDezBu8334,False,95,88,2,0.586,0.762,11,-4.055,1,0.0263,0.253,0,0.109,0.59,114.067,247880,4
2007-05-12,89,I'm Throwed,Paul Wall Featuring Jermaine Dupri,5PH2eU6P5LdnwDezBu8334,False,87,87,3,0.739,0.777,4,-5.7,0,0.239,0.0135,0,0.134,0.756,82.01,231307,4
2007-05-12,90,Don't Make Me,Blake Shelton,5PH2eU6P5LdnwDezBu8334,False,93,90,2,0.513,0.546,5,-5.703,1,0.0282,0.0181,0,0.122,0.245,141.876,246560,4
2007-05-12,91,It's Me Snitches,Swizz Beatz,5PH2eU6P5LdnwDezBu8334,False,83,83,3,0.785,0.95,9,-5.136,1,0.267,0.132,0.000229,0.362,0.145,92.033,154227,4
2007-05-12,92,Johnny Cash,Jason Aldean,5PH2eU6P5LdnwDezBu8334,False,97,92,2,0.626,0.856,8,-4.114,1,0.0463,0.0081,3.8e-06,0.13,0.699,112.078,190560,4
2007-05-12,93,I Don't Need A Man,The Pussycat Dolls,41Mx3PTX0YtnpQ9SD1MDGI,True,0,93,1,0.777,0.958,7,-3.872,0,0.0431,0.04,2.78e-05,0.0842,0.763,105.834,219093,4
2007-05-12,94,Dig,Incubus,41Mx3PTX0YtnpQ9SD1MDGI,False,99,94,2,0.45,0.895,11,-4.739,1,0.0386,0.0293,0,0.116,0.463,77.577,257253,4
2007-05-12,95,Smile,Lily Allen,41Mx3PTX0YtnpQ9SD1MDGI,False,85,49,14,0.632,0.639,5,-5.938,1,0.0259,0.00143,0,0.221,0.733,95.506,196893,4
2007-05-12,96,Upgrade U,Beyonce Featuring Jay Z,41Mx3PTX0YtnpQ9SD1MDGI,False,89,59,18,0.593,0.68,7,-5.556,1,0.335,0.00182,4.84e-05,0.31,0.483,84.547,273053,4
2007-05-12,97,Gravity,John Mayer,41Mx3PTX0YtnpQ9SD1MDGI,False,0,71,3,0.764,0.326,7,-9.883,1,0.0342,0.731,0.0013,0.24,0.237,123.98,245827,3
2007-05-12,98,Me And God,Josh Turner,41Mx3PTX0YtnpQ9SD1MDGI,False,98,98,2,0.592,0.761,3,-6.212,1,0.0284,0.2,1.4e-05,0.146,0.861,153.362,179587,4
2007-05-12,99,Sexy Lady,Yung Berg Featuring Junior,34LDpnJTzst8uc8T1oSHFy,True,0,99,1,0.374,0.669,0,-7.098,1,0.303,0.00051,0,0.304,0.274,184.978,229840,4
2007-05-12,100,Wipe Me Down,Lil Boosie Featuring Foxx & Webbie,6D1CstH1YvzNN8cPd9ay9Q,True,0,100,1,0.836,0.906,1,-2.902,1,0.279,0.000426,0,0.227,0.718,165.091,272347,4
