date,position,title,artist,spotify_id,is_new,last_pos,peak_pos,weeks,danceability,energy,key,loudness,mode,speechiness,acousticness,instrumentalness,liveness,valence,tempo,duration_ms,time_signature
1995-11-11,1,Fantasy,Mariah Carey,02D9uD9WQb834Lb54xCvDS,False,1,1,7,0.669,0.727,7,-7.588,1,0.0353,0.139,0,0.123,0.807,102.322,243493,4
1995-11-11,2,"Gangsta's Paradise (From ""Dangerous Minds"")",Coolio Featuring L.V.,02D9uD9WQb834Lb54xCvDS,False,2,1,13,0.647,0.514,8,-10.05,1,0.0593,0.0655,0,0.398,0.387,79.974,240693,4
1995-11-11,3,Runaway,Janet Jackson,02D9uD9WQb834Lb54xCvDS,False,3,3,9,0.787,0.86,1,-4.974,1,0.0344,0.364,0.041,0.0612,0.862,109.154,214933,4
1995-11-11,4,Kiss From A Rose,Seal,02D9uD9WQb834Lb54xCvDS,False,4,1,21,0.584,0.533,10,-7.11,0,0.0305,0.684,0,0.306,0.224,131.745,288427,3
1995-11-11,5,Tell Me,Groove Theory,02D9uD9WQb834Lb54xCvDS,False,5,5,12,0.8,0.361,6,-10.849,0,0.0635,0.0355,3.75e-06,0.0668,0.887,93.059,236067,4
1995-11-11,6,As I Lay Me Down,Sophie B. Hawkins,02D9uD9WQb834Lb54xCvDS,False,6,6,24,0.519,0.737,10,-8.7,1,0.0437,0.645,1.77e-06,0.271,0.668,82.999,248893,4
1995-11-11,7,Back For Good,Take That,02D9uD9WQb834Lb54xCvDS,False,9,7,14,0.6,0.504,5,-9.761,1,0.0292,0.308,0,0.137,0.547,78.961,242267,4
1995-11-11,8,Only Wanna Be With You,Hootie & The Blowfish,02D9uD9WQb834Lb54xCvDS,False,7,6,15,0.49,0.873,6,-5.861,1,0.0355,0.107,5.19e-06,0.118,0.513,103.272,229587,4
1995-11-11,9,Who Can I Run To,Xscape,02D9uD9WQb834Lb54xCvDS,False,11,9,5,0.71,0.545,4,-9.599,1,0.0588,0.483,0,0.0644,0.632,140.233,216333,4
1995-11-11,10,Name,Goo Goo Dolls,02D9uD9WQb834Lb54xCvDS,False,12,10,5,0.464,0.701,9,-5.943,1,0.0341,0.0691,0.00182,0.0766,0.407,73.97,270000,4
1995-11-11,11,Roll To Me,Del Amitri,02D9uD9WQb834Lb54xCvDS,False,10,10,19,0.567,0.821,6,-5.894,1,0.0371,0.418,0,0.108,0.895,150.106,132307,4
1995-11-11,12,Carnival,Natalie Merchant,02D9uD9WQb834Lb54xCvDS,False,14,10,15,0.601,0.48,6,-11.41,0,0.0732,0.2,0.0955,0.0297,0.802,188.214,361107,4
1995-11-11,13,You Are Not Alone,Michael Jackson,02D9uD9WQb834Lb54xCvDS,False,8,1,11,0.651,0.402,11,-9.303,1,0.028,0.639,7.73e-05,0.0765,0.258,119.873,345600,4
1995-11-11,14,Brokenhearted,Brandy,02D9uD9WQb834Lb54xCvDS,False,13,9,10,0.533,0.516,6,-7.178,1,0.0311,0.488,0,0.0985,0.42,74.921,286493,4
1995-11-11,15,I'd Lie For You (And That's The Truth),Meat Loaf,02D9uD9WQb834Lb54xCvDS,False,19,15,4,0.409,0.626,2,-8.032,1,0.0363,0.556,0,0.415,0.305,170.949,400358,4
1995-11-11,16,I Can Love You Like That,All-4-One,02D9uD9WQb834Lb54xCvDS,False,15,5,22,0.635,0.712,8,-4.998,1,0.0283,0.0811,0,0.322,0.423,91.024,257960,4
1995-11-11,17,Run-Around,Blues Traveler,02D9uD9WQb834Lb54xCvDS,False,16,8,34,0.629,0.867,7,-7.307,1,0.0603,0.0865,0,0.126,0.876,151.695,279800,4
1995-11-11,18,Do You Sleep?,Lisa Loeb & Nine Stories,02D9uD9WQb834Lb54xCvDS,False,18,18,8,0.643,0.671,1,-7.158,0,0.0296,0.0383,4.65e-05,0.0496,0.26,90.396,233493,4
1995-11-11,20,Waterfalls,TLC,,False,17,1,23,0.77,0.505,1,-7.345,1,0.0828,0.311,7.4e-05,0.0777,0.757,171.798,279507,4
1995-11-11,21,Breakfast At Tiffany's,Deep Blue Something,,False,21,21,13,0.622,0.829,2,-5.548,1,0.029,0.11,0,0.0954,0.539,110.367,257373,4
1995-11-11,22,December,Collective Soul,,False,23,20,27,0.684,0.645,0,-5.707,1,0.0272,0.589,0.00432,0.18,0.366,121.995,285000,4
1995-11-11,23,Dreaming Of You,Selena,,False,26,23,3,0.553,0.458,8,-10.796,1,0.0381,0.325,9.71e-05,0.0583,0.247,165.807,314867,4
1995-11-11,24,I Got 5 On It,Luniz,,False,20,8,23,0.6,0.706,10,-7.899,0,0.361,0.209,0,0.125,0.58,173.926,253533,4
1995-11-11,25,Pretty Girl,Jon B,,False,25,25,11,0.696,0.521,0,-9.32,1,0.0339,0.398,0,0.339,0.646,93.056,258107,4
1995-11-11,26,I'll Be There For You/This House Is Not A Home,The Rembrandts,,False,22,17,7,0.258,0.919,9,-6.927,1,0.0809,0.065,0,0.279,0.636,93.62,187293,4
1995-11-11,27,Sentimental,Deborah Cox,,False,28,27,10,0.773,0.79,5,-8.057,1,0.0782,0.193,0,0.0356,0.712,88.977,270333,4
1995-11-11,28,Bullet With Butterfly Wings,The Smashing Pumpkins,6GtX0jaNL8IjVQfrDBx81z,True,0,28,1,0.404,0.72,10,-9.18,0,0.0623,5.59e-05,0.836,0.0466,0.475,121.864,258467,4
1995-11-11,29,Let Me Be The One,Blessid Union Of Souls,6GtX0jaNL8IjVQfrDBx81z,False,29,29,15,0.562,0.799,7,-8.958,1,0.0463,0.095,2.25e-05,0.217,0.425,88.032,278333,4
1995-11-11,30,Beautiful Life,Ace Of Base,74jTexO94dFGyXGyeu8krd,True,0,30,1,0.749,0.988,0,-5.266,0,0.0387,0.202,0.00631,0.17,0.749,135.015,221187,4
1995-11-11,32,"A Girl Like You (From ""Empire Records"")",Edwyn Collins,,False,40,32,3,0.619,0.781,5,-7.455,0,0.0393,0.0243,0.000286,0.402,0.533,126.267,236583,4
1995-11-11,33,Comedown,Bush,,False,30,30,11,0.46,0.81,11,-5.008,0,0.0557,6.54e-05,0.000189,0.123,0.38,139.671,326667,4
1995-11-11,34,"Colors Of The Wind (From ""Pocahontas"")",Vanessa Williams,,False,31,4,21,0.55,0.241,10,-18.092,1,0.0482,0.395,2.37e-05,0.104,0.135,83.964,257867,4
1995-11-11,35,Anything,3T,,False,39,35,6,0.686,0.454,10,-10.928,0,0.0328,0.43,0.00021,0.286,0.645,131.977,321000,4
1995-11-11,36,'Til You Do Me Right,After 7,,False,34,31,19,0.663,0.462,2,-8.784,0,0.0252,0.306,0,0.0687,0.431,76.794,295000,4
1995-11-11,37,Don't Take It Personal (Just One Of Dem Days),Monica,,False,36,2,29,0.731,0.355,8,-12.741,1,0.0603,0.00864,5.14e-05,0.0579,0.529,175.72,258467,4
1995-11-11,38,Ain't Nuthin' But A She Thing,Salt-N-Pepa,,False,38,38,4,0.835,0.553,6,-8.607,1,0.0784,0.0314,0.000253,0.331,0.314,97.698,271308,4
1995-11-11,39,He's Mine,MoKenStef,,False,32,7,22,0.616,0.535,11,-8.789,1,0.0379,0.0814,0.0924,0.121,0.391,64.979,253040,4
1995-11-11,40,Missing,Everything But The Girl,,False,44,40,14,0.677,0.484,9,-10.506,0,0.0324,0.077,4.75e-05,0.135,0.697,123.534,247200,4
1995-11-11,41,Sugar Hill,AZ,,False,33,25,18,0.682,0.647,8,-7.332,1,0.189,0.000693,5.97e-06,0.0693,0.529,181.86,249760,4
1995-11-11,43,Someone To Love,Jon B. Featuring Babyface,,False,41,10,29,0.665,0.452,6,-8.486,0,0.0257,0.14,8.03e-06,0.125,0.304,136.12,272360,4
1995-11-11,44,Cell Therapy,Goodie Mob,,False,52,44,5,0.849,0.476,0,-10.479,1,0.445,0.0966,0,0.105,0.48,83.21,277133,4
1995-11-11,45,Macarena (Bayside Boys Mix),Los Del Rio,,False,46,45,11,0.927,0.721,8,-12.561,1,0.0908,0.422,4.36e-05,0.0422,0.965,103.018,249382,4
1995-11-11,46,Set U Free,Planet Soul,,False,59,46,4,0.636,0.645,6,-11.64,1,0.0873,0.101,1.64e-05,0.0686,0.711,128.43,258933,4
1995-11-11,47,1st Of Tha Month,Bone Thugs-N-Harmony,,False,35,14,12,0.729,0.581,5,-8.235,0,0.18,0.0777,3.81e-06,0.696,0.508,74.038,314680,4
1995-11-11,48,Liquid Swords,Genius/GZA,,False,56,48,3,0.704,0.642,1,-10.11,1,0.39,0.00704,1.43e-06,0.161,0.72,92.09,209973,4
1995-11-11,49,I Wanna B With U,Fun Factory,,False,49,45,17,0.762,0.863,7,-4.124,1,0.0472,0.0869,0,0.101,0.57,100.003,213600,4
1995-11-11,50,"I Like It, I Love It",Tim McGraw,,False,48,25,12,0.643,0.961,0,-5.298,1,0.0315,0.0196,0,0.948,0.96,124.027,205707,4
1995-11-11,51,Danger,Blahzay Blahzay,,False,60,51,6,0.723,0.739,0,-7.943,1,0.401,0.403,0,0.365,0.805,177.886,225267,4
1995-11-11,52,Automatic Lover (Call For Love),Real McCoy,,False,55,52,4,0.688,0.98,5,-4.862,0,0.034,0.0693,0.462,0.16,0.538,132.992,227933,4
1995-11-11,53,Heaven,Solo,,False,42,42,14,0.405,0.237,0,-9.502,1,0.0351,0.94,0,0.144,0.361,101.51,256492,3
1995-11-11,54,"Summertime In The LBC (From ""The Show"")",The Dove Shack,,False,54,54,14,0.695,0.361,5,-9.699,1,0.0318,0.492,2.43e-05,0.0857,0.471,98.998,238771,4
1995-11-11,55,Come With Me,Shai,,False,62,55,9,0.57,0.32,2,-8.965,1,0.0323,0.644,0,0.244,0.321,183.524,279960,3
1995-11-11,56,"The Riddler (From ""Batman Forever"")",Method Man,0GzXo2jahyCJbyTEo5fqCB,True,0,56,1,0.798,0.668,10,-4.824,1,0.091,0.0571,0.00987,0.204,0.438,168.039,213733,4
1995-11-11,57,Hook,Blues Traveler,0GzXo2jahyCJbyTEo5fqCB,False,61,57,6,0.562,0.742,9,-6.355,1,0.0346,0.0369,1.47e-06,0.102,0.793,165.6,289200,4
1995-11-11,58,"Feel The Funk (From ""Dangerous Minds"")",Immature,0GzXo2jahyCJbyTEo5fqCB,False,47,46,8,0.706,0.646,0,-5.266,1,0.0441,0.327,0,0.301,0.355,136.935,294760,4
1995-11-11,60,Love U 4 Life,Jodeci,,False,90,60,2,0.606,0.648,0,-7.802,1,0.0466,0.349,0,0.639,0.646,59.041,290067,4
1995-11-11,61,Throw Your Set In The Air,Cypress Hill,,False,51,45,5,0.776,0.731,9,-12.264,1,0.43,0.0945,0.000274,0.318,0.485,92.394,245800,4
1995-11-11,62,Time,Hootie & The Blowfish,1N0UflnZhn7xOkrN2l8zxx,True,0,62,1,0.387,0.875,2,-5.741,1,0.0385,0.0373,0,0.152,0.238,105.1,296840,4
1995-11-11,63,Hurricane,The Click,5qiDen4GXbcZixkS114QXw,True,0,63,1,0.824,0.48,0,-6.745,0,0.144,0.178,0,0.167,0.724,88.029,261080,4
1995-11-11,64,Runnin',The Pharcyde,5qiDen4GXbcZixkS114QXw,False,68,64,4,0.754,0.785,10,-8.178,0,0.18,0.0287,0.00144,0.319,0.821,94.123,296267,4
1995-11-11,65,Good,Better Than Ezra,5qiDen4GXbcZixkS114QXw,False,63,30,20,0.615,0.657,7,-6.873,1,0.029,0.000372,0.0204,0.132,0.792,109.95,185093,4
1995-11-11,66,Can I Touch You...There?,Michael Bolton,5qiDen4GXbcZixkS114QXw,False,58,27,11,0.555,0.841,0,-6.704,1,0.351,0.281,0,0.244,0.802,82.871,315893,4
1995-11-11,67,I Hate U,Prince,5qiDen4GXbcZixkS114QXw,False,53,12,8,0.613,0.472,2,-10.609,1,0.0334,0.633,0.0273,0.0835,0.197,133.016,161215,4
1995-11-11,68,A Mover La Colita,Artie The 1 Man Party,5qiDen4GXbcZixkS114QXw,False,65,65,7,0.846,0.73,11,-7.868,0,0.0521,0.0012,0.711,0.0592,0.733,130.05,184613,4
1995-11-11,69,Blessed,Elton John,5qiDen4GXbcZixkS114QXw,False,87,69,2,0.601,0.412,5,-11.963,1,0.0361,0.147,0.00585,0.263,0.464,204.064,300733,4
1995-11-11,70,Hooked On You,Silk,5qiDen4GXbcZixkS114QXw,False,79,70,2,0.598,0.56,6,-7.401,1,0.0278,0.0429,1.2e-05,0.12,0.775,179.529,289933,4
1995-11-11,71,Magic Carpet Ride,The Mighty Dub Katz,5qiDen4GXbcZixkS114QXw,False,71,71,5,0.916,0.824,6,-6.947,0,0.0652,0.0153,0.926,0.0844,0.886,128.698,189147,4
1995-11-11,72,Runaway,The Corrs,5qiDen4GXbcZixkS114QXw,False,72,72,5,0.423,0.598,5,-7.443,1,0.0268,0.641,1.24e-06,0.34,0.521,151.972,265133,3
1995-11-11,73,Where Ever You Are,Terry Ellis,5qiDen4GXbcZixkS114QXw,False,75,73,2,0.732,0.499,5,-6.794,1,0.0346,0.52,8.62e-06,0.0842,0.428,134.027,298080,4
1995-11-11,74,"I Miss You (Come Back Home) (From ""New York Undercover"")",Monifah,5qiDen4GXbcZixkS114QXw,False,74,74,3,0.639,0.495,5,-10.783,0,0.356,0.0738,0,0.0682,0.833,175.982,233867,4
1995-11-11,75,Player's Anthem,Junior M.A.F.I.A.,5qiDen4GXbcZixkS114QXw,False,67,13,17,0.788,0.626,0,-8.582,1,0.354,0.262,0,0.0791,0.74,87.96,322227,4
1995-11-11,76,Solitude,Edwin McCain,5qiDen4GXbcZixkS114QXw,False,76,76,6,0.601,0.494,9,-10.304,1,0.0422,0.63,7.47e-06,0.132,0.308,79.976,270747,4
1995-11-11,77,Already Missing You,"Gerald Levert & Eddie Levert, Sr.",5qiDen4GXbcZixkS114QXw,False,77,77,4,0.733,0.669,0,-5.249,1,0.0542,0.312,0,0.113,0.607,161.786,308560,4
1995-11-11,78,Vibin',Boyz II Men,5qiDen4GXbcZixkS114QXw,False,64,56,11,0.707,0.445,1,-10.081,1,0.0337,0.0187,0.0011,0.0699,0.605,90.981,267893,4
1995-11-11,79,Wings Of The Morning,Capleton,5qiDen4GXbcZixkS114QXw,False,88,79,3,0.819,0.771,4,-4.427,0,0.195,0.113,2.3e-05,0.118,0.731,88.016,231667,4
1995-11-11,80,Brown Sugar,D'Angelo,5qiDen4GXbcZixkS114QXw,False,66,27,20,0.718,0.486,9,-8.342,1,0.168,0.53,0.0342,0.102,0.589,83.077,262893,4
1995-11-11,81,Sexual Healing,Max-A-Million,5qiDen4GXbcZixkS114QXw,False,81,81,2,0.775,0.745,8,-7.167,1,0.0563,0.0268,0,0.27,0.691,99.008,243613,4
1995-11-11,82,We've Got It Goin' On,Backstreet Boys,5qiDen4GXbcZixkS114QXw,False,82,82,3,0.758,0.875,3,-4.518,0,0.0363,0.0851,0,0.227,0.91,112.966,219467,4
1995-11-11,83,You Used To Love Me,Faith Evans,5qiDen4GXbcZixkS114QXw,False,70,24,20,0.702,0.458,0,-8.195,1,0.0348,0.247,1.64e-06,0.126,0.679,89.266,269173,4
1995-11-11,84,Boom Boom Boom,The Outhere Brothers,5qiDen4GXbcZixkS114QXw,False,69,69,7,0.723,0.857,7,-9.989,1,0.241,0.0523,2.66e-05,0.149,0.642,129.87,201893,4
1995-11-11,85,Be My Lover,La Bouche,7FoUzKTSQp25oe32pY9z5p,True,0,85,1,0.669,0.941,1,-5.765,0,0.0313,0.00129,4.3e-06,0.886,0.841,134.809,240267,4
1995-11-11,86,Forever Tonight,Peter Cetera & Crystal Bernard,7FoUzKTSQp25oe32pY9z5p,False,86,86,4,0.601,0.527,1,-8.894,1,0.0246,0.601,0.000966,0.177,0.284,105.953,274453,4
1995-11-11,87,Cruisin',D'Angelo,7FoUzKTSQp25oe32pY9z5p,False,89,87,2,0.407,0.525,11,-12.725,0,0.166,0.381,0.000452,0.0816,0.329,74.34,384667,4
1995-11-11,88,East Side Rendezvous,Frost,7FoUzKTSQp25oe32pY9z5p,False,73,73,3,0.798,0.561,4,-8.625,0,0.147,0.412,0,0.0446,0.785,83.971,273400,4
1995-11-11,89,Somethin' 4 Da Honeyz,Montell Jordan,7FoUzKTSQp25oe32pY9z5p,False,83,21,14,0.72,0.7,4,-8.333,0,0.0802,0.0119,0,0.202,0.764,93.167,276107,4
1995-11-11,90,Real Hip Hop,Das EFX,7FoUzKTSQp25oe32pY9z5p,False,85,61,8,0.858,0.76,4,-7.895,0,0.254,0.0217,0,0.322,0.951,93.082,247613,4
1995-11-11,91,Bomdigi,Erick Sermon,7FoUzKTSQp25oe32pY9z5p,False,84,84,3,0.793,0.634,7,-9.744,1,0.326,0.00388,1.74e-05,0.0713,0.751,90.965,214133,4
1995-11-11,92,MC's Act Like They Don't Know,KRS-One,7FoUzKTSQp25oe32pY9z5p,False,80,57,10,0.855,0.798,1,-4.018,1,0.237,0.0101,0.000615,0.628,0.855,90.429,295933,4
1995-11-11,93,Last Dayz,Onyx,0usovqilR2yhLw9zWEaWzk,True,0,93,1,0.625,0.621,10,-9.595,0,0.439,0.0193,3.04e-05,0.124,0.771,88.216,224253,4
1995-11-11,94,I Will Remember You (Live),Sarah McLachlan,0HWP0zWAUviRgsXdqCCOSc,True,0,94,1,0.606,0.353,9,-11.484,1,0.0315,0.763,0.000578,0.0778,0.179,140.057,291400,4
1995-11-11,95,West Up!,WC & The Maad Circle,0HWP0zWAUviRgsXdqCCOSc,False,96,88,7,0.843,0.837,7,-5.37,1,0.267,0.261,0,0.222,0.774,89.095,284267,4
1995-11-11,96,Downtown Venus,P.M. Dawn,0HWP0zWAUviRgsXdqCCOSc,False,78,48,8,0.602,0.837,8,-10.22,0,0.0894,0.0129,0.000181,0.161,0.824,99.019,213133,4
1995-11-11,97,Molly (Sixteen Candles),Sponge,0HWP0zWAUviRgsXdqCCOSc,False,94,55,14,0.459,0.673,1,-8.846,1,0.028,1.49e-05,0.00174,0.0505,0.549,101.159,221500,4
1995-11-11,98,Scatman (Ski-Ba-Bop-Ba-Dop-Bop),Scatman John,0HWP0zWAUviRgsXdqCCOSc,False,91,60,13,0.65,0.82,5,-10.9,0,0.0356,0.0655,0.00274,0.215,0.757,135.982,215973,4
1995-11-11,99,(If You're Not In It For Love) I'm Outta Here!/The Woman In Me,Shania Twain,0HWP0zWAUviRgsXdqCCOSc,False,95,90,3,0.598,0.839,4,-4.605,1,0.111,0.106,0,0.372,0.783,105.084,156276,4
1995-11-11,100,"Jeeps, Lex Coups, Bimaz & Benz",Lost Boyz,0HWP0zWAUviRgsXdqCCOSc,False,92,67,10,0.562,0.652,1,-9.253,0,0.426,0.0103,0,0.557,0.545,177.987,272467,4
