date,position,title,artist,spotify_id,is_new,last_pos,peak_pos,weeks,danceability,energy,key,loudness,mode,speechiness,acousticness,instrumentalness,liveness,valence,tempo,duration_ms,time_signature
2018-08-04,1,In My Feelings,Drake,5sIx4BlfYGuZeSLF40N9GH,False,1,1,4,0.835,0.626,1,-5.833,1,0.125,0.0589,6e-05,0.396,0.35,91.03,217925,4
2018-08-04,2,I Like It,"Cardi B, Bad Bunny & J Balvin",5sIx4BlfYGuZeSLF40N9GH,False,2,1,16,0.816,0.726,5,-3.998,0,0.129,0.099,0,0.372,0.65,136.048,253390,4
2018-08-04,3,Girls Like You,Maroon 5 Featuring Cardi B,5sIx4BlfYGuZeSLF40N9GH,False,3,3,9,0.609,0.529,0,-6.859,1,0.106,0.545,0,0.127,0.474,60.349,235680,4
2018-08-04,4,FEFE,6ix9ine Featuring Nicki Minaj & Murda Beatz,2l8nEO0vsTRCRnGqQty6qx,True,0,4,1,0.931,0.387,1,-9.127,1,0.412,0.088,0,0.136,0.376,125.978,179405,4
2018-08-04,5,Better Now,Post Malone,2l8nEO0vsTRCRnGqQty6qx,False,7,5,13,0.68,0.578,10,-5.804,1,0.04,0.331,0,0.135,0.341,145.038,231267,4
2018-08-04,6,Nice For What,Drake,2l8nEO0vsTRCRnGqQty6qx,False,4,1,16,0.585,0.909,8,-6.474,1,0.0707,0.0891,9.7e-05,0.119,0.758,93.372,210747,4
2018-08-04,7,Boo'd Up,Ella Mai,2l8nEO0vsTRCRnGqQty6qx,False,5,5,17,0.561,0.779,10,-5.107,0,0.0531,0.0862,0,0.078,0.235,81.965,256064,4
2018-08-04,8,Lucid Dreams,Juice WRLD,2l8nEO0vsTRCRnGqQty6qx,False,6,3,11,0.511,0.566,6,-7.23,0,0.2,0.349,0,0.34,0.218,83.903,239836,4
2018-08-04,9,Psycho,Post Malone Featuring Ty Dolla $ign,2l8nEO0vsTRCRnGqQty6qx,False,9,1,22,0.75,0.56,8,-8.094,1,0.105,0.546,0,0.111,0.459,140.06,221440,4
2018-08-04,10,Taste,Tyga Featuring Offset,2l8nEO0vsTRCRnGqQty6qx,False,13,10,9,0.884,0.559,0,-7.442,1,0.12,0.0236,0,0.101,0.342,97.994,232959,4
2018-08-04,11,No Tears Left To Cry,Ariana Grande,2l8nEO0vsTRCRnGqQty6qx,False,8,3,14,0.699,0.713,9,-5.507,0,0.0594,0.04,3.11e-06,0.294,0.354,121.993,205920,4
2018-08-04,12,Delicate,Taylor Swift,2l8nEO0vsTRCRnGqQty6qx,False,12,12,20,0.75,0.404,9,-10.178,0,0.0682,0.216,0.000357,0.0911,0.0499,95.045,232253,4
2018-08-04,13,God's Plan,Drake,2l8nEO0vsTRCRnGqQty6qx,False,10,1,27,0.754,0.449,7,-9.211,1,0.109,0.0332,8.29e-05,0.552,0.357,77.169,198973,4
2018-08-04,14,Yes Indeed,Lil Baby & Drake,2l8nEO0vsTRCRnGqQty6qx,False,16,6,11,0.963,0.346,5,-9.309,0,0.53,0.0355,0,0.108,0.562,119.957,142273,4
2018-08-04,15,The Middle,"Zedd, Maren Morris & Grey",2l8nEO0vsTRCRnGqQty6qx,False,14,5,26,0.753,0.657,7,-3.061,1,0.0449,0.171,0,0.112,0.437,107.01,184732,4
2018-08-04,16,Friends,Marshmello & Anne-Marie,2l8nEO0vsTRCRnGqQty6qx,False,18,11,24,0.626,0.88,9,-2.384,0,0.0504,0.205,0,0.128,0.534,95.079,202621,4
2018-08-04,17,Perfect,Ed Sheeran,2l8nEO0vsTRCRnGqQty6qx,False,19,1,48,0.598,0.448,8,-6.312,1,0.0232,0.162,0,0.106,0.168,95.009,263400,3
2018-08-04,18,Love Lies,Khalid & Normani,2l8nEO0vsTRCRnGqQty6qx,False,21,18,23,0.708,0.648,6,-5.626,1,0.0449,0.0956,0,0.134,0.338,143.955,201707,4
2018-08-04,19,Sad!,XXXTENTACION,2l8nEO0vsTRCRnGqQty6qx,False,15,1,21,0.74,0.613,8,-4.88,1,0.145,0.258,0.00372,0.123,0.473,75.023,166606,4
2018-08-04,20,Meant To Be,Bebe Rexha & Florida Georgia Line,2l8nEO0vsTRCRnGqQty6qx,False,17,2,40,0.643,0.783,10,-6.458,1,0.0856,0.047,0,0.083,0.579,154.084,163870,4
2018-08-04,21,God Is A Woman,Ariana Grande,2l8nEO0vsTRCRnGqQty6qx,False,11,11,2,0.602,0.658,1,-5.934,1,0.0558,0.0233,6e-05,0.237,0.268,145.031,197547,4
2018-08-04,22,Mine,Bazzi,2l8nEO0vsTRCRnGqQty6qx,False,22,11,27,0.71,0.789,4,-3.874,1,0.0722,0.0161,2.77e-06,0.451,0.717,142.929,131064,4
2018-08-04,23,In My Blood,Shawn Mendes,2l8nEO0vsTRCRnGqQty6qx,False,23,11,19,0.622,0.711,5,-7.321,1,0.0665,0.0573,0,0.13,0.487,140.016,211360,4
2018-08-04,24,Tequila,Dan + Shay,2l8nEO0vsTRCRnGqQty6qx,False,25,21,20,0.489,0.581,11,-5.731,1,0.0281,0.0312,0,0.132,0.494,86.016,196747,4
2018-08-04,25,Youngblood,5 Seconds Of Summer,2l8nEO0vsTRCRnGqQty6qx,False,32,25,8,0.596,0.854,7,-5.114,0,0.463,0.0169,0,0.124,0.152,120.274,203418,4
2018-08-04,26,Back To You,Selena Gomez,2l8nEO0vsTRCRnGqQty6qx,False,27,22,11,0.601,0.724,6,-4.856,1,0.0486,0.0945,1.68e-06,0.12,0.508,102.061,207905,4
2018-08-04,27,One Kiss,Calvin Harris & Dua Lipa,2l8nEO0vsTRCRnGqQty6qx,False,26,26,16,0.791,0.862,9,-3.24,0,0.11,0.037,2.19e-05,0.0814,0.592,123.994,214847,4
2018-08-04,28,Big Bank,"YG Featuring 2 Chainz, Big Sean & Nicki Minaj",2l8nEO0vsTRCRnGqQty6qx,False,39,28,8,0.745,0.346,1,-7.709,1,0.331,0.00552,0,0.0881,0.112,203.911,237240,4
2018-08-04,29,Nonstop,Drake,2l8nEO0vsTRCRnGqQty6qx,False,20,2,4,0.912,0.412,7,-8.074,1,0.123,0.0165,0.0126,0.104,0.423,154.983,238614,4
2018-08-04,30,Apes**t,The Carters,2l8nEO0vsTRCRnGqQty6qx,False,28,13,6,0.698,0.783,2,-6.503,1,0.266,0.016,0,0.176,0.378,160.034,264853,4
2018-08-04,31,I Like Me Better,Lauv,2l8nEO0vsTRCRnGqQty6qx,False,29,29,24,0.752,0.505,9,-7.621,1,0.253,0.535,2.55e-06,0.104,0.419,91.97,197437,4
2018-08-04,32,Never Be The Same,Camila Cabello,2l8nEO0vsTRCRnGqQty6qx,False,30,6,32,0.637,0.713,0,-4.333,1,0.0747,0.181,0.000637,0.137,0.243,129.923,226973,4
2018-08-04,33,Mercy,Brett Young,2l8nEO0vsTRCRnGqQty6qx,False,38,33,12,0.638,0.367,4,-7.906,1,0.0266,0.84,0,0.0999,0.219,71.957,217120,4
2018-08-04,34,Whatever It Takes,Imagine Dragons,2l8nEO0vsTRCRnGqQty6qx,False,34,12,26,0.672,0.655,10,-5.021,0,0.0311,0.0362,0,0.117,0.556,134.945,201240,4
2018-08-04,35,Get Along,Kenny Chesney,2l8nEO0vsTRCRnGqQty6qx,False,31,31,16,0.632,0.804,7,-6.109,1,0.0503,0.101,0,0.17,0.35,92.456,199625,4
2018-08-04,36,Simple,Florida Georgia Line,2l8nEO0vsTRCRnGqQty6qx,False,36,36,8,0.362,0.882,3,-3.717,1,0.0973,0.0791,0,0.15,0.864,199.811,185200,4
2018-08-04,37,Natural,Imagine Dragons,2FY7b99s15jUprqC0M5NCT,True,0,37,1,0.704,0.611,2,-6.112,1,0.0409,0.217,0,0.0812,0.22,100.0,189467,4
2018-08-04,38,I'm Upset,Drake,2FY7b99s15jUprqC0M5NCT,False,24,7,9,0.899,0.586,11,-7.866,0,0.343,0.279,0,0.0836,0.492,150.002,214467,4
2018-08-04,39,Moonlight,XXXTENTACION,2FY7b99s15jUprqC0M5NCT,False,37,13,15,0.921,0.537,9,-5.723,0,0.0804,0.556,0.00404,0.102,0.711,128.009,135090,4
2018-08-04,40,Look Alive,BlocBoy JB Featuring Drake,2FY7b99s15jUprqC0M5NCT,False,35,5,24,0.922,0.581,10,-7.495,1,0.27,0.00104,5.86e-05,0.105,0.595,140.022,181263,4
2018-08-04,41,Te Bote,"Casper Magico, Nio Garcia, Darell, Nicky Jam, Ozuna & Bad Bunny",2FY7b99s15jUprqC0M5NCT,False,42,36,14,0.903,0.675,11,-3.445,0,0.214,0.542,1.28e-05,0.0595,0.442,96.507,417920,4
2018-08-04,42,Drowns The Whiskey,Jason Aldean Featuring Miranda Lambert,2FY7b99s15jUprqC0M5NCT,False,48,42,6,0.552,0.698,8,-4.817,1,0.0306,0.294,0.000103,0.0905,0.6,90.006,202067,4
2018-08-04,43,I Was Jack (You Were Diane),Jake Owen,2FY7b99s15jUprqC0M5NCT,False,45,43,9,0.604,0.868,6,-3.539,1,0.0445,0.086,0,0.0502,0.553,94.058,187027,4
2018-08-04,44,Sit Next To Me,Foster The People,2FY7b99s15jUprqC0M5NCT,False,46,42,19,0.638,0.738,6,-4.976,0,0.0292,0.117,0.000384,0.689,0.657,97.021,243147,4
2018-08-04,45,This Is America,Childish Gambino,2FY7b99s15jUprqC0M5NCT,False,40,1,12,0.854,0.463,5,-6.159,1,0.137,0.117,0,0.354,0.549,120.024,225773,4
2018-08-04,46,Be Careful,Cardi B,2FY7b99s15jUprqC0M5NCT,False,41,11,17,0.82,0.568,6,-8.23,0,0.411,0.0256,0,0.0952,0.535,152.279,210787,4
2018-08-04,47,X,Nicky Jam x J Balvin,2FY7b99s15jUprqC0M5NCT,False,47,41,21,0.594,0.749,9,-5.298,0,0.056,0.0338,0.00106,0.3,0.694,179.968,172854,4
2018-08-04,48,One Number Away,Luke Combs,2FY7b99s15jUprqC0M5NCT,False,49,34,19,0.544,0.781,6,-6.16,0,0.0311,0.00585,0,0.191,0.527,144.075,221800,4
2018-08-04,49,Life Changes,Thomas Rhett,2FY7b99s15jUprqC0M5NCT,False,54,49,5,0.687,0.845,7,-4.37,1,0.0576,0.1,0,0.0452,0.809,87.972,190227,4
2018-08-04,50,Coming Home,Keith Urban Featuring Julia Michaels,2FY7b99s15jUprqC0M5NCT,False,62,50,5,0.383,0.703,4,-6.988,1,0.228,0.216,5.47e-06,0.131,0.57,88.502,213939,4
2018-08-04,51,Changes,XXXTENTACION,2FY7b99s15jUprqC0M5NCT,False,51,18,15,0.669,0.308,11,-10.068,1,0.029,0.883,0,0.0984,0.52,64.934,121887,4
2018-08-04,52,Eastside,"benny blanco, Halsey & Khalid",2FY7b99s15jUprqC0M5NCT,False,56,52,2,0.56,0.68,6,-7.648,0,0.321,0.555,0,0.116,0.319,89.391,173800,4
2018-08-04,53,Mob Ties,Drake,2FY7b99s15jUprqC0M5NCT,False,43,13,4,0.754,0.575,4,-8.393,0,0.0682,0.045,0.00131,0.276,0.491,86.009,205147,4
2018-08-04,54,Don't Matter To Me,Drake Featuring Michael Jackson,2FY7b99s15jUprqC0M5NCT,False,33,9,4,0.822,0.318,10,-12.391,1,0.0575,0.493,0.0128,0.11,0.138,102.998,245787,4
2018-08-04,55,Bed,Nicki Minaj Featuring Ariana Grande,2FY7b99s15jUprqC0M5NCT,False,52,43,6,0.757,0.73,7,-6.304,1,0.185,0.0342,5.87e-05,0.136,0.452,90.013,189533,4
2018-08-04,56,Sober,Demi Lovato,2FY7b99s15jUprqC0M5NCT,False,0,56,2,0.398,0.302,1,-10.413,1,0.11,0.798,4.11e-06,0.0824,0.17,169.808,197893,3
2018-08-04,57,Take Back Home Girl,Chris Lane Featuring Tori Kelly,2FY7b99s15jUprqC0M5NCT,False,57,57,8,0.493,0.796,11,-3.971,1,0.0691,0.39,0,0.0957,0.644,159.988,212107,4
2018-08-04,58,All Girls Are The Same,Juice WRLD,2FY7b99s15jUprqC0M5NCT,False,55,41,11,0.671,0.529,0,-7.226,1,0.307,0.0769,0.000335,0.0856,0.203,161.989,165820,4
2018-08-04,59,"Sunrise, Sunburn, Sunset",Luke Bryan,2FY7b99s15jUprqC0M5NCT,False,64,59,4,0.471,0.897,9,-2.27,1,0.0597,0.193,0,0.196,0.719,159.958,216093,4
2018-08-04,60,I Might Need Security,Chance The Rapper,3EApebexZ7YqDIqw2EMTDh,True,0,60,1,0.514,0.693,9,-5.868,1,0.408,0.177,0,0.351,0.287,110.568,240640,3
2018-08-04,61,Solo,Clean Bandit Featuring Demi Lovato,3EApebexZ7YqDIqw2EMTDh,False,66,61,4,0.737,0.636,11,-4.546,0,0.0437,0.0441,6.66e-05,0.35,0.565,105.005,222653,4
2018-08-04,62,Jackie Chan,Tiesto & Dzeko Featuring Preme & Post Malone,3EApebexZ7YqDIqw2EMTDh,False,60,60,3,0.747,0.834,3,-2.867,0,0.045,0.374,0,0.0586,0.687,128.005,215760,4
2018-08-04,63,Hotel Key,Old Dominion,3EApebexZ7YqDIqw2EMTDh,False,70,63,4,0.758,0.867,11,-5.087,1,0.0475,0.152,0,0.308,0.964,102.018,166573,4
2018-08-04,64,I'm A Mess,Bebe Rexha,3EApebexZ7YqDIqw2EMTDh,False,92,64,2,0.63,0.694,11,-6.257,0,0.0253,0.00281,0,0.0719,0.216,97.005,195519,4
2018-08-04,65,Medicine,Queen Naija,3EApebexZ7YqDIqw2EMTDh,False,78,45,8,0.741,0.37,8,-8.437,0,0.324,0.24,0,0.118,0.13,116.06,219136,4
2018-08-04,66,Growing Pains,Alessia Cara,3EApebexZ7YqDIqw2EMTDh,False,65,65,4,0.353,0.753,1,-6.277,0,0.74,0.0833,0,0.383,0.432,191.142,193627,4
2018-08-04,67,Wasted,Juice WRLD Featuring Lil Uzi Vert,3EApebexZ7YqDIqw2EMTDh,False,68,67,2,0.742,0.579,0,-5.024,1,0.202,0.0381,0,0.0952,0.502,144.994,258475,4
2018-08-04,68,Don't Go Breaking My Heart,Backstreet Boys,3EApebexZ7YqDIqw2EMTDh,False,63,63,5,0.643,0.703,0,-5.573,1,0.0913,0.0218,0,0.0964,0.246,95.041,215724,4
2018-08-04,69,Summertime Magic,Childish Gambino,3EApebexZ7YqDIqw2EMTDh,False,44,44,2,0.76,0.579,0,-7.374,1,0.0569,0.0129,0.00351,0.106,0.125,100.01,213600,4
2018-08-04,70,Up Down,Morgan Wallen Featuring Florida Georgia Line,3EApebexZ7YqDIqw2EMTDh,False,59,49,18,0.589,0.882,6,-3.039,1,0.035,0.0813,0,0.146,0.793,129.915,197253,4
2018-08-04,71,Kiss Somebody,Morgan Evans,3EApebexZ7YqDIqw2EMTDh,False,74,71,4,0.57,0.684,6,-7.054,1,0.0465,0.136,0,0.205,0.531,89.012,213183,4
2018-08-04,72,Sin Pijama,Becky G + Natti Natasha,3EApebexZ7YqDIqw2EMTDh,False,83,72,7,0.791,0.745,11,-3.695,0,0.0464,0.354,2.93e-05,0.104,0.82,94.014,188560,4
2018-08-04,73,Freaky Friday,Lil Dicky Featuring Chris Brown,3EApebexZ7YqDIqw2EMTDh,False,69,8,19,0.755,0.599,8,-5.042,1,0.224,0.147,0,0.109,0.755,133.123,216632,4
2018-08-04,74,You Say,Lauren Daigle,3EApebexZ7YqDIqw2EMTDh,False,53,53,2,0.494,0.632,5,-6.89,1,0.0342,0.682,0,0.0869,0.0797,147.873,274693,4
2018-08-04,75,Broken,lovelytheband,3EApebexZ7YqDIqw2EMTDh,False,84,75,2,0.666,0.728,7,-5.808,1,0.0419,0.00175,4.26e-06,0.0429,0.51,122.996,204878,4
2018-08-04,76,Hooked,Dylan Scott,3EApebexZ7YqDIqw2EMTDh,False,85,76,2,0.597,0.721,9,-6.422,1,0.0356,0.0362,0,0.0832,0.437,132.054,149293,4
2018-08-04,77,Level Up,Ciara,7ssEhls1ZYEGtBsoovkMSe,True,0,77,1,0.746,0.825,1,-4.666,1,0.169,0.0142,0.0107,0.121,0.584,152.914,204150,4
2018-08-04,78,Ocean,TK Kravitz Featuring Jacqueez,7ssEhls1ZYEGtBsoovkMSe,False,87,78,2,0.709,0.264,1,-17.696,0,0.186,0.268,0,0.24,0.341,133.858,219437,4
2018-08-04,79,Remind Me To Forget,Kygo Featuring Miguel,7ssEhls1ZYEGtBsoovkMSe,False,94,79,2,0.685,0.508,0,-6.4,1,0.0987,0.193,0,0.139,0.315,99.063,217287,4
2018-08-04,80,OTW,"Khalid, Ty Dolla $ign & 6LACK",7ssEhls1ZYEGtBsoovkMSe,False,75,57,13,0.652,0.678,2,-6.183,1,0.0541,0.183,3.26e-05,0.106,0.28,72.989,263014,4
2018-08-04,81,Best Part,Daniel Caesar Featuring H.E.R.,1RMJOxR6GRPsBHL8qeC2ux,True,0,81,1,0.524,0.364,7,-10.209,1,0.0367,0.808,0,0.1,0.436,75.24,209831,4
2018-08-04,82,1942,G-Eazy Featuring Yo Gotti & YBN Nahmir,1RMJOxR6GRPsBHL8qeC2ux,False,90,82,2,0.817,0.646,4,-5.12,0,0.249,0.0152,0,0.125,0.835,162.898,213080,4
2018-08-04,83,Ball For Me,Post Malone Featuring Nicki Minaj,1RMJOxR6GRPsBHL8qeC2ux,False,76,16,13,0.797,0.55,9,-4.166,1,0.24,0.513,0,0.0786,0.543,134.206,206267,4
2018-08-04,84,Cry Pretty,Carrie Underwood,1RMJOxR6GRPsBHL8qeC2ux,False,81,48,7,0.374,0.742,6,-3.36,1,0.0432,0.00517,0,0.11,0.21,139.953,247320,3
2018-08-04,85,Ocean,Martin Garrix Featuring Khalid,1RMJOxR6GRPsBHL8qeC2ux,False,88,78,4,0.506,0.693,0,-7.265,0,0.0412,0.584,9.58e-05,0.0891,0.221,139.912,216420,4
2018-08-04,86,Africa,Weezer,1RMJOxR6GRPsBHL8qeC2ux,False,0,86,2,0.534,0.784,8,-3.59,1,0.0339,0.205,0.00579,0.106,0.6,92.147,238627,4
2018-08-04,87,Break Up In The End,Cole Swindell,1RMJOxR6GRPsBHL8qeC2ux,False,91,87,3,0.507,0.372,1,-8.433,1,0.0303,0.481,0,0.271,0.257,86.422,199693,4
2018-08-04,88,Jumpsuit,twenty one pilots,1RMJOxR6GRPsBHL8qeC2ux,False,50,50,3,0.62,0.61,11,-8.329,0,0.0373,0.00849,0.162,0.205,0.235,127.052,238560,4
2018-08-04,89,Call Out My Name,The Weeknd,1RMJOxR6GRPsBHL8qeC2ux,False,95,4,17,0.471,0.581,1,-5.195,1,0.0345,0.19,0,0.309,0.161,133.991,228382,3
2018-08-04,90,Nevermind,Dennis Lloyd,63SevszngYpZOwf63o61K4,True,0,90,1,0.6,0.688,5,-8.339,0,0.201,0.159,1.29e-05,0.409,0.0793,99.977,156600,4
2018-08-04,91,All Mine,Kanye West,63SevszngYpZOwf63o61K4,False,77,11,8,0.925,0.31,11,-6.531,0,0.291,0.123,0,0.0931,0.291,121.927,145507,4
2018-08-04,92,Narcos,Migos,63SevszngYpZOwf63o61K4,False,93,36,11,0.936,0.585,0,-6.914,1,0.125,0.0142,0,0.132,0.242,124.991,255379,4
2018-08-04,93,You Should See Me In A Crown,Billie Eilish,3XF5xLJHOQQRbWya6hBp7d,True,0,93,1,0.678,0.533,4,-10.485,1,0.186,0.462,0.219,0.139,0.323,150.455,180953,4
2018-08-04,94,Desperate Man,Eric Church,3XF5xLJHOQQRbWya6hBp7d,False,71,71,2,0.711,0.796,10,-5.87,1,0.0341,0.0716,0.0045,0.262,0.901,109.991,208733,4
2018-08-04,95,Hopeless Romantic,Wiz Khalifa Featuring Swae Lee,3XF5xLJHOQQRbWya6hBp7d,False,72,72,2,0.877,0.477,9,-7.379,0,0.0587,0.307,0,0.0929,0.552,127.023,226743,4
2018-08-04,96,Praise The Lord (Da Shine),A$AP Rocky Featuring Skepta,3XF5xLJHOQQRbWya6hBp7d,False,96,45,7,0.854,0.569,5,-8.151,0,0.106,0.0609,0.0816,0.1,0.294,80.015,205040,4
2018-08-04,97,Lie,NF,07FkzikE6FuHIa8Ma7zJGc,True,0,97,1,0.513,0.661,5,-6.419,1,0.24,0.161,0,0.246,0.179,94.791,209213,4
2018-08-04,98,Lose It,Kane Brown,07FkzikE6FuHIa8Ma7zJGc,False,0,84,2,0.544,0.854,4,-4.968,0,0.0289,0.00245,1.2e-06,0.249,0.436,91.966,178987,4
2018-08-04,99,Emotionless,Drake,07FkzikE6FuHIa8Ma7zJGc,False,58,8,4,0.414,0.677,1,-5.12,1,0.254,0.0248,0,0.0793,0.0853,172.521,302173,4
2018-08-04,100,Can't Take A Joke,Drake,07FkzikE6FuHIa8Ma7zJGc,False,61,18,4,0.761,0.598,10,-7.249,0,0.182,0.126,0,0.0839,0.446,173.897,163974,4
