date,position,title,artist,spotify_id,is_new,last_pos,peak_pos,weeks,danceability,energy,key,loudness,mode,speechiness,acousticness,instrumentalness,liveness,valence,tempo,duration_ms,time_signature
2016-10-15,1,Closer,The Chainsmokers Featuring Halsey,19W5OTEcQI3ZoRW1HERMyy,False,1,1,9,0.748,0.524,8,-5.599,1,0.0338,0.414,0,0.111,0.661,95.01,244960,4
2016-10-15,2,Heathens,twenty one pilots,19W5OTEcQI3ZoRW1HERMyy,False,2,2,15,0.732,0.396,4,-9.348,0,0.0286,0.0841,3.58e-05,0.105,0.548,90.024,195920,4
2016-10-15,3,Starboy,The Weeknd Featuring Daft Punk,19W5OTEcQI3ZoRW1HERMyy,False,40,3,2,0.676,0.588,7,-7.025,1,0.275,0.137,8.47e-06,0.137,0.484,186.012,230461,4
2016-10-15,4,Cold Water,Major Lazer Featuring Justin Bieber & MO,19W5OTEcQI3ZoRW1HERMyy,False,3,2,10,0.608,0.798,6,-5.092,0,0.0432,0.0736,0,0.156,0.501,92.943,185360,4
2016-10-15,5,Let Me Love You,DJ Snake Featuring Justin Bieber,19W5OTEcQI3ZoRW1HERMyy,False,4,4,8,0.649,0.716,8,-5.371,1,0.0349,0.0863,2.63e-05,0.135,0.163,99.988,205947,4
2016-10-15,6,Treat You Better,Shawn Mendes,19W5OTEcQI3ZoRW1HERMyy,False,6,6,17,0.443,0.82,10,-4.091,0,0.34,0.107,0,0.107,0.771,82.697,187973,4
2016-10-15,7,Cheap Thrills,Sia Featuring Sean Paul,19W5OTEcQI3ZoRW1HERMyy,False,5,1,33,0.628,0.698,6,-5.608,0,0.105,0.0472,0.00143,0.0907,0.732,89.976,211667,4
2016-10-15,8,Broccoli,D.R.A.M. Featuring Lil Yachty,19W5OTEcQI3ZoRW1HERMyy,False,8,8,16,0.825,0.485,8,-11.479,1,0.395,0.187,0,0.0904,0.792,145.976,233278,4
2016-10-15,9,Don't Let Me Down,The Chainsmokers Featuring Daya,19W5OTEcQI3ZoRW1HERMyy,False,7,3,33,0.532,0.869,11,-5.094,1,0.172,0.157,0.00508,0.136,0.422,159.803,208373,4
2016-10-15,10,This Is What You Came For,Calvin Harris Featuring Rihanna,19W5OTEcQI3ZoRW1HERMyy,False,10,3,22,0.63,0.928,9,-2.787,0,0.0331,0.199,0.124,0.148,0.465,123.963,222160,4
2016-10-15,11,We Don't Talk Anymore,Charlie Puth Featuring Selena Gomez,19W5OTEcQI3ZoRW1HERMyy,False,9,9,17,0.728,0.563,1,-8.053,0,0.134,0.621,0,0.179,0.352,100.017,217707,4
2016-10-15,12,Ride,twenty one pilots,19W5OTEcQI3ZoRW1HERMyy,False,11,5,29,0.645,0.713,6,-5.355,1,0.0393,0.00835,0,0.113,0.566,74.989,214507,4
2016-10-15,13,I Hate U I Love U,gnash Featuring Olivia O'Brien,19W5OTEcQI3ZoRW1HERMyy,False,19,13,24,0.492,0.275,6,-13.4,0,0.3,0.687,0,0.101,0.18,92.6,251034,4
2016-10-15,14,One Dance,Drake Featuring WizKid & Kyla,19W5OTEcQI3ZoRW1HERMyy,False,14,1,26,0.792,0.625,1,-5.609,1,0.0536,0.00776,0.0018,0.329,0.37,103.967,173987,4
2016-10-15,15,Gold,Kiiara,19W5OTEcQI3ZoRW1HERMyy,False,16,15,19,0.6,0.412,8,-9.343,1,0.344,0.615,0.0025,0.134,0.408,113.049,225882,5
2016-10-15,16,Send My Love (To Your New Lover),Adele,19W5OTEcQI3ZoRW1HERMyy,False,13,8,20,0.688,0.533,6,-8.363,0,0.0865,0.0355,3.48e-06,0.172,0.567,164.069,223079,4
2016-10-15,17,Needed Me,Rihanna,19W5OTEcQI3ZoRW1HERMyy,False,12,7,35,0.671,0.314,5,-8.091,0,0.244,0.11,0,0.0825,0.296,110.898,191600,4
2016-10-15,18,Too Good,Drake Featuring Rihanna,19W5OTEcQI3ZoRW1HERMyy,False,15,14,22,0.794,0.653,7,-7.839,1,0.104,0.0489,4.88e-05,0.1,0.397,117.996,263373,4
2016-10-15,19,Side To Side,Ariana Grande Featuring Nicki Minaj,19W5OTEcQI3ZoRW1HERMyy,False,18,18,5,0.65,0.736,6,-5.84,0,0.229,0.0528,0,0.235,0.613,159.173,226160,4
2016-10-15,20,Can't Stop The Feeling!,Justin Timberlake,19W5OTEcQI3ZoRW1HERMyy,False,17,1,21,0.669,0.832,0,-5.72,1,0.0682,0.0106,0,0.0968,0.7,113.035,237547,4
2016-10-15,21,Luv,Tory Lanez,19W5OTEcQI3ZoRW1HERMyy,False,22,19,14,0.539,0.528,11,-8.113,0,0.252,0.0108,0,0.117,0.252,190.169,228640,4
2016-10-15,22,Sucker For Pain,"Lil Wayne, Wiz Khalifa & Imagine Dragons With Logic & Ty Dolla $ign Feat. X Ambassadors",19W5OTEcQI3ZoRW1HERMyy,False,23,15,14,0.502,0.786,9,-4.378,0,0.317,0.255,0,0.65,0.739,169.021,243491,4
2016-10-15,23,Into You,Ariana Grande,19W5OTEcQI3ZoRW1HERMyy,False,20,13,20,0.623,0.734,9,-5.948,1,0.107,0.0162,1.75e-06,0.145,0.37,107.853,244453,4
2016-10-15,24,Starving,Hailee Steinfeld & Grey Featuring Zedd,19W5OTEcQI3ZoRW1HERMyy,False,31,24,9,0.728,0.616,4,-4.238,1,0.0645,0.378,0,0.105,0.508,99.962,181880,4
2016-10-15,25,Hymn For The Weekend,Coldplay,19W5OTEcQI3ZoRW1HERMyy,False,25,25,18,0.491,0.693,0,-6.487,0,0.0377,0.211,6.92e-06,0.325,0.412,90.027,258267,4
2016-10-15,26,Unsteady,X Ambassadors,19W5OTEcQI3ZoRW1HERMyy,False,27,26,20,0.389,0.665,0,-6.169,1,0.0644,0.178,0.000732,0.116,0.199,117.055,193547,4
2016-10-15,27,My Way,Calvin Harris,19W5OTEcQI3ZoRW1HERMyy,False,24,24,2,0.819,0.913,4,-3.059,0,0.0427,0.0935,3.72e-05,0.161,0.536,119.989,219160,4
2016-10-15,28,Panda,Desiigner,19W5OTEcQI3ZoRW1HERMyy,False,28,1,32,0.685,0.731,10,-5.503,0,0.414,0.0292,0,0.369,0.266,145.245,247867,4
2016-10-15,29,This Girl,Kungs vs Cookin' On 3 Burners,19W5OTEcQI3ZoRW1HERMyy,False,26,26,10,0.792,0.717,0,-4.759,0,0.0393,0.0927,3.59e-05,0.226,0.466,121.985,195547,4
2016-10-15,30,The Greatest,Sia Featuring Kendrick Lamar,19W5OTEcQI3ZoRW1HERMyy,False,34,24,4,0.668,0.725,1,-6.127,1,0.266,0.0102,0.000479,0.0561,0.729,191.944,210227,4
2016-10-15,31,For Free,DJ Khaled Featuring Drake,19W5OTEcQI3ZoRW1HERMyy,False,30,13,17,0.916,0.571,10,-8.241,0,0.2,0.0173,1.11e-06,0.153,0.498,103.521,183695,4
2016-10-15,32,Controlla,Drake,19W5OTEcQI3ZoRW1HERMyy,False,33,16,22,0.59,0.468,10,-11.083,0,0.185,0.0789,0,0.101,0.349,92.287,245227,4
2016-10-15,33,"Sit Still, Look Pretty",Daya,19W5OTEcQI3ZoRW1HERMyy,False,29,28,18,0.655,0.74,2,-4.081,1,0.274,0.14,0,0.106,0.543,182.105,202221,4
2016-10-15,34,Forever Country,"Artists Of Then, Now & Forever",19W5OTEcQI3ZoRW1HERMyy,False,21,21,2,0.201,0.684,7,-5.931,1,0.0389,0.401,1.46e-05,0.0954,0.131,90.056,242480,4
2016-10-15,35,No Limit,Usher Featuring Young Thug,19W5OTEcQI3ZoRW1HERMyy,False,32,32,14,0.717,0.523,10,-6.506,0,0.0611,0.0799,0,0.206,0.282,127.047,228613,4
2016-10-15,36,OOOUUU,Young M.A,19W5OTEcQI3ZoRW1HERMyy,False,52,36,5,0.635,0.847,7,-3.152,1,0.447,0.533,0,0.154,0.568,166.072,234650,4
2016-10-15,37,Setting The World On Fire,Kenny Chesney Featuring P!nk,19W5OTEcQI3ZoRW1HERMyy,False,37,29,9,0.61,0.822,0,-4.422,1,0.0355,0.0171,1.88e-06,0.093,0.437,93.993,217467,4
2016-10-15,38,Just Like Fire,P!nk,19W5OTEcQI3ZoRW1HERMyy,False,38,10,24,0.632,0.701,7,-5.921,1,0.146,0.0114,0,0.108,0.497,162.958,215414,4
2016-10-15,39,Work From Home,Fifth Harmony Featuring Ty Dolla $ign,19W5OTEcQI3ZoRW1HERMyy,False,39,4,31,0.803,0.585,8,-5.861,1,0.0432,0.103,3.94e-06,0.0644,0.593,105.017,214480,4
2016-10-15,40,Chill Bill,Rob $tone Featuring J. Davi$ & Spooks,19W5OTEcQI3ZoRW1HERMyy,False,43,40,9,0.886,0.427,6,-10.028,1,0.145,0.0312,0.00099,0.0906,0.23,108.034,177184,4
2016-10-15,41,Black Beatles,Rae Sremmurd Featuring Gucci Mane,19W5OTEcQI3ZoRW1HERMyy,False,77,41,3,0.794,0.632,0,-6.163,1,0.0649,0.142,0,0.128,0.355,145.926,291893,4
2016-10-15,42,Low Life,Future Featuring The Weeknd,19W5OTEcQI3ZoRW1HERMyy,False,44,18,34,0.722,0.331,8,-7.789,1,0.0725,0.337,0.283,0.146,0.102,143.974,313547,4
2016-10-15,43,Tiimmy Turner,Desiigner,19W5OTEcQI3ZoRW1HERMyy,False,35,34,10,0.603,0.725,6,-3.054,1,0.0393,0.174,0,0.0786,0.304,122.803,239853,4
2016-10-15,44,It Don't Hurt Like It Used To,Billy Currington,19W5OTEcQI3ZoRW1HERMyy,False,53,44,10,0.558,0.818,8,-4.07,1,0.0403,0.071,0,0.21,0.453,81.034,184507,4
2016-10-15,45,Work,Rihanna Featuring Drake,19W5OTEcQI3ZoRW1HERMyy,False,41,1,36,0.725,0.534,11,-6.238,1,0.0946,0.0752,0,0.0919,0.558,91.974,219320,4
2016-10-15,46,I Took A Pill In Ibiza,Mike Posner,19W5OTEcQI3ZoRW1HERMyy,False,45,4,37,0.664,0.714,7,-6.645,0,0.111,0.0353,8.42e-06,0.0843,0.71,101.969,197933,4
2016-10-15,47,In The Name Of Love,Martin Garrix & Bebe Rexha,19W5OTEcQI3ZoRW1HERMyy,False,49,47,7,0.501,0.519,4,-5.88,0,0.0409,0.109,0,0.454,0.168,133.99,195707,4
2016-10-15,48,Never Be Like You,Flume Featuring Kai,19W5OTEcQI3ZoRW1HERMyy,False,36,20,26,0.444,0.557,0,-5.476,1,0.0602,0.453,0,0.152,0.296,115.058,234910,4
2016-10-15,49,Pick Up The Phone,Young Thug And Travis Scott Featuring Quavo,19W5OTEcQI3ZoRW1HERMyy,False,50,43,7,0.711,0.739,7,-3.804,0,0.129,0.114,0,0.226,0.43,136.919,252256,4
2016-10-15,50,H.O.L.Y.,Florida Georgia Line,19W5OTEcQI3ZoRW1HERMyy,False,47,14,22,0.523,0.666,7,-4.081,0,0.0327,0.401,0,0.0728,0.564,78.077,194187,4
2016-10-15,51,Scars To Your Beautiful,Alessia Cara,19W5OTEcQI3ZoRW1HERMyy,False,58,51,5,0.573,0.739,0,-5.74,1,0.129,0.0285,0,0.111,0.451,97.085,230227,4
2016-10-15,52,Caroline,Amine,19W5OTEcQI3ZoRW1HERMyy,False,65,52,4,0.94,0.335,5,-10.179,0,0.505,0.17,0,0.262,0.707,120.04,209640,4
2016-10-15,53,Blue Ain't Your Color,Keith Urban,19W5OTEcQI3ZoRW1HERMyy,False,60,53,3,0.69,0.416,7,-7.865,1,0.0335,0.617,1.37e-06,0.102,0.479,82.45,230600,3
2016-10-15,54,No Problem,Chance The Rapper Featuring Lil Wayne & 2 Chainz,19W5OTEcQI3ZoRW1HERMyy,False,55,54,19,0.652,0.795,11,-5.192,0,0.174,0.156,0,0.123,0.788,135.018,304607,4
2016-10-15,55,Different For Girls,Dierks Bentley Featuring Elle King,19W5OTEcQI3ZoRW1HERMyy,False,48,42,17,0.655,0.768,4,-5.616,1,0.0365,0.385,0.000257,0.0733,0.431,92.021,180360,4
2016-10-15,56,Middle Of A Memory,Cole Swindell,19W5OTEcQI3ZoRW1HERMyy,False,59,56,10,0.531,0.746,11,-4.228,1,0.0329,0.0972,0,0.102,0.304,139.788,226307,4
2016-10-15,57,Father Stretch My Hands Pt. 1,Kanye West,19W5OTEcQI3ZoRW1HERMyy,False,56,37,21,0.724,0.573,7,-4.113,1,0.0549,0.118,0,0.538,0.438,113.088,135920,4
2016-10-15,58,Fade,Kanye West,19W5OTEcQI3ZoRW1HERMyy,False,62,47,4,0.752,0.765,9,-5.805,0,0.0908,0.118,0,0.31,0.309,105.998,193748,4
2016-10-15,59,Perfect Illusion,Lady Gaga,19W5OTEcQI3ZoRW1HERMyy,False,42,15,3,0.613,0.857,1,-5.492,0,0.0365,0.0012,0,0.358,0.656,124.989,182000,4
2016-10-15,60,I Met A Girl,William Michael Morgan,19W5OTEcQI3ZoRW1HERMyy,False,67,60,6,0.512,0.545,2,-10.154,1,0.0294,0.111,0.00177,0.135,0.346,83.94,201533,4
2016-10-15,61,Move,Luke Bryan,19W5OTEcQI3ZoRW1HERMyy,False,71,61,6,0.57,0.939,5,-0.716,0,0.0789,0.00719,1.08e-06,0.0462,0.801,103.983,227413,4
2016-10-15,62,1 Night,Lil Yachty,19W5OTEcQI3ZoRW1HERMyy,False,70,62,8,0.764,0.475,0,-12.618,1,0.114,0.345,0,0.14,0.34,129.974,243270,4
2016-10-15,63,This Town,Niall Horan,0qvzXomUDJVaUboy2wMfiS,True,0,63,1,0.677,0.401,9,-8.467,1,0.0308,0.712,0,0.116,0.195,111.825,232852,4
2016-10-15,64,Vice,Miranda Lambert,0qvzXomUDJVaUboy2wMfiS,False,69,47,11,0.568,0.562,9,-7.775,1,0.0418,0.101,6.16e-05,0.363,0.247,133.647,240280,4
2016-10-15,65,May We All,Florida Georgia Line Featuring Tim McGraw,0qvzXomUDJVaUboy2wMfiS,False,74,56,5,0.514,0.918,7,-4.306,1,0.0365,0.0409,0,0.342,0.64,150.033,226173,4
2016-10-15,66,Money Longer,Lil Uzi Vert,0qvzXomUDJVaUboy2wMfiS,False,61,54,16,0.795,0.568,5,-7.817,0,0.142,0.0541,0,0.108,0.478,136.173,198944,4
2016-10-15,67,Rock On,Tucker Beathard,0qvzXomUDJVaUboy2wMfiS,False,64,64,7,0.629,0.465,2,-8.58,1,0.0306,0.000159,0.427,0.0809,0.513,156.035,214533,4
2016-10-15,68,Mercy,Shawn Mendes,0qvzXomUDJVaUboy2wMfiS,False,0,68,2,0.57,0.347,11,-6.649,0,0.0358,0.711,0,0.11,0.43,74.054,219160,4
2016-10-15,69,Peter Pan,Kelsea Ballerini,0qvzXomUDJVaUboy2wMfiS,False,54,35,18,0.514,0.659,1,-6.142,1,0.0309,0.0284,0,0.266,0.463,76.483,200040,4
2016-10-15,70,Come And See Me,PARTYNEXTDOOR Featuring Drake,0qvzXomUDJVaUboy2wMfiS,False,76,65,13,0.717,0.347,11,-10.265,0,0.0636,0.0511,2.43e-06,0.087,0.0589,84.987,235477,4
2016-10-15,71,A Little More Summertime,Jason Aldean,0qvzXomUDJVaUboy2wMfiS,False,75,69,4,0.482,0.823,9,-4.446,1,0.0661,0.0386,3.69e-05,0.0948,0.451,167.665,219547,4
2016-10-15,72,I Know Somebody,LOCASH,0qvzXomUDJVaUboy2wMfiS,False,79,72,5,0.505,0.903,1,-3.699,1,0.037,0.0356,0,0.127,0.491,88.986,197830,4
2016-10-15,73,Mama Said,Lukas Graham,0qvzXomUDJVaUboy2wMfiS,False,51,36,11,0.712,0.799,7,-4.564,0,0.0703,0.0447,6.4e-05,0.37,0.591,83.996,206903,4
2016-10-15,74,You & Me,Marc E. Bassy Featuring G-Eazy,0qvzXomUDJVaUboy2wMfiS,False,68,58,12,0.449,0.635,1,-8.301,1,0.275,0.0413,0,0.188,0.608,84.414,218493,4
2016-10-15,75,Me Too,Meghan Trainor,0qvzXomUDJVaUboy2wMfiS,False,66,13,20,0.934,0.694,11,-5.849,0,0.101,0.0971,1.2e-06,0.477,0.833,123.831,181240,4
2016-10-15,76,Sleep Without You,Brett Young,0qvzXomUDJVaUboy2wMfiS,False,81,76,3,0.626,0.707,5,-5.755,0,0.0425,0.0169,0,0.0772,0.653,88.543,187813,4
2016-10-15,77,All In My Head (Flex),Fifth Harmony Featuring Fetty Wap,0qvzXomUDJVaUboy2wMfiS,False,63,24,15,0.689,0.791,0,-5.194,0,0.053,0.023,0,0.0526,0.755,95.04,210573,4
2016-10-15,78,X,21 Savage & Metro Boomin Featuring Future,0qvzXomUDJVaUboy2wMfiS,False,84,78,3,0.835,0.413,1,-9.81,1,0.396,0.373,0.00133,0.101,0.111,149.004,258880,4
2016-10-15,79,Too Much Sauce,DJ ESCO Featuring Future & Lil Uzi Vert,0qvzXomUDJVaUboy2wMfiS,False,85,79,6,0.96,0.547,6,-6.992,0,0.0786,0.0496,0,0.216,0.186,121.01,223093,4
2016-10-15,80,Make You Miss Me,Sam Hunt,0qvzXomUDJVaUboy2wMfiS,False,72,45,18,0.614,0.472,7,-6.626,1,0.0297,0.158,0,0.111,0.168,146.005,225693,4
2016-10-15,81,I Got The Keys,DJ Khaled Featuring Jay Z & Future,0qvzXomUDJVaUboy2wMfiS,False,73,30,14,0.686,0.623,1,-3.425,1,0.13,0.00287,0.00145,0.219,0.176,140.171,219759,4
2016-10-15,82,Do You Mind,"DJ Khaled Featuring Nicki Minaj, Chris Brown, August Alsina, Jeremih, Future & Rick Ross",0qvzXomUDJVaUboy2wMfiS,False,88,82,8,0.412,0.548,10,-6.981,1,0.243,0.0173,0,0.181,0.176,81.293,325615,4
2016-10-15,83,THat Part,ScHoolboy Q Featuring Kanye West,0qvzXomUDJVaUboy2wMfiS,False,78,40,17,0.927,0.535,6,-7.59,0,0.0911,0.0855,0,0.136,0.336,112.96,313573,4
2016-10-15,84,"Wat U Mean (Aye, Aye, Aye)",Dae Dae,0qvzXomUDJVaUboy2wMfiS,False,83,66,11,0.923,0.599,6,-4.888,1,0.238,0.07,1.23e-06,0.0951,0.667,138.024,181739,4
2016-10-15,85,You Was Right,Lil Uzi Vert,0qvzXomUDJVaUboy2wMfiS,False,93,85,12,0.843,0.359,0,-7.417,1,0.461,0.069,0,0.12,0.156,81.987,163944,4
2016-10-15,86,Key To The Streets,YFN Lucci Featuring Migos & Trouble,0qvzXomUDJVaUboy2wMfiS,False,87,86,2,0.773,0.696,6,-5.448,0,0.121,0.119,0,0.122,0.264,140.022,281994,4
2016-10-15,87,Hold Up,Beyonce,0qvzXomUDJVaUboy2wMfiS,False,89,13,9,0.524,0.397,0,-11.936,1,0.405,0.745,0,0.521,0.552,80.744,221093,4
2016-10-15,88,Gangsta,Kehlani,0qvzXomUDJVaUboy2wMfiS,False,82,41,8,0.439,0.447,10,-8.318,0,0.0436,0.111,0,0.303,0.11,121.48,177029,4
2016-10-15,89,HandClap,Fitz And The Tantrums,4qRaZYiaOsSvWC7VgcxrI0,True,0,89,1,0.636,0.836,8,-3.004,1,0.0427,0.00609,0.000157,0.0828,0.715,139.956,193253,4
2016-10-15,90,Why You Always Hatin?,YG Featuring Drake & Kamaiyah,4qRaZYiaOsSvWC7VgcxrI0,False,86,62,15,0.926,0.336,0,-9.326,0,0.594,0.0392,0,0.138,0.38,92.995,196600,4
2016-10-15,91,Goosebumps,Travis Scott,4qRaZYiaOsSvWC7VgcxrI0,False,97,91,3,0.841,0.593,1,-7.846,1,0.0379,0.418,0,0.124,0.808,124.917,162803,4
2016-10-15,92,Song For Another Time,Old Dominion,7px4t7HGiuMUvFkEOpZEwp,True,0,92,1,0.498,0.804,11,-3.995,1,0.0332,0.125,0,0.167,0.697,166.054,191827,4
2016-10-15,93,Wishing,"DJ Drama Featuring Chris Brown, Skeme & Lyquin",7px4t7HGiuMUvFkEOpZEwp,False,95,91,7,0.563,0.691,3,-4.464,0,0.382,0.197,0,0.0886,0.567,108.406,330387,4
2016-10-15,94,Capsize,Frenship & Emily Warren,2XMTqoHHSH0lvuXrvIEdco,True,0,94,1,0.683,0.708,5,-6.244,0,0.0305,0.0398,0.155,0.686,0.355,92.991,237707,4
2016-10-15,95,CRZY,Kehlani,6Dwtha2FtZFoMEBh5GR2sq,True,0,95,1,0.827,0.702,6,-7.264,1,0.267,0.226,5.04e-05,0.158,0.694,130.02,191720,4
2016-10-15,96,Purple Lamborghini,Skrillex & Rick Ross,6Dwtha2FtZFoMEBh5GR2sq,False,90,33,10,0.457,0.899,10,-2.591,0,0.132,0.0019,0,0.831,0.298,147.268,215510,4
2016-10-15,97,With You Tonight / Hasta El Amanecer,Nicky Jam,6Dwtha2FtZFoMEBh5GR2sq,False,94,73,19,0.786,0.577,6,-6.675,0,0.0466,0.285,0,0.262,0.651,94.019,195893,4
2016-10-15,98,Cool Girl,Tove Lo,6Dwtha2FtZFoMEBh5GR2sq,False,0,84,4,0.674,0.694,9,-7.076,0,0.109,0.313,7.17e-06,0.0752,0.203,101.993,199179,4
2016-10-15,99,You Look Like I Need A Drink,Justin Moore,6Dwtha2FtZFoMEBh5GR2sq,False,80,79,8,0.608,0.841,11,-3.626,1,0.028,0.0028,0,0.0834,0.917,106.004,187480,4
2016-10-15,100,No Shopping,French Montana Featuring Drake,6Dwtha2FtZFoMEBh5GR2sq,False,98,36,11,0.895,0.491,10,-10.261,0,0.246,0.0144,0.000988,0.143,0.249,83.505,227727,4
