date,position,title,artist,spotify_id,is_new,last_pos,peak_pos,weeks,danceability,energy,key,loudness,mode,speechiness,acousticness,instrumentalness,liveness,valence,tempo,duration_ms,time_signature
1992-05-30,1,Jump,Kris Kross,,False,1,1,9,0.749,0.745,2,-10.625,1,0.164,0.000501,0.00403,0.333,0.481,101.972,195107,4
1992-05-30,2,My Lovin' (You're Never Gonna Get It),En Vogue,,False,2,2,11,0.767,0.839,8,-5.519,1,0.0613,0.0318,9.31e-06,0.111,0.461,98.055,281613,4
1992-05-30,3,Under The Bridge,Red Hot Chili Peppers,,False,3,3,9,0.559,0.345,4,-13.496,1,0.0459,0.0576,0.000105,0.141,0.458,84.581,264307,4
1992-05-30,4,Live And Learn,Joe Public,,False,4,4,12,0.744,0.894,11,-9.448,0,0.0711,0.0794,0,0.139,0.683,106.637,262333,4
1992-05-30,5,Baby Got Back,Sir Mix-A-Lot,,False,12,5,8,0.926,0.669,1,-11.271,1,0.301,0.0051,0,0.0887,0.642,128.462,262827,4
1992-05-30,6,In The Closet,Michael Jackson,,False,10,6,6,0.877,0.781,11,-3.775,0,0.0691,0.117,0.000746,0.149,0.606,110.494,390573,4
1992-05-30,7,Damn I Wish I Was Your Lover,Sophie B. Hawkins,,False,14,7,7,0.546,0.781,11,-9.439,0,0.0506,0.22,1.51e-05,0.363,0.539,95.032,323267,4
1992-05-30,8,Ain't 2 Proud 2 Beg,TLC,,False,8,6,15,0.674,0.707,10,-10.799,0,0.0343,0.00265,0.00214,0.352,0.712,104.854,336560,4
1992-05-30,9,Bohemian Rhapsody,Queen,,False,5,2,35,0.392,0.402,0,-9.961,0,0.0536,0.288,0,0.243,0.228,143.883,354320,4
1992-05-30,10,Save The Best For Last,Vanessa Williams,,False,7,1,18,0.528,0.234,3,-15.784,1,0.0283,0.641,0,0.183,0.191,95.911,218733,4
1992-05-30,11,Tears In Heaven,Eric Clapton,,False,6,2,17,0.695,0.336,9,-12.999,1,0.0313,0.8,0.00264,0.701,0.422,79.109,280000,4
1992-05-30,12,If You Asked Me To,Celine Dion,,False,18,12,6,0.46,0.437,7,-10.587,1,0.0304,0.128,0,0.025,0.227,172.382,234360,4
1992-05-30,13,I'll Be There,Mariah Carey,5jI2ApByK8KJeWVU39oRO4,True,0,13,1,0.404,0.511,5,-9.427,1,0.0315,0.716,0,0.871,0.279,82.025,264160,4
1992-05-30,14,Everything About You,Ugly Kid Joe,5jI2ApByK8KJeWVU39oRO4,False,9,9,9,0.501,0.803,1,-8.449,1,0.0547,0.00881,1.78e-06,0.107,0.738,122.458,255160,4
1992-05-30,15,One,U2,5jI2ApByK8KJeWVU39oRO4,False,11,10,12,0.392,0.534,0,-8.793,1,0.0369,0.245,0.00104,0.155,0.325,181.305,276187,4
1992-05-30,16,Thought I'd Died And Gone To Heaven,Bryan Adams,5jI2ApByK8KJeWVU39oRO4,False,13,13,12,0.44,0.738,4,-8.193,1,0.0295,0.0657,0,0.0988,0.535,174.376,348400,4
1992-05-30,17,Hold On My Heart,Genesis,5jI2ApByK8KJeWVU39oRO4,False,19,17,5,0.465,0.365,5,-12.633,0,0.0295,0.618,0.0113,0.0747,0.265,171.904,276373,4
1992-05-30,18,Achy Breaky Heart,Billy Ray Cyrus,5jI2ApByK8KJeWVU39oRO4,False,24,18,4,0.8,0.563,9,-10.209,1,0.0303,0.051,0,0.0797,0.961,121.808,203373,4
1992-05-30,19,Tennessee,Arrested Development,5jI2ApByK8KJeWVU39oRO4,False,20,19,8,0.822,0.661,1,-10.234,0,0.164,0.0241,3.95e-06,0.315,0.67,99.883,272707,4
1992-05-30,20,Let's Get Rocked,Def Leppard,5jI2ApByK8KJeWVU39oRO4,False,17,15,8,0.564,0.888,5,-6.763,1,0.0325,0.0109,6.68e-05,0.177,0.526,91.989,295957,4
1992-05-30,21,Hazard,Richard Marx,5jI2ApByK8KJeWVU39oRO4,False,16,9,16,0.674,0.565,7,-10.417,0,0.0259,0.163,0.00169,0.0959,0.655,124.833,275373,4
1992-05-30,22,Just Take My Heart,Mr. Big,5jI2ApByK8KJeWVU39oRO4,False,22,22,8,0.508,0.362,0,-9.369,1,0.0349,0.483,0,0.0996,0.207,168.586,265307,4
1992-05-30,23,Make It Happen,Mariah Carey,5jI2ApByK8KJeWVU39oRO4,False,15,5,15,0.811,0.531,2,-8.537,0,0.0355,0.00657,0.0285,0.0801,0.752,107.853,307000,4
1992-05-30,24,The Best Things In Life Are Free,Luther Vandross And Janet Jackson With BBD And Ralph Tresvant,5nvYnwbX1Gb60mpX7m8P01,True,0,24,1,0.852,0.863,6,-9.241,0,0.136,0.197,0,0.143,0.496,120.953,297907,4
1992-05-30,25,You Won't See Me Cry,Wilson Phillips,5nvYnwbX1Gb60mpX7m8P01,False,30,25,4,0.47,0.442,9,-11.142,1,0.0266,0.582,1.79e-06,0.0899,0.129,76.765,233533,4
1992-05-30,26,I Will Remember You,Amy Grant,5nvYnwbX1Gb60mpX7m8P01,False,29,26,6,0.513,0.658,0,-6.432,1,0.0277,0.0329,9.3e-05,0.0805,0.336,177.625,300560,4
1992-05-30,27,Will You Marry Me?,Paula Abdul,5nvYnwbX1Gb60mpX7m8P01,False,21,19,9,0.623,0.7,11,-7.9,1,0.0575,0.422,3.12e-05,0.31,0.548,149.726,264867,3
1992-05-30,28,Slow Motion,Color Me Badd,5nvYnwbX1Gb60mpX7m8P01,False,37,28,4,0.783,0.885,6,-7.747,0,0.0648,0.00525,0.752,0.0435,0.941,92.042,265667,4
1992-05-30,29,Do It To Me,Lionel Richie,5nvYnwbX1Gb60mpX7m8P01,False,34,29,5,0.696,0.515,0,-10.286,1,0.028,0.197,0.000115,0.462,0.501,91.48,270507,4
1992-05-30,30,Just Another Day,Jon Secada,5nvYnwbX1Gb60mpX7m8P01,False,40,30,7,0.717,0.642,1,-10.727,1,0.0287,0.0194,0.000249,0.043,0.732,105.894,327427,4
1992-05-30,31,Nu Nu,Lidell Townsell,5nvYnwbX1Gb60mpX7m8P01,False,26,26,14,0.936,0.55,3,-12.744,0,0.0548,0.00935,0.000322,0.0688,0.763,120.963,199627,4
1992-05-30,32,Come & Talk To Me,Jodeci,5nvYnwbX1Gb60mpX7m8P01,False,32,32,9,0.609,0.57,7,-14.773,1,0.0912,0.223,0,0.366,0.84,172.095,276267,4
1992-05-30,33,Lift Me Up,Howard Jones,5nvYnwbX1Gb60mpX7m8P01,False,35,33,8,0.701,0.837,8,-4.266,1,0.0269,0.0414,6.77e-05,0.145,0.872,109.526,218613,4
1992-05-30,34,Silent Prayer,Shanice,5nvYnwbX1Gb60mpX7m8P01,False,31,31,6,0.466,0.405,9,-13.259,0,0.0365,0.136,0,0.102,0.159,141.758,303867,3
1992-05-30,35,Not The Only One,Bonnie Raitt,5nvYnwbX1Gb60mpX7m8P01,False,39,35,7,0.726,0.731,5,-7.264,1,0.0383,0.411,7.18e-05,0.084,0.513,115.905,250533,4
1992-05-30,36,Everything Changes,Kathy Troccoli,5nvYnwbX1Gb60mpX7m8P01,False,28,14,15,0.749,0.874,6,-3.981,1,0.0332,0.0853,2.66e-06,0.0414,0.78,117.776,262200,4
1992-05-30,37,Money Don't Matter 2 Night,Prince And The N.P.G.,5nvYnwbX1Gb60mpX7m8P01,False,25,23,10,0.824,0.569,1,-10.386,1,0.0348,0.0292,2.35e-05,0.0595,0.703,110.129,286627,4
1992-05-30,38,I'm The One You Need,Jody Watley,5nvYnwbX1Gb60mpX7m8P01,False,23,19,13,0.761,0.729,7,-8.909,0,0.0352,0.182,0,0.245,0.631,112.184,261040,4
1992-05-30,39,T.L.C.,Linear,5nvYnwbX1Gb60mpX7m8P01,False,44,39,4,0.252,0.821,4,-6.916,1,0.0346,0.000372,0.635,0.204,0.452,86.312,190773,4
1992-05-30,40,Masterpiece,Atlantic Starr,5nvYnwbX1Gb60mpX7m8P01,False,27,3,18,0.642,0.448,5,-10.418,0,0.0259,0.492,1.74e-05,0.0646,0.299,137.831,295347,4
1992-05-30,41,Wishing On A Star,The Cover Girls,7EE5va6hu88TSdtbXrEl0J,True,0,41,1,0.353,0.544,5,-10.812,0,0.0331,0.581,9.95e-05,0.0835,0.48,88.898,281200,4
1992-05-30,42,Breakin' My Heart (Pretty Brown Eyes),Mint Condition,7EE5va6hu88TSdtbXrEl0J,False,33,6,22,0.672,0.52,7,-9.965,0,0.0407,0.0985,1.28e-06,0.0365,0.551,137.213,356960,4
1992-05-30,43,High,The Cure,7EE5va6hu88TSdtbXrEl0J,False,49,42,9,0.618,0.717,9,-12.107,1,0.03,0.0164,0.000339,0.0594,0.761,114.802,213333,4
1992-05-30,44,Life Is A Highway,Tom Cochrane,7EE5va6hu88TSdtbXrEl0J,False,61,44,3,0.683,0.751,5,-10.184,1,0.0346,0.0681,8.36e-06,0.248,0.841,103.036,266560,4
1992-05-30,45,I Can't Dance,Genesis,7EE5va6hu88TSdtbXrEl0J,False,41,7,18,0.914,0.528,3,-9.114,1,0.0508,0.499,4.38e-06,0.0454,0.898,107.557,241360,4
1992-05-30,46,Why Me Baby?,Keith Sweat,7EE5va6hu88TSdtbXrEl0J,False,50,46,8,0.718,0.524,5,-10.215,0,0.0282,0.0161,6.1e-06,0.195,0.345,132.782,327973,4
1992-05-30,47,Beauty And The Beast,Celine Dion And Peabo Bryson,7EE5va6hu88TSdtbXrEl0J,False,38,9,20,0.463,0.4,6,-9.999,0,0.0308,0.643,2.46e-05,0.131,0.121,77.314,249240,4
1992-05-30,48,To Be With You,Mr. Big,7EE5va6hu88TSdtbXrEl0J,False,43,1,24,0.688,0.375,4,-9.601,1,0.0535,0.286,0,0.133,0.45,83.635,210480,4
1992-05-30,49,Remember The Time,Michael Jackson,7EE5va6hu88TSdtbXrEl0J,False,45,3,19,0.831,0.921,5,-2.383,0,0.0582,0.153,0.00224,0.305,0.795,108.002,239227,4
1992-05-30,50,Good For Me,Amy Grant,7EE5va6hu88TSdtbXrEl0J,False,48,8,20,0.594,0.883,5,-4.279,1,0.0451,0.329,8.33e-05,0.276,0.863,89.997,239493,4
1992-05-30,51,Take Time,Chris Walker,7EE5va6hu88TSdtbXrEl0J,False,36,29,12,0.648,0.743,7,-9.595,0,0.0592,0.0799,0,0.125,0.81,97.059,260840,4
1992-05-30,52,Your Song,Rod Stewart,7EE5va6hu88TSdtbXrEl0J,False,54,52,6,0.553,0.328,9,-10.797,1,0.0341,0.643,0,0.109,0.345,103.472,270960,4
1992-05-30,53,Smells Like Nirvana,"""Weird Al"" Yankovic",7EE5va6hu88TSdtbXrEl0J,False,42,35,6,0.591,0.786,6,-7.664,1,0.0749,0.162,0.00178,0.28,0.729,120.762,224533,4
1992-05-30,54,Come As You Are,Nirvana,7EE5va6hu88TSdtbXrEl0J,False,51,32,11,0.5,0.824,4,-5.846,0,0.0388,0.00016,0.00161,0.0916,0.539,120.125,218920,4
1992-05-30,55,They Want EFX,Das EFX,7EE5va6hu88TSdtbXrEl0J,False,63,55,4,0.755,0.459,5,-12.84,0,0.358,0.115,0,0.0851,0.597,98.454,221400,4
1992-05-30,56,Please Don't Go,Boyz II Men,7EE5va6hu88TSdtbXrEl0J,False,60,49,9,0.644,0.663,6,-12.847,0,0.0454,0.197,0,0.302,0.743,135.622,263960,4
1992-05-30,58,Anything At All,Mitch Malloy,,False,65,58,5,0.537,0.97,6,-2.481,1,0.0455,0.000411,8.3e-06,0.331,0.695,119.155,242153,4
1992-05-30,59,You Think You Know Her,Cause And Effect,,False,46,38,14,0.648,0.699,0,-11.729,1,0.0328,0.0183,0.111,0.343,0.753,122.964,283933,4
1992-05-30,60,Maria,TKA,,False,70,60,9,0.658,0.887,6,-8.444,0,0.0638,0.0263,0.329,0.07,0.538,118.098,417120,4
1992-05-30,62,Love Me,Tracie Spencer,,False,53,48,10,0.652,0.366,1,-11.492,1,0.0301,0.5,2.7e-05,0.127,0.288,137.264,303800,4
1992-05-30,63,3-2-1 Pump,Redhead Kingpin & The F.B.I.,,False,55,52,10,0.875,0.69,11,-11.484,0,0.0819,0.0241,6.07e-05,0.0627,0.53,127.143,265400,4
1992-05-30,64,Just For Tonight,Vanessa Williams,,False,93,64,2,0.57,0.352,9,-15.484,1,0.0311,0.324,0,0.0969,0.318,141.969,268600,4
1992-05-30,65,The Choice Is Yours,Black Sheep,,False,57,57,14,0.867,0.679,10,-12.028,0,0.207,0.0336,1.59e-06,0.0742,0.68,101.293,243200,4
1992-05-30,66,What Goes Around Comes Around,Giggles,,False,64,47,19,0.744,0.819,7,-10.303,1,0.0546,0.0259,0.00229,0.178,0.87,120.355,223467,4
1992-05-30,67,Closer To Me,The Outfield,,False,72,67,3,0.675,0.61,9,-12.398,1,0.0355,0.152,0.00135,0.124,0.821,120.98,197333,4
1992-05-30,68,We Got A Love Thang,CeCe Peniston,,False,52,20,18,0.669,0.644,0,-10.47,1,0.0302,0.000172,0.00585,0.356,0.764,120.012,328800,4
1992-05-30,70,Helluva,Brotherhood Creed,,False,67,67,7,0.804,0.864,6,-7.148,1,0.125,0.0658,0,0.0609,0.765,105.414,249827,4
1992-05-30,71,Nothing Else Matters,Metallica,,False,58,34,10,0.558,0.364,4,-11.258,0,0.0265,0.0505,5.02e-06,0.0753,0.17,142.171,388733,3
1992-05-30,72,Don't Be Afraid,Aaron Hall,,False,59,44,12,0.507,0.709,9,-6.751,0,0.0484,0.133,0,0.447,0.36,135.814,271673,4
1992-05-30,73,Fall In Love Again,Eddie Money,,False,81,73,3,0.596,0.521,4,-8.357,1,0.0298,0.605,5.48e-06,0.0981,0.519,146.951,262333,4
1992-05-30,74,All Woman,Lisa Stansfield,,False,56,56,13,0.583,0.338,7,-13.63,0,0.064,0.607,9.86e-06,0.0708,0.378,141.889,317373,4
1992-05-30,75,This Is The Last Time,Laura Enea,,False,71,71,10,0.646,0.951,6,-5.528,0,0.0318,0.00141,0.00152,0.211,0.756,121.0,238943,4
1992-05-30,76,Everything's Gonna Be Alright,Naughty By Nature,,False,73,53,17,0.883,0.647,10,-14.054,0,0.197,0.0633,0,0.254,0.739,101.649,291867,4
1992-05-30,77,Why,Annie Lennox,,False,87,77,3,0.531,0.471,0,-9.267,1,0.0236,0.28,6.22e-05,0.133,0.119,90.941,293838,4
1992-05-30,78,Love You All My Lifetime,Chaka Khan,,False,68,68,6,0.693,0.827,10,-6.437,0,0.0483,0.0114,0.189,0.32,0.906,103.087,281680,4
1992-05-30,79,Sometimes I Rhyme Slow,Nice & Smooth,,False,89,79,4,0.797,0.563,6,-14.138,0,0.123,0.119,0.323,0.0969,0.687,108.369,172267,4
1992-05-30,80,Keep On Walkin',CeCe Peniston,,False,97,80,2,0.766,0.712,6,-12.111,1,0.0427,0.00291,0.0201,0.226,0.655,104.974,270838,4
1992-05-30,81,Thinkin' Back,Color Me Badd,,False,62,16,18,0.587,0.326,6,-11.204,0,0.0242,0.21,1e-05,0.133,0.271,90.821,322533,4
1992-05-30,82,If You Want It,2nd II None,,False,69,64,9,0.93,0.547,0,-14.057,1,0.0607,0.00864,0,0.114,0.92,107.086,226667,4
1992-05-30,83,Boom! I Got Your Boyfriend,MC Luscious,,False,76,61,17,0.932,0.578,2,-14.006,1,0.166,0.0192,2.34e-05,0.0624,0.644,129.823,267533,4
1992-05-30,85,Goodbye,Tevin Campbell,,False,85,85,8,0.506,0.818,4,-5.051,0,0.176,0.0291,0.000123,0.184,0.656,188.807,254280,4
1992-05-30,86,Take My Advice,Kym Sims,,False,88,86,4,0.737,0.814,2,-10.396,1,0.0307,0.00019,0.392,0.0844,0.803,120.01,283227,4
1992-05-30,87,This Is The Way We Roll,M.C. Hammer,,False,86,86,2,0.83,0.944,8,-6.558,0,0.0715,0.0434,1.19e-06,0.101,0.664,109.929,281227,4
1992-05-30,88,Missing You Now,Michael Bolton,,False,77,12,19,0.62,0.508,7,-11.621,1,0.0272,0.118,0,0.187,0.289,95.01,273307,4
1992-05-30,89,Don't Talk Just Kiss,Right Said Fred,,False,78,76,7,0.581,0.835,6,-12.596,0,0.0414,0.0416,0.227,0.21,0.755,124.006,241867,4
1992-05-30,90,She's Got That Vibe,R. Kelly & Public Announcement,,False,83,59,12,0.801,0.693,1,-10.239,1,0.073,0.0504,0,0.168,0.742,113.137,274133,4
1992-05-30,91,I Wanna Rock,Luke,,False,80,73,11,0.801,0.765,6,-11.968,0,0.203,0.0399,8.35e-06,0.429,0.624,138.052,279933,4
1992-05-30,92,James Brown Is Dead,L.A. Style,,False,90,88,7,0.599,0.976,0,-7.649,0,0.0859,0.0013,0.787,0.383,0.501,130.724,344400,4
1992-05-30,93,"Mama, I'm Coming Home",Ozzy Osbourne,,False,82,28,16,0.282,0.656,8,-6.557,1,0.0302,0.0105,0,0.0892,0.242,139.352,251867,4
1992-05-30,94,Set Me Free,Clubland Featuring Zemya Hamilton,,False,94,94,2,0.658,0.809,2,-6.125,1,0.0453,0.0019,0,0.242,0.4,123.989,189677,4
1992-05-30,95,Justified And Ancient,The KLF Featuring Tammy Wynette,,False,79,11,18,0.628,0.953,10,-4.989,0,0.0626,0.00276,0.0132,0.427,0.515,111.134,228372,4
1992-05-30,96,You Showed Me,Salt-N-Pepa,,False,84,47,18,0.79,0.584,1,-15.101,0,0.0752,0.0194,0.000122,0.105,0.697,105.579,247427,4
1992-05-30,97,Victim Of The Ghetto,The College Boyz,,False,99,97,2,0.673,0.649,1,-9.695,1,0.212,0.0282,0,0.0969,0.693,178.108,293440,4
1992-05-30,98,Honey Love,R. Kelly & Public Announcement,,False,98,98,2,0.693,0.65,4,-4.204,1,0.0441,0.109,0,0.167,0.452,71.034,243973,4
1992-05-30,99,Can't Cry Hard Enough,The Williams Brothers,,False,91,42,17,0.444,0.199,0,-14.508,1,0.0266,0.239,0,0.116,0.32,85.904,191960,4
