date,position,title,artist,spotify_id,is_new,last_pos,peak_pos,weeks,danceability,energy,key,loudness,mode,speechiness,acousticness,instrumentalness,liveness,valence,tempo,duration_ms,time_signature
2016-12-31,1,Black Beatles,Rae Sremmurd Featuring Gucci Mane,5knuzwU65gJK7IF5yJsuaW,False,1,1,14,0.794,0.632,0,-6.163,1,0.0649,0.142,0,0.128,0.355,145.926,291893,4
2016-12-31,2,Starboy,The Weeknd Featuring Daft Punk,5knuzwU65gJK7IF5yJsuaW,False,2,2,13,0.676,0.588,7,-7.025,1,0.275,0.137,8.47e-06,0.137,0.484,186.012,230461,4
2016-12-31,3,Closer,The Chainsmokers Featuring Halsey,5knuzwU65gJK7IF5yJsuaW,False,3,1,20,0.748,0.524,8,-5.599,1,0.0338,0.414,0,0.111,0.661,95.01,244960,4
2016-12-31,4,24K Magic,Bruno Mars,5knuzwU65gJK7IF5yJsuaW,False,4,4,10,0.818,0.803,1,-4.282,1,0.0797,0.034,0,0.153,0.632,106.97,225983,4
2016-12-31,5,Side To Side,Ariana Grande Featuring Nicki Minaj,5knuzwU65gJK7IF5yJsuaW,False,5,4,16,0.65,0.736,6,-5.84,0,0.229,0.0528,0,0.235,0.613,159.173,226160,4
2016-12-31,7,Deja Vu,J. Cole,6I6NX6tjGsxFAsIfGzY9lJ,True,0,7,1,0.657,0.421,9,-11.378,1,0.412,0.352,0.000218,0.187,0.181,174.063,264747,4
2016-12-31,8,Juju On That Beat (TZ Anthem),Zay Hilfigerrr & Zayion McCall,6I6NX6tjGsxFAsIfGzY9lJ,False,6,5,12,0.807,0.887,1,-3.892,1,0.275,0.00381,0,0.391,0.78,160.517,144244,4
2016-12-31,9,Let Me Love You,DJ Snake Featuring Justin Bieber,6I6NX6tjGsxFAsIfGzY9lJ,False,8,4,19,0.649,0.716,8,-5.371,1,0.0349,0.0863,2.63e-05,0.135,0.163,99.988,205947,4
2016-12-31,10,Don't Wanna Know,Maroon 5 Featuring Kendrick Lamar,6I6NX6tjGsxFAsIfGzY9lJ,False,7,7,10,0.783,0.61,7,-6.124,1,0.0696,0.343,0,0.0983,0.418,100.047,214265,4
2016-12-31,11,Immortal,J. Cole,6AGON2BGdPmPMJGiiNuuwl,True,0,11,1,0.744,0.43,3,-10.604,0,0.309,0.455,2.73e-06,0.126,0.266,92.039,201667,4
2016-12-31,12,Fake Love,Drake,6AGON2BGdPmPMJGiiNuuwl,False,11,10,8,0.928,0.481,9,-9.35,0,0.287,0.105,0,0.176,0.613,134.007,210937,4
2016-12-31,13,Neighbors,J. Cole,0utlOiJy2weVl9WTkcEWHy,True,0,13,1,0.898,0.283,6,-12.335,0,0.356,0.319,0.000383,0.11,0.469,138.97,216520,4
2016-12-31,14,Bad Things,Machine Gun Kelly x Camila Cabello,0utlOiJy2weVl9WTkcEWHy,False,10,10,7,0.679,0.697,2,-4.75,1,0.14,0.232,0,0.178,0.287,137.816,239289,4
2016-12-31,15,Heathens,twenty one pilots,0utlOiJy2weVl9WTkcEWHy,False,9,2,26,0.732,0.396,4,-9.348,0,0.0286,0.0841,3.58e-05,0.105,0.548,90.024,195920,4
2016-12-31,16,Caroline,Amine,0utlOiJy2weVl9WTkcEWHy,False,15,12,15,0.94,0.335,5,-10.179,0,0.505,0.17,0,0.262,0.707,120.04,209640,4
2016-12-31,17,Broccoli,D.R.A.M. Featuring Lil Yachty,0utlOiJy2weVl9WTkcEWHy,False,12,5,27,0.825,0.485,8,-11.479,1,0.395,0.187,0,0.0904,0.792,145.976,233278,4
2016-12-31,18,Scars To Your Beautiful,Alessia Cara,0utlOiJy2weVl9WTkcEWHy,False,13,13,16,0.573,0.739,0,-5.74,1,0.129,0.0285,0,0.111,0.451,97.085,230227,4
2016-12-31,19,Starving,Hailee Steinfeld & Grey Featuring Zedd,0utlOiJy2weVl9WTkcEWHy,False,14,12,20,0.728,0.616,4,-4.238,1,0.0645,0.378,0,0.105,0.508,99.962,181880,4
2016-12-31,20,All I Want For Christmas Is You,Mariah Carey,0utlOiJy2weVl9WTkcEWHy,False,17,11,17,0.695,0.652,11,-7.828,0,0.0751,0.000441,5.66e-06,0.0667,0.744,128.024,401680,4
2016-12-31,21,Change,J. Cole,3pjUyVbFmM96tYhSaKJwTt,True,0,21,1,0.74,0.523,11,-10.753,0,0.233,0.666,0.00142,0.0968,0.235,97.063,331480,4
2016-12-31,22,She's Mine Pt. 1,J. Cole,0HtOJj7Kl74s1Ngf3MWeif,True,0,22,1,0.439,0.204,2,-15.165,1,0.0587,0.766,0.0913,0.284,0.0408,139.652,209080,4
2016-12-31,23,For Whom The Bell Tolls,J. Cole,3MWlVSkoLS1e66nlZ2tuWJ,True,0,23,1,0.595,0.416,10,-10.957,0,0.0366,0.536,0,0.293,0.185,74.556,127880,4
2016-12-31,24,Ville Mentality,J. Cole,2z3joGXrdGL2iEjIKQTiN1,True,0,24,1,0.87,0.386,7,-7.843,0,0.0684,0.745,0.00013,0.122,0.642,119.91,194347,3
2016-12-31,25,I Hate U I Love U,gnash Featuring Olivia O'Brien,2z3joGXrdGL2iEjIKQTiN1,False,16,10,35,0.492,0.275,6,-13.4,0,0.3,0.687,0,0.101,0.18,92.6,251034,4
2016-12-31,26,Bad And Boujee,Migos Featuring Lil Uzi Vert,2z3joGXrdGL2iEjIKQTiN1,False,24,24,5,0.927,0.665,11,-5.313,1,0.244,0.061,0,0.123,0.175,127.076,343150,4
2016-12-31,27,Love On The Brain,Rihanna,2z3joGXrdGL2iEjIKQTiN1,False,20,20,9,0.509,0.637,4,-4.83,0,0.0471,0.0717,1.08e-05,0.0789,0.378,172.006,224000,3
2016-12-31,28,The Greatest,Sia Featuring Kendrick Lamar,2z3joGXrdGL2iEjIKQTiN1,False,18,18,15,0.668,0.725,1,-6.127,1,0.266,0.0102,0.000479,0.0561,0.729,191.944,210227,4
2016-12-31,29,4 Your Eyez Only,J. Cole,1vvnYpYEMVB4aq9I6tHIEB,True,0,29,1,0.701,0.485,11,-10.305,0,0.364,0.367,6.31e-05,0.0852,0.496,78.863,530253,4
2016-12-31,30,Foldin Clothes,J. Cole,77IAeEz8LEchPN8UNjaTJ2,True,0,30,1,0.698,0.487,7,-9.887,0,0.312,0.234,0.00086,0.0724,0.614,161.943,316920,4
2016-12-31,31,Bounce Back,Big Sean,77IAeEz8LEchPN8UNjaTJ2,False,39,31,6,0.78,0.575,1,-5.628,0,0.139,0.106,0,0.129,0.273,81.502,222360,4
2016-12-31,32,Treat You Better,Shawn Mendes,77IAeEz8LEchPN8UNjaTJ2,False,19,6,28,0.443,0.82,10,-4.091,0,0.34,0.107,0,0.107,0.771,82.697,187973,4
2016-12-31,33,I Feel It Coming,The Weeknd Featuring Daft Punk,77IAeEz8LEchPN8UNjaTJ2,False,28,22,4,0.773,0.815,0,-5.933,0,0.128,0.415,0,0.087,0.559,92.973,269177,4
2016-12-31,34,She's Mine Pt. 2,J. Cole,5rmcjZTrE9JR1YrbNZDFNW,True,0,34,1,0.486,0.194,2,-15.265,1,0.0712,0.798,0.00624,0.114,0.048,70.031,278920,4
2016-12-31,35,In The Name Of Love,Martin Garrix & Bebe Rexha,5rmcjZTrE9JR1YrbNZDFNW,False,25,24,18,0.501,0.519,4,-5.88,0,0.0409,0.109,0,0.454,0.168,133.99,195707,4
2016-12-31,36,All Time Low,Jon Bellion,5rmcjZTrE9JR1YrbNZDFNW,False,33,32,10,0.617,0.567,0,-4.188,1,0.0828,0.0584,0,0.0933,0.505,90.246,217603,4
2016-12-31,37,Love Me Now,John Legend,5rmcjZTrE9JR1YrbNZDFNW,False,23,23,8,0.488,0.762,8,-3.842,1,0.0865,0.591,0,0.0763,0.709,123.889,210293,4
2016-12-31,38,Blue Ain't Your Color,Keith Urban,5rmcjZTrE9JR1YrbNZDFNW,False,30,24,14,0.69,0.416,7,-7.865,1,0.0335,0.617,1.37e-06,0.102,0.479,82.45,230600,3
2016-12-31,39,Can't Stop The Feeling!,Justin Timberlake,5rmcjZTrE9JR1YrbNZDFNW,False,32,1,32,0.669,0.832,0,-5.72,1,0.0682,0.0106,0,0.0968,0.7,113.035,237547,4
2016-12-31,40,Cold Water,Major Lazer Featuring Justin Bieber & MO,5rmcjZTrE9JR1YrbNZDFNW,False,21,2,21,0.608,0.798,6,-5.092,0,0.0432,0.0736,0,0.156,0.501,92.943,185360,4
2016-12-31,41,Cheap Thrills,Sia Featuring Sean Paul,5rmcjZTrE9JR1YrbNZDFNW,False,26,1,44,0.628,0.698,6,-5.608,0,0.105,0.0472,0.00143,0.0907,0.732,89.976,211667,4
2016-12-31,42,Unsteady,X Ambassadors,5rmcjZTrE9JR1YrbNZDFNW,False,22,20,31,0.389,0.665,0,-6.169,1,0.0644,0.178,0.000732,0.116,0.199,117.055,193547,4
2016-12-31,43,Don't Let Me Down,The Chainsmokers Featuring Daya,5rmcjZTrE9JR1YrbNZDFNW,False,31,3,44,0.532,0.869,11,-5.094,1,0.172,0.157,0.00508,0.136,0.422,159.803,208373,4
2016-12-31,44,Mercy,Shawn Mendes,5rmcjZTrE9JR1YrbNZDFNW,False,38,35,13,0.57,0.347,11,-6.649,0,0.0358,0.711,0,0.11,0.43,74.054,219160,4
2016-12-31,45,Hallelujah,Pentatonix,5rmcjZTrE9JR1YrbNZDFNW,False,45,32,8,0.364,0.378,7,-7.381,0,0.0331,0.47,0,0.339,0.366,89.918,268960,3
2016-12-31,46,Jingle Bell Rock,Bobby Helms,5rmcjZTrE9JR1YrbNZDFNW,False,35,35,18,0.754,0.424,2,-8.463,1,0.0363,0.643,0,0.0652,0.806,119.705,130973,4
2016-12-31,47,OOOUUU,Young M.A,5rmcjZTrE9JR1YrbNZDFNW,False,27,19,16,0.635,0.847,7,-3.152,1,0.447,0.533,0,0.154,0.568,166.072,234650,4
2016-12-31,48,Rockin' Around The Christmas Tree,Brenda Lee,5rmcjZTrE9JR1YrbNZDFNW,False,37,14,17,0.589,0.472,8,-8.749,1,0.0502,0.614,0,0.505,0.898,67.196,126267,4
2016-12-31,49,Chill Bill,Rob $tone Featuring J. Davi$ & Spooks,5rmcjZTrE9JR1YrbNZDFNW,False,34,29,20,0.886,0.427,6,-10.028,1,0.145,0.0312,0.00099,0.0906,0.23,108.034,177184,4
2016-12-31,50,This Town,Niall Horan,5rmcjZTrE9JR1YrbNZDFNW,False,41,25,12,0.677,0.401,9,-8.467,1,0.0308,0.712,0,0.116,0.195,111.825,232852,4
2016-12-31,51,X,21 Savage & Metro Boomin Featuring Future,5rmcjZTrE9JR1YrbNZDFNW,False,43,36,14,0.835,0.413,1,-9.81,1,0.396,0.373,0.00133,0.101,0.111,149.004,258880,4
2016-12-31,52,Just Hold On,Steve Aoki & Louis Tomlinson,508oFmt92FyICj6pZiWQwC,True,0,52,1,0.647,0.932,11,-3.517,1,0.083,0.00377,1.69e-06,0.0574,0.387,115.0,198774,4
2016-12-31,53,Party Monster,The Weeknd,508oFmt92FyICj6pZiWQwC,False,29,16,4,0.573,0.63,1,-8.389,1,0.105,0.189,2.31e-05,0.259,0.218,77.525,249213,4
2016-12-31,54,False Prophets,J. Cole,508oFmt92FyICj6pZiWQwC,False,93,54,2,0.729,0.739,8,-9.5,0,0.338,0.696,9.37e-06,0.164,0.749,90.306,237427,4
2016-12-31,55,No Heart,21 Savage & Metro Boomin,508oFmt92FyICj6pZiWQwC,False,57,55,8,0.906,0.444,4,-8.692,0,0.384,0.136,6.44e-05,0.173,0.678,140.063,235040,4
2016-12-31,56,May We All,Florida Georgia Line Featuring Tim McGraw,508oFmt92FyICj6pZiWQwC,False,42,30,16,0.514,0.918,7,-4.306,1,0.0365,0.0409,0,0.342,0.64,150.033,226173,4
2016-12-31,57,Everybody Dies,J. Cole,1wIQtB3UQ1TfjNMZZqO6eh,True,0,57,1,0.779,0.694,9,-9.376,1,0.2,0.281,1.36e-05,0.109,0.569,82.861,161827,4
2016-12-31,58,You Was Right,Lil Uzi Vert,1wIQtB3UQ1TfjNMZZqO6eh,False,49,49,23,0.843,0.359,0,-7.417,1,0.461,0.069,0,0.12,0.156,81.987,163944,4
2016-12-31,59,Wanna Be That Song,Brett Eldredge,1wIQtB3UQ1TfjNMZZqO6eh,False,53,53,11,0.518,0.686,9,-4.911,1,0.0313,0.114,0,0.114,0.334,144.065,236227,4
2016-12-31,60,Do You Mind,"DJ Khaled Featuring Nicki Minaj, Chris Brown, August Alsina, Jeremih, Future & Rick Ross",1wIQtB3UQ1TfjNMZZqO6eh,False,44,27,19,0.412,0.548,10,-6.981,1,0.243,0.0173,0,0.181,0.176,81.293,325615,4
2016-12-31,61,Water Under The Bridge,Adele,1wIQtB3UQ1TfjNMZZqO6eh,False,58,58,6,0.59,0.833,5,-6.503,0,0.0615,0.0142,5.4e-06,0.105,0.538,94.963,240439,4
2016-12-31,62,Million Reasons,Lady Gaga,1wIQtB3UQ1TfjNMZZqO6eh,False,52,52,6,0.666,0.423,0,-8.012,1,0.0429,0.494,0,0.106,0.154,129.893,205280,4
2016-12-31,63,Come And See Me,PARTYNEXTDOOR Featuring Drake,1wIQtB3UQ1TfjNMZZqO6eh,False,56,55,24,0.717,0.347,11,-10.265,0,0.0636,0.0511,2.43e-06,0.087,0.0589,84.987,235477,4
2016-12-31,64,Used To This,Future Featuring Drake,1wIQtB3UQ1TfjNMZZqO6eh,False,51,14,6,0.618,0.727,3,-7.224,0,0.208,0.0312,0,0.196,0.401,164.992,180520,4
2016-12-31,65,Say You Won't Let Go,James Arthur,1wIQtB3UQ1TfjNMZZqO6eh,False,60,60,8,0.358,0.557,10,-7.398,1,0.059,0.695,0,0.0902,0.494,85.043,211467,4
2016-12-31,66,How Far I'll Go,Auli'i Cravalho,1wIQtB3UQ1TfjNMZZqO6eh,False,70,52,3,0.571,0.307,1,-10.958,0,0.0499,0.649,0,0.178,0.108,83.72,163387,4
2016-12-31,67,Darlin' Don't Go,Sundance Head,7lOkmIpzOEOufmOQbLlaHW,True,0,67,1,0.683,0.324,4,-9.735,1,0.0331,0.202,0.000132,0.11,0.324,117.746,263013,3
2016-12-31,68,Better Man,Little Big Town,7lOkmIpzOEOufmOQbLlaHW,False,67,53,7,0.514,0.836,5,-3.663,1,0.0381,0.112,0,0.0878,0.501,143.888,263120,4
2016-12-31,69,Song For Another Time,Old Dominion,7lOkmIpzOEOufmOQbLlaHW,False,59,59,12,0.498,0.804,11,-3.995,1,0.0332,0.125,0,0.167,0.697,166.054,191827,4
2016-12-31,70,Dirty Laundry,Carrie Underwood,7lOkmIpzOEOufmOQbLlaHW,False,69,69,9,0.456,0.874,10,-4.129,0,0.114,0.0595,1.12e-05,0.111,0.5,200.179,204093,4
2016-12-31,71,Chantaje,Shakira Featuring Maluma,7lOkmIpzOEOufmOQbLlaHW,False,79,71,5,0.852,0.773,8,-2.921,0,0.0776,0.187,3.05e-05,0.159,0.907,102.034,195840,4
2016-12-31,72,Sneakin',Drake Featuring 21 Savage,7lOkmIpzOEOufmOQbLlaHW,False,63,28,8,0.806,0.558,8,-6.538,1,0.172,0.00496,1.45e-06,0.16,0.26,85.011,251333,4
2016-12-31,73,1 Night,Lil Yachty,7lOkmIpzOEOufmOQbLlaHW,False,72,49,19,0.764,0.475,0,-12.618,1,0.114,0.345,0,0.14,0.34,129.974,243270,4
2016-12-31,74,Too Much Sauce,DJ ESCO Featuring Future & Lil Uzi Vert,7lOkmIpzOEOufmOQbLlaHW,False,64,61,17,0.96,0.547,6,-6.992,0,0.0786,0.0496,0,0.216,0.186,121.01,223093,4
2016-12-31,75,Redbone,Childish Gambino,7lOkmIpzOEOufmOQbLlaHW,False,48,48,3,0.743,0.347,1,-11.174,1,0.121,0.167,0.00951,0.103,0.572,160.143,326933,4
2016-12-31,76,Pick Up The Phone,Young Thug And Travis Scott Featuring Quavo,7lOkmIpzOEOufmOQbLlaHW,False,62,43,18,0.711,0.739,7,-3.804,0,0.129,0.114,0,0.226,0.43,136.919,252256,4
2016-12-31,77,Deja Vu,Post Malone Featuring Justin Bieber,7lOkmIpzOEOufmOQbLlaHW,False,0,75,2,0.62,0.69,7,-6.508,1,0.0493,0.0931,0,0.131,0.331,133.935,234213,4
2016-12-31,78,Reminder,The Weeknd,7lOkmIpzOEOufmOQbLlaHW,False,50,31,3,0.706,0.505,8,-6.923,1,0.193,0.142,0,0.164,0.388,160.053,218880,4
2016-12-31,79,A Guy With A Girl,Blake Shelton,7lOkmIpzOEOufmOQbLlaHW,False,81,79,5,0.552,0.893,0,-4.593,1,0.0383,0.0158,0,0.105,0.777,163.948,189467,4
2016-12-31,80,HandClap,Fitz And The Tantrums,7lOkmIpzOEOufmOQbLlaHW,False,75,63,12,0.636,0.836,8,-3.004,1,0.0427,0.00609,0.000157,0.0828,0.715,139.956,193253,4
2016-12-31,81,Six Feet Under,The Weeknd,7lOkmIpzOEOufmOQbLlaHW,False,55,34,3,0.772,0.504,6,-8.219,0,0.0761,0.129,0,0.125,0.244,140.035,237573,4
2016-12-31,82,Sidewalks,The Weeknd Featuring Kendrick Lamar,7lOkmIpzOEOufmOQbLlaHW,False,54,27,3,0.542,0.72,1,-5.136,0,0.0628,0.147,0,0.348,0.623,149.828,231360,4
2016-12-31,83,Congratulations,Post Malone Featuring Quavo,3a1lNhkSLSkpJE4MSHpDu9,True,0,83,1,0.63,0.804,6,-4.183,1,0.0363,0.215,0,0.253,0.492,123.146,220293,4
2016-12-31,84,Star Of The Show,Thomas Rhett,3a1lNhkSLSkpJE4MSHpDu9,False,85,82,7,0.695,0.641,7,-5.807,1,0.0261,0.142,0,0.131,0.664,101.974,181200,4
2016-12-31,85,How I'll Always Be,Tim McGraw,3a1lNhkSLSkpJE4MSHpDu9,False,88,85,9,0.578,0.825,2,-4.693,1,0.0331,0.312,1.4e-05,0.0912,0.654,93.035,213453,4
2016-12-31,86,Sleep Without You,Brett Young,3a1lNhkSLSkpJE4MSHpDu9,False,74,47,14,0.626,0.707,5,-5.755,0,0.0425,0.0169,0,0.0772,0.653,88.543,187813,4
2016-12-31,87,Play That Song,Train,3a1lNhkSLSkpJE4MSHpDu9,False,77,77,3,0.392,0.825,0,-2.068,0,0.0535,0.0231,2.25e-06,0.0972,0.482,98.959,243253,4
2016-12-31,88,Fresh Eyes,Andy Grammer,3a1lNhkSLSkpJE4MSHpDu9,False,73,59,11,0.828,0.56,0,-6.685,1,0.0327,0.548,3.66e-05,0.15,0.872,122.054,198001,4
2016-12-31,89,At Last,Sundance Head,6FDqlXpko4R2CW2id2IK2T,True,0,89,1,0.254,0.531,2,-5.629,1,0.0326,0.233,0,0.119,0.375,101.617,207853,3
2016-12-31,90,Rockabye,Clean Bandit Featuring Sean Paul & Anne-Marie,6FDqlXpko4R2CW2id2IK2T,False,100,90,2,0.72,0.763,9,-4.068,0,0.0523,0.406,0,0.18,0.742,101.965,251088,4
2016-12-31,91,Setting The World On Fire,Kenny Chesney Featuring P!nk,6FDqlXpko4R2CW2id2IK2T,False,87,29,20,0.61,0.822,0,-4.422,1,0.0355,0.0171,1.88e-06,0.093,0.437,93.993,217467,4
2016-12-31,92,Dirt On My Boots,Jon Pardi,6FDqlXpko4R2CW2id2IK2T,False,95,92,2,0.683,0.796,11,-4.179,1,0.0285,0.111,0,0.197,0.531,90.031,201893,4
2016-12-31,93,Die For You,The Weeknd,6FDqlXpko4R2CW2id2IK2T,False,71,43,3,0.602,0.528,1,-7.152,0,0.0556,0.11,0,0.157,0.455,133.851,260256,4
2016-12-31,94,How Far I'll Go,Alessia Cara,6FDqlXpko4R2CW2id2IK2T,False,0,88,2,0.31,0.54,9,-9.629,1,0.346,0.163,0.000129,0.0713,0.148,180.994,175507,4
2016-12-31,95,All We Know,The Chainsmokers Featuring Phoebe Ryan,6FDqlXpko4R2CW2id2IK2T,False,89,18,11,0.662,0.586,0,-8.821,1,0.0307,0.097,0.00272,0.115,0.296,90.0,194080,4
2016-12-31,96,Selfish,PnB Rock,6FDqlXpko4R2CW2id2IK2T,False,90,81,6,0.638,0.6,1,-5.84,0,0.0438,0.114,0,0.187,0.0399,101.981,245604,4
2016-12-31,97,You're Welcome,Dwayne Johnson,6FDqlXpko4R2CW2id2IK2T,False,92,83,3,0.788,0.745,5,-7.072,1,0.258,0.29,0,0.0373,0.672,135.278,163893,4
2016-12-31,99,Alone,Marshmello,,False,94,93,3,0.631,0.953,2,-3.739,1,0.0343,0.0241,0.0155,0.108,0.422,141.99,273803,4
2016-12-31,100,Sex With Me,Rihanna,,False,98,92,8,0.58,0.532,1,-5.668,0,0.0424,0.294,0,0.0948,0.39,112.049,206400,4
