date,position,title,artist,spotify_id,is_new,last_pos,peak_pos,weeks,danceability,energy,key,loudness,mode,speechiness,acousticness,instrumentalness,liveness,valence,tempo,duration_ms,time_signature
2009-04-18,1,Boom Boom Pow,The Black Eyed Peas,1ddEJFVOCOjNqh19FTQAsX,False,39,1,4,0.867,0.857,9,-5.892,1,0.0663,0.13,0.00171,0.13,0.402,130.048,251440,4
2009-04-18,2,Poker Face,Lady Gaga,1ddEJFVOCOjNqh19FTQAsX,False,1,1,16,0.851,0.806,4,-4.62,1,0.0787,0.118,1.64e-06,0.121,0.787,118.999,237200,4
2009-04-18,3,Right Round,Flo Rida,1ddEJFVOCOjNqh19FTQAsX,False,2,1,10,0.72,0.672,7,-6.852,1,0.0551,0.009,0,0.232,0.705,124.986,204640,4
2009-04-18,4,Kiss Me Thru The Phone,Soulja Boy Tell 'em Featuring Sammie,1ddEJFVOCOjNqh19FTQAsX,False,3,3,15,0.758,0.712,7,-3.781,1,0.112,0.0185,0,0.0677,0.795,149.998,193387,4
2009-04-18,5,Blame It,Jamie Foxx Featuring T-Pain,1ddEJFVOCOjNqh19FTQAsX,False,5,5,12,0.673,0.614,7,-5.426,1,0.103,0.0782,0,0.139,0.362,176.052,289747,4
2009-04-18,6,Dead And Gone,T.I. Featuring Justin Timberlake,1ddEJFVOCOjNqh19FTQAsX,False,4,2,18,0.713,0.746,0,-4.99,1,0.259,0.0402,0,0.601,0.47,135.021,299747,4
2009-04-18,7,Day 'N' Nite,Kid Cudi,1ddEJFVOCOjNqh19FTQAsX,False,11,7,12,0.871,0.44,11,-6.25,0,0.0761,0.499,4.15e-06,0.114,0.799,137.996,221267,4
2009-04-18,8,Gives You Hell,The All-American Rejects,1ddEJFVOCOjNqh19FTQAsX,False,6,4,21,0.718,0.691,4,-6.44,1,0.0387,0.0159,0,0.0627,0.552,100.008,213107,4
2009-04-18,9,You Found Me,The Fray,1ddEJFVOCOjNqh19FTQAsX,False,14,7,20,0.338,0.803,8,-5.412,0,0.0413,0.0187,0,0.136,0.4,151.994,241853,4
2009-04-18,10,The Climb,Miley Cyrus,1ddEJFVOCOjNqh19FTQAsX,False,8,6,5,0.327,0.588,4,-6.611,1,0.0336,0.0834,0,0.104,0.329,161.074,236067,4
2009-04-18,11,Just Dance,Lady Gaga Featuring Colby O'Donis,1ddEJFVOCOjNqh19FTQAsX,False,9,1,35,0.813,0.74,1,-4.668,0,0.0327,0.0318,1.43e-05,0.166,0.699,118.976,244055,4
2009-04-18,12,My Life Would Suck Without You,Kelly Clarkson,1ddEJFVOCOjNqh19FTQAsX,False,7,1,12,0.526,0.882,9,-4.006,1,0.0509,0.0014,0,0.144,0.424,144.982,211493,4
2009-04-18,13,Love Sex Magic,Ciara Featuring Justin Timberlake,1ddEJFVOCOjNqh19FTQAsX,False,10,10,4,0.893,0.665,1,-5.07,1,0.137,0.0201,0,0.299,0.874,107.029,219568,4
2009-04-18,14,Love Story,Taylor Swift,1ddEJFVOCOjNqh19FTQAsX,False,15,4,30,0.626,0.79,2,-4.302,1,0.0311,0.135,3.97e-06,0.0989,0.416,119.082,235767,4
2009-04-18,15,I Love College,Asher Roth,1ddEJFVOCOjNqh19FTQAsX,False,12,12,8,0.713,0.826,8,-4.075,1,0.243,0.0897,0,0.421,0.664,86.444,241933,4
2009-04-18,16,Turnin Me On,Keri Hilson Featuring Lil Wayne,1ddEJFVOCOjNqh19FTQAsX,False,17,15,16,0.675,0.602,1,-4.688,1,0.0596,0.0034,1.28e-05,0.199,0.092,159.994,247800,4
2009-04-18,17,Mad,Ne-Yo,1ddEJFVOCOjNqh19FTQAsX,False,13,11,18,0.727,0.649,0,-5.356,1,0.0338,0.661,0,0.111,0.669,129.992,254533,4
2009-04-18,18,Halo,Beyonce,1ddEJFVOCOjNqh19FTQAsX,False,23,18,11,0.508,0.72,11,-5.908,0,0.0628,0.272,0,0.0563,0.472,79.983,261640,4
2009-04-18,19,Heartless,Kanye West,1ddEJFVOCOjNqh19FTQAsX,False,16,2,22,0.79,0.647,10,-5.983,0,0.136,0.0515,0,0.248,0.654,87.999,211000,4
2009-04-18,20,Beautiful,Akon Featuring Colby O'Donis & Kardinal Offishall,1ddEJFVOCOjNqh19FTQAsX,False,21,19,18,0.743,0.948,0,-4.445,0,0.0893,0.122,0,0.112,0.614,130.024,312987,4
2009-04-18,21,If U Seek Amy,Britney Spears,1ddEJFVOCOjNqh19FTQAsX,False,24,21,8,0.717,0.587,4,-7.296,0,0.0339,0.0192,0,0.0523,0.544,129.954,216520,4
2009-04-18,22,Sober,P!nk,1ddEJFVOCOjNqh19FTQAsX,False,19,15,19,0.612,0.797,6,-4.896,1,0.0315,0.0626,0,0.187,0.373,90.95,251533,4
2009-04-18,23,I'm Yours,Jason Mraz,1ddEJFVOCOjNqh19FTQAsX,False,22,6,51,0.686,0.457,11,-8.322,1,0.0468,0.595,0,0.105,0.718,150.953,242187,4
2009-04-18,24,Circus,Britney Spears,1ddEJFVOCOjNqh19FTQAsX,False,18,3,18,0.791,0.733,6,-5.215,0,0.052,0.147,0.000381,0.0713,0.761,114.98,192360,4
2009-04-18,25,Jai Ho! (You Are My Destiny),A R Rahman & The Pussycat Dolls Featuring Nicole Scherzinger,1ddEJFVOCOjNqh19FTQAsX,False,43,15,7,0.657,0.941,8,-3.919,0,0.061,0.0476,0,0.0797,0.879,136.202,222400,4
2009-04-18,26,How Do You Sleep?,Jesse McCartney Featuring Ludacris,1ddEJFVOCOjNqh19FTQAsX,False,27,26,9,0.747,0.878,8,-3.533,1,0.0282,0.343,0,0.0872,0.557,106.004,208333,4
2009-04-18,27,Second Chance,Shinedown,1ddEJFVOCOjNqh19FTQAsX,False,33,27,19,0.46,0.796,0,-4.501,0,0.0333,0.00107,0,0.106,0.182,100.011,222067,4
2009-04-18,28,Rockin' That Thang,The-Dream,1ddEJFVOCOjNqh19FTQAsX,False,26,22,15,0.674,0.616,8,-4.757,1,0.0432,0.118,0,0.289,0.63,77.968,221933,4
2009-04-18,29,Don't Trust Me,3OH!3,1ddEJFVOCOjNqh19FTQAsX,False,34,29,17,0.757,0.629,7,-5.582,0,0.125,0.018,0,0.339,0.711,129.942,194613,4
2009-04-18,30,Let It Rock,Kevin Rudolf Featuring Lil Wayne,1ddEJFVOCOjNqh19FTQAsX,False,29,5,32,0.607,0.783,7,-4.41,1,0.0397,0.000683,0,0.0678,0.434,113.172,231173,4
2009-04-18,31,Sugar,Flo Rida Featuring Wynter,1ddEJFVOCOjNqh19FTQAsX,False,20,20,3,0.738,0.868,1,-4.15,1,0.0348,0.0371,0,0.294,0.199,130.003,252933,4
2009-04-18,32,I Know You Want Me (Calle Ocho),Pitbull,1ddEJFVOCOjNqh19FTQAsX,False,37,32,6,0.817,0.733,2,-6.009,1,0.145,0.0152,4.31e-05,0.107,0.833,127.056,237120,4
2009-04-18,33,I Told You So,Carrie Underwood Featuring Randy Travis,1ddEJFVOCOjNqh19FTQAsX,False,25,9,8,0.423,0.522,8,-3.849,1,0.029,0.643,0,0.122,0.236,147.745,257893,4
2009-04-18,34,Here Comes Goodbye,Rascal Flatts,1ddEJFVOCOjNqh19FTQAsX,False,36,11,6,0.458,0.585,2,-5.574,1,0.0342,0.324,0,0.231,0.196,145.977,245373,4
2009-04-18,35,Single Ladies (Put A Ring On It),Beyonce,1ddEJFVOCOjNqh19FTQAsX,False,31,1,25,0.426,0.584,1,-5.293,1,0.296,0.0383,0,0.188,0.272,193.437,193213,4
2009-04-18,36,Crack A Bottle,"Eminem, Dr. Dre & 50 Cent",1ddEJFVOCOjNqh19FTQAsX,False,28,1,12,0.516,0.874,9,-2.571,1,0.186,0.0864,0,0.173,0.391,169.561,297520,3
2009-04-18,37,Hot N Cold,Katy Perry,1ddEJFVOCOjNqh19FTQAsX,False,35,3,36,0.706,0.841,7,-3.956,1,0.0418,7.95e-05,0,0.0688,0.861,132.032,220227,4
2009-04-18,38,I Hate This Part,The Pussycat Dolls,1ddEJFVOCOjNqh19FTQAsX,False,30,11,19,0.757,0.607,5,-4.335,1,0.0309,0.0723,0,0.305,0.454,111.579,218960,4
2009-04-18,39,White Horse,Taylor Swift,1ddEJFVOCOjNqh19FTQAsX,False,32,13,21,0.578,0.34,0,-8.027,1,0.0264,0.305,0,0.104,0.223,92.702,234427,4
2009-04-18,40,She's Country,Jason Aldean,1ddEJFVOCOjNqh19FTQAsX,False,41,40,12,0.553,0.872,1,-2.832,0,0.0782,0.198,0,0.0659,0.638,172.138,220573,4
2009-04-18,41,"1, 2, 3, 4",Plain White T's,1ddEJFVOCOjNqh19FTQAsX,False,42,41,11,0.458,0.55,2,-7.092,1,0.0262,0.566,1.39e-05,0.108,0.56,90.56,198360,4
2009-04-18,42,Turn My Swag On,Soulja Boy Tell'em,1ddEJFVOCOjNqh19FTQAsX,False,52,42,5,0.546,0.712,3,-3.104,0,0.0269,0.000969,0,0.406,0.489,150.154,206333,4
2009-04-18,43,Viva La Vida,Coldplay,1ddEJFVOCOjNqh19FTQAsX,False,40,1,48,0.486,0.617,5,-7.115,0,0.0287,0.0954,3.23e-06,0.109,0.417,138.015,242373,4
2009-04-18,44,It's America,Rodney Atkins,1ddEJFVOCOjNqh19FTQAsX,False,56,44,7,0.612,0.791,6,-3.519,1,0.0291,0.224,0,0.112,0.786,133.977,207040,4
2009-04-18,45,All The Above,Maino Featuring T-Pain,1ddEJFVOCOjNqh19FTQAsX,False,54,39,6,0.374,0.888,8,-3.197,1,0.12,0.0762,0,0.202,0.365,148.828,319940,4
2009-04-18,46,Don't Forget,Demi Lovato,1ddEJFVOCOjNqh19FTQAsX,False,48,46,4,0.641,0.451,4,-7.694,1,0.0899,0.507,1.71e-06,0.629,0.612,179.967,223160,4
2009-04-18,47,It Won't Be Like This For Long,Darius Rucker,1ddEJFVOCOjNqh19FTQAsX,False,44,36,14,0.584,0.524,4,-6.001,1,0.0287,0.335,0,0.11,0.389,143.863,219000,4
2009-04-18,48,Live Your Life,T.I. Featuring Rihanna,1ddEJFVOCOjNqh19FTQAsX,False,45,1,28,0.375,0.862,11,-3.363,0,0.255,0.071,0,0.211,0.478,159.841,338853,4
2009-04-18,49,Ain't I,Yung L.A. Featuring Young Dro & T.I.,1ddEJFVOCOjNqh19FTQAsX,False,51,47,10,0.665,0.826,11,-3.126,1,0.116,0.141,0,0.0926,0.541,77.504,252093,4
2009-04-18,50,Gotta Be Somebody,Nickelback,1ddEJFVOCOjNqh19FTQAsX,False,47,10,27,0.536,0.89,0,-5.222,1,0.0601,0.000354,0.00165,0.133,0.205,115.998,252653,4
2009-04-18,51,Then,Brad Paisley,1ddEJFVOCOjNqh19FTQAsX,False,49,35,3,0.493,0.643,0,-5.19,1,0.0299,0.512,2.42e-05,0.209,0.3,144.717,321640,4
2009-04-18,52,Lucky,Jason Mraz & Colbie Caillat,1ddEJFVOCOjNqh19FTQAsX,False,53,48,13,0.623,0.417,0,-8.699,1,0.0354,0.296,0,0.135,0.721,130.032,191360,4
2009-04-18,53,Diva,Beyonce,1ddEJFVOCOjNqh19FTQAsX,False,50,19,16,0.875,0.551,6,-6.744,0,0.317,0.0488,0.00728,0.0537,0.861,146.092,200613,4
2009-04-18,54,Knock You Down,Keri Hilson Featuring Kanye West & Ne-Yo,1ddEJFVOCOjNqh19FTQAsX,False,65,54,2,0.588,0.877,8,-4.78,1,0.16,0.00952,0,0.171,0.645,155.165,326187,4
2009-04-18,55,You Can Get It All,Bow Wow Featuring Johnta Austin,1ddEJFVOCOjNqh19FTQAsX,False,69,55,5,0.783,0.765,9,-5.227,1,0.145,0.31,0,0.0777,0.692,89.006,216840,4
2009-04-18,56,That's Not My Name,The Ting Tings,1ddEJFVOCOjNqh19FTQAsX,False,68,56,13,0.755,0.901,9,-3.152,1,0.0893,0.0451,0.0373,0.363,0.959,145.042,310573,4
2009-04-18,57,Don't Think I Can't Love You,Jake Owen,1ddEJFVOCOjNqh19FTQAsX,False,61,57,10,0.435,0.558,10,-5.423,1,0.0342,0.26,0,0.245,0.203,115.742,185107,3
2009-04-18,58,It Happens,Sugarland,1ddEJFVOCOjNqh19FTQAsX,False,70,58,5,0.641,0.724,8,-3.843,1,0.0483,0.00631,7.08e-05,0.0724,0.748,89.971,181253,4
2009-04-18,59,Stanky Legg,GS Boyz,1ddEJFVOCOjNqh19FTQAsX,False,58,49,9,0.761,0.704,11,-5.975,0,0.059,0.00435,0,0.272,0.738,154.007,233320,4
2009-04-18,60,River Of Love,George Strait,1ddEJFVOCOjNqh19FTQAsX,False,63,59,17,0.474,0.814,7,-6.875,1,0.0419,0.604,0.0145,0.15,0.91,79.216,195147,4
2009-04-18,61,Candle (Sick And Tired),The White Tie Affair,1ddEJFVOCOjNqh19FTQAsX,False,60,60,5,0.557,0.874,0,-5.729,1,0.0339,0.00134,0,0.127,0.396,139.002,230707,3
2009-04-18,62,Hoedown Throwdown,Miley Cyrus,1ddEJFVOCOjNqh19FTQAsX,False,46,46,4,0.738,0.804,10,-6.018,0,0.0608,0.197,0,0.297,0.791,109.045,181013,4
2009-04-18,63,Come Back To Me,David Cook,55r33uTqnLglVMHb1qeWOd,True,0,63,1,0.476,0.895,4,-4.857,1,0.0299,0.0101,1.02e-06,0.127,0.632,108.087,248000,4
2009-04-18,64,Use Somebody,Kings Of Leon,55r33uTqnLglVMHb1qeWOd,False,67,64,10,0.276,0.715,0,-5.356,1,0.0432,0.00552,0.000417,0.201,0.173,137.028,230760,4
2009-04-18,65,I'm On A Boat,The Lonely Island Featuring T-Pain,55r33uTqnLglVMHb1qeWOd,False,66,65,8,0.623,0.871,0,-2.403,1,0.239,0.0465,0,0.111,0.653,150.079,156267,4
2009-04-18,66,Careless Whisper,Seether,55r33uTqnLglVMHb1qeWOd,False,71,66,5,0.469,0.943,2,-4.196,1,0.102,6.07e-05,0.00547,0.0717,0.358,134.031,296973,4
2009-04-18,67,Thinking Of You,Katy Perry,55r33uTqnLglVMHb1qeWOd,False,55,29,12,0.431,0.803,4,-4.459,1,0.0364,0.00167,0,0.331,0.309,147.048,246410,4
2009-04-18,68,Whatever It Is,Zac Brown Band,55r33uTqnLglVMHb1qeWOd,False,79,68,4,0.686,0.576,1,-6.632,1,0.0284,0.443,1.7e-05,0.212,0.72,83.971,208213,4
2009-04-18,69,Crazier,Taylor Swift,55r33uTqnLglVMHb1qeWOd,False,72,69,2,0.452,0.544,4,-5.423,1,0.0277,0.0631,5.33e-06,0.104,0.158,133.042,191947,3
2009-04-18,70,Magnificent,Rick Ross Featuring John Legend,55r33uTqnLglVMHb1qeWOd,False,75,70,5,0.631,0.755,7,-7.206,1,0.136,0.00733,0,0.0889,0.439,91.378,257480,4
2009-04-18,71,Next To You,Mike Jones,55r33uTqnLglVMHb1qeWOd,False,76,71,5,0.65,0.753,2,-4.745,0,0.0632,0.324,0,0.307,0.616,82.478,221933,4
2009-04-18,72,Untouched,The Veronicas,55r33uTqnLglVMHb1qeWOd,False,64,17,19,0.557,0.783,6,-4.893,0,0.234,0.0171,0.0172,0.151,0.442,177.008,255360,4
2009-04-18,73,Nothin' To Die For,Tim McGraw,55r33uTqnLglVMHb1qeWOd,False,73,68,8,0.481,0.786,10,-5.654,1,0.0288,0.0538,0,0.0759,0.389,153.105,253640,4
2009-04-18,74,Move (If You 'W'anna),Mims,55r33uTqnLglVMHb1qeWOd,False,74,61,11,0.728,0.605,8,-7.953,1,0.334,0.0197,2.46e-05,0.0668,0.743,80.545,190667,4
2009-04-18,75,Be On You,Flo Rida Featuring Ne-Yo,7maTLYdnHDNsq3bB1tu2nH,True,0,75,1,0.398,0.709,4,-4.602,0,0.211,0.334,0,0.142,0.714,78.089,243227,1
2009-04-18,76,I Run To You,Lady Antebellum,7maTLYdnHDNsq3bB1tu2nH,False,97,76,3,0.655,0.786,3,-4.451,1,0.034,0.163,5.99e-05,0.124,0.378,113.964,256013,4
2009-04-18,77,Boyfriend #2,Pleasure P,7maTLYdnHDNsq3bB1tu2nH,False,90,77,3,0.648,0.767,8,-5.052,1,0.0608,0.0219,0,0.19,0.796,141.906,207400,4
2009-04-18,78,Shuttin' Detroit Down,John Rich,7maTLYdnHDNsq3bB1tu2nH,False,80,75,6,0.515,0.759,7,-2.502,1,0.0304,0.285,0,0.242,0.579,167.875,241640,4
2009-04-18,79,God Love Her,Toby Keith,7maTLYdnHDNsq3bB1tu2nH,False,78,36,20,0.551,0.919,10,-3.895,1,0.0529,0.133,8.36e-05,0.0637,0.432,125.025,216627,4
2009-04-18,80,The Fear,Lily Allen,7maTLYdnHDNsq3bB1tu2nH,False,99,80,6,0.661,0.847,10,-6.948,1,0.0404,0.419,8.82e-05,0.107,0.522,134.002,207120,4
2009-04-18,81,One In Every Crowd,Montgomery Gentry,7maTLYdnHDNsq3bB1tu2nH,False,94,81,4,0.643,0.86,11,-4.447,1,0.0495,0.00423,0,0.286,0.674,111.148,211107,4
2009-04-18,82,Ride,Martina McBride,7maTLYdnHDNsq3bB1tu2nH,False,84,82,6,0.556,0.836,7,-3.931,1,0.042,0.109,0,0.274,0.559,116.978,232547,4
2009-04-18,83,Never Ever,Ciara Featuring Young Jeezy,7maTLYdnHDNsq3bB1tu2nH,False,85,72,7,0.669,0.725,11,-6.386,1,0.0337,0.0215,0,0.158,0.287,131.963,272602,4
2009-04-18,84,She Got Her Own,Ne-Yo Featuring Jamie Foxx & Fabolous,7maTLYdnHDNsq3bB1tu2nH,False,83,54,17,0.65,0.659,11,-9.477,1,0.619,0.356,1.62e-06,0.229,0.352,80.618,202222,4
2009-04-18,85,Things That Matter,Rascal Flatts,6IX5nEnp3BDGtGFQJzh1EH,True,0,85,1,0.565,0.453,8,-7.76,1,0.0281,0.252,0.000273,0.0793,0.28,126.034,281427,4
2009-04-18,86,You Complete Me,Keyshia Cole,6IX5nEnp3BDGtGFQJzh1EH,False,82,62,9,0.681,0.666,2,-4.984,0,0.0491,0.578,0,0.26,0.732,111.401,230920,4
2009-04-18,87,If This Isn't Love,Jennifer Hudson,6IX5nEnp3BDGtGFQJzh1EH,False,91,84,6,0.587,0.778,4,-3.447,1,0.0441,0.21,0,0.106,0.403,129.868,216387,4
2009-04-18,88,Lifeline,Papa Roach,6IX5nEnp3BDGtGFQJzh1EH,False,81,81,2,0.454,0.909,2,-5.23,1,0.0555,0.000183,0.00026,0.371,0.3,106.044,257547,4
2009-04-18,89,Kiss A Girl,Keith Urban,6IX5nEnp3BDGtGFQJzh1EH,False,88,51,4,0.653,0.786,2,-5.418,1,0.0338,0.0103,2.19e-06,0.201,0.477,120.992,226733,4
2009-04-18,90,Sideways,Dierks Bentley,19DnL1HnJiijuEfaiS0Eus,True,0,90,1,0.624,0.915,5,-2.627,0,0.0364,0.141,0,0.386,0.815,108.046,184160,3
2009-04-18,91,Prom Queen,Lil Wayne Featuring Shanell AKA SNL,19DnL1HnJiijuEfaiS0Eus,False,86,15,10,0.514,0.876,7,-4.828,1,0.0625,3.52e-05,2.56e-05,0.17,0.365,144.035,217400,4
2009-04-18,92,Hot Revolver,Lil Wayne,19DnL1HnJiijuEfaiS0Eus,False,38,33,3,0.703,0.513,7,-7.209,1,0.0481,0.00523,0,0.0872,0.274,128.994,200800,4
2009-04-18,93,Just Like Me,Jamie Foxx Featuring T.I.,19DnL1HnJiijuEfaiS0Eus,False,92,49,17,0.755,0.713,11,-4.753,0,0.15,0.151,0,0.269,0.741,151.047,206093,5
2009-04-18,94,Always The Love Songs,Eli Young Band,19DnL1HnJiijuEfaiS0Eus,False,100,94,3,0.474,0.766,4,-3.419,1,0.0291,0.291,1.38e-05,0.685,0.402,149.988,221800,4
2009-04-18,95,Jump,Flo Rida Featuring Nelly Furtado,4uGucgzv0ydi35DgAlsTQ4,True,0,95,1,0.731,0.813,6,-7.366,0,0.065,0.00439,3.5e-06,0.26,0.497,130.028,208920,4
2009-04-18,96,sobeautiful,Musiq Soulchild,4uGucgzv0ydi35DgAlsTQ4,False,0,92,3,0.689,0.562,7,-7.048,0,0.0637,0.0656,0,0.0885,0.21,133.987,291133,4
2009-04-18,97,You'll Always Find Your Way Back Home,Hannah Montana,4uGucgzv0ydi35DgAlsTQ4,False,87,87,2,0.577,0.906,8,-3.673,1,0.0583,0.0304,0,0.189,0.692,152.946,224187,4
2009-04-18,98,Down The Road,Kenny Chesney With Mac McAnally,4uGucgzv0ydi35DgAlsTQ4,False,95,47,18,0.414,0.584,5,-9.245,1,0.0285,0.801,6.05e-06,0.617,0.579,162.887,189293,4
2009-04-18,99,Kids,MGMT,4uGucgzv0ydi35DgAlsTQ4,False,93,91,5,0.451,0.931,9,-3.871,1,0.0719,0.00076,0.0049,0.361,0.172,122.961,302840,4
2009-04-18,100,My Love,The-Dream Featuring Mariah Carey,4uGucgzv0ydi35DgAlsTQ4,False,0,82,3,0.369,0.639,0,-4.839,1,0.0341,0.418,0,0.141,0.345,81.053,204613,4
