date,position,title,artist,spotify_id,is_new,last_pos,peak_pos,weeks,danceability,energy,key,loudness,mode,speechiness,acousticness,instrumentalness,liveness,valence,tempo,duration_ms,time_signature
2020-02-08,1,The Box,Roddy Ricch,0udOCZp7yk0Ml92C0k8H8D,False,1,1,8,0.896,0.586,10,-6.687,0,0.0559,0.104,0,0.79,0.642,116.971,196653,4
2020-02-08,2,Life Is Good,Future Featuring Drake,0udOCZp7yk0Ml92C0k8H8D,False,2,2,3,0.676,0.609,2,-5.831,0,0.481,0.0706,0,0.152,0.508,142.037,237735,4
2020-02-08,3,Circles,Post Malone,0udOCZp7yk0Ml92C0k8H8D,False,4,1,22,0.695,0.762,0,-3.497,1,0.0395,0.192,0.00244,0.0863,0.553,120.042,215280,4
2020-02-08,4,Memories,Maroon 5,0udOCZp7yk0Ml92C0k8H8D,False,5,2,19,0.764,0.32,11,-7.209,1,0.0546,0.837,0,0.0822,0.575,91.019,189486,4
2020-02-08,5,Someone You Loved,Lewis Capaldi,0udOCZp7yk0Ml92C0k8H8D,False,8,1,38,0.501,0.405,1,-5.679,1,0.0319,0.751,0,0.105,0.446,109.891,182161,4
2020-02-08,6,"10,000 Hours",Dan + Shay & Justin Bieber,0udOCZp7yk0Ml92C0k8H8D,False,6,4,17,0.654,0.63,10,-4.644,1,0.0259,0.153,0,0.111,0.43,89.991,167693,4
2020-02-08,7,Dance Monkey,Tones And I,0udOCZp7yk0Ml92C0k8H8D,False,7,7,17,0.824,0.588,6,-6.4,0,0.0924,0.692,0.000104,0.149,0.513,98.027,209438,4
2020-02-08,8,Roxanne,Arizona Zervas,0udOCZp7yk0Ml92C0k8H8D,False,9,4,13,0.621,0.601,6,-5.616,0,0.148,0.0522,0,0.46,0.457,116.735,163636,5
2020-02-08,9,Don't Start Now,Dua Lipa,0udOCZp7yk0Ml92C0k8H8D,False,15,9,13,0.794,0.793,11,-4.521,0,0.0842,0.0125,0,0.0952,0.677,123.941,183290,4
2020-02-08,10,Everything I Wanted,Billie Eilish,0udOCZp7yk0Ml92C0k8H8D,False,23,8,12,0.704,0.225,6,-14.454,0,0.0994,0.902,0.657,0.106,0.243,120.006,245426,4
2020-02-08,11,Lose You To Love Me,Selena Gomez,0udOCZp7yk0Ml92C0k8H8D,False,10,1,15,0.488,0.343,4,-8.985,1,0.0436,0.556,0,0.21,0.0978,102.819,206459,4
2020-02-08,12,Godzilla,Eminem Featuring Juice WRLD,0udOCZp7yk0Ml92C0k8H8D,False,3,3,2,0.808,0.745,10,-5.26,0,0.342,0.145,0,0.292,0.829,165.995,210800,4
2020-02-08,13,Good As Hell,Lizzo,0udOCZp7yk0Ml92C0k8H8D,False,12,3,23,0.682,0.919,0,-3.18,0,0.0875,0.256,0,0.442,0.535,95.982,159736,4
2020-02-08,14,BOP,DaBaby,0udOCZp7yk0Ml92C0k8H8D,False,13,11,18,0.769,0.787,11,-3.909,1,0.367,0.189,0,0.129,0.836,126.77,159715,4
2020-02-08,15,Yummy,Justin Bieber,0udOCZp7yk0Ml92C0k8H8D,False,11,2,4,0.653,0.578,2,-5.709,0,0.0513,0.292,0,0.105,0.554,145.883,209177,4
2020-02-08,16,Ballin',Mustard & Roddy Ricch,0udOCZp7yk0Ml92C0k8H8D,False,14,11,28,0.809,0.545,7,-6.678,1,0.0735,0.392,0,0.151,0.244,97.008,180435,4
2020-02-08,17,Bad Guy,Billie Eilish,0udOCZp7yk0Ml92C0k8H8D,False,41,1,44,0.701,0.425,7,-10.965,1,0.375,0.328,0.13,0.1,0.562,135.128,194088,4
2020-02-08,18,Blinding Lights,The Weeknd,0udOCZp7yk0Ml92C0k8H8D,False,21,11,9,0.514,0.73,1,-5.934,1,0.0598,0.00146,9.54e-05,0.0897,0.334,171.005,200040,4
2020-02-08,19,Heartless,The Weeknd,0udOCZp7yk0Ml92C0k8H8D,False,19,1,10,0.538,0.751,10,-5.487,0,0.128,0.0194,1.42e-06,0.145,0.244,169.985,198267,4
2020-02-08,20,HIGHEST IN THE ROOM,Travis Scott,0udOCZp7yk0Ml92C0k8H8D,False,17,1,17,0.598,0.427,7,-8.764,0,0.0317,0.0546,5.83e-06,0.21,0.0605,76.469,175721,4
2020-02-08,21,The Bones,Maren Morris,0udOCZp7yk0Ml92C0k8H8D,False,22,21,19,0.612,0.57,11,-6.642,0,0.0347,0.278,0,0.0963,0.334,77.002,197293,4
2020-02-08,22,High Fashion,Roddy Ricch Featuring Mustard,0udOCZp7yk0Ml92C0k8H8D,False,20,20,5,0.831,0.499,11,-8.442,0,0.114,0.269,0,0.3,0.511,97.956,220487,4
2020-02-08,23,Hot Girl Bummer,blackbear,0udOCZp7yk0Ml92C0k8H8D,False,27,23,20,0.782,0.559,6,-7.106,0,0.0767,0.125,0,0.385,0.685,129.992,188344,1
2020-02-08,24,No Guidance,Chris Brown Featuring Drake,0udOCZp7yk0Ml92C0k8H8D,False,25,5,34,0.696,0.454,1,-6.756,0,0.153,0.123,0,0.155,0.136,92.928,260640,4
2020-02-08,25,Woah,Lil Baby,0udOCZp7yk0Ml92C0k8H8D,False,29,16,12,0.884,0.617,11,-5.598,1,0.233,0.0153,0,0.19,0.402,142.952,183011,4
2020-02-08,26,Senorita,Shawn Mendes & Camila Cabello,0udOCZp7yk0Ml92C0k8H8D,False,30,1,32,0.759,0.54,9,-6.039,0,0.0287,0.037,0,0.0945,0.75,116.947,190960,4
2020-02-08,27,Trampoline,SHAED,0udOCZp7yk0Ml92C0k8H8D,False,24,13,35,0.689,0.412,7,-7.523,0,0.0301,0.488,0.00016,0.0659,0.537,126.754,184060,4
2020-02-08,28,You Should Be Sad,Halsey,0udOCZp7yk0Ml92C0k8H8D,False,26,26,3,0.591,0.585,2,-6.35,1,0.0277,0.143,0,0.109,0.324,110.94,205473,4
2020-02-08,29,Adore You,Harry Styles,0udOCZp7yk0Ml92C0k8H8D,False,32,24,8,0.676,0.771,8,-3.675,1,0.0483,0.0237,7e-06,0.102,0.569,99.048,207133,4
2020-02-08,30,What A Man Gotta Do,Jonas Brothers,0udOCZp7yk0Ml92C0k8H8D,False,16,16,2,0.852,0.698,9,-7.206,1,0.0629,0.00839,1.03e-06,0.0773,0.324,113.039,180645,4
2020-02-08,31,B.I.T.C.H.,Megan Thee Stallion,06scTb0zbkxYNgpAB3J9fN,True,0,31,1,0.742,0.731,11,-4.362,0,0.306,0.0851,0,0.131,0.547,174.019,183143,4
2020-02-08,32,Truth Hurts,Lizzo,06scTb0zbkxYNgpAB3J9fN,False,43,1,39,0.715,0.624,4,-3.046,0,0.114,0.11,0,0.123,0.412,158.087,173325,4
2020-02-08,33,Falling,Trevor Daniel,06scTb0zbkxYNgpAB3J9fN,False,37,31,11,0.785,0.431,10,-8.756,0,0.0364,0.123,0,0.0887,0.236,127.085,159382,4
2020-02-08,34,Anyone,Demi Lovato,18ssFhD04lWo1RzpcohnrG,True,0,34,1,0.557,0.387,11,-6.338,1,0.0374,0.876,0,0.111,0.317,129.98,227813,4
2020-02-08,35,My Oh My,Camila Cabello Featuring DaBaby,18ssFhD04lWo1RzpcohnrG,False,40,35,8,0.724,0.491,8,-6.024,1,0.0296,0.018,1.29e-05,0.0887,0.383,105.046,170746,4
2020-02-08,36,Suicidal,YNW Melly & Juice WRLD,18ssFhD04lWo1RzpcohnrG,False,34,34,10,0.655,0.441,9,-5.245,0,0.0629,0.474,0,0.099,0.273,139.957,225857,4
2020-02-08,37,Only Human,Jonas Brothers,18ssFhD04lWo1RzpcohnrG,False,35,18,32,0.795,0.496,0,-5.883,1,0.0722,0.108,0,0.0645,0.874,94.01,183000,4
2020-02-08,38,Sum 2 Prove,Lil Baby,18ssFhD04lWo1RzpcohnrG,False,33,16,3,0.823,0.552,4,-7.57,0,0.324,0.0174,0,0.122,0.418,124.038,205760,4
2020-02-08,39,Sucker,Jonas Brothers,18ssFhD04lWo1RzpcohnrG,False,49,1,43,0.842,0.734,1,-5.065,0,0.0588,0.0427,0,0.106,0.952,137.958,181027,4
2020-02-08,40,One Man Band,Old Dominion,18ssFhD04lWo1RzpcohnrG,False,46,20,23,0.706,0.358,6,-8.331,1,0.0347,0.677,0,0.107,0.478,75.991,186240,4
2020-02-08,41,Even Though I'm Leaving,Luke Combs,18ssFhD04lWo1RzpcohnrG,False,45,11,22,0.554,0.755,2,-6.04,1,0.0319,0.225,0,0.301,0.624,77.962,225253,4
2020-02-08,42,Heartache Medication,Jon Pardi,18ssFhD04lWo1RzpcohnrG,False,51,42,18,0.621,0.791,9,-3.343,1,0.0265,0.0361,0,0.143,0.734,95.075,209110,4
2020-02-08,43,Nobody But You,Blake Shelton Duet With Gwen Stefani,18ssFhD04lWo1RzpcohnrG,False,76,43,3,0.463,0.653,0,-5.515,1,0.0273,0.111,0.000136,0.172,0.233,143.912,194867,4
2020-02-08,44,I Don't Care,Ed Sheeran & Justin Bieber,18ssFhD04lWo1RzpcohnrG,False,44,2,35,0.798,0.675,6,-5.041,1,0.0442,0.0912,0,0.0894,0.842,101.956,219947,4
2020-02-08,45,Hot,Young Thug Featuring Gunna,18ssFhD04lWo1RzpcohnrG,False,42,11,24,0.855,0.651,0,-8.044,0,0.235,0.063,0,0.0772,0.559,111.997,193027,4
2020-02-08,46,Kinfolks,Sam Hunt,18ssFhD04lWo1RzpcohnrG,False,53,46,16,0.569,0.807,0,-4.584,1,0.0464,0.0876,0,0.164,0.883,76.011,181933,4
2020-02-08,47,Bandit,Juice WRLD & YoungBoy Never Broke Again,18ssFhD04lWo1RzpcohnrG,False,47,10,17,0.474,0.631,5,-5.884,0,0.343,0.0687,0,0.132,0.425,180.051,189323,4
2020-02-08,48,Juicy,Doja Cat & Tyga,18ssFhD04lWo1RzpcohnrG,False,50,45,14,0.786,0.652,0,-2.607,1,0.0669,0.102,0,0.0697,0.483,170.031,203093,4
2020-02-08,49,Panini,Lil Nas X,18ssFhD04lWo1RzpcohnrG,False,39,5,32,0.717,0.598,5,-5.613,0,0.0809,0.22,0,0.122,0.496,153.905,151040,4
2020-02-08,50,South Of The Border,Ed Sheeran Featuring Camila Cabello & Cardi B,18ssFhD04lWo1RzpcohnrG,False,56,50,8,0.857,0.621,9,-6.376,0,0.0825,0.148,0,0.0865,0.668,97.989,204467,4
2020-02-08,51,Tusa,Karol G & Nicki Minaj,18ssFhD04lWo1RzpcohnrG,False,55,51,9,0.803,0.715,2,-3.28,1,0.298,0.295,0.000134,0.0574,0.574,101.085,200960,4
2020-02-08,52,Homesick,Kane Brown,18ssFhD04lWo1RzpcohnrG,False,66,52,11,0.701,0.5,8,-8.82,1,0.0303,0.46,0,0.234,0.409,97.028,205400,4
2020-02-08,53,RITMO (Bad Boys For Life),Black Eyed Peas X J Balvin,18ssFhD04lWo1RzpcohnrG,False,62,53,10,0.721,0.716,10,-7.037,0,0.0657,0.0334,0.00084,0.237,0.667,104.994,221714,4
2020-02-08,54,Good News,Mac Miller,18ssFhD04lWo1RzpcohnrG,False,18,17,3,0.794,0.32,1,-12.92,0,0.173,0.853,0.134,0.112,0.241,174.088,342040,4
2020-02-08,55,P*$$y Fairy (OTW),Jhene Aiko,18ssFhD04lWo1RzpcohnrG,False,58,55,2,0.572,0.519,2,-7.092,0,0.212,0.536,0,0.102,0.35,128.331,181860,4
2020-02-08,56,I Hope,Gabby Barrett Featuring Charlie Puth,18ssFhD04lWo1RzpcohnrG,False,73,56,5,0.466,0.536,6,-6.227,1,0.0429,0.0951,0,0.114,0.377,75.998,210773,4
2020-02-08,57,Slide,H.E.R. Featuring YG,18ssFhD04lWo1RzpcohnrG,False,70,57,6,0.827,0.469,10,-9.141,0,0.341,0.0807,8.12e-06,0.207,0.196,97.028,238321,4
2020-02-08,58,TOES,DaBaby Featuring Lil Baby & Moneybagg Yo,18ssFhD04lWo1RzpcohnrG,False,65,28,9,0.816,0.582,8,-4.141,1,0.341,0.0794,5.84e-06,0.0916,0.542,160.004,136366,4
2020-02-08,59,Heart On Ice,Rod Wave,18ssFhD04lWo1RzpcohnrG,False,72,54,12,0.733,0.389,10,-8.468,0,0.0738,0.0513,0,0.141,0.244,157.878,159670,3
2020-02-08,60,Futsal Shuffle 2020,Lil Uzi Vert,18ssFhD04lWo1RzpcohnrG,False,59,5,7,0.881,0.457,7,-8.191,0,0.156,0.0327,0,0.231,0.296,136.97,198913,4
2020-02-08,61,VIBEZ,DaBaby,18ssFhD04lWo1RzpcohnrG,False,69,21,18,0.768,0.652,1,-2.708,0,0.307,0.113,0,0.107,0.777,154.187,144935,4
2020-02-08,62,BEST ON EARTH,Russ & BIA,18ssFhD04lWo1RzpcohnrG,False,79,62,8,0.846,0.748,5,-3.512,0,0.078,0.188,0,0.093,0.597,90.006,160720,4
2020-02-08,63,Out West,JACKBOYS Featuring Young Thug,18ssFhD04lWo1RzpcohnrG,False,85,38,5,0.802,0.591,8,-4.895,1,0.225,0.0104,0,0.196,0.309,139.864,157712,4
2020-02-08,64,Graveyard,Halsey,18ssFhD04lWo1RzpcohnrG,False,54,34,20,0.667,0.583,11,-5.127,0,0.0747,0.231,4.48e-05,0.181,0.187,92.043,181806,4
2020-02-08,65,What She Wants Tonight,Luke Bryan,18ssFhD04lWo1RzpcohnrG,False,90,65,6,0.484,0.903,8,-3.9,0,0.0882,0.0649,0,0.151,0.716,169.948,186988,4
2020-02-08,66,No Idea,Don Toliver,18ssFhD04lWo1RzpcohnrG,False,77,43,9,0.652,0.631,6,-5.718,0,0.0893,0.524,0.000579,0.165,0.35,127.998,154424,4
2020-02-08,67,Ridin' Roads,Dustin Lynch,18ssFhD04lWo1RzpcohnrG,False,60,47,13,0.547,0.817,9,-4.255,1,0.0448,0.0986,0,0.136,0.592,142.118,205427,4
2020-02-08,68,More Hearts Than Mine,Ingrid Andress,18ssFhD04lWo1RzpcohnrG,False,86,68,5,0.375,0.428,0,-7.387,1,0.029,0.109,0,0.105,0.361,78.516,214787,4
2020-02-08,69,SUGAR,BrockHampton,18ssFhD04lWo1RzpcohnrG,False,78,66,4,0.453,0.538,1,-8.212,1,0.0638,0.449,0,0.19,0.516,122.973,204533,4
2020-02-08,70,I Wish Grandpas Never Died,Riley Green,18ssFhD04lWo1RzpcohnrG,False,87,70,5,0.445,0.492,6,-5.717,1,0.0294,0.036,0,0.122,0.24,148.013,250413,4
2020-02-08,71,Start Wit Me,Roddy Ricch & Gunna,18ssFhD04lWo1RzpcohnrG,False,74,56,11,0.886,0.479,4,-8.054,0,0.334,0.077,0,0.135,0.408,130.029,158692,4
2020-02-08,72,Make Me Want To,Jimmie Allen,18ssFhD04lWo1RzpcohnrG,False,88,72,5,0.519,0.872,2,-3.212,1,0.0616,0.0793,0,0.111,0.74,179.965,172280,4
2020-02-08,73,Say So,Doja Cat Featuring Nicki Minaj,18ssFhD04lWo1RzpcohnrG,False,92,73,4,0.787,0.673,11,-4.577,0,0.158,0.256,3.57e-06,0.0904,0.786,110.962,237893,4
2020-02-08,74,We Back,Jason Aldean,18ssFhD04lWo1RzpcohnrG,False,95,72,9,0.433,0.928,4,-5.117,0,0.0512,0.0135,2.01e-06,0.32,0.552,155.938,197160,4
2020-02-08,75,I Hope You're Happy Now,Carly Pearce & Lee Brice,18ssFhD04lWo1RzpcohnrG,False,97,75,4,0.591,0.815,10,-4.725,1,0.0366,0.168,8.68e-06,0.142,0.306,118.024,198689,4
2020-02-08,76,homecoming queen?,Kelsea Ballerini,18ssFhD04lWo1RzpcohnrG,False,96,76,8,0.462,0.512,9,-5.443,1,0.0334,0.478,0,0.0993,0.29,114.014,167796,4
2020-02-08,77,U Played,MoneyBagg Yo Featuring Lil Baby,18ssFhD04lWo1RzpcohnrG,False,82,53,4,0.874,0.847,2,-3.574,1,0.233,0.00341,0,0.29,0.881,134.965,164754,4
2020-02-08,78,Blue World,Mac Miller,18ssFhD04lWo1RzpcohnrG,False,38,38,2,0.742,0.553,8,-8.98,1,0.419,0.389,0,0.0694,0.508,84.931,209440,4
2020-02-08,79,Make No Sense,YoungBoy Never Broke Again,18ssFhD04lWo1RzpcohnrG,False,98,57,12,0.876,0.733,10,-4.478,0,0.333,0.0208,0,0.0999,0.962,154.904,148630,4
2020-02-08,80,Letter To Nipsey,Meek Mill Featuring Roddy Ricch,0j2CNrgtalXRGIvHMO2vzh,True,0,80,1,0.744,0.702,7,-6.255,0,0.288,0.264,0,0.12,0.338,91.885,167845,4
2020-02-08,81,Jerry Sprunger,Tory Lanez & T-Pain,0j2CNrgtalXRGIvHMO2vzh,False,0,44,8,0.76,0.746,0,-5.331,0,0.227,0.137,0,0.0905,0.449,100.011,233546,4
2020-02-08,82,Chasin' You,Morgan Wallen,5MwynWK9s4hlyKHqhkNn4A,True,0,82,1,0.631,0.591,7,-5.785,1,0.0277,0.657,0,0.11,0.489,97.074,205453,4
2020-02-08,83,Rare,Selena Gomez,5MwynWK9s4hlyKHqhkNn4A,False,81,30,3,0.838,0.541,5,-6.746,1,0.0708,0.207,7.97e-05,0.103,0.637,114.996,220590,4
2020-02-08,84,Slow Dance In A Parking Lot,Jordan Davis,5MwynWK9s4hlyKHqhkNn4A,False,0,84,4,0.523,0.837,7,-4.494,1,0.0335,0.301,0,0.172,0.523,82.006,193929,4
2020-02-08,85,Before You Go,Lewis Capaldi,7ce20yLkzuXXLUhzIDoZih,True,0,85,1,0.459,0.575,3,-4.858,1,0.0573,0.604,0,0.0885,0.183,111.881,215107,4
2020-02-08,86,Those Kinda Nights,Eminem Featuring Ed Sheeran,7ce20yLkzuXXLUhzIDoZih,False,31,31,2,0.794,0.637,4,-6.29,0,0.339,0.028,0,0.0919,0.393,103.868,177693,4
2020-02-08,87,Vete,Bad Bunny,7ce20yLkzuXXLUhzIDoZih,False,0,33,9,0.886,0.672,1,-4.394,1,0.188,0.0363,8.78e-06,0.101,0.526,91.976,192024,4
2020-02-08,88,Homemade,Jake Owen,31JID2STTlLuFqXFWHyM8e,True,0,88,1,0.51,0.838,6,-2.702,1,0.0469,0.396,0,0.195,0.574,145.922,192653,4
2020-02-08,89,Easy,DaniLeigh Featuring Chris Brown,31JID2STTlLuFqXFWHyM8e,False,99,79,13,0.799,0.301,7,-11.361,1,0.185,0.195,0,0.0816,0.511,100.026,186587,4
2020-02-08,90,Come Thru,Summer Walker & Usher,31JID2STTlLuFqXFWHyM8e,False,0,42,7,0.679,0.728,5,-3.092,0,0.154,0.159,0,0.107,0.46,152.001,181013,4
2020-02-08,91,Darkness,Eminem,31JID2STTlLuFqXFWHyM8e,False,28,28,2,0.671,0.623,2,-7.161,1,0.308,0.00998,7.55e-06,0.643,0.195,75.055,337147,4
2020-02-08,92,Camelot,NLE Choppa,31JID2STTlLuFqXFWHyM8e,False,0,37,19,0.787,0.713,7,-5.252,1,0.401,0.0849,0,0.717,0.761,175.046,148759,4
2020-02-08,93,Underdog,Alicia Keys,3FGiFUJRRp5RGikVrs6kig,True,0,93,1,0.656,0.722,0,-4.726,0,0.0478,0.556,0,0.134,0.301,90.097,208208,4
2020-02-08,94,First Man,Camila Cabello,6TRt2bniIq0EIlrDlje7b8,True,0,94,1,0.572,0.292,7,-7.621,1,0.0364,0.906,1.04e-06,0.106,0.223,100.152,228759,4
2020-02-08,95,What If I Told You That I Love You,Ali Gatie,74D7JUfU6HYeMx4bZhsHnG,True,0,95,1,0.605,0.365,7,-11.144,1,0.111,0.63,6.83e-06,0.0554,0.224,84.628,193668,4
2020-02-08,96,Catch,Brett Young,53cGGBxGPaRjP0HVUESyW5,True,0,96,1,0.566,0.765,2,-6.337,1,0.0439,0.0248,0,0.0783,0.604,156.036,196440,4
2020-02-08,97,Unaccommodating,Eminem Featuring Young M.A,53cGGBxGPaRjP0HVUESyW5,False,36,36,2,0.852,0.752,1,-5.793,1,0.0597,0.0169,0,0.394,0.389,89.95,216600,4
2020-02-08,98,July,Noah Cyrus & Leon Bridges,53cGGBxGPaRjP0HVUESyW5,False,0,91,4,0.708,0.186,9,-8.953,0,0.042,0.868,0,0.0779,0.322,72.541,156106,4
2020-02-08,99,You Gon' Learn,"Eminem Featuring Royce da 5'9"" & White Gold",53cGGBxGPaRjP0HVUESyW5,False,52,52,2,0.68,0.82,4,-4.197,0,0.151,0.0614,0,0.597,0.243,140.033,234653,4
