date,position,title,artist,spotify_id,is_new,last_pos,peak_pos,weeks,danceability,energy,key,loudness,mode,speechiness,acousticness,instrumentalness,liveness,valence,tempo,duration_ms,time_signature
2019-04-13,1,Old Town Road,Lil Nas X Featuring Billy Ray Cyrus,0i0wnv9UoFdZ5MfuFGQzMy,False,15,1,5,0.878,0.619,6,-5.56,1,0.102,0.0533,0,0.113,0.639,136.041,157067,4
2019-04-13,2,Sunflower (Spider-Man: Into The Spider-Verse),Post Malone & Swae Lee,0i0wnv9UoFdZ5MfuFGQzMy,False,3,1,24,0.76,0.479,2,-5.574,1,0.0466,0.556,0,0.0703,0.913,89.911,158040,4
2019-04-13,3,7 Rings,Ariana Grande,0i0wnv9UoFdZ5MfuFGQzMy,False,1,1,11,0.778,0.317,1,-10.732,0,0.334,0.592,0,0.0881,0.327,140.048,178627,4
2019-04-13,4,Wow.,Post Malone,0i0wnv9UoFdZ5MfuFGQzMy,False,2,2,15,0.829,0.539,11,-7.359,0,0.208,0.136,1.78e-06,0.103,0.388,99.96,149547,4
2019-04-13,5,Without Me,Halsey,0i0wnv9UoFdZ5MfuFGQzMy,False,4,1,26,0.752,0.488,6,-7.05,1,0.0705,0.297,9.11e-06,0.0936,0.533,136.041,201661,4
2019-04-13,6,Please Me,Cardi B & Bruno Mars,0i0wnv9UoFdZ5MfuFGQzMy,False,5,3,7,0.747,0.57,1,-6.711,1,0.081,0.0642,0,0.0832,0.65,133.992,200890,4
2019-04-13,7,Bad Guy,Billie Eilish,2Fxmhks0bxGSBdJ92vM42m,True,0,7,1,0.701,0.425,7,-10.965,1,0.375,0.328,0.13,0.1,0.562,135.128,194088,4
2019-04-13,8,Sucker,Jonas Brothers,2Fxmhks0bxGSBdJ92vM42m,False,9,1,5,0.842,0.734,1,-5.065,0,0.0588,0.0427,0,0.106,0.952,137.958,181027,4
2019-04-13,9,Happier,Marshmello & Bastille,2Fxmhks0bxGSBdJ92vM42m,False,6,2,33,0.687,0.792,5,-2.749,1,0.0452,0.191,0,0.167,0.671,100.015,214290,4
2019-04-13,10,Middle Child,J. Cole,2Fxmhks0bxGSBdJ92vM42m,False,7,4,11,0.837,0.364,8,-11.713,1,0.276,0.149,0,0.271,0.463,123.984,213594,4
2019-04-13,11,Shallow,Lady Gaga & Bradley Cooper,2Fxmhks0bxGSBdJ92vM42m,False,10,1,27,0.572,0.385,7,-6.362,1,0.0308,0.371,0,0.231,0.323,95.799,215733,4
2019-04-13,12,Eastside,"benny blanco, Halsey & Khalid",2Fxmhks0bxGSBdJ92vM42m,False,11,9,38,0.56,0.68,6,-7.648,0,0.321,0.555,0,0.116,0.319,89.391,173800,4
2019-04-13,13,Thotiana,Blueface,2Fxmhks0bxGSBdJ92vM42m,False,8,8,12,0.906,0.382,10,-12.89,0,0.269,0.18,0,0.113,0.391,104.025,129264,4
2019-04-13,14,Going Bad,Meek Mill Featuring Drake,2Fxmhks0bxGSBdJ92vM42m,False,12,6,18,0.889,0.496,4,-6.365,0,0.0905,0.259,0,0.252,0.544,86.003,180522,4
2019-04-13,15,Dancing With A Stranger,Sam Smith & Normani,2Fxmhks0bxGSBdJ92vM42m,False,17,15,12,0.741,0.52,8,-7.513,1,0.0656,0.45,1.97e-06,0.222,0.347,102.998,171030,4
2019-04-13,16,Better,Khalid,2Fxmhks0bxGSBdJ92vM42m,False,16,16,29,0.596,0.552,0,-10.278,0,0.097,0.0765,0.334,0.104,0.112,97.949,229320,4
2019-04-13,17,High Hopes,Panic! At The Disco,2Fxmhks0bxGSBdJ92vM42m,False,13,4,35,0.579,0.904,5,-2.729,1,0.0618,0.193,0,0.064,0.681,82.014,190947,4
2019-04-13,18,"Break Up With Your Girlfriend, I'm Bored",Ariana Grande,2Fxmhks0bxGSBdJ92vM42m,False,14,2,8,0.726,0.554,5,-5.29,0,0.0917,0.0421,0,0.106,0.335,169.999,190440,4
2019-04-13,19,Sweet But Psycho,Ava Max,2Fxmhks0bxGSBdJ92vM42m,False,20,19,16,0.72,0.706,1,-4.719,1,0.0473,0.0684,0,0.166,0.62,133.002,187436,4
2019-04-13,20,Sicko Mode,Travis Scott,2Fxmhks0bxGSBdJ92vM42m,False,18,1,35,0.834,0.73,8,-3.714,1,0.222,0.00513,0,0.124,0.446,155.008,312820,4
2019-04-13,21,Murder On My Mind,YNW Melly,2Fxmhks0bxGSBdJ92vM42m,False,19,14,11,0.759,0.73,0,-7.985,0,0.0516,0.145,3.06e-06,0.11,0.74,115.007,268434,4
2019-04-13,22,A Lot,21 Savage,2Fxmhks0bxGSBdJ92vM42m,False,22,12,15,0.837,0.636,1,-7.643,1,0.086,0.0395,0.00125,0.342,0.274,145.972,288624,4
2019-04-13,23,Girls Like You,Maroon 5 Featuring Cardi B,2Fxmhks0bxGSBdJ92vM42m,False,23,1,45,0.609,0.529,0,-6.859,1,0.106,0.545,0,0.127,0.474,60.349,235680,4
2019-04-13,24,"Thank U, Next",Ariana Grande,2Fxmhks0bxGSBdJ92vM42m,False,21,1,22,0.717,0.653,1,-5.634,1,0.0658,0.229,0,0.101,0.412,106.966,207320,4
2019-04-13,25,Bury A Friend,Billie Eilish,2Fxmhks0bxGSBdJ92vM42m,False,41,14,10,0.905,0.389,8,-14.505,1,0.332,0.74,0.162,0.106,0.196,120.046,193143,4
2019-04-13,26,Beautiful Crazy,Luke Combs,2Fxmhks0bxGSBdJ92vM42m,False,25,23,21,0.551,0.402,11,-7.431,1,0.0262,0.676,0,0.0928,0.382,103.313,193200,4
2019-04-13,27,Close To Me,Ellie Goulding X Diplo Featuring Swae Lee,2Fxmhks0bxGSBdJ92vM42m,False,27,27,20,0.572,0.75,1,-5.042,0,0.0604,0.0946,0,0.378,0.475,144.081,182627,4
2019-04-13,28,Be Alright,Dean Lewis,2Fxmhks0bxGSBdJ92vM42m,False,24,23,23,0.553,0.586,11,-6.319,1,0.0362,0.697,0,0.0813,0.443,126.684,196373,4
2019-04-13,29,When The Party's Over,Billie Eilish,2Fxmhks0bxGSBdJ92vM42m,False,0,29,21,0.367,0.111,4,-14.084,1,0.0972,0.978,3.97e-05,0.0897,0.198,82.642,196077,4
2019-04-13,30,Drip Too Hard,Lil Baby & Gunna,2Fxmhks0bxGSBdJ92vM42m,False,26,4,29,0.897,0.662,1,-6.903,0,0.292,0.0852,0,0.534,0.389,112.511,145543,4
2019-04-13,31,Wish You Were Gay,Billie Eilish,2Fxmhks0bxGSBdJ92vM42m,False,84,31,5,0.853,0.351,7,-10.198,1,0.241,0.39,9.38e-06,0.752,0.282,118.028,221543,4
2019-04-13,32,You Say,Lauren Daigle,2Fxmhks0bxGSBdJ92vM42m,False,30,29,38,0.494,0.632,5,-6.89,1,0.0342,0.682,0,0.0869,0.0797,147.873,274693,4
2019-04-13,33,Pure Water,Mustard & Migos,2Fxmhks0bxGSBdJ92vM42m,False,31,31,10,0.682,0.559,0,-5.545,1,0.127,0.174,0,0.344,0.137,202.015,192471,4
2019-04-13,34,Better Now,Post Malone,2Fxmhks0bxGSBdJ92vM42m,False,29,3,49,0.68,0.578,10,-5.804,1,0.04,0.331,0,0.135,0.341,145.038,231267,4
2019-04-13,35,Xanny,Billie Eilish,4QIo4oxwzzafcBWkKjDpXY,True,0,35,1,0.521,0.125,9,-17.832,1,0.239,0.751,0.00207,0.265,0.0528,111.554,243725,4
2019-04-13,36,Money,Cardi B,4QIo4oxwzzafcBWkKjDpXY,False,28,13,24,0.95,0.59,8,-6.508,0,0.29,0.00534,0,0.11,0.219,130.003,183527,4
2019-04-13,37,Look Back At It,A Boogie Wit da Hoodie,4QIo4oxwzzafcBWkKjDpXY,False,35,32,17,0.791,0.587,3,-5.075,0,0.0413,0.407,0,0.148,0.536,96.057,179449,4
2019-04-13,38,Envy Me,Calboy,4QIo4oxwzzafcBWkKjDpXY,False,36,36,16,0.74,0.488,1,-7.664,0,0.27,0.234,0,0.241,0.584,149.042,120133,4
2019-04-13,39,Talk,Khalid,4QIo4oxwzzafcBWkKjDpXY,False,40,39,8,0.901,0.4,0,-8.575,1,0.126,0.051,0,0.0599,0.346,135.984,197573,4
2019-04-13,40,Youngblood,5 Seconds Of Summer,4QIo4oxwzzafcBWkKjDpXY,False,32,7,44,0.596,0.854,7,-5.114,0,0.463,0.0169,0,0.124,0.152,120.274,203418,4
2019-04-13,41,You Should See Me In A Crown,Billie Eilish,4QIo4oxwzzafcBWkKjDpXY,False,0,41,2,0.678,0.533,4,-10.485,1,0.186,0.462,0.219,0.139,0.323,150.455,180953,4
2019-04-13,42,Baby Shark,Pinkfong,4QIo4oxwzzafcBWkKjDpXY,False,33,32,14,0.829,0.886,8,-1.746,1,0.112,0.259,0,0.0559,0.777,115.056,80927,4
2019-04-13,43,My Strange Addiction,Billie Eilish,3Tc57t9l2O8FwQZtQOvPXK,True,0,43,1,0.939,0.305,8,-10.952,0,0.354,0.35,0.000169,0.105,0.563,100.029,179889,4
2019-04-13,44,Racks In The Middle,Nipsey Hussle Featuring Roddy Ricch & Hit-Boy,6ya8ejoKgw906Y8LWclqrp,True,0,44,1,0.671,0.833,5,-5.152,0,0.395,0.0825,0,0.0726,0.702,79.351,233278,4
2019-04-13,45,MIA,Bad Bunny Featuring Drake,6ya8ejoKgw906Y8LWclqrp,False,34,5,25,0.817,0.539,6,-6.349,0,0.0621,0.0141,0.000496,0.099,0.158,97.062,210368,4
2019-04-13,46,All The Good Girls Go To Hell,Billie Eilish,6IRdLKIyS4p7XNiP8r6rsx,True,0,46,1,0.726,0.444,8,-8.922,0,0.372,0.283,0.143,0.177,0.569,185.044,168840,4
2019-04-13,47,Act Up,City Girls,6IRdLKIyS4p7XNiP8r6rsx,False,43,43,5,0.938,0.638,8,-4.713,1,0.189,0.0167,0,0.111,0.313,97.075,158332,4
2019-04-13,48,Robbery,Juice WRLD,6IRdLKIyS4p7XNiP8r6rsx,False,37,27,7,0.685,0.692,2,-5.122,1,0.0457,0.328,0,0.153,0.578,159.966,240051,5
2019-04-13,49,ZEZE,Kodak Black Featuring Travis Scott & Offset,6IRdLKIyS4p7XNiP8r6rsx,False,38,2,25,0.861,0.603,8,-5.788,0,0.176,0.0521,0,0.0924,0.504,98.043,228760,4
2019-04-13,50,Tequila,Dan + Shay,6IRdLKIyS4p7XNiP8r6rsx,False,39,21,48,0.489,0.581,11,-5.731,1,0.0281,0.0312,0,0.132,0.494,86.016,196747,4
2019-04-13,51,Here Tonight,Brett Young,6IRdLKIyS4p7XNiP8r6rsx,False,51,51,13,0.517,0.776,11,-5.271,1,0.0362,0.0144,0,0.113,0.448,96.002,216533,4
2019-04-13,52,Swervin,A Boogie Wit da Hoodie Featuring 6ix9ine,6IRdLKIyS4p7XNiP8r6rsx,False,44,38,15,0.581,0.662,9,-5.239,1,0.303,0.0153,0,0.111,0.434,93.023,189487,4
2019-04-13,53,I Love You,Billie Eilish,6CcJMwBtXByIz4zQLzFkKc,True,0,53,1,0.421,0.131,0,-18.435,1,0.0382,0.952,0.00453,0.109,0.12,137.446,291796,4
2019-04-13,54,Mixed Personalities,YNW Melly Featuring Kanye West,6CcJMwBtXByIz4zQLzFkKc,False,42,42,11,0.661,0.44,2,-9.104,1,0.0803,0.457,0,0.128,0.352,149.937,230400,4
2019-04-13,55,Here With Me,Marshmello Featuring CHVRCHES,6CcJMwBtXByIz4zQLzFkKc,False,53,53,4,0.791,0.565,5,-3.933,0,0.0439,0.0623,0,0.156,0.181,99.961,156347,4
2019-04-13,56,Who Do You Love,The Chainsmokers Featuring 5 Seconds Of Summer,6CcJMwBtXByIz4zQLzFkKc,False,52,52,8,0.51,0.846,3,-4.595,1,0.0461,0.0101,0,0.208,0.475,139.927,226733,4
2019-04-13,57,Put A Date On It,Yo Gotti Featuring Lil Baby,6CcJMwBtXByIz4zQLzFkKc,False,46,46,10,0.835,0.659,4,-5.696,1,0.31,0.0123,0,0.372,0.579,129.93,195257,4
2019-04-13,58,Con Calma,Daddy Yankee & Katy Perry Featuring Snow,6CcJMwBtXByIz4zQLzFkKc,False,49,48,9,0.737,0.86,8,-2.652,0,0.0593,0.11,1.94e-06,0.0574,0.656,93.989,193227,4
2019-04-13,59,God's Country,Blake Shelton,1dyxS3YzBbL0t8rEVwVQ1K,True,0,59,1,0.538,0.752,10,-5.106,1,0.0396,0.0608,5.39e-06,0.118,0.217,139.984,205107,4
2019-04-13,60,Worth It,YK Osiris,1dyxS3YzBbL0t8rEVwVQ1K,False,55,55,7,0.749,0.535,5,-4.054,0,0.0638,0.517,0,0.0942,0.459,124.008,189253,5
2019-04-13,61,Eyes On You,Chase Rice,1dyxS3YzBbL0t8rEVwVQ1K,False,54,54,7,0.606,0.652,9,-6.982,1,0.0281,0.323,0,0.201,0.476,97.155,182493,4
2019-04-13,62,Ilomilo,Billie Eilish,7qEKqBCD2vE5vIBsrUitpD,True,0,62,1,0.855,0.423,5,-15.044,0,0.0585,0.724,0.469,0.0896,0.572,120.02,156371,4
2019-04-13,63,Listen Before I Go,Billie Eilish,0tMSssfxAL2oV8Vri0mFHE,True,0,63,1,0.319,0.0561,0,-23.023,1,0.045,0.935,0.00384,0.388,0.082,79.764,242652,3
2019-04-13,64,Close Friends,Lil Baby,0tMSssfxAL2oV8Vri0mFHE,False,57,28,23,0.676,0.578,10,-4.669,0,0.375,0.0509,0,0.0796,0.698,158.896,203881,4
2019-04-13,65,Double Up,Nipsey Hussle Featuring Belly & DOM KENNEDY,4iVD0fTHGxV9JWloujsL3s,True,0,65,1,0.604,0.436,2,-8.32,1,0.188,0.0544,0.000242,0.162,0.239,107.978,361280,4
2019-04-13,66,Bad Liar,Imagine Dragons,4iVD0fTHGxV9JWloujsL3s,False,56,56,6,0.374,0.642,3,-6.737,1,0.0611,0.0672,0,0.331,0.112,177.9,260293,4
2019-04-13,67,Whiskey Glasses,Morgan Wallen,4iVD0fTHGxV9JWloujsL3s,False,66,66,5,0.614,0.68,6,-4.58,1,0.0289,0.369,1.84e-06,0.115,0.707,149.959,234347,4
2019-04-13,68,Good As You,Kane Brown,4iVD0fTHGxV9JWloujsL3s,False,59,59,6,0.634,0.516,8,-6.05,1,0.0373,0.4,0,0.142,0.769,153.831,192053,4
2019-04-13,69,One That Got Away,Michael Ray,4iVD0fTHGxV9JWloujsL3s,False,67,67,6,0.565,0.825,10,-4.245,1,0.0417,0.00303,0,0.0779,0.609,160.003,218733,4
2019-04-13,70,Monopoly,Ariana Grande & Victoria Monet,6tsOcBnaKgzK22yEiqRh8P,True,0,70,1,0.892,0.507,0,-8.282,1,0.378,0.704,3.14e-05,0.109,0.695,143.96,158587,4
2019-04-13,71,Miss Me More,Kelsea Ballerini,6tsOcBnaKgzK22yEiqRh8P,False,60,60,9,0.643,0.72,2,-7.146,1,0.0527,0.014,0,0.0834,0.491,96.028,192840,4
2019-04-13,72,Shot Clock,Ella Mai,6tsOcBnaKgzK22yEiqRh8P,False,62,62,10,0.512,0.512,4,-6.008,0,0.285,0.654,0,0.148,0.434,95.11,201609,1
2019-04-13,73,Make It Sweet,Old Dominion,6tsOcBnaKgzK22yEiqRh8P,False,74,73,14,0.424,0.837,7,-4.453,1,0.0472,0.0373,0,0.0665,0.554,180.175,187000,4
2019-04-13,74,Look What God Gave Her,Thomas Rhett,6tsOcBnaKgzK22yEiqRh8P,False,69,52,5,0.739,0.85,2,-3.966,1,0.0308,0.0272,0,0.181,0.883,113.0,168960,4
2019-04-13,75,There Was This Girl,Riley Green,6tsOcBnaKgzK22yEiqRh8P,False,71,71,6,0.616,0.877,1,-4.223,1,0.0347,0.00258,2.56e-06,0.114,0.94,127.981,194427,4
2019-04-13,76,Girls Need Love,Summer Walker X Drake,6tsOcBnaKgzK22yEiqRh8P,False,58,37,6,0.656,0.432,6,-9.481,0,0.217,0.443,0,0.132,0.0897,97.022,222374,4
2019-04-13,77,Undrunk,FLETCHER,6tsOcBnaKgzK22yEiqRh8P,False,61,61,4,0.442,0.579,5,-6.484,1,0.145,0.489,1.04e-06,0.126,0.546,83.336,183428,4
2019-04-13,78,I've Been Waiting,Lil Peep & iLoveMakonnen Featuring Fall Out Boy,6tsOcBnaKgzK22yEiqRh8P,False,75,75,4,0.741,0.845,5,-3.568,0,0.0381,0.15,0,0.174,0.926,129.939,233613,4
2019-04-13,79,8,Billie Eilish,6X29iaaazwho3ab7GNue5r,True,0,79,1,0.735,0.235,3,-13.239,1,0.315,0.698,0.00604,0.107,0.462,62.446,173202,4
2019-04-13,80,Walk Me Home,P!nk,6X29iaaazwho3ab7GNue5r,False,63,54,5,0.652,0.453,1,-6.119,1,0.0445,0.0519,0,0.179,0.432,88.038,177391,3
2019-04-13,81,Saturday Nights,Khalid & Kane Brown,6X29iaaazwho3ab7GNue5r,False,73,57,9,0.551,0.44,10,-8.559,1,0.0985,0.606,3.02e-05,0.11,0.341,167.923,210667,4
2019-04-13,82,Last Time That I Checc'd,Nipsey Hussle Featuring YG,39xWBHPM4E9MwzEy5gbM7p,True,0,82,1,0.711,0.746,1,-4.224,1,0.253,0.0289,0,0.371,0.279,96.024,225573,4
2019-04-13,83,Twerk,City Girls Featuring Cardi B,39xWBHPM4E9MwzEy5gbM7p,False,50,29,13,0.788,0.842,4,-4.006,0,0.142,0.121,0.00112,0.166,0.481,190.077,166476,4
2019-04-13,84,GIRL,Maren Morris,39xWBHPM4E9MwzEy5gbM7p,False,77,61,5,0.44,0.793,6,-3.95,1,0.0501,0.0677,0,0.0788,0.447,143.603,250653,4
2019-04-13,85,Lovely,Billie Eilish & Khalid,39xWBHPM4E9MwzEy5gbM7p,False,96,64,22,0.351,0.296,4,-10.109,0,0.0333,0.934,0,0.095,0.12,115.284,200186,4
2019-04-13,86,Calma,Pedro Capo X Farruko,39xWBHPM4E9MwzEy5gbM7p,False,90,86,4,0.826,0.773,11,-4.218,0,0.0524,0.323,0,0.143,0.761,126.899,238200,4
2019-04-13,87,Suge,DaBaby,2gwkD6igEhQbDQegRCcdoB,True,0,87,1,0.876,0.662,2,-6.482,0,0.426,0.0608,0,0.127,0.844,75.445,163320,4
2019-04-13,88,Night Shift,Jon Pardi,2gwkD6igEhQbDQegRCcdoB,False,81,81,7,0.63,0.754,2,-3.564,1,0.0284,0.0963,0,0.268,0.73,95.999,172253,4
2019-04-13,89,This Is It,Scotty McCreery,2gwkD6igEhQbDQegRCcdoB,False,68,42,17,0.579,0.511,8,-6.788,1,0.0293,0.254,0,0.099,0.594,78.003,230973,4
2019-04-13,90,Rumor,Lee Brice,2gwkD6igEhQbDQegRCcdoB,False,83,83,4,0.655,0.56,9,-6.857,1,0.0486,0.749,0,0.115,0.599,140.975,198440,4
2019-04-13,91,I Can't Get Enough,"benny blanco, Tainy, Selena Gomez & J Balvin",2gwkD6igEhQbDQegRCcdoB,False,85,66,5,0.541,0.468,10,-4.039,0,0.362,0.404,3.65e-06,0.358,0.69,95.266,158027,4
2019-04-13,92,Don't Call Me Up,Mabel,2gwkD6igEhQbDQegRCcdoB,False,97,92,2,0.674,0.881,9,-2.853,1,0.147,0.296,3.01e-06,0.0793,0.234,98.994,178480,4
2019-04-13,93,Dedication,Nipsey Hussle Featuring Kendrick Lamar,6fIjnWrv46njJHLDAY2JdC,True,0,93,1,0.512,0.734,8,-5.448,0,0.438,0.431,0,0.226,0.168,93.995,245813,4
2019-04-13,94,Ocean Eyes,Billie Eilish,6fIjnWrv46njJHLDAY2JdC,False,0,94,7,0.511,0.363,4,-7.65,0,0.041,0.816,0.0317,0.084,0.169,144.892,200379,4
2019-04-13,95,Millionaire,Chris Stapleton,6fIjnWrv46njJHLDAY2JdC,False,64,47,17,0.616,0.474,10,-9.608,1,0.0266,0.192,0.00762,0.0989,0.493,142.689,210133,4
2019-04-13,96,Talk You Out Of It,Florida Georgia Line,6fIjnWrv46njJHLDAY2JdC,False,88,80,7,0.651,0.708,4,-4.791,1,0.0376,0.582,0,0.0796,0.558,119.964,202920,4
2019-04-13,97,Faucet Failure,Ski Mask The Slump God,6fIjnWrv46njJHLDAY2JdC,False,87,87,6,0.935,0.552,10,-9.373,0,0.335,0.111,0,0.0952,0.615,99.993,145627,4
2019-04-13,98,Girl Like You,Jason Aldean,6fIjnWrv46njJHLDAY2JdC,False,76,46,19,0.543,0.88,3,-4.204,0,0.0365,0.035,0.000227,0.304,0.483,144.057,193067,4
2019-04-13,99,Pure Cocaine,Lil Baby,6fIjnWrv46njJHLDAY2JdC,False,70,46,15,0.964,0.487,10,-6.071,0,0.421,0.00127,6.57e-06,0.115,0.107,127.05,154024,4
2019-04-13,100,Pop Out,Polo G Featuring Lil Tjay,6fIjnWrv46njJHLDAY2JdC,False,95,95,2,0.772,0.639,1,-7.119,1,0.467,0.15,0,0.0698,0.261,168.112,166560,4
