date,position,title,artist,spotify_id,is_new,last_pos,peak_pos,weeks,danceability,energy,key,loudness,mode,speechiness,acousticness,instrumentalness,liveness,valence,tempo,duration_ms,time_signature
1998-12-12,1,I'm Your Angel,R. Kelly & Celine Dion,3LglfWKjbclW7Efzz8K1zS,False,1,1,2,0.62,0.504,0,-7.26,1,0.0301,0.669,0,0.11,0.266,112.681,332067,4
1998-12-12,2,Nobody's Supposed To Be Here,Deborah Cox,3LglfWKjbclW7Efzz8K1zS,False,2,2,11,0.662,0.531,8,-5.3,1,0.0361,0.202,1.16e-05,0.595,0.399,119.957,262333,4
1998-12-12,3,Lately,Divine,3LglfWKjbclW7Efzz8K1zS,False,3,1,14,0.686,0.48,9,-9.592,1,0.0312,0.206,1.16e-06,0.156,0.494,121.039,269533,4
1998-12-12,4,Doo Wop (That Thing),Lauryn Hill,3LglfWKjbclW7Efzz8K1zS,False,4,1,5,0.535,0.505,2,-8.926,0,0.245,0.0393,0,0.0923,0.495,99.935,320267,4
1998-12-12,5,From This Moment On,Shania Twain,3LglfWKjbclW7Efzz8K1zS,False,5,5,2,0.459,0.505,9,-5.487,1,0.0266,0.42,0,0.134,0.22,135.752,235107,4
1998-12-12,6,Because Of You,98 Degrees,3LglfWKjbclW7Efzz8K1zS,False,6,3,11,0.732,0.603,0,-7.624,1,0.0271,0.341,0,0.113,0.514,104.498,297893,4
1998-12-12,7,Love Like This,Faith Evans,3LglfWKjbclW7Efzz8K1zS,False,10,7,5,0.767,0.551,0,-7.328,1,0.0616,0.00364,0,0.0451,0.796,100.904,275707,4
1998-12-12,8,Lullaby,Shawn Mullins,3LglfWKjbclW7Efzz8K1zS,False,12,8,2,0.509,0.833,7,-5.337,1,0.0597,0.0398,0.00257,0.207,0.569,79.935,330667,4
1998-12-12,9,...Baby One More Time,Britney Spears,3LglfWKjbclW7Efzz8K1zS,False,18,9,4,0.759,0.699,0,-5.745,0,0.0307,0.202,0.000131,0.443,0.907,92.96,211067,4
1998-12-12,10,Have You Ever?,Brandy,3LglfWKjbclW7Efzz8K1zS,False,15,10,2,0.698,0.533,2,-6.246,1,0.0437,0.542,0,0.333,0.275,134.001,273440,4
1998-12-12,11,The First Night,Monica,3LglfWKjbclW7Efzz8K1zS,False,7,1,18,0.671,0.766,1,-9.218,0,0.0634,0.139,0,0.26,0.906,152.088,235573,4
1998-12-12,12,Iris,Goo Goo Dolls,3LglfWKjbclW7Efzz8K1zS,False,9,9,2,0.315,0.715,11,-8.072,0,0.0362,0.00125,7.97e-06,0.0942,0.497,155.925,289533,3
1998-12-12,13,This Kiss,Faith Hill,3LglfWKjbclW7Efzz8K1zS,False,11,7,39,0.398,0.804,11,-5.559,1,0.0451,0.175,0,0.181,0.709,186.752,194307,4
1998-12-12,14,Trippin',Total Featuring Missy Elliott,3LglfWKjbclW7Efzz8K1zS,False,20,14,6,0.753,0.831,11,-6.431,0,0.0958,0.173,1.23e-05,0.0927,0.505,124.151,267328,4
1998-12-12,15,How Deep Is Your Love,Dru Hill Featuring Redman,3LglfWKjbclW7Efzz8K1zS,False,8,3,10,0.729,0.434,3,-9.111,0,0.079,0.0473,1.23e-05,0.314,0.743,94.411,243360,4
1998-12-12,16,Jumper,Third Eye Blind,3LglfWKjbclW7Efzz8K1zS,False,16,16,2,0.599,0.543,0,-9.226,1,0.0302,0.0129,0.00193,0.291,0.624,91.105,272973,4
1998-12-12,17,Save Tonight,Eagle-Eye Cherry,3LglfWKjbclW7Efzz8K1zS,False,14,14,2,0.547,0.693,0,-8.786,1,0.0353,9.24e-05,5.46e-05,0.113,0.583,119.567,239227,4
1998-12-12,18,Hands,Jewel,3LglfWKjbclW7Efzz8K1zS,False,24,18,2,0.644,0.495,5,-10.175,0,0.0292,0.423,0.00128,0.082,0.321,127.221,235000,4
1998-12-12,19,One Week,Barenaked Ladies,3LglfWKjbclW7Efzz8K1zS,False,13,1,11,0.702,0.898,9,-6.003,1,0.0373,0.00854,0.000154,0.0917,0.731,112.845,169760,4
1998-12-12,20,Thank U,Alanis Morissette,3LglfWKjbclW7Efzz8K1zS,False,17,17,2,0.672,0.616,0,-5.764,1,0.0258,0.379,2.73e-05,0.0887,0.566,92.094,258773,4
1998-12-12,21,Love Me,112 Featuring Mase,3LglfWKjbclW7Efzz8K1zS,False,19,17,8,0.654,0.817,0,-5.898,1,0.153,0.124,1.18e-05,0.156,0.649,90.063,257333,4
1998-12-12,22,Can I Get A...,Jay-Z Featuring Amil (Of Major Coinz) & Ja,3LglfWKjbclW7Efzz8K1zS,False,27,22,11,0.792,0.694,8,-8.496,0,0.33,0.0619,2.32e-05,0.25,0.804,177.094,309773,4
1998-12-12,23,My Favorite Mistake,Sheryl Crow,3LglfWKjbclW7Efzz8K1zS,False,23,23,2,0.613,0.754,4,-8.191,0,0.0318,0.00594,0.000318,0.33,0.576,104.651,245093,4
1998-12-12,24,Slide,Goo Goo Dolls,3LglfWKjbclW7Efzz8K1zS,False,25,24,2,0.395,0.843,8,-4.476,1,0.0374,0.00483,0,0.0404,0.481,112.423,212067,4
1998-12-12,25,I'll Be,Edwin McCain,3LglfWKjbclW7Efzz8K1zS,False,22,5,12,0.371,0.609,11,-5.524,1,0.0295,0.386,0,0.104,0.426,136.526,266533,3
1998-12-12,26,Are You That Somebody?,Aaliyah,3LglfWKjbclW7Efzz8K1zS,False,21,21,2,0.848,0.663,9,-7.078,0,0.159,0.124,0.0293,0.0737,0.833,137.953,265667,4
1998-12-12,27,Touch It,Monifah,3LglfWKjbclW7Efzz8K1zS,False,28,9,19,0.863,0.476,8,-10.019,0,0.0932,0.0307,0.0515,0.0706,0.783,115.459,285827,4
1998-12-12,28,Too Close,Next,3LglfWKjbclW7Efzz8K1zS,False,32,1,44,0.847,0.402,7,-9.952,1,0.0641,0.0118,0,0.283,0.752,99.693,259440,4
1998-12-12,29,Crush,Jennifer Paige,3LglfWKjbclW7Efzz8K1zS,False,26,3,24,0.733,0.706,1,-5.652,0,0.0292,0.0262,0,0.0881,0.598,115.04,199960,4
1998-12-12,30,The Power Of Good-Bye,Madonna,3LglfWKjbclW7Efzz8K1zS,False,30,11,9,0.534,0.561,5,-11.089,0,0.0409,0.0442,0.678,0.189,0.219,84.978,250560,4
1998-12-12,31,Inside Out,Eve 6,3LglfWKjbclW7Efzz8K1zS,False,31,31,2,0.483,0.818,11,-7.666,1,0.0444,0.114,0,0.367,0.691,175.668,219467,4
1998-12-12,32,Westside,TQ,3LglfWKjbclW7Efzz8K1zS,False,29,12,11,0.685,0.62,4,-6.665,0,0.0406,0.19,0,0.158,0.372,82.52,304733,4
1998-12-12,33,Let Me Let Go,Faith Hill,3LglfWKjbclW7Efzz8K1zS,False,39,33,2,0.592,0.49,6,-8.053,1,0.0241,0.489,0,0.0967,0.29,91.775,264507,4
1998-12-12,34,All The Places (I Will Kiss You),Aaron Hall,3LglfWKjbclW7Efzz8K1zS,False,33,26,9,0.722,0.423,0,-5.711,0,0.0566,0.0161,2.11e-06,0.0603,0.353,136.039,240133,4
1998-12-12,35,Take Me There,BLACKstreet & Mya Featuring Mase & Blinky Blink,3LglfWKjbclW7Efzz8K1zS,False,70,35,2,0.401,0.872,0,-4.91,1,0.117,0.215,0.00104,0.292,0.642,78.443,243000,3
1998-12-12,36,Hard Knock Life (Ghetto Anthem),JAY-Z,3LglfWKjbclW7Efzz8K1zS,False,36,32,6,0.884,0.679,10,-5.857,0,0.282,0.0957,0.00209,0.0289,0.591,76.993,238467,4
1998-12-12,37,Someone You Used To Know,Collin Raye,3LglfWKjbclW7Efzz8K1zS,False,45,37,4,0.589,0.369,9,-11.477,1,0.0242,0.123,2.21e-06,0.114,0.295,98.997,225440,4
1998-12-12,38,It Must Be Love,Ty Herndon,3LglfWKjbclW7Efzz8K1zS,False,40,38,2,0.622,0.784,4,-4.576,1,0.0342,0.249,0,0.121,0.727,115.958,212307,4
1998-12-12,39,Husbands And Wives,Brooks & Dunn,3LglfWKjbclW7Efzz8K1zS,False,48,39,2,0.507,0.388,5,-8.069,1,0.027,0.653,0.000216,0.162,0.12,105.601,190347,3
1998-12-12,40,Miami,Will Smith,3LglfWKjbclW7Efzz8K1zS,False,57,40,2,0.877,0.534,1,-6.178,1,0.15,0.0339,1.67e-05,0.0441,0.89,108.17,197560,4
1998-12-12,41,Pushin' Weight,Ice Cube Featuring Mr. Short Khop,3LglfWKjbclW7Efzz8K1zS,False,44,28,7,0.826,0.836,10,-4.252,0,0.221,0.00398,0,0.108,0.556,91.788,274600,4
1998-12-12,42,Torn,Natalie Imbruglia,3LglfWKjbclW7Efzz8K1zS,False,47,42,2,0.575,0.886,5,-5.182,1,0.034,0.0647,0.000187,0.709,0.609,96.309,244667,4
1998-12-12,43,You're Easy On The Eyes,Terri Clark,3LglfWKjbclW7Efzz8K1zS,False,50,43,2,0.724,0.793,0,-5.837,1,0.0271,0.127,0,0.0713,0.898,126.486,213160,4
1998-12-12,44,We Really Shouldn't Be Doing This,George Strait,3LglfWKjbclW7Efzz8K1zS,False,49,44,2,0.684,0.814,6,-7.668,1,0.0307,0.331,0.00049,0.357,0.961,146.905,143733,4
1998-12-12,45,I'll Never Break Your Heart,Backstreet Boys,3LglfWKjbclW7Efzz8K1zS,False,35,35,2,0.519,0.589,7,-6.005,0,0.029,0.0885,0,0.153,0.341,161.992,287507,3
1998-12-12,46,I Don't Want To Miss A Thing,Aerosmith,3LglfWKjbclW7Efzz8K1zS,False,37,1,15,0.383,0.662,2,-5.162,1,0.0333,0.165,0,0.248,0.138,121.154,298760,4
1998-12-12,47,Wide Open Spaces,Dixie Chicks,3LglfWKjbclW7Efzz8K1zS,False,41,41,15,0.563,0.544,4,-6.102,1,0.0306,0.577,0,0.128,0.602,179.351,223832,4
1998-12-12,48,Fly Away,Lenny Kravitz,3LglfWKjbclW7Efzz8K1zS,False,52,48,2,0.587,0.872,7,-5.066,1,0.0484,0.018,0,0.622,0.735,159.925,221333,4
1998-12-12,49,Ghetto Cowboy,Mo Thugs Family Featuring Bone Thugs-N-Harmony,3LglfWKjbclW7Efzz8K1zS,False,54,29,4,0.693,0.637,0,-5.487,1,0.158,0.00096,0.00498,0.0908,0.204,170.26,324493,4
1998-12-12,50,Real World,matchbox 20,3LglfWKjbclW7Efzz8K1zS,False,38,38,2,0.504,0.761,10,-5.446,1,0.0437,0.00628,0,0.0892,0.884,117.999,231693,4
1998-12-12,51,These Are The Times,Dru Hill,3LglfWKjbclW7Efzz8K1zS,False,56,51,2,0.718,0.473,9,-9.278,0,0.0267,0.106,0,0.0964,0.384,109.992,248400,4
1998-12-12,52,Right On The Money,Alan Jackson,3LglfWKjbclW7Efzz8K1zS,False,53,52,2,0.762,0.415,3,-11.262,1,0.0302,0.423,0,0.316,0.567,113.975,229827,4
1998-12-12,53,When You Believe,Whitney Houston & Mariah Carey,3LglfWKjbclW7Efzz8K1zS,False,51,51,2,0.436,0.39,1,-9.62,0,0.0326,0.557,0,0.12,0.119,125.313,272893,4
1998-12-12,54,I Still Love You,Next,3LglfWKjbclW7Efzz8K1zS,False,34,14,19,0.578,0.447,9,-10.49,0,0.0682,0.506,0,0.308,0.783,170.775,254200,4
1998-12-12,55,Changes,2Pac,3LglfWKjbclW7Efzz8K1zS,False,68,55,2,0.865,0.665,7,-6.289,1,0.073,0.0453,0,0.224,0.331,111.113,268827,4
1998-12-12,56,Angel,Sarah McLachlan,3LglfWKjbclW7Efzz8K1zS,False,63,56,2,0.532,0.0744,1,-16.092,1,0.0355,0.949,1.22e-05,0.106,0.125,117.131,270400,3
1998-12-12,57,(God Must Have Spent) A Little More Time On You,'N Sync,3LglfWKjbclW7Efzz8K1zS,False,60,57,2,0.61,0.926,8,-4.843,0,0.0479,0.031,0.0012,0.0821,0.861,172.638,200400,4
1998-12-12,58,You're Beginning To Get To Me,Clay Walker,3LglfWKjbclW7Efzz8K1zS,False,58,58,2,0.536,0.582,4,-6.589,1,0.0397,0.184,0,0.109,0.491,83.238,161533,4
1998-12-12,59,Come And Get With Me,Keith Sweat Featuring Snoop Dogg,3LglfWKjbclW7Efzz8K1zS,False,42,12,8,0.831,0.44,1,-7.273,1,0.203,0.172,0,0.115,0.628,92.688,293720,4
1998-12-12,60,You Get What You Give,New Radicals,3LglfWKjbclW7Efzz8K1zS,False,64,60,2,0.621,0.901,2,-5.396,1,0.0302,0.17,0,0.0875,0.744,113.967,300773,4
1998-12-12,61,For You I Will,Aaron Tippin,3LglfWKjbclW7Efzz8K1zS,False,55,55,10,0.652,0.561,1,-7.271,1,0.0247,0.137,0.00309,0.12,0.385,107.747,211733,4
1998-12-12,62,My Little Secret,Xscape,3LglfWKjbclW7Efzz8K1zS,False,46,9,8,0.814,0.431,8,-9.125,1,0.0936,0.371,0,0.335,0.542,129.957,268040,4
1998-12-12,63,Angel Of Mine,Monica,3LglfWKjbclW7Efzz8K1zS,False,74,63,2,0.592,0.562,10,-6.869,0,0.0239,0.00373,3.23e-05,0.223,0.208,90.16,250173,4
1998-12-12,64,Wrong Again,Martina McBride,3LglfWKjbclW7Efzz8K1zS,False,61,61,2,0.531,0.554,0,-5.231,1,0.0265,0.215,0,0.101,0.102,141.434,195400,4
1998-12-12,65,There You Have It,BlackHawk,3LglfWKjbclW7Efzz8K1zS,False,65,65,2,0.711,0.667,4,-5.75,1,0.0258,0.218,0,0.354,0.777,113.655,192267,4
1998-12-12,66,A Little Past Little Rock,Lee Ann Womack,3LglfWKjbclW7Efzz8K1zS,False,43,43,7,0.439,0.539,4,-8.035,1,0.0329,0.602,1.31e-05,0.155,0.319,171.888,256027,4
1998-12-12,67,Home Alone,R. Kelly Featuring Keith Murray,3LglfWKjbclW7Efzz8K1zS,False,71,67,2,0.887,0.643,4,-2.578,0,0.214,0.0447,0,0.132,0.513,99.533,299560,4
1998-12-12,68,Hold Me,Brian McKnight Featuring Tone & Kobe Bryant,3LglfWKjbclW7Efzz8K1zS,False,90,68,2,0.866,0.476,0,-8.121,1,0.0522,0.0414,0.000149,0.0523,0.631,96.932,229000,4
1998-12-12,69,Sweetest Thing,U2,3LglfWKjbclW7Efzz8K1zS,False,66,66,2,0.524,0.641,0,-8.967,1,0.0497,0.0437,2.78e-05,0.159,0.482,141.65,184543,4
1998-12-12,70,Pretty Fly (For A White Guy),The Offspring,3LglfWKjbclW7Efzz8K1zS,False,72,70,2,0.723,0.895,11,-3.707,0,0.102,0.088,0,0.0717,0.963,143.373,188667,4
1998-12-12,71,Rosa Parks,OutKast,3LglfWKjbclW7Efzz8K1zS,False,75,71,2,0.792,0.701,6,-7.198,0,0.283,0.105,0,0.761,0.251,103.89,324373,4
1998-12-12,72,It's Your Song,Garth Brooks,3LglfWKjbclW7Efzz8K1zS,False,62,62,2,0.597,0.286,8,-9.49,1,0.03,0.8,1.73e-06,0.0951,0.134,137.845,225120,4
1998-12-12,73,"Spirit Of A Boy, Wisdom Of A Man",Randy Travis,3LglfWKjbclW7Efzz8K1zS,False,84,73,2,0.519,0.398,3,-10.968,1,0.0273,0.608,1.79e-05,0.11,0.247,71.932,230040,3
1998-12-12,74,For A Little While,Tim McGraw,3LglfWKjbclW7Efzz8K1zS,False,86,74,2,0.554,0.815,7,-7.954,1,0.0256,0.133,0,0.0778,0.618,99.333,213893,4
1998-12-12,75,Stand Beside Me,Jo Dee Messina,6bZOZIVFWpCydhyXrqP1iR,True,0,75,1,0.587,0.72,0,-7.746,1,0.0278,0.179,0,0.0878,0.33,99.916,224640,4
1998-12-12,76,Hooch,Everything,6bZOZIVFWpCydhyXrqP1iR,False,69,69,2,0.69,0.803,4,-6.549,1,0.0354,0.032,2.01e-05,0.0676,0.602,95.959,219844,4
1998-12-12,77,Father Of Mine,Everclear,6bZOZIVFWpCydhyXrqP1iR,False,77,77,2,0.568,0.94,1,-5.401,1,0.0411,0.000431,4.96e-05,0.0779,0.738,97.096,231400,4
1998-12-12,78,How Do You Sleep At Night,Wade Hayes,6bZOZIVFWpCydhyXrqP1iR,False,67,67,2,0.709,0.685,6,-6.639,0,0.0251,0.00628,0.000453,0.141,0.465,123.997,205800,4
1998-12-12,79,Lean On Me,"Kirk Franklin Featuring Mary J. Blige, Bono, R. Kelly, Crystal Lewis & The Family",6bZOZIVFWpCydhyXrqP1iR,False,80,79,2,0.517,0.464,5,-8.021,1,0.0275,0.269,0,0.0827,0.162,106.395,309067,4
1998-12-12,80,Where The Green Grass Grows,Tim McGraw,6bZOZIVFWpCydhyXrqP1iR,False,79,79,2,0.479,0.698,7,-7.914,1,0.0277,0.198,0,0.126,0.673,159.699,201600,4
1998-12-12,81,Angel In Disguise,Brandy,6bZOZIVFWpCydhyXrqP1iR,False,78,78,2,0.625,0.643,1,-6.773,0,0.0307,0.0301,0.00233,0.347,0.593,140.135,288267,4
1998-12-12,82,Hold On To Me,John Michael Montgomery,6bZOZIVFWpCydhyXrqP1iR,False,91,82,2,0.488,0.425,10,-9.407,1,0.0262,0.333,0,0.104,0.233,165.06,251200,3
1998-12-12,83,Never There,Cake,6bZOZIVFWpCydhyXrqP1iR,False,87,83,2,0.761,0.735,9,-8.171,0,0.043,0.0426,0.0838,0.0917,0.592,125.815,164267,4
1998-12-12,84,Wrong Night,Reba,3LYHh0VAiQhcw2rgqhtNf4,True,0,84,1,0.532,0.95,9,-4.123,1,0.106,0.103,0,0.315,0.898,156.815,171027,4
1998-12-12,85,Wherever You Go,Voices Of Theory,3LYHh0VAiQhcw2rgqhtNf4,False,81,36,9,0.527,0.461,11,-7.57,1,0.0252,0.687,0,0.187,0.261,107.836,339760,4
1998-12-12,86,Don't Laugh At Me,Mark Wills,3LYHh0VAiQhcw2rgqhtNf4,False,73,73,2,0.399,0.357,5,-10.86,1,0.028,0.389,0,0.159,0.267,178.088,217800,4
1998-12-12,87,Absence Of The Heart,Deana Carter,3LYHh0VAiQhcw2rgqhtNf4,False,83,83,2,0.59,0.299,6,-10.839,1,0.0246,0.684,1.83e-05,0.0976,0.139,84.981,210733,4
1998-12-12,88,Movin' On,Mya Featuring Silkk The Shocker,3LYHh0VAiQhcw2rgqhtNf4,False,76,34,19,0.74,0.569,1,-9.641,0,0.0984,0.236,0.00565,0.0815,0.608,90.457,270267,4
1998-12-12,89,Fire Escape,Fastball,3LYHh0VAiQhcw2rgqhtNf4,False,89,89,2,0.576,0.813,6,-5.69,1,0.0297,0.00354,0.143,0.0712,0.857,125.686,201133,4
1998-12-12,90,Celebrity Skin,Hole,3LYHh0VAiQhcw2rgqhtNf4,False,85,85,2,0.438,0.905,9,-6.161,1,0.0419,9.44e-06,5.4e-05,0.363,0.723,134.163,162667,4
1998-12-12,91,If I Lost You,Travis Tritt,3LYHh0VAiQhcw2rgqhtNf4,False,92,86,9,0.458,0.395,5,-7.313,1,0.0263,0.242,1.16e-06,0.137,0.124,140.011,228867,4
1998-12-12,93,How Do You Fall In Love,Alabama,,False,82,82,2,0.44,0.17,2,-13.266,1,0.0271,0.57,1.28e-05,0.122,0.272,84.565,179827,4
1998-12-12,94,It's The Things You Do,Five,,False,99,53,5,0.768,0.871,8,-4.255,0,0.0393,0.0792,0,0.325,0.961,94.02,208960,4
1998-12-12,95,Fly (The Angel Song),The Wilkinsons,48jSA0lHI6q7v4DhK23mYz,True,0,95,1,0.531,0.47,6,-8.004,1,0.0331,0.571,0,0.0688,0.246,170.395,222667,4
1998-12-12,96,No Place That Far,Sara Evans,0Rg5tIACULED7Jv2sEzWSd,True,0,96,1,0.547,0.373,0,-7.336,1,0.0273,0.504,0,0.176,0.182,132.741,217400,4
1998-12-12,97,Can't Get Enough,Willie Max Featuring Raphael Saadiq,0Rg5tIACULED7Jv2sEzWSd,False,96,49,6,0.738,0.324,8,-9.31,0,0.0571,0.0917,0.004,0.11,0.283,57.003,279467,4
1998-12-12,98,Everything's Changed,Lonestar,0Rg5tIACULED7Jv2sEzWSd,False,95,95,2,0.679,0.58,5,-7.034,1,0.0238,0.176,0.00153,0.0944,0.429,104.357,233773,4
1998-12-12,99,Jump Jive An' Wail,The Brian Setzer Orchestra,0Rg5tIACULED7Jv2sEzWSd,False,94,94,2,0.638,0.811,8,-5.43,1,0.117,0.0311,0,0.144,0.915,101.154,172933,4
1998-12-12,100,Thinkin' Bout It,Gerald Levert,0Rg5tIACULED7Jv2sEzWSd,False,88,12,15,0.738,0.659,1,-5.193,1,0.0653,0.0979,0,0.252,0.373,116.485,391040,4
