date,position,title,artist,spotify_id,is_new,last_pos,peak_pos,weeks,danceability,energy,key,loudness,mode,speechiness,acousticness,instrumentalness,liveness,valence,tempo,duration_ms,time_signature
1996-10-12,1,Macarena (Bayside Boys Mix),Los Del Rio,3ODF56f90W3qxDqxHAUi3v,False,1,1,43,0.927,0.721,8,-12.561,1,0.0908,0.422,4.36e-05,0.0422,0.965,103.018,249382,4
1996-10-12,2,I Love You Always Forever,Donna Lewis,3ODF56f90W3qxDqxHAUi3v,False,2,2,17,0.744,0.453,5,-11.977,1,0.0348,0.627,0.421,0.0898,0.122,103.773,239960,4
1996-10-12,3,It's All Coming Back To Me Now,Celine Dion,3ODF56f90W3qxDqxHAUi3v,False,3,3,9,0.384,0.438,0,-9.149,1,0.0362,0.753,0,0.101,0.287,87.903,456867,4
1996-10-12,4,Twisted,Keith Sweat,3ODF56f90W3qxDqxHAUi3v,False,4,2,17,0.615,0.514,11,-9.759,1,0.0466,0.393,0,0.248,0.822,175.849,260667,4
1996-10-12,5,Where Do You Go,No Mercy,3ODF56f90W3qxDqxHAUi3v,False,7,5,15,0.734,0.828,10,-11.018,0,0.0318,0.0346,0.118,0.071,0.964,127.06,272093,4
1996-10-12,6,Change The World,Eric Clapton,3ODF56f90W3qxDqxHAUi3v,False,6,5,13,0.721,0.558,9,-8.8,1,0.0246,0.492,0.00563,0.113,0.542,96.887,234867,4
1996-10-12,7,C'mon N' Ride It (The Train),Quad City DJ's,3ODF56f90W3qxDqxHAUi3v,False,5,3,31,0.843,0.959,6,-4.933,0,0.0914,0.0913,0,0.408,0.923,135.988,451440,4
1996-10-12,8,Loungin,LL Cool J,3ODF56f90W3qxDqxHAUi3v,False,8,3,15,0.817,0.584,7,-9.785,1,0.174,0.432,0.00609,0.225,0.501,99.947,229373,4
1996-10-12,10,"Last Night (From ""The Nutty Professor"")",Az Yet,,False,14,10,8,0.555,0.543,3,-8.874,0,0.0272,0.428,0,0.105,0.359,164.021,269027,4
1996-10-12,12,If Your Girl Only Knew,Aaliyah,,False,12,12,7,0.649,0.678,2,-7.396,0,0.0573,0.191,0.0224,0.291,0.711,92.02,312600,4
1996-10-12,14,Key West Intermezzo (I Saw You First),John Mellencamp,,False,19,14,7,0.673,0.858,11,-6.511,1,0.027,0.005,1.92e-05,0.274,0.959,116.477,294293,4
1996-10-12,15,Only You,112 Featuring The Notorious B.I.G.,,False,16,13,20,0.764,0.525,8,-5.969,1,0.048,0.0296,0,0.0993,0.787,95.813,289413,4
1996-10-12,16,Counting Blue Cars,Dishwalla,,False,18,15,28,0.454,0.79,11,-4.361,0,0.0285,0.00604,3.09e-05,0.225,0.362,100.225,291907,4
1996-10-12,17,Give Me One Reason,Tracy Chapman,,False,13,3,28,0.608,0.419,11,-10.016,1,0.0331,0.602,7.58e-06,0.108,0.602,100.22,268333,4
1996-10-12,18,I Can't Sleep Baby (If I),R. Kelly,,False,15,5,14,0.701,0.515,4,-7.899,0,0.0326,0.23,0,0.262,0.232,120.202,330720,4
1996-10-12,19,Who Will Save Your Soul,Jewel,,False,17,11,20,0.686,0.467,7,-9.712,1,0.0419,0.704,0.00103,0.13,0.753,126.179,239293,4
1996-10-12,20,Mouth,Merril Bainbridge,,False,20,20,6,0.695,0.499,1,-9.201,1,0.218,0.702,5.85e-05,0.154,0.78,175.896,205733,4
1996-10-12,21,Bow Down,Westside Connection,,False,21,21,3,0.897,0.458,9,-11.01,1,0.279,0.0208,0,0.419,0.513,92.928,206827,4
1996-10-12,22,If It Makes You Happy,Sheryl Crow,,False,24,22,4,0.543,0.681,7,-7.091,1,0.0289,0.0482,8.43e-05,0.104,0.292,95.415,323400,4
1996-10-12,24,Nobody,Keith Sweat Featuring Athena Cage,,False,37,24,2,0.699,0.492,9,-9.449,0,0.0318,0.484,0,0.0482,0.388,117.907,264773,4
1996-10-12,25,"Missing You (From ""Set It Off"")","Brandy, Tamia, Gladys Knight & Chaka Khan",,False,25,25,8,0.581,0.505,4,-5.434,1,0.0309,0.231,0,0.142,0.131,135.594,252494,4
1996-10-12,26,Let's Make A Night To Remember,Bryan Adams,,False,28,26,7,0.469,0.621,0,-6.763,1,0.0253,0.205,0.000776,0.135,0.395,175.906,378907,4
1996-10-12,27,This Is Your Night,Amber,,False,30,27,18,0.674,0.908,9,-3.262,0,0.0325,0.0714,0.000104,0.121,0.861,127.99,238160,4
1996-10-12,28,Pony,Ginuwine,,False,38,28,6,0.749,0.605,8,-9.359,0,0.086,0.00186,0.0381,0.115,0.966,142.024,251733,4
1996-10-12,29,Use Your Heart,SWV,,False,22,22,9,0.625,0.459,9,-9.537,1,0.0372,0.105,0.000162,0.334,0.651,73.927,289240,4
1996-10-12,30,"Insensitive (From ""Bed Of Roses"")",Jann Arden,,False,31,12,36,0.512,0.429,2,-9.931,1,0.0256,0.154,8.81e-05,0.101,0.332,178.669,255893,4
1996-10-12,31,My Boo,Ghost Town DJ's,,False,34,31,15,0.885,0.477,6,-9.196,0,0.0664,0.000131,0.000664,0.336,0.691,130.078,346840,4
1996-10-12,32,"What's Love Got To Do With It (From ""Supercop"")",Warren G Featuring Adina Howard,,False,32,32,4,0.757,0.675,1,-6.517,1,0.0649,0.296,0,0.196,0.336,102.032,203973,4
1996-10-12,33,Hit Me Off,New Edition,,False,26,3,7,0.72,0.719,7,-4.571,0,0.0882,0.185,0.000128,0.522,0.899,88.987,261400,4
1996-10-12,34,Sittin' On Top Of The World,Da Brat,6NWZkG7pv1raYZB1FVWMKA,True,0,34,1,0.793,0.673,7,-5.924,1,0.23,0.0383,0.000294,0.224,0.686,92.965,239173,4
1996-10-12,35,Elevators (Me & You),OutKast,6NWZkG7pv1raYZB1FVWMKA,False,27,12,12,0.772,0.586,10,-10.434,0,0.301,0.0234,0.000722,0.0562,0.643,85.068,265200,4
1996-10-12,36,Ascension (Don't Ever Wonder),Maxwell,6NWZkG7pv1raYZB1FVWMKA,False,36,36,9,0.753,0.471,0,-10.48,1,0.0317,0.0805,0.0299,0.131,0.778,96.038,346133,4
1996-10-12,37,"Tell Me (From ""Eddie"")",Dru Hill,6NWZkG7pv1raYZB1FVWMKA,False,41,37,7,0.723,0.297,6,-9.903,1,0.0326,0.231,0,0.115,0.541,130.182,253667,4
1996-10-12,38,Macarena,Los Del Rio,6NWZkG7pv1raYZB1FVWMKA,False,33,23,15,0.927,0.721,8,-12.561,1,0.0908,0.422,4.36e-05,0.0422,0.965,103.018,249382,4
1996-10-12,39,Sweet Dreams,La Bouche,6NWZkG7pv1raYZB1FVWMKA,False,29,13,29,0.656,0.956,11,-5.647,0,0.0536,0.0784,0.0247,0.0923,0.831,133.713,204587,4
1996-10-12,40,Nowhere To Go,Melissa Etheridge,035Wi3SCHzijMtWdhVv5K8,True,0,40,1,0.51,0.421,4,-11.24,1,0.0268,0.173,1.64e-05,0.187,0.215,102.577,353040,4
1996-10-12,41,Always Be My Baby,Mariah Carey,035Wi3SCHzijMtWdhVv5K8,False,42,1,28,0.65,0.531,4,-8.335,1,0.0364,0.457,0,0.249,0.487,78.946,258133,4
1996-10-12,42,Stupid Girl,Garbage,035Wi3SCHzijMtWdhVv5K8,False,35,24,12,0.59,0.802,11,-4.163,1,0.0356,0.00226,0.00143,0.0392,0.696,120.051,258133,4
1996-10-12,44,What Kind Of Man Would I Be,Mint Condition,,False,50,44,6,0.651,0.498,0,-8.868,0,0.0318,0.39,0,0.143,0.423,109.906,264600,4
1996-10-12,45,"Because You Loved Me (From ""Up Close & Personal"")",Celine Dion,,False,40,1,32,0.615,0.467,1,-9.883,1,0.0327,0.314,0,0.099,0.177,119.919,273667,4
1996-10-12,46,Nobody Knows,The Tony Rich Project,,False,44,2,44,0.64,0.433,5,-9.432,1,0.0374,0.509,4.9e-06,0.103,0.25,176.086,306933,4
1996-10-12,47,Jealousy,Natalie Merchant,,False,39,23,18,0.723,0.521,0,-9.78,1,0.028,0.296,0.0406,0.0998,0.61,101.127,161533,4
1996-10-12,48,No Diggity,BLACKstreet (Featuring Dr. Dre),138a7rJxyR3qKsLSPNO4uH,True,0,48,1,0.849,0.379,1,-10.546,0,0.0614,0.139,0.0917,0.0448,0.44,89.007,267053,4
1996-10-12,49,Ironic,Alanis Morissette,138a7rJxyR3qKsLSPNO4uH,False,43,4,31,0.408,0.582,11,-8.305,1,0.0508,0.218,0,0.159,0.365,114.926,230000,5
1996-10-12,50,The Things That You Do,Gina Thompson,138a7rJxyR3qKsLSPNO4uH,False,47,41,14,0.757,0.781,6,-5.331,0,0.199,0.0919,0.00144,0.0887,0.623,97.343,343467,4
1996-10-12,51,That Girl,Maxi Priest Featuring Shaggy,138a7rJxyR3qKsLSPNO4uH,False,48,20,16,0.667,0.698,5,-7.35,0,0.119,0.056,0,0.335,0.662,138.654,240947,4
1996-10-12,52,Birmingham,Amanda Marshall,138a7rJxyR3qKsLSPNO4uH,False,58,52,3,0.525,0.726,7,-8.381,1,0.0306,0.04,0.00332,0.0564,0.686,185.513,321067,4
1996-10-12,53,Let's Get The Mood Right,Johnny Gill,138a7rJxyR3qKsLSPNO4uH,False,53,53,4,0.548,0.364,4,-10.541,1,0.0316,0.348,0,0.0683,0.315,179.747,250493,3
1996-10-12,54,Tucker's Town,Hootie & The Blowfish,138a7rJxyR3qKsLSPNO4uH,False,49,38,14,0.419,0.666,0,-7.781,1,0.0401,0.0372,0,0.281,0.481,79.78,241973,4
1996-10-12,56,"Why Does It Hurt So Bad (From ""Waiting To Exhale"")",Whitney Houston,,False,46,26,11,0.625,0.422,10,-8.061,1,0.0238,0.139,0,0.209,0.259,76.862,278027,4
1996-10-12,57,Tell Me (I'll Be Around),Shades,,False,54,50,11,0.409,0.471,10,-11.716,1,0.0398,0.415,0.00614,0.303,0.228,144.979,228427,4
1996-10-12,58,Music Makes Me High,Lost Boyz,,False,62,58,2,0.841,0.599,1,-3.121,1,0.161,0.0029,0,0.296,0.56,94.145,270973,4
1996-10-12,59,Ready To Go,Republica,,False,59,59,10,0.559,0.953,2,-4.657,1,0.0568,0.000283,0.188,0.187,0.236,130.053,301067,4
1996-10-12,60,Do You Miss Me,Jocelyn Enriquez,,False,56,56,12,0.72,0.872,11,-8.705,0,0.0631,0.00265,0.00192,0.259,0.755,129.956,218253,4
1996-10-12,61,Your Secret Love,Luther Vandross,,False,52,52,4,0.658,0.688,5,-7.049,0,0.0297,0.191,1.23e-06,0.173,0.424,143.804,252600,4
1996-10-12,62,Falling,Montell Jordan,,False,76,62,2,0.742,0.424,0,-5.696,1,0.0457,0.119,0.0104,0.263,0.414,79.956,241533,4
1996-10-12,63,Steelo,702,,False,63,63,5,0.767,0.731,8,-8.109,0,0.114,0.103,0.00364,0.102,0.678,90.997,257960,4
1996-10-12,64,Don't Look Back In Anger,Oasis,,False,57,55,9,0.349,0.917,0,-3.645,1,0.071,0.026,7.25e-06,0.0968,0.206,164.036,287827,4
1996-10-12,65,Floatin' On Your Love,The Isley Brothers Featuring Angela Winbush,,False,72,65,3,0.653,0.373,11,-7.758,0,0.0578,0.677,0.00534,0.119,0.789,90.309,249067,4
1996-10-12,66,If I Ruled The World,Nas,,False,67,53,17,0.879,0.564,10,-7.682,0,0.247,0.0474,9.43e-06,0.0519,0.523,93.908,282373,4
1996-10-12,67,E-Bow The Letter,R.E.M.,,False,55,49,6,0.349,0.627,2,-8.386,1,0.033,0.173,0.000521,0.0836,0.312,155.107,324827,4
1996-10-12,68,One And One,Robert Miles Featuring Maria Nayler,,False,90,68,2,0.64,0.727,2,-9.532,0,0.0297,0.0436,0.00161,0.641,0.76,120.061,236227,4
1996-10-12,69,"Touch Myself (From ""Fled"")",T-Boz,,False,61,40,10,0.852,0.509,5,-7.126,0,0.166,0.16,0.00103,0.172,0.831,88.906,250200,4
1996-10-12,70,You'll Be Mine (Party Time),Gloria Estefan,,False,70,70,6,0.796,0.932,1,-7.058,1,0.087,0.00951,1.11e-06,0.063,0.831,118.118,240293,4
1996-10-12,71,All I See,A+,,False,69,66,11,0.741,0.401,4,-12.267,1,0.0827,0.000736,0.645,0.104,0.859,154.953,164944,4
1996-10-12,72,At Night I Pray,Wild Orchid,,False,84,72,3,0.608,0.785,2,-5.992,0,0.0891,0.439,0,0.0786,0.403,155.458,256600,4
1996-10-12,73,"Tonight, Tonight",The Smashing Pumpkins,,False,60,36,16,0.277,0.67,6,-9.381,1,0.0376,6.28e-05,0.751,0.237,0.217,148.342,254627,4
1996-10-12,74,Me And Those Dreamin' Eyes Of Mine,D'Angelo,,False,78,74,2,0.511,0.402,4,-10.695,0,0.219,0.702,0.00014,0.11,0.503,83.339,286800,4
1996-10-12,76,Shake A Lil' Somethin'...,The 2 Live Crew,,False,73,72,10,0.864,0.837,11,-7.139,0,0.221,0.0003,0.0623,0.0867,0.926,144.302,239960,4
1996-10-12,77,Like A Woman,The Tony Rich Project,,False,64,41,12,0.644,0.454,10,-7.559,1,0.0405,0.0277,0.185,0.131,0.622,80.046,244907,4
1996-10-12,78,"I Like (From ""The Nutty Professor"")",Montell Jordan Featuring Slick Rick,,False,68,28,16,0.849,0.587,8,-4.703,1,0.103,0.0869,0,0.0913,0.59,95.906,281467,4
1996-10-12,79,Gettin' It,Too Short Featuring Parliament Funkadelic,,False,74,68,8,0.902,0.411,1,-5.311,1,0.217,0.176,0,0.119,0.667,84.07,341427,4
1996-10-12,80,Jellyhead,Crush,,False,80,80,9,0.681,0.967,2,-6.639,1,0.0393,0.0182,0.488,0.0477,0.965,136.987,262600,4
1996-10-12,81,Blackberry Molasses,Mista,,False,65,53,16,0.765,0.387,0,-9.142,1,0.0283,0.26,7.57e-06,0.126,0.697,95.173,246453,4
1996-10-12,82,Where It's At,Beck,,False,81,61,16,0.68,0.671,2,-7.142,1,0.0536,0.169,0.0286,0.076,0.532,96.941,330947,4
1996-10-12,83,Blue,LeAnn Rimes,,False,75,26,17,0.545,0.452,4,-8.604,1,0.0248,0.595,1.29e-06,0.161,0.297,91.294,169547,4
1996-10-12,84,"Wu-Wear: The Garment Renaissance (From ""High School High"")",RZA Feat. Method Man & Cappadonna,,False,85,60,9,0.894,0.635,1,-8.004,1,0.135,0.118,2.8e-06,0.0753,0.51,92.04,232560,4
1996-10-12,85,Guys Do It All The Time,Mindy McCready,,False,79,72,7,0.551,0.794,0,-5.995,1,0.0341,0.0594,2.01e-05,0.231,0.587,165.813,191800,4
1996-10-12,86,DJ Girl,Katalina,,False,86,86,5,0.887,0.599,11,-12.187,0,0.0593,0.0272,0.000461,0.0662,0.949,125.936,219400,4
1996-10-12,87,"Walls (From ""She's The One"")",Tom Petty And The Heartbreakers,,False,77,69,3,0.538,0.763,5,-5.238,1,0.0264,0.0742,3.54e-06,0.116,0.384,100.837,265307,4
1996-10-12,88,Maria,Ricky Martin,,False,88,88,13,0.723,0.914,7,-5.598,0,0.0663,0.0726,2.12e-05,0.95,0.968,101.181,262573,4
1996-10-12,89,Strawberry Wine,Deana Carter,,False,96,89,2,0.558,0.435,1,-6.812,1,0.0264,0.302,0,0.0351,0.199,122.385,290467,3
1996-10-12,90,Who You Are,Pearl Jam,,False,71,31,9,0.427,0.884,4,-8.631,1,0.0905,0.0301,0.211,0.109,0.623,176.563,230133,3
1996-10-12,91,Baby Luv,Groove Theory,,False,82,65,11,0.741,0.71,0,-9.377,1,0.0612,0.00404,0.00194,0.099,0.747,97.329,287267,4
1996-10-12,92,"That Thing You Do! (From ""That Thing You Do!"")",The Wonders,4O6ZaZrRCFfiZZKjnrXqlk,True,0,92,1,0.598,0.874,9,-4.222,1,0.0432,0.0446,5.86e-06,0.094,0.962,134.52,166773,4
1996-10-12,93,Can't Knock The Hustle,JAY-Z,4O6ZaZrRCFfiZZKjnrXqlk,False,92,85,5,0.78,0.378,7,-11.481,1,0.464,0.197,0,0.0782,0.579,94.895,317800,4
1996-10-12,94,The Child (Inside),Qkumba Zoo,41NMHDlXO1qeo8YYxcQDHU,True,0,94,1,0.694,0.923,4,-7.428,1,0.0382,0.185,0.00187,0.318,0.849,127.144,241507,4
1996-10-12,95,Missing You,Tina Turner,41NMHDlXO1qeo8YYxcQDHU,False,95,95,2,0.665,0.706,9,-4.472,1,0.0311,0.123,0.00108,0.13,0.331,104.866,279040,4
1996-10-12,96,Until It Sleeps,Metallica,41NMHDlXO1qeo8YYxcQDHU,False,87,10,19,0.562,0.919,8,-4.458,0,0.0293,0.000223,0.113,0.142,0.728,113.357,269573,4
1996-10-12,97,"Where Do We Go From Here (From ""Eraser"")",Vanessa Williams,41NMHDlXO1qeo8YYxcQDHU,False,91,71,14,0.662,0.425,0,-11.016,1,0.0416,0.17,0,0.378,0.235,131.966,258760,4
1996-10-12,98,All Along,Blessid Union Of Souls,41NMHDlXO1qeo8YYxcQDHU,False,94,70,14,0.537,0.291,1,-9.619,1,0.0266,0.343,0,0.11,0.0643,76.086,234707,4
1996-10-12,99,Superstar,Charm Farm,41NMHDlXO1qeo8YYxcQDHU,False,89,89,4,0.629,0.837,2,-6.193,1,0.0651,0.174,0.000221,0.873,0.725,125.079,310573,4
1996-10-12,100,"So Many Ways (From ""High School High"")",The Braxtons,41NMHDlXO1qeo8YYxcQDHU,False,83,83,8,0.769,0.552,8,-6.11,1,0.0323,0.306,0,0.351,0.689,90.07,264827,4
