date,position,title,artist,spotify_id,is_new,last_pos,peak_pos,weeks,danceability,energy,key,loudness,mode,speechiness,acousticness,instrumentalness,liveness,valence,tempo,duration_ms,time_signature
1996-03-16,1,One Sweet Day,Mariah Carey & Boyz II Men,382tT20uGQpkqWPnkdEV6A,False,1,1,16,0.568,0.495,1,-8.964,1,0.0299,0.353,0,0.0839,0.303,128.234,281067,4
1996-03-16,2,"Sittin' Up In My Room (From ""Waiting To Exhale"")",Brandy,382tT20uGQpkqWPnkdEV6A,False,2,2,12,0.791,0.61,8,-5.408,0,0.0264,0.288,0.00123,0.0457,0.907,93.277,291067,4
1996-03-16,3,"Not Gon' Cry (From ""Waiting To Exhale"")",Mary J. Blige,382tT20uGQpkqWPnkdEV6A,False,3,2,8,0.758,0.424,2,-8.935,0,0.0468,0.664,0,0.095,0.455,110.087,294267,4
1996-03-16,4,Nobody Knows,The Tony Rich Project,382tT20uGQpkqWPnkdEV6A,False,4,4,14,0.64,0.433,5,-9.432,1,0.0374,0.509,4.9e-06,0.103,0.25,176.086,306933,4
1996-03-16,5,"Because You Loved Me (From ""Up Close & Personal"")",Celine Dion,382tT20uGQpkqWPnkdEV6A,False,36,5,2,0.615,0.467,1,-9.883,1,0.0327,0.314,0,0.099,0.177,119.919,273667,4
1996-03-16,6,Missing,Everything But The Girl,382tT20uGQpkqWPnkdEV6A,False,5,2,32,0.677,0.484,9,-10.506,0,0.0324,0.077,4.75e-05,0.135,0.697,123.534,247200,4
1996-03-16,7,Down Low (Nobody Has To Know),R. Kelly Featuring Ronald Isley,382tT20uGQpkqWPnkdEV6A,False,10,7,3,0.603,0.417,10,-9.408,0,0.0273,0.282,0.000183,0.0651,0.172,107.72,288507,4
1996-03-16,8,One Of Us,Joan Osborne,382tT20uGQpkqWPnkdEV6A,False,7,4,15,0.316,0.499,9,-7.899,1,0.0298,0.0108,1.81e-05,0.126,0.403,174.782,320467,4
1996-03-16,10,Be My Lover,La Bouche,,False,6,6,19,0.669,0.941,1,-5.765,0,0.0313,0.00129,4.3e-06,0.886,0.841,134.809,240267,4
1996-03-16,11,Ironic,Alanis Morissette,1d6KS9GH06JAd19uiBy9IE,True,0,11,1,0.408,0.582,11,-8.305,1,0.0508,0.218,0,0.159,0.365,114.926,230000,5
1996-03-16,12,Wonderwall,Oasis,1d6KS9GH06JAd19uiBy9IE,False,8,8,8,0.41,0.854,2,-5.609,1,0.0366,0.00236,0,0.133,0.456,174.584,258907,4
1996-03-16,13,1979,The Smashing Pumpkins,1d6KS9GH06JAd19uiBy9IE,False,13,13,6,0.767,0.787,3,-9.897,1,0.0331,0.0163,0.583,0.0513,0.964,126.879,266200,4
1996-03-16,14,"Exhale (Shoop Shoop) (From ""Waiting To Exhale"")",Whitney Houston,1d6KS9GH06JAd19uiBy9IE,False,11,1,17,0.661,0.394,1,-9.032,1,0.0318,0.401,0,0.119,0.107,137.954,204333,4
1996-03-16,15,Lady,D'Angelo,1d6KS9GH06JAd19uiBy9IE,False,20,15,3,0.815,0.364,8,-11.834,0,0.089,0.14,0.0255,0.121,0.723,84.898,346267,4
1996-03-16,16,Name,Goo Goo Dolls,1d6KS9GH06JAd19uiBy9IE,False,16,5,23,0.464,0.701,9,-5.943,1,0.0341,0.0691,0.00182,0.0766,0.407,73.97,270000,4
1996-03-16,17,Time,Hootie & The Blowfish,1d6KS9GH06JAd19uiBy9IE,False,18,14,19,0.387,0.875,2,-5.741,1,0.0385,0.0373,0,0.152,0.238,105.1,296840,4
1996-03-16,18,Anything,3T,1d6KS9GH06JAd19uiBy9IE,False,15,15,24,0.686,0.454,10,-10.928,0,0.0328,0.43,0.00021,0.286,0.645,131.977,321000,4
1996-03-16,20,Jesus To A Child,George Michael,,False,12,7,4,0.534,0.415,1,-11.781,0,0.0278,0.314,0.000365,0.0847,0.188,173.561,411147,4
1996-03-16,21,The World I Know,Collective Soul,,False,19,19,18,0.514,0.704,2,-4.724,1,0.0261,0.0515,0.00219,0.228,0.386,76.975,255467,4
1996-03-16,22,No One Else,Total,,False,29,22,14,0.782,0.515,6,-8.215,0,0.3,0.185,1.34e-05,0.0577,0.791,182.19,260467,4
1996-03-16,23,Hey Lover,LL Cool J,,False,17,3,18,0.707,0.427,5,-12.216,0,0.0698,0.339,0,0.105,0.541,88.08,284693,4
1996-03-16,24,I Want To Come Over,Melissa Etheridge,,False,24,24,5,0.537,0.488,9,-9.874,1,0.0316,0.0631,0.00295,0.108,0.538,113.796,324667,4
1996-03-16,25,"All The Things (Your Man Won't Do) (From ""Don't Be A Menace..."")",Joe,,False,26,25,6,0.573,0.679,3,-6.774,0,0.0423,0.247,0,0.321,0.648,66.215,380533,4
1996-03-16,26,Wonder,Natalie Merchant,,False,21,21,15,0.719,0.739,1,-5.577,1,0.0419,0.346,0.0102,0.0581,0.603,115.142,266008,4
1996-03-16,27,"Gangsta's Paradise (From ""Dangerous Minds"")",Coolio Featuring L.V.,,False,27,1,31,0.647,0.514,8,-10.05,1,0.0593,0.0655,0,0.398,0.387,79.974,240693,4
1996-03-16,28,Doin It,LL Cool J,,False,28,28,2,0.801,0.55,10,-11.044,0,0.209,0.365,0.0234,0.117,0.609,94.994,293933,4
1996-03-16,29,Breakfast At Tiffany's,Deep Blue Something,,False,25,5,31,0.622,0.829,2,-5.548,1,0.029,0.11,0,0.0954,0.539,110.367,257373,4
1996-03-16,30,Who Do U Love,Deborah Cox,,False,30,30,7,0.69,0.888,6,-5.781,0,0.186,0.163,2.25e-05,0.659,0.686,87.918,262933,4
1996-03-16,31,Tonite's Tha Night,Kris Kross,,False,22,12,15,0.743,0.523,5,-5.456,0,0.103,0.0231,0.0309,0.0701,0.789,90.974,199293,4
1996-03-16,33,"Closer To Free (From ""Party Of Five"")",BoDeans,,False,35,33,2,0.497,0.943,7,-4.792,1,0.0412,0.000627,0.000698,0.731,0.702,98.155,188600,4
1996-03-16,34,Hook,Blues Traveler,,False,23,23,24,0.562,0.742,9,-6.355,1,0.0346,0.0369,1.47e-06,0.102,0.793,165.6,289200,4
1996-03-16,35,"1, 2, 3, 4 (Sumpin' New)",Coolio,,False,68,35,2,0.91,0.681,1,-9.639,0,0.153,0.288,0.00477,0.372,0.7,115.186,214307,4
1996-03-16,36,Fu-Gee-La,Fugees,,False,31,31,12,0.681,0.505,1,-11.709,1,0.138,0.137,0,0.234,0.399,89.953,260067,4
1996-03-16,37,Peaches,The Presidents Of The United States Of America,,False,47,37,2,0.417,0.849,1,-4.199,0,0.0481,0.0146,0.000387,0.0673,0.594,94.267,171693,4
1996-03-16,38,Don't Cry,Seal,,False,37,33,5,0.282,0.421,2,-8.112,1,0.0306,0.726,9.09e-05,0.33,0.153,92.546,377907,3
1996-03-16,39,Set U Free,Planet Soul,,False,34,26,22,0.636,0.645,6,-11.64,1,0.0873,0.101,1.64e-05,0.0686,0.711,128.43,258933,4
1996-03-16,40,I Will Survive,Chantay Savage,,False,54,40,5,0.624,0.405,3,-10.084,0,0.0403,0.501,9.5e-05,0.228,0.209,84.153,372400,4
1996-03-16,41,Feels So Good (Show Me Your Love),Lina Santiago,,False,41,41,8,0.772,0.902,6,-4.376,0,0.0566,0.0703,0.0102,0.0536,0.748,126.958,307438,4
1996-03-16,42,Tell Me,Groove Theory,,False,33,5,30,0.8,0.361,6,-10.849,0,0.0635,0.0355,3.75e-06,0.0668,0.887,93.059,236067,4
1996-03-16,43,Get Money,Junior M.A.F.I.A. Featuring The Notorious B.I.G.,,False,38,30,6,0.727,0.83,2,-5.835,1,0.286,0.478,0,0.251,0.894,91.174,274938,4
1996-03-16,44,As I Lay Me Down,Sophie B. Hawkins,,False,46,6,42,0.519,0.737,10,-8.7,1,0.0437,0.645,1.77e-06,0.271,0.668,82.999,248893,4
1996-03-16,45,Glycerine,Bush,,False,32,28,8,0.437,0.337,5,-11.439,1,0.0326,0.0371,0.000946,0.0981,0.0784,114.239,266493,4
1996-03-16,46,Lucky Love,Ace Of Base,,False,53,46,4,0.769,0.662,5,-7.238,1,0.0319,0.129,0.00102,0.0814,0.863,104.104,175747,4
1996-03-16,47,Fantasy,Mariah Carey,,False,42,1,25,0.669,0.727,7,-7.588,1,0.0353,0.139,0,0.123,0.807,102.322,243493,4
1996-03-16,48,Cumbersome,Seven Mary Three,,False,39,39,9,0.543,0.79,11,-5.932,1,0.0358,0.00811,0,0.238,0.339,80.923,236973,4
1996-03-16,49,You'll See,Madonna,,False,40,6,15,0.601,0.545,4,-9.972,0,0.0311,0.479,0.000224,0.0975,0.234,89.79,281067,4
1996-03-16,51,Diggin' On You,TLC,,False,45,5,18,0.719,0.631,6,-7.411,1,0.0451,0.0235,0.702,0.0686,0.456,80.127,254560,4
1996-03-16,52,Only Love (The Ballad Of Sleeping Beauty),Sophie B. Hawkins,,False,56,52,3,0.656,0.733,9,-6.87,1,0.031,0.425,0,0.0712,0.437,104.999,302693,4
1996-03-16,53,Blessed,Elton John,,False,57,34,20,0.601,0.412,5,-11.963,1,0.0361,0.147,0.00585,0.263,0.464,204.064,300733,4
1996-03-16,54,"Natural One (From ""Kids"")",Folk Implosion,,False,43,29,15,0.677,0.463,4,-10.743,1,0.0304,0.53,7.17e-06,0.0988,0.481,110.908,179006,4
1996-03-16,55,Soon As I Get Home,Faith Evans,,False,44,21,15,0.652,0.498,11,-6.2,1,0.0413,0.519,0,0.149,0.336,120.141,324280,4
1996-03-16,56,Just A Girl,No Doubt,,False,51,51,14,0.638,0.906,2,-4.824,1,0.0504,0.0662,6.88e-05,0.142,0.767,107.991,209200,4
1996-03-16,57,Where Do U Want Me To Put It,Solo,,False,50,50,11,0.782,0.759,8,-5.87,1,0.0447,0.261,0,0.102,0.779,87.01,243667,4
1996-03-16,59,"Visions Of A Sunset (From ""Mr. Holland's Opus"")",Shawn Stockman,,False,55,45,10,0.229,0.418,0,-9.066,1,0.0291,0.697,0,0.256,0.219,84.645,271600,4
1996-03-16,60,Let's Play House,Tha Dogg Pound Featuring Michel'le,,False,60,45,11,0.822,0.702,10,-4.759,0,0.0755,0.0919,0.00559,0.191,0.804,91.37,204440,4
1996-03-16,62,"Keep On, Keepin' On (From ""Sunset Park"")",MC Lyte Featuring Xscape,42aZFX1bcCDj75ue0KoNSd,True,0,62,1,0.875,0.63,1,-6.015,0,0.114,0.24,0.00011,0.0742,0.733,91.043,271440,4
1996-03-16,63,"Insensitive (From ""Bed Of Roses"")",Jann Arden,42aZFX1bcCDj75ue0KoNSd,False,71,63,6,0.512,0.429,2,-9.931,1,0.0256,0.154,8.81e-05,0.101,0.332,178.669,255893,4
1996-03-16,64,Keep Tryin',Groove Theory,42aZFX1bcCDj75ue0KoNSd,False,64,64,6,0.634,0.598,2,-10.415,1,0.0962,0.0997,0.00035,0.298,0.729,83.082,260440,4
1996-03-16,65,"Can't Be Wasting My Time (From ""Don't Be A Menace..."")",Mona Lisa Featuring Lost Boyz,42aZFX1bcCDj75ue0KoNSd,False,65,65,5,0.542,0.645,0,-8.206,1,0.133,0.218,0,0.134,0.594,174.415,275067,4
1996-03-16,66,Bullet With Butterfly Wings,The Smashing Pumpkins,42aZFX1bcCDj75ue0KoNSd,False,58,22,19,0.404,0.72,10,-9.18,0,0.0623,5.59e-05,0.836,0.0466,0.475,121.864,258467,4
1996-03-16,67,Ridin' Low,L.A.D.,42aZFX1bcCDj75ue0KoNSd,False,67,47,18,0.699,0.722,5,-6.532,1,0.0735,0.158,0.000452,0.0523,0.673,197.562,252360,4
1996-03-16,68,Stayin' Alive,N-Trance,42aZFX1bcCDj75ue0KoNSd,False,62,62,9,0.805,0.863,6,-7.853,0,0.0771,0.0515,0.000427,0.98,0.826,106.787,245907,4
1996-03-16,69,Only Happy When It Rains,Garbage,42aZFX1bcCDj75ue0KoNSd,False,74,69,2,0.511,0.827,1,-4.55,0,0.0323,3.77e-05,0.00103,0.208,0.486,121.459,236533,4
1996-03-16,70,Love U 4 Life,Jodeci,42aZFX1bcCDj75ue0KoNSd,False,66,31,20,0.606,0.648,0,-7.802,1,0.0466,0.349,0,0.639,0.646,59.041,290067,4
1996-03-16,71,5 O'Clock,Nonchalant,42aZFX1bcCDj75ue0KoNSd,False,79,71,3,0.731,0.76,10,-8.321,0,0.116,0.111,1.85e-06,0.0987,0.799,86.108,302640,4
1996-03-16,72,Caught A Lite Sneeze,Tori Amos,42aZFX1bcCDj75ue0KoNSd,False,70,60,9,0.6,0.772,5,-8.483,0,0.0444,0.37,4.46e-06,0.0641,0.921,79.059,265213,4
1996-03-16,73,"A Thin Line Between Love & Hate (From ""A Thin Line..."")",H-Town,42aZFX1bcCDj75ue0KoNSd,False,75,73,5,0.549,0.446,0,-7.807,1,0.258,0.536,0,0.0442,0.511,122.431,300000,4
1996-03-16,74,Everyday & Everynight,Yvette Michele,42aZFX1bcCDj75ue0KoNSd,False,69,60,7,0.72,0.559,10,-7.519,0,0.259,0.0952,0.0148,0.172,0.597,97.865,211400,4
1996-03-16,75,Beautiful Life,Ace Of Base,42aZFX1bcCDj75ue0KoNSd,False,72,15,19,0.749,0.988,0,-5.266,0,0.0387,0.202,0.00631,0.17,0.749,135.015,221187,4
1996-03-16,77,La Familia,Frost,,False,82,77,3,0.834,0.697,4,-7.063,1,0.19,0.0364,0.000407,0.122,0.618,101.398,243774,4
1996-03-16,78,You Remind Me Of Something,R. Kelly,,False,73,4,18,0.631,0.536,6,-7.194,1,0.0586,0.591,0,0.108,0.829,59.999,249920,4
1996-03-16,79,Sexual Healing,Max-A-Million,,False,78,60,20,0.775,0.745,8,-7.167,1,0.0563,0.0268,0,0.27,0.691,99.008,243613,4
1996-03-16,80,Give Me...A Reason,Buffy,4KazaC4HTYKJarG7jfaLYY,True,0,80,1,0.691,0.731,0,-9.675,1,0.0371,0.0079,1.11e-05,0.108,0.83,123.044,304160,4
1996-03-16,81,I Will Remember You (Live),Sarah McLachlan,4KazaC4HTYKJarG7jfaLYY,False,84,65,19,0.606,0.353,9,-11.484,1,0.0315,0.763,0.000578,0.0778,0.179,140.057,291400,4
1996-03-16,82,Ain't No Playa,Rappin' 4-Tay,4KazaC4HTYKJarG7jfaLYY,False,80,73,3,0.741,0.763,7,-6.514,1,0.11,0.0106,0,0.201,0.449,84.992,302360,4
1996-03-16,83,High And Dry,Radiohead,2a1iMaoWQ5MnvLFBDv4qkf,True,0,83,1,0.419,0.383,4,-11.782,1,0.0256,0.0724,0.0176,0.0896,0.35,87.568,257480,4
1996-03-16,84,Take A Look,J'Son,2a1iMaoWQ5MnvLFBDv4qkf,False,88,84,4,0.443,0.937,6,-3.817,0,0.0724,0.000303,0.00649,0.124,0.572,178.147,249733,4
1996-03-16,86,Let Your Soul Be Your Pilot,Sting,,False,87,86,3,0.647,0.574,10,-9.127,1,0.0224,0.368,0.000496,0.11,0.543,96.02,403533,4
1996-03-16,87,Physical Funk,Domino,,False,93,87,2,0.706,0.501,9,-10.89,1,0.426,0.00992,0,0.082,0.615,99.57,213067,4
1996-03-16,88,It Matters To Me,Faith Hill,,False,89,74,13,0.613,0.355,6,-8.218,1,0.0247,0.567,0,0.0909,0.129,135.622,197667,4
1996-03-16,90,Too Hot,Coolio,,False,76,24,15,0.845,0.407,7,-14.983,1,0.203,0.089,0.00985,0.222,0.576,102.598,218933,4
1996-03-16,91,Ever Since You Went Away,Art N' Soul,7zEJjYDPoMYKHTuLN0H9Bh,True,0,91,1,0.693,0.498,3,-9.714,0,0.0346,0.265,0.000139,0.246,0.719,138.04,249661,4
1996-03-16,92,Where Ever You Are,Terry Ellis,7zEJjYDPoMYKHTuLN0H9Bh,False,90,52,20,0.732,0.499,5,-6.794,1,0.0346,0.52,8.62e-06,0.0842,0.428,134.027,298080,4
1996-03-16,93,Promises Broken,Soul Asylum,7zEJjYDPoMYKHTuLN0H9Bh,False,83,63,5,0.472,0.475,4,-11.115,1,0.0311,0.138,3.04e-06,0.113,0.718,150.611,194587,4
1996-03-16,96,Ain't Nobody,Diana King,67EJJfVy93Hlyo3Z742Ka7,True,0,96,1,0.695,0.772,10,-5.351,0,0.0446,0.00164,4.6e-05,0.0507,0.495,97.298,321907,4
1996-03-16,97,C'mon N' Ride It (The Train),Quad City DJ's,2QLEN3RVunMas7j0PHjeAT,True,0,97,1,0.843,0.959,6,-4.933,0,0.0914,0.0913,0,0.408,0.923,135.988,451440,4
1996-03-16,98,Energy,Devone,2QLEN3RVunMas7j0PHjeAT,False,92,70,9,0.696,0.978,7,-4.329,1,0.0732,0.084,2.74e-06,0.365,0.562,135.793,176747,4
1996-03-16,100,Celebration/Take Your Chance,Fun Factory,,False,94,88,10,0.61,0.957,11,-8.205,0,0.0402,0.228,0.002,0.248,0.873,140.257,240400,4
