date,position,title,artist,spotify_id,is_new,last_pos,peak_pos,weeks,danceability,energy,key,loudness,mode,speechiness,acousticness,instrumentalness,liveness,valence,tempo,duration_ms,time_signature
2002-10-19,1,Dilemma,Nelly Featuring Kelly Rowland,0yORE7Aw2erLpuYlws1SJJ,False,2,1,15,0.727,0.552,2,-8.074,0,0.14,0.227,0.000164,0.198,0.607,168.189,289160,4
2002-10-19,2,A Moment Like This,Kelly Clarkson,0yORE7Aw2erLpuYlws1SJJ,False,1,1,5,0.414,0.572,8,-3.918,1,0.0311,0.163,0,0.115,0.16,145.184,228280,4
2002-10-19,3,Gangsta Lovin',Eve Featuring Alicia Keys,0yORE7Aw2erLpuYlws1SJJ,False,3,2,15,0.723,0.84,1,-3.523,0,0.0608,0.0619,0,0.0945,0.827,94.332,239267,4
2002-10-19,4,Hey Ma,"Cam'Ron Featuring Juelz Santana, Freekey Zekey & Toya",0yORE7Aw2erLpuYlws1SJJ,False,5,4,8,0.791,0.666,8,-5.484,1,0.341,0.0256,6.33e-06,0.0796,0.938,90.345,232533,4
2002-10-19,5,Work It,"Missy ""Misdemeanor"" Elliott",0yORE7Aw2erLpuYlws1SJJ,False,8,5,6,0.869,0.735,10,-6.364,0,0.157,0.228,0,0.0874,0.463,101.909,254813,4
2002-10-19,6,Complicated,Avril Lavigne,0yORE7Aw2erLpuYlws1SJJ,False,4,2,21,0.585,0.776,5,-5.898,1,0.0459,0.0572,7.74e-06,0.3,0.427,77.987,244507,4
2002-10-19,7,One Last Breath,Creed,0yORE7Aw2erLpuYlws1SJJ,False,6,6,20,0.386,0.677,2,-5.83,1,0.0346,0.00841,0.00366,0.341,0.195,126.602,238240,4
2002-10-19,8,Underneath It All,No Doubt Featuring Lady Saw,0yORE7Aw2erLpuYlws1SJJ,False,12,8,8,0.729,0.731,4,-4.823,1,0.0682,0.235,1.35e-06,0.391,0.838,138.204,302720,4
2002-10-19,9,Lose Yourself,Eminem,0yORE7Aw2erLpuYlws1SJJ,False,18,9,3,0.692,0.744,2,-4.565,1,0.257,0.00868,0.000423,0.359,0.0612,171.374,326467,4
2002-10-19,10,Luv U Better,LL Cool J,0yORE7Aw2erLpuYlws1SJJ,False,14,10,9,0.668,0.806,6,-3.9,1,0.239,0.232,0,0.18,0.721,95.022,287000,4
2002-10-19,11,Sk8er Boi,Avril Lavigne,0yORE7Aw2erLpuYlws1SJJ,False,15,11,6,0.487,0.9,0,-4.417,1,0.0482,6.79e-05,0,0.358,0.484,149.937,204000,4
2002-10-19,12,Cleanin' Out My Closet,Eminem,0yORE7Aw2erLpuYlws1SJJ,False,7,4,12,0.908,0.758,9,-4.753,0,0.174,0.0687,0,0.0783,0.87,148.015,297840,4
2002-10-19,13,I Need A Girl (Part Two),"P. Diddy & Ginuwine Featuring Loon, Mario Winans & Tammy Ruggeri",0yORE7Aw2erLpuYlws1SJJ,False,9,4,20,0.713,0.471,1,-7.392,0,0.483,0.421,0,0.0308,0.781,199.765,285587,4
2002-10-19,14,Like I Love You,Justin Timberlake,0yORE7Aw2erLpuYlws1SJJ,False,11,11,7,0.853,0.811,6,-4.926,0,0.0646,0.0439,0.000304,0.0703,0.901,114.961,283627,4
2002-10-19,15,Move B***h,Ludacris Featuring Mystikal & Infamous 2.0,0yORE7Aw2erLpuYlws1SJJ,False,10,10,20,0.787,0.732,8,-5.466,1,0.129,0.183,0,0.1,0.15,177.653,271627,4
2002-10-19,16,Gotta Get Thru This,Daniel Bedingfield,0yORE7Aw2erLpuYlws1SJJ,False,13,10,13,0.837,0.765,7,-5.007,0,0.0631,0.0852,7.08e-05,0.1,0.912,133.57,161200,4
2002-10-19,17,If I Could Go!,Angie Martinez Featuring Lil' Mo & Sacario,0yORE7Aw2erLpuYlws1SJJ,False,16,15,18,0.791,0.649,9,-5.714,0,0.198,0.496,0,0.0566,0.645,97.874,263853,4
2002-10-19,18,Gimme The Light,Sean Paul,0yORE7Aw2erLpuYlws1SJJ,False,34,18,25,0.778,0.761,2,-5.529,1,0.0525,0.141,4.61e-05,0.0441,0.923,107.288,228000,4
2002-10-19,19,I Care 4 U,Aaliyah,0yORE7Aw2erLpuYlws1SJJ,False,19,19,9,0.384,0.496,0,-9.203,0,0.0482,0.345,0.000224,0.119,0.223,133.891,286699,3
2002-10-19,20,Nothin',N.O.R.E.,0yORE7Aw2erLpuYlws1SJJ,False,21,10,22,0.791,0.863,3,-6.118,0,0.151,0.317,1.13e-06,0.27,0.742,97.035,264653,4
2002-10-19,21,The Game Of Love,Santana Featuring Michelle Branch,0yORE7Aw2erLpuYlws1SJJ,False,35,21,3,0.59,0.929,2,-3.236,1,0.0478,0.0714,0.000153,0.0598,0.674,119.818,254467,4
2002-10-19,22,Trade It All,Fabolous Featuring P. Diddy & Jagged Edge,0yORE7Aw2erLpuYlws1SJJ,False,20,20,10,0.819,0.778,1,-5.839,0,0.21,0.029,0,0.215,0.779,96.72,275267,4
2002-10-19,23,Happy,Ashanti,0yORE7Aw2erLpuYlws1SJJ,False,17,8,21,0.727,0.515,2,-6.553,0,0.0289,0.241,3.74e-06,0.124,0.695,89.488,262227,4
2002-10-19,24,Baby,Ashanti,0yORE7Aw2erLpuYlws1SJJ,False,24,24,13,0.567,0.58,4,-5.757,0,0.223,0.0084,5.37e-06,0.0342,0.46,157.596,265707,4
2002-10-19,25,Just Like A Pill,P!nk,0yORE7Aw2erLpuYlws1SJJ,False,22,8,16,0.689,0.774,9,-4.528,1,0.0278,8.85e-05,0,0.0941,0.253,102.052,236600,4
2002-10-19,26,Somebody Like You,Keith Urban,0yORE7Aw2erLpuYlws1SJJ,False,26,26,10,0.624,0.84,4,-5.768,1,0.0337,0.108,0.000546,0.144,0.656,111.02,323040,4
2002-10-19,27,Goodbye To You,Michelle Branch,0yORE7Aw2erLpuYlws1SJJ,False,27,27,8,0.504,0.556,8,-6.19,1,0.0263,0.288,0.000246,0.173,0.276,81.008,251200,4
2002-10-19,28,A Thousand Miles,Vanessa Carlton,0yORE7Aw2erLpuYlws1SJJ,False,25,5,34,0.56,0.825,11,-3.862,1,0.0379,0.323,0,0.161,0.268,94.931,237493,4
2002-10-19,29,Po' Folks,Nappy Roots Featuring Anthony Hamilton,0yORE7Aw2erLpuYlws1SJJ,False,32,29,14,0.854,0.847,2,-3.03,1,0.258,0.212,0,0.0894,0.651,86.062,255227,4
2002-10-19,30,Ordinary Day,Vanessa Carlton,0yORE7Aw2erLpuYlws1SJJ,False,37,30,9,0.371,0.666,0,-3.336,1,0.0301,0.244,0,0.151,0.449,185.476,238440,3
2002-10-19,31,dontchange,Musiq,0yORE7Aw2erLpuYlws1SJJ,False,38,31,7,0.58,0.526,6,-6.664,0,0.0313,0.221,0,0.0959,0.2,101.89,304427,4
2002-10-19,32,Beautiful Mess,Diamond Rio,0yORE7Aw2erLpuYlws1SJJ,False,28,28,11,0.402,0.817,1,-3.756,1,0.0406,0.317,0,0.105,0.376,177.342,227920,4
2002-10-19,33,Cry,Faith Hill,0yORE7Aw2erLpuYlws1SJJ,False,33,33,8,0.512,0.645,8,-5.631,1,0.029,0.141,0,0.0987,0.283,111.015,226307,3
2002-10-19,34,Heaven,DJ Sammy & Yanou Featuring Do,0yORE7Aw2erLpuYlws1SJJ,False,31,8,21,0.571,0.953,8,-5.601,1,0.0548,0.0011,0.000606,0.226,0.601,137.965,233600,4
2002-10-19,35,Hot In Herre,Nelly,0yORE7Aw2erLpuYlws1SJJ,False,23,1,25,0.956,0.745,11,-4.753,0,0.12,0.206,0,0.0615,0.912,107.075,228240,4
2002-10-19,36,Stingy,Ginuwine,0yORE7Aw2erLpuYlws1SJJ,False,36,33,12,0.622,0.573,1,-6.934,0,0.0547,0.26,0,0.173,0.617,127.132,259493,4
2002-10-19,37,No Such Thing,John Mayer,0yORE7Aw2erLpuYlws1SJJ,False,30,13,21,0.668,0.739,4,-4.919,1,0.0308,0.0383,0,0.13,0.571,131.918,231467,4
2002-10-19,38,Jenny From The Block,Jennifer Lopez Featuring Styles & Jadakiss,0yORE7Aw2erLpuYlws1SJJ,False,67,38,2,0.844,0.754,6,-5.46,1,0.207,0.00833,3.42e-06,0.0575,0.961,100.002,187840,4
2002-10-19,39,When The Last Time,Clipse,0yORE7Aw2erLpuYlws1SJJ,False,50,39,6,0.847,0.884,11,-3.326,1,0.245,0.514,0,0.303,0.845,99.036,254307,4
2002-10-19,40,Good Times,Styles,0yORE7Aw2erLpuYlws1SJJ,False,29,22,14,0.697,0.761,11,-7.647,0,0.302,0.157,0,0.789,0.666,81.728,211493,4
2002-10-19,41,Die Another Day,Madonna,7DUpuAzGUyJaJB3p9BC3Ms,True,0,41,1,0.792,0.797,0,-5.166,0,0.0901,0.062,0.00325,0.0896,0.491,123.993,276360,4
2002-10-19,42,Soak Up The Sun,Sheryl Crow,7DUpuAzGUyJaJB3p9BC3Ms,False,41,17,28,0.717,0.733,4,-4.985,1,0.0427,0.0398,0,0.136,0.713,119.996,292307,4
2002-10-19,43,The Middle,Jimmy Eat World,7DUpuAzGUyJaJB3p9BC3Ms,False,40,5,32,0.643,0.849,2,-5.428,1,0.0526,0.0371,0,0.058,0.903,162.152,165853,4
2002-10-19,44,Somewhere Out There,Our Lady Peace,7DUpuAzGUyJaJB3p9BC3Ms,False,44,44,9,0.388,0.746,1,-5.306,1,0.0318,0.000563,0,0.0719,0.458,159.675,251333,4
2002-10-19,45,The Impossible,Joe Nichols,7DUpuAzGUyJaJB3p9BC3Ms,False,39,29,21,0.617,0.504,9,-6.702,1,0.0295,0.354,3.1e-06,0.0875,0.197,77.988,245573,4
2002-10-19,46,Where Would You Be,Martina McBride,7DUpuAzGUyJaJB3p9BC3Ms,False,47,46,7,0.523,0.668,8,-6.646,1,0.0332,0.0607,3.23e-06,0.0353,0.278,128.092,272720,4
2002-10-19,47,Landslide,Dixie Chicks,7DUpuAzGUyJaJB3p9BC3Ms,False,58,47,5,0.571,0.438,2,-7.007,1,0.0279,0.534,1.56e-05,0.187,0.444,145.948,230549,4
2002-10-19,48,American Child,Phil Vassar,7DUpuAzGUyJaJB3p9BC3Ms,False,53,48,9,0.397,0.685,2,-5.815,1,0.0277,0.252,0,0.157,0.443,168.121,189373,3
2002-10-19,49,Work In Progress,Alan Jackson,7DUpuAzGUyJaJB3p9BC3Ms,False,54,49,9,0.748,0.673,11,-8.45,0,0.0486,0.191,5.86e-06,0.212,0.661,135.257,247600,4
2002-10-19,50,Dirrty,Christina Aguilera Featuring Redman,7DUpuAzGUyJaJB3p9BC3Ms,False,48,48,5,0.64,0.889,2,-3.073,1,0.322,0.107,0,0.339,0.436,99.931,298853,4
2002-10-19,51,Ten Rounds With Jose Cuervo,Tracy Byrd,7DUpuAzGUyJaJB3p9BC3Ms,False,43,26,16,0.681,0.864,2,-7.839,1,0.0347,0.00504,0,0.212,0.931,127.079,182453,4
2002-10-19,52,My Town,Montgomery Gentry,7DUpuAzGUyJaJB3p9BC3Ms,False,57,52,4,0.511,0.846,2,-6.677,1,0.0531,0.00258,0,0.0777,0.528,93.848,285587,4
2002-10-19,53,Oh Yeah!,"Big Tymers Featuring Tateeze, Boo & Gotti",7DUpuAzGUyJaJB3p9BC3Ms,False,55,53,8,0.882,0.769,11,-3.448,1,0.147,0.091,3.56e-06,0.0809,0.529,98.002,279680,4
2002-10-19,54,Running Away,Hoobastank,7DUpuAzGUyJaJB3p9BC3Ms,False,52,44,16,0.608,0.801,9,-5.452,0,0.0376,0.0011,8.11e-06,0.223,0.544,100.25,178440,3
2002-10-19,55,You Know You're Right,Nirvana,5O8L4I2S4izFGDjvP7xAKv,True,0,55,1,0.289,0.716,5,-6.53,0,0.106,0.0407,0.00123,0.135,0.344,168.049,217000,4
2002-10-19,56,Where Are You Going,Dave Matthews Band,5O8L4I2S4izFGDjvP7xAKv,False,49,39,19,0.444,0.583,7,-8.121,1,0.0259,0.5,0.15,0.105,0.258,97.492,231867,4
2002-10-19,57,The Good Stuff,Kenny Chesney,5O8L4I2S4izFGDjvP7xAKv,False,51,22,20,0.612,0.62,7,-9.785,1,0.0645,0.255,0,0.129,0.502,143.78,200440,4
2002-10-19,58,Aerials,System Of A Down,5O8L4I2S4izFGDjvP7xAKv,False,56,55,10,0.364,0.922,0,-4.217,0,0.0566,0.000918,0.035,0.0696,0.227,79.342,235053,4
2002-10-19,59,These Days,Rascal Flatts,5O8L4I2S4izFGDjvP7xAKv,False,63,59,3,0.587,0.778,7,-4.233,1,0.0343,0.31,0,0.318,0.319,81.943,254493,4
2002-10-19,60,Don't Mess With My Man,Nivea Featuring Brian & Brandon Casey,5O8L4I2S4izFGDjvP7xAKv,False,60,60,11,0.879,0.73,11,-4.369,0,0.164,0.114,0,0.241,0.885,99.925,213227,4
2002-10-19,61,Down 4 U,"Irv Gotti Presents The Inc. Featuring Ja Rule, Ashanti, Charli Baltimore & Vita",5O8L4I2S4izFGDjvP7xAKv,False,46,6,18,0.64,0.59,7,-7.442,1,0.32,0.252,0,0.665,0.519,83.133,318213,4
2002-10-19,62,Stole,Kelly Rowland,5O8L4I2S4izFGDjvP7xAKv,False,62,62,4,0.649,0.718,7,-4.984,0,0.0594,0.00676,4.26e-06,0.174,0.477,79.993,249293,4
2002-10-19,63,Starry Eyed Surprise,Oakenfold Featuring Shifty Shellshock,6A4Kuy7JL0Znab3Skgloiv,True,0,63,1,0.721,0.794,4,-6.134,1,0.132,0.0195,0.00013,0.283,0.562,103.211,228493,4
2002-10-19,64,She'll Leave You With A Smile,George Strait,6A4Kuy7JL0Znab3Skgloiv,False,65,64,3,0.635,0.6,4,-7.233,1,0.0229,0.59,0.000198,0.254,0.516,97.983,178773,4
2002-10-19,65,I'm Gonna Getcha Good!,Shania Twain,3wimPgsJv0hEgP5A3sQ7Ag,True,0,65,1,0.723,0.789,1,-4.813,1,0.0302,0.0441,0,0.0612,0.946,124.013,269400,4
2002-10-19,66,She Hates Me,Puddle Of Mudd,3wimPgsJv0hEgP5A3sQ7Ag,False,71,66,2,0.58,0.748,4,-5.433,1,0.0323,0.00935,0,0.753,0.584,109.781,216760,4
2002-10-19,67,The Ketchup Song (Hey Hah),Las Ketchup,3wimPgsJv0hEgP5A3sQ7Ag,False,76,67,2,0.607,0.923,1,-6.777,1,0.0948,0.0193,1.1e-06,0.0924,0.868,184.819,213973,4
2002-10-19,68,Prayer,Disturbed,3wimPgsJv0hEgP5A3sQ7Ag,False,69,68,4,0.65,0.914,9,-4.672,1,0.0716,0.000642,1.23e-06,0.0251,0.586,99.107,218973,4
2002-10-19,69,Who's Your Daddy?,Toby Keith,3wimPgsJv0hEgP5A3sQ7Ag,False,64,64,3,0.684,0.872,9,-4.307,1,0.0402,0.283,0.0289,0.049,0.849,126.381,238013,4
2002-10-19,70,Red Rag Top,Tim McGraw,3wimPgsJv0hEgP5A3sQ7Ag,False,70,70,2,0.484,0.463,7,-11.98,1,0.0279,0.0677,0.598,0.246,0.247,77.009,244051,4
2002-10-19,71,Disease,matchbox twenty,1QHYnWwo87BY9JXIMsMppO,True,0,71,1,0.561,0.849,8,-3.913,0,0.0466,0.00289,0,0.288,0.829,115.04,220067,4
2002-10-19,72,Don't Know Why,Norah Jones,1QHYnWwo87BY9JXIMsMppO,False,72,72,4,0.732,0.198,5,-11.775,1,0.028,0.883,1.1e-05,0.0659,0.618,88.174,186147,4
2002-10-19,73,Love Of My Life (An Ode To Hip Hop),Erykah Badu Featuring Common,1QHYnWwo87BY9JXIMsMppO,False,82,73,7,0.808,0.404,7,-9.27,1,0.348,0.118,0.000625,0.0913,0.487,87.461,337573,4
2002-10-19,74,I Am Mine,Pearl Jam,1QHYnWwo87BY9JXIMsMppO,False,74,74,2,0.323,0.728,7,-5.416,1,0.0321,0.00394,0.000447,0.102,0.489,161.586,215333,3
2002-10-19,75,Braid My Hair,Mario,1QHYnWwo87BY9JXIMsMppO,False,75,75,2,0.687,0.619,5,-6.733,0,0.0533,0.0829,0,0.188,0.449,134.037,247267,4
2002-10-19,76,By The Way,Red Hot Chili Peppers,1QHYnWwo87BY9JXIMsMppO,False,59,34,19,0.451,0.97,0,-4.938,1,0.107,0.0264,0.00355,0.102,0.198,122.444,216933,4
2002-10-19,77,I Miss My Friend,Darryl Worley,1QHYnWwo87BY9JXIMsMppO,False,61,28,19,0.554,0.474,4,-7.843,1,0.025,0.155,1.67e-05,0.0859,0.41,139.832,242927,4
2002-10-19,78,I Do (Wanna Get Close To You),3LW Featuring P. Diddy & Loon,1QHYnWwo87BY9JXIMsMppO,False,73,58,12,0.836,0.491,1,-5.734,1,0.19,0.139,0,0.0489,0.862,97.303,254227,4
2002-10-19,79,React,Erick Sermon Featuring Redman,4psCG36I4hy1h3qgG6o03m,True,0,79,1,0.584,0.894,9,-1.605,0,0.429,0.176,0,0.169,0.786,94.383,217840,4
2002-10-19,80,Two Wrongs,Wyclef Jean Featuring Claudette Ortiz,4psCG36I4hy1h3qgG6o03m,False,66,28,15,0.662,0.613,9,-7.553,1,0.189,0.0899,0,0.0831,0.401,83.015,231133,4
2002-10-19,81,Flake,Jack Johnson,4psCG36I4hy1h3qgG6o03m,False,81,73,12,0.758,0.654,5,-10.98,1,0.04,0.662,0.0197,0.199,0.962,97.657,281749,4
2002-10-19,82,I Keep Looking,Sara Evans,4psCG36I4hy1h3qgG6o03m,False,77,35,14,0.737,0.817,10,-4.246,1,0.0508,0.0577,0,0.118,0.751,112.866,276173,4
2002-10-19,83,"Courtesy Of The Red, White And Blue (The Angry American)",Toby Keith,4psCG36I4hy1h3qgG6o03m,False,78,25,20,0.424,0.661,2,-5.547,1,0.0425,0.521,1.62e-06,0.0719,0.384,111.762,195533,4
2002-10-19,84,Burnin' Up,"Faith Evans Featuring Missy ""Misdemeanor"" Elliott",4psCG36I4hy1h3qgG6o03m,False,80,60,10,0.726,0.82,11,-3.472,0,0.18,0.162,2.96e-06,0.212,0.894,98.051,211133,4
2002-10-19,85,Unbroken,Tim McGraw,4psCG36I4hy1h3qgG6o03m,False,79,26,16,0.595,0.792,1,-6.979,0,0.0286,0.0865,0,0.0769,0.536,119.8,241427,4
2002-10-19,86,Objection (Tango),Shakira,4psCG36I4hy1h3qgG6o03m,False,68,55,7,0.603,0.864,11,-5.282,0,0.0677,0.0147,0,0.0246,0.705,179.344,222533,4
2002-10-19,87,Electrical Storm,U2,4psCG36I4hy1h3qgG6o03m,False,85,77,4,0.229,0.5,4,-6.769,1,0.0312,0.166,0.000248,0.454,0.185,96.022,277467,4
2002-10-19,88,Sweetness,Jimmy Eat World,4psCG36I4hy1h3qgG6o03m,False,83,75,12,0.487,0.898,5,-4.436,1,0.038,0.00305,0,0.26,0.597,135.331,220027,4
2002-10-19,89,Crush Tonight,Fat Joe Featuring Ginuwine,1fjRcOZYdjUSTl4qt57rhS,True,0,89,1,0.598,0.711,3,-5.373,0,0.434,0.266,0,0.599,0.87,91.627,317000,4
2002-10-19,90,Long Time Gone,Dixie Chicks,1fjRcOZYdjUSTl4qt57rhS,False,86,7,18,0.549,0.693,2,-5.572,1,0.0311,0.18,1.75e-06,0.153,0.819,170.241,249412,4
2002-10-19,91,Little Things,India.Arie,1fjRcOZYdjUSTl4qt57rhS,False,91,91,4,0.789,0.513,8,-9.193,1,0.109,0.072,0.00175,0.181,0.547,92.981,209387,4
2002-10-19,92,Downfall,TRUSTcompany,76xddM2irVQCbuBoVbaElZ,True,0,92,1,0.31,0.94,6,-3.395,1,0.106,0.000106,2.21e-06,0.205,0.454,128.682,191373,5
2002-10-19,93,The Streets,WC Featuring Nate Dogg,76xddM2irVQCbuBoVbaElZ,False,93,93,4,0.92,0.811,4,-2.892,0,0.117,0.159,0.0026,0.0935,0.602,97.117,227867,4
2002-10-19,94,In Da Wind,Trick Daddy Featuring Cee-Lo & Big Boi,76xddM2irVQCbuBoVbaElZ,False,84,70,15,0.974,0.586,0,-3.801,1,0.18,0.12,0,0.0585,0.689,113.998,260480,4
2002-10-19,95,I'd Rather,Luther Vandross,76xddM2irVQCbuBoVbaElZ,False,88,83,6,0.705,0.467,0,-8.456,1,0.0298,0.236,0,0.113,0.522,119.938,259693,4
2002-10-19,96,Are We Cuttin',Pastor Troy Featuring Ms. Jade,76xddM2irVQCbuBoVbaElZ,False,97,96,3,0.745,0.947,2,-5.113,1,0.331,0.252,0.000225,0.342,0.679,121.026,296640,5
2002-10-19,97,When You Lie Next To Me,Kellie Coffey,76xddM2irVQCbuBoVbaElZ,False,98,54,17,0.312,0.404,5,-10.014,1,0.0293,0.184,0,0.306,0.115,138.425,239827,4
2002-10-19,98,Rock The Party,Benzino,76xddM2irVQCbuBoVbaElZ,False,99,98,2,0.843,0.871,10,-5.796,0,0.142,0.29,0,0.0934,0.723,101.03,227933,4
2002-10-19,99,Feel It Boy,Beenie Man Featuring Janet,76xddM2irVQCbuBoVbaElZ,False,89,28,12,0.842,0.656,5,-3.189,0,0.107,0.16,0,0.0626,0.95,102.794,207133,4
2002-10-19,100,She Was,Mark Chesnutt,76xddM2irVQCbuBoVbaElZ,False,96,62,11,0.398,0.54,3,-9.31,1,0.0276,0.0118,0,0.0684,0.447,177.168,201173,4
