date,position,title,artist,spotify_id,is_new,last_pos,peak_pos,weeks,danceability,energy,key,loudness,mode,speechiness,acousticness,instrumentalness,liveness,valence,tempo,duration_ms,time_signature
2016-08-06,1,Cheap Thrills,Sia Featuring Sean Paul,0gb1J5UrTpzaU1s3nupgCd,False,3,1,23,0.628,0.698,6,-5.608,0,0.105,0.0472,0.00143,0.0907,0.732,89.976,211667,4
2016-08-06,2,One Dance,Drake Featuring WizKid & Kyla,0gb1J5UrTpzaU1s3nupgCd,False,1,1,16,0.792,0.625,1,-5.609,1,0.0536,0.00776,0.0018,0.329,0.37,103.967,173987,4
2016-08-06,3,This Is What You Came For,Calvin Harris Featuring Rihanna,0gb1J5UrTpzaU1s3nupgCd,False,4,3,12,0.63,0.928,9,-2.787,0,0.0331,0.199,0.124,0.148,0.465,123.963,222160,4
2016-08-06,4,Can't Stop The Feeling!,Justin Timberlake,0gb1J5UrTpzaU1s3nupgCd,False,2,1,11,0.669,0.832,0,-5.72,1,0.0682,0.0106,0,0.0968,0.7,113.035,237547,4
2016-08-06,5,Don't Let Me Down,The Chainsmokers Featuring Daya,0gb1J5UrTpzaU1s3nupgCd,False,5,3,23,0.532,0.869,11,-5.094,1,0.172,0.157,0.00508,0.136,0.422,159.803,208373,4
2016-08-06,6,Ride,twenty one pilots,0gb1J5UrTpzaU1s3nupgCd,False,6,6,19,0.645,0.713,6,-5.355,1,0.0393,0.00835,0,0.113,0.566,74.989,214507,4
2016-08-06,7,Needed Me,Rihanna,0gb1J5UrTpzaU1s3nupgCd,False,7,7,25,0.671,0.314,5,-8.091,0,0.244,0.11,0,0.0825,0.296,110.898,191600,4
2016-08-06,8,Don't Mind,Kent Jones,0gb1J5UrTpzaU1s3nupgCd,False,9,8,12,0.464,0.771,8,-4.503,1,0.336,0.0235,0,0.063,0.69,158.777,198237,4
2016-08-06,9,Panda,Desiigner,0gb1J5UrTpzaU1s3nupgCd,False,8,1,22,0.685,0.731,10,-5.503,0,0.414,0.0292,0,0.369,0.266,145.245,247867,4
2016-08-06,10,Send My Love (To Your New Lover),Adele,0gb1J5UrTpzaU1s3nupgCd,False,10,10,10,0.688,0.533,6,-8.363,0,0.0865,0.0355,3.48e-06,0.172,0.567,164.069,223079,4
2016-08-06,11,Rise,Katy Perry,1CwNogTShsnsn1C8UhRmYX,True,0,11,1,0.553,0.639,11,-6.445,1,0.0458,0.0468,0,0.107,0.442,101.418,203475,4
2016-08-06,12,Just Like Fire,P!nk,1CwNogTShsnsn1C8UhRmYX,False,11,10,14,0.632,0.701,7,-5.921,1,0.146,0.0114,0,0.108,0.497,162.958,215414,4
2016-08-06,13,Work From Home,Fifth Harmony Featuring Ty Dolla $ign,1CwNogTShsnsn1C8UhRmYX,False,12,4,21,0.803,0.585,8,-5.861,1,0.0432,0.103,3.94e-06,0.0644,0.593,105.017,214480,4
2016-08-06,14,Me Too,Meghan Trainor,1CwNogTShsnsn1C8UhRmYX,False,15,14,10,0.934,0.694,11,-5.849,0,0.101,0.0971,1.2e-06,0.477,0.833,123.831,181240,4
2016-08-06,15,H.O.L.Y.,Florida Georgia Line,1CwNogTShsnsn1C8UhRmYX,False,14,14,12,0.523,0.666,7,-4.081,0,0.0327,0.401,0,0.0728,0.564,78.077,194187,4
2016-08-06,16,I Took A Pill In Ibiza,Mike Posner,1CwNogTShsnsn1C8UhRmYX,False,13,4,27,0.664,0.714,7,-6.645,0,0.111,0.0353,8.42e-06,0.0843,0.71,101.969,197933,4
2016-08-06,17,Make Me...,Britney Spears Featuring G-Eazy,0nUGa8WQpQqg2vzJUprEo5,True,0,17,1,0.701,0.7,7,-6.672,0,0.0925,0.146,0,0.206,0.592,122.984,230960,4
2016-08-06,18,Controlla,Drake,0nUGa8WQpQqg2vzJUprEo5,False,16,16,12,0.59,0.468,10,-11.083,0,0.185,0.0789,0,0.101,0.349,92.287,245227,4
2016-08-06,19,For Free,DJ Khaled Featuring Drake,0nUGa8WQpQqg2vzJUprEo5,False,17,17,7,0.916,0.571,10,-8.241,0,0.2,0.0173,1.11e-06,0.153,0.498,103.521,183695,4
2016-08-06,20,Too Good,Drake Featuring Rihanna,0nUGa8WQpQqg2vzJUprEo5,False,19,19,12,0.794,0.653,7,-7.839,1,0.104,0.0489,4.88e-05,0.1,0.397,117.996,263373,4
2016-08-06,21,Treat You Better,Shawn Mendes,0nUGa8WQpQqg2vzJUprEo5,False,20,20,7,0.443,0.82,10,-4.091,0,0.34,0.107,0,0.107,0.771,82.697,187973,4
2016-08-06,22,Heathens,twenty one pilots,0nUGa8WQpQqg2vzJUprEo5,False,23,14,5,0.732,0.396,4,-9.348,0,0.0286,0.0841,3.58e-05,0.105,0.548,90.024,195920,4
2016-08-06,23,Work,Rihanna Featuring Drake,0nUGa8WQpQqg2vzJUprEo5,False,21,1,26,0.725,0.534,11,-6.238,1,0.0946,0.0752,0,0.0919,0.558,91.974,219320,4
2016-08-06,24,Into You,Ariana Grande,0nUGa8WQpQqg2vzJUprEo5,False,33,24,10,0.623,0.734,9,-5.948,1,0.107,0.0162,1.75e-06,0.145,0.37,107.853,244453,4
2016-08-06,25,Never Be Like You,Flume Featuring Kai,0nUGa8WQpQqg2vzJUprEo5,False,26,25,16,0.444,0.557,0,-5.476,1,0.0602,0.453,0,0.152,0.296,115.058,234910,4
2016-08-06,26,7 Years,Lukas Graham,0nUGa8WQpQqg2vzJUprEo5,False,22,2,27,0.765,0.473,10,-5.829,1,0.0514,0.287,0,0.391,0.34,119.992,237300,4
2016-08-06,27,We Don't Talk Anymore,Charlie Puth Featuring Selena Gomez,0nUGa8WQpQqg2vzJUprEo5,False,35,27,7,0.728,0.563,1,-8.053,0,0.134,0.621,0,0.179,0.352,100.017,217707,4
2016-08-06,28,All In My Head (Flex),Fifth Harmony Featuring Fetty Wap,0nUGa8WQpQqg2vzJUprEo5,False,29,28,5,0.689,0.791,0,-5.194,0,0.053,0.023,0,0.0526,0.755,95.04,210573,4
2016-08-06,29,Stressed Out,twenty one pilots,0nUGa8WQpQqg2vzJUprEo5,False,25,2,44,0.734,0.637,4,-5.677,0,0.141,0.0462,2.29e-05,0.0602,0.648,169.977,202333,4
2016-08-06,30,I Got The Keys,DJ Khaled Featuring Jay Z & Future,0nUGa8WQpQqg2vzJUprEo5,False,34,30,4,0.686,0.623,1,-3.425,1,0.13,0.00287,0.00145,0.219,0.176,140.171,219759,4
2016-08-06,31,Sorry,Beyonce,0nUGa8WQpQqg2vzJUprEo5,False,28,11,13,0.775,0.598,2,-7.274,1,0.0535,0.00175,4.44e-06,0.253,0.356,129.988,232560,4
2016-08-06,32,Let It Go,James Bay,0nUGa8WQpQqg2vzJUprEo5,False,18,16,31,0.546,0.311,1,-10.396,1,0.0288,0.818,1.65e-05,0.107,0.246,147.464,260533,4
2016-08-06,33,Low Life,Future Featuring The Weeknd,0nUGa8WQpQqg2vzJUprEo5,False,32,18,24,0.722,0.331,8,-7.789,1,0.0725,0.337,0.283,0.146,0.102,143.974,313547,4
2016-08-06,34,Broccoli,D.R.A.M. Featuring Lil Yachty,0nUGa8WQpQqg2vzJUprEo5,False,39,34,6,0.825,0.485,8,-11.479,1,0.395,0.187,0,0.0904,0.792,145.976,233278,4
2016-08-06,35,I Hate U I Love U,gnash Featuring Olivia O'Brien,0nUGa8WQpQqg2vzJUprEo5,False,50,35,14,0.492,0.275,6,-13.4,0,0.3,0.687,0,0.101,0.18,92.6,251034,4
2016-08-06,36,Dangerous Woman,Ariana Grande,0nUGa8WQpQqg2vzJUprEo5,False,24,8,19,0.664,0.602,4,-5.369,0,0.0412,0.0529,0,0.356,0.289,134.049,235947,3
2016-08-06,37,Love Yourself,Justin Bieber,0nUGa8WQpQqg2vzJUprEo5,False,30,1,36,0.759,0.401,4,-8.999,1,0.259,0.86,0,0.299,0.576,100.126,232627,4
2016-08-06,38,My House,Flo Rida,0nUGa8WQpQqg2vzJUprEo5,False,36,4,37,0.688,0.702,7,-4.792,0,0.0499,0.0215,0,0.128,0.74,94.006,192191,4
2016-08-06,39,Cake By The Ocean,DNCE,0nUGa8WQpQqg2vzJUprEo5,False,37,9,40,0.774,0.753,4,-5.446,0,0.0517,0.152,0,0.0371,0.896,119.002,219147,4
2016-08-06,40,Gold,Kiiara,0nUGa8WQpQqg2vzJUprEo5,False,45,40,9,0.6,0.412,8,-9.343,1,0.344,0.615,0.0025,0.134,0.408,113.049,225882,5
2016-08-06,41,Close,Nick Jonas Featuring Tove Lo,0nUGa8WQpQqg2vzJUprEo5,False,31,14,17,0.654,0.623,6,-5.273,0,0.082,0.253,0,0.144,0.401,123.996,234213,4
2016-08-06,42,THat Part,ScHoolboy Q Featuring Kanye West,0nUGa8WQpQqg2vzJUprEo5,False,43,42,7,0.927,0.535,6,-7.59,0,0.0911,0.0855,0,0.136,0.336,112.96,313573,4
2016-08-06,43,Lost Boy,Ruth B,0nUGa8WQpQqg2vzJUprEo5,False,27,24,22,0.71,0.0565,7,-15.099,1,0.0534,0.965,0,0.0889,0.348,123.994,275280,4
2016-08-06,44,Wicked,Future,0nUGa8WQpQqg2vzJUprEo5,False,41,41,14,0.718,0.679,11,-5.899,0,0.0706,0.00191,0.0104,0.385,0.205,157.97,173347,4
2016-08-06,45,Sorry,Justin Bieber,0nUGa8WQpQqg2vzJUprEo5,False,42,1,39,0.679,0.748,0,-3.624,0,0.0385,0.0878,0,0.299,0.438,100.035,200787,4
2016-08-06,46,All The Way Up,"Fat Joe, Remy Ma & Jay Z Featuring French Montana & Infared",0nUGa8WQpQqg2vzJUprEo5,False,38,27,17,0.536,0.721,10,-6.44,0,0.386,0.062,0,0.824,0.393,117.139,191942,5
2016-08-06,47,Vice,Miranda Lambert,4Qtw0HNKSbIRT5sWUnbRXc,True,0,47,1,0.568,0.562,9,-7.775,1,0.0418,0.101,6.16e-05,0.363,0.247,133.647,240280,4
2016-08-06,48,From The Ground Up,Dan + Shay,4Qtw0HNKSbIRT5sWUnbRXc,False,59,48,9,0.281,0.58,9,-5.967,1,0.0323,0.333,0,0.122,0.282,151.568,253933,3
2016-08-06,49,Never Forget You,Zara Larsson & MNEK,4Qtw0HNKSbIRT5sWUnbRXc,False,40,13,23,0.583,0.732,11,-5.728,0,0.0457,0.00312,9.86e-06,0.269,0.276,145.992,213428,4
2016-08-06,50,Kill Em With Kindness,Selena Gomez,4Qtw0HNKSbIRT5sWUnbRXc,False,51,39,8,0.757,0.884,10,-5.488,0,0.0404,0.00795,5.87e-05,0.0973,0.398,120.012,217907,4
2016-08-06,51,Hymn For The Weekend,Coldplay,4Qtw0HNKSbIRT5sWUnbRXc,False,54,51,8,0.491,0.693,0,-6.487,0,0.0377,0.211,6.92e-06,0.325,0.412,90.027,258267,4
2016-08-06,52,Church Bells,Carrie Underwood,4Qtw0HNKSbIRT5sWUnbRXc,False,47,43,11,0.575,0.844,3,-1.772,0,0.0633,0.226,0,0.0538,0.542,87.007,193333,4
2016-08-06,53,Record Year,Eric Church,4Qtw0HNKSbIRT5sWUnbRXc,False,52,52,14,0.589,0.641,5,-8.12,1,0.0838,0.205,0,0.0864,0.57,160.031,179347,4
2016-08-06,54,Toothbrush,DNCE,4Qtw0HNKSbIRT5sWUnbRXc,False,44,44,6,0.556,0.785,7,-5.842,1,0.133,0.122,0,0.468,0.825,104.978,231813,4
2016-08-06,55,Head Over Boots,Jon Pardi,4Qtw0HNKSbIRT5sWUnbRXc,False,56,54,21,0.563,0.688,7,-4.474,1,0.0262,0.0763,0,0.0863,0.622,108.008,202347,4
2016-08-06,56,Wherever I Go,OneRepublic,4Qtw0HNKSbIRT5sWUnbRXc,False,55,55,10,0.54,0.675,10,-6.449,0,0.0429,0.1,0,0.237,0.348,99.97,169773,4
2016-08-06,57,My PYT,Wale,4Qtw0HNKSbIRT5sWUnbRXc,False,64,57,6,0.554,0.481,0,-9.823,1,0.329,0.0139,0,0.0787,0.456,191.991,236867,4
2016-08-06,58,Lights Come On,Jason Aldean,4Qtw0HNKSbIRT5sWUnbRXc,False,53,43,15,0.567,0.839,6,-4.048,0,0.0698,0.0489,0,0.103,0.903,160.062,194507,4
2016-08-06,59,Peter Pan,Kelsea Ballerini,4Qtw0HNKSbIRT5sWUnbRXc,False,58,58,8,0.514,0.659,1,-6.142,1,0.0309,0.0284,0,0.266,0.463,76.483,200040,4
2016-08-06,60,Make You Miss Me,Sam Hunt,4Qtw0HNKSbIRT5sWUnbRXc,False,62,60,8,0.614,0.472,7,-6.626,1,0.0297,0.158,0,0.111,0.168,146.005,225693,4
2016-08-06,61,Unsteady,X Ambassadors,4Qtw0HNKSbIRT5sWUnbRXc,False,46,39,10,0.389,0.665,0,-6.169,1,0.0644,0.178,0.000732,0.116,0.199,117.055,193547,4
2016-08-06,62,Luv,Tory Lanez,4Qtw0HNKSbIRT5sWUnbRXc,False,69,62,4,0.539,0.528,11,-8.113,0,0.252,0.0108,0,0.117,0.252,190.169,228640,4
2016-08-06,63,No Limit,Usher Featuring Young Thug,4Qtw0HNKSbIRT5sWUnbRXc,False,70,63,4,0.717,0.523,10,-6.506,0,0.0611,0.0799,0,0.206,0.282,127.047,228613,4
2016-08-06,64,"Sit Still, Look Pretty",Daya,4Qtw0HNKSbIRT5sWUnbRXc,False,61,61,8,0.655,0.74,2,-4.081,1,0.274,0.14,0,0.106,0.543,182.105,202221,4
2016-08-06,65,Fix,Chris Lane,4Qtw0HNKSbIRT5sWUnbRXc,False,66,65,8,0.532,0.883,0,-2.743,0,0.0352,0.0951,0,0.304,0.7,99.995,190240,4
2016-08-06,66,Different For Girls,Dierks Bentley Featuring Elle King,4Qtw0HNKSbIRT5sWUnbRXc,False,73,66,7,0.655,0.768,4,-5.616,1,0.0365,0.385,0.000257,0.0733,0.431,92.021,180360,4
2016-08-06,67,American Country Love Song,Jake Owen,4Qtw0HNKSbIRT5sWUnbRXc,False,65,65,9,0.529,0.891,8,-4.36,1,0.043,0.0457,0,0.0942,0.329,104.031,199747,4
2016-08-06,68,Girls Talk Boys,5 Seconds Of Summer,3AqhGYasXnen5PvLsHL1vc,True,0,68,1,0.828,0.777,7,-3.356,1,0.0513,0.0901,0,0.0973,0.867,120.04,216093,4
2016-08-06,69,Uber Everywhere,MadeinTYO,3AqhGYasXnen5PvLsHL1vc,False,57,51,16,0.779,0.455,1,-15.025,1,0.28,0.0542,0,0.177,0.197,140.181,153429,4
2016-08-06,70,Wake Up,Fetty Wap,3AqhGYasXnen5PvLsHL1vc,False,60,50,10,0.647,0.673,5,-5.992,1,0.176,0.172,0,0.223,0.527,179.971,224000,4
2016-08-06,71,Famous,Kanye West,3AqhGYasXnen5PvLsHL1vc,False,88,34,10,0.465,0.735,6,-3.715,1,0.117,0.0711,0,0.0975,0.409,173.935,196040,4
2016-08-06,72,Pop Style,Drake Featuring The Throne,3AqhGYasXnen5PvLsHL1vc,False,67,16,16,0.713,0.462,7,-10.027,1,0.123,0.192,2.16e-06,0.105,0.0594,133.053,212947,4
2016-08-06,73,Lockjaw,French Montana Featuring Kodak Black,3AqhGYasXnen5PvLsHL1vc,False,79,73,3,0.615,0.648,5,-3.792,0,0.22,0.0411,0,0.277,0.26,169.912,223147,4
2016-08-06,74,Money Longer,Lil Uzi Vert,3AqhGYasXnen5PvLsHL1vc,False,74,74,6,0.795,0.568,5,-7.817,0,0.142,0.0541,0,0.108,0.478,136.173,198944,4
2016-08-06,75,She's Got A Way With Words,Blake Shelton,3AqhGYasXnen5PvLsHL1vc,False,75,75,4,0.616,0.697,3,-5.952,1,0.0295,0.326,2.18e-05,0.0827,0.68,148.93,190987,4
2016-08-06,76,Wasted Time,Keith Urban,3AqhGYasXnen5PvLsHL1vc,False,63,51,13,0.625,0.825,7,-5.758,1,0.0481,0.0621,0,0.0753,0.341,100.004,233827,4
2016-08-06,77,With You Tonight / Hasta El Amanecer,Nicky Jam,3AqhGYasXnen5PvLsHL1vc,False,77,77,9,0.786,0.577,6,-6.675,0,0.0466,0.285,0,0.262,0.651,94.019,195893,4
2016-08-06,78,"Huntin', Fishin' & Lovin' Every Day",Luke Bryan,3AqhGYasXnen5PvLsHL1vc,False,71,37,17,0.543,0.81,0,-4.275,1,0.0368,0.14,1.23e-05,0.145,0.395,76.978,278613,4
2016-08-06,79,Sucker For Pain,"Lil Wayne, Wiz Khalifa & Imagine Dragons With Logic & Ty Dolla $ign Feat. X Ambassadors",3AqhGYasXnen5PvLsHL1vc,False,76,32,4,0.502,0.786,9,-4.378,0,0.317,0.255,0,0.65,0.739,169.021,243491,4
2016-08-06,80,You & Me,Marc E. Bassy Featuring G-Eazy,3AqhGYasXnen5PvLsHL1vc,False,91,80,2,0.449,0.635,1,-8.301,1,0.275,0.0413,0,0.188,0.608,84.414,218493,4
2016-08-06,81,Mama Said,Lukas Graham,5ArQzSBevAdXTxRY6Ulhbq,True,0,81,1,0.712,0.799,7,-4.564,0,0.0703,0.0447,6.4e-05,0.37,0.591,83.996,206903,4
2016-08-06,82,Brand New,Ben Rector,5ArQzSBevAdXTxRY6Ulhbq,False,82,82,3,0.555,0.934,9,-5.04,1,0.113,0.00268,0,0.122,0.422,144.874,243933,4
2016-08-06,83,Duele El Corazon,Enrique Iglesias Feat. Wisin or Tinashe & Javada,5ArQzSBevAdXTxRY6Ulhbq,False,86,83,2,0.724,0.904,8,-3.354,0,0.0966,0.0786,0,0.226,0.846,90.999,200813,4
2016-08-06,84,Body Say,Demi Lovato,7xrA11O07xo57Bbg6p4hck,True,0,84,1,0.628,0.74,5,-4.836,0,0.0358,0.00415,0,0.277,0.257,86.983,193893,4
2016-08-06,85,No,Meghan Trainor,7xrA11O07xo57Bbg6p4hck,False,78,3,20,0.557,0.803,1,-3.599,0,0.213,0.0124,1.61e-06,0.737,0.657,92.134,213507,4
2016-08-06,86,M.I.L.F. $,Fergie,7xrA11O07xo57Bbg6p4hck,False,80,34,3,0.773,0.706,0,-5.709,1,0.0999,0.00538,0.0148,0.0208,0.693,160.912,162365,4
2016-08-06,87,Why You Always Hatin?,YG Featuring Drake & Kamaiyah,7xrA11O07xo57Bbg6p4hck,False,87,87,5,0.926,0.336,0,-9.326,0,0.594,0.0392,0,0.138,0.38,92.995,196600,4
2016-08-06,88,Night's On Fire,David Nail,7xrA11O07xo57Bbg6p4hck,False,81,81,5,0.54,0.776,4,-4.155,1,0.043,0.243,0,0.378,0.784,164.046,189733,4
2016-08-06,89,No Shopping,French Montana Featuring Drake,0Di26AbdtizzHkFstPyt7A,True,0,89,1,0.895,0.491,10,-10.261,0,0.246,0.0144,0.000988,0.143,0.249,83.505,227727,4
2016-08-06,90,A Little More Summertime,Jason Aldean,3esPcn43N0CytAtcY9V30C,True,0,90,1,0.482,0.823,9,-4.446,1,0.0661,0.0386,3.69e-05,0.0948,0.451,167.665,219547,4
2016-08-06,91,You Was Right,Lil Uzi Vert,3esPcn43N0CytAtcY9V30C,False,89,89,2,0.843,0.359,0,-7.417,1,0.461,0.069,0,0.12,0.156,81.987,163944,4
2016-08-06,92,Light It Up,Major Lazer Featuring Nyla & Fuse ODG,3esPcn43N0CytAtcY9V30C,False,85,73,19,0.747,0.877,9,-3.782,0,0.0668,0.0385,0.00089,0.233,0.751,107.989,166138,4
2016-08-06,93,No Problem,Chance The Rapper Featuring Lil Wayne & 2 Chainz,3esPcn43N0CytAtcY9V30C,False,98,86,9,0.652,0.795,11,-5.192,0,0.174,0.156,0,0.123,0.788,135.018,304607,4
2016-08-06,94,Ophelia,The Lumineers,3esPcn43N0CytAtcY9V30C,False,94,66,12,0.664,0.573,5,-6.519,1,0.0277,0.613,0.000363,0.0857,0.566,76.023,160097,4
2016-08-06,95,Childs Play,Drake,3esPcn43N0CytAtcY9V30C,False,93,49,12,0.746,0.475,10,-11.243,0,0.113,0.0175,1.1e-05,0.197,0.292,80.006,241400,4
2016-08-06,96,"Wat U Mean (Aye, Aye, Aye)",Dae Dae,46IdjlVO3EmaMqooXZ1Hcu,True,0,96,1,0.923,0.599,6,-4.888,1,0.238,0.07,1.23e-06,0.0951,0.667,138.024,181739,4
2016-08-06,97,Sex With Me,Rihanna,7BiELrM90hRxpozaIXbsLw,True,0,97,1,0.58,0.532,1,-5.668,0,0.0424,0.294,0,0.0948,0.39,112.049,206400,4
2016-08-06,98,Come And See Me,PARTYNEXTDOOR Featuring Drake,7BiELrM90hRxpozaIXbsLw,False,0,97,3,0.717,0.347,11,-10.265,0,0.0636,0.0511,2.43e-06,0.087,0.0589,84.987,235477,4
2016-08-06,99,Body,Dreezy Featuring Jeremih,7BiELrM90hRxpozaIXbsLw,False,96,62,18,0.735,0.567,0,-5.962,1,0.0635,0.554,0,0.0659,0.574,149.968,232707,4
2016-08-06,100,Lush Life,Zara Larsson,7BiELrM90hRxpozaIXbsLw,False,97,97,2,0.694,0.712,7,-3.923,0,0.046,0.133,0,0.211,0.799,98.022,201122,4
