date,position,title,artist,spotify_id,is_new,last_pos,peak_pos,weeks,danceability,energy,key,loudness,mode,speechiness,acousticness,instrumentalness,liveness,valence,tempo,duration_ms,time_signature
2013-07-20,1,Blurred Lines,Robin Thicke Featuring T.I. + Pharrell,6bxUnsSGZCmoHHU5auwtps,False,1,1,12,0.853,0.599,7,-4.756,1,0.0411,0.00334,7.93e-06,0.0759,0.843,119.993,263827,4
2013-07-20,2,Get Lucky,Daft Punk Featuring Pharrell Williams,6bxUnsSGZCmoHHU5auwtps,False,2,2,12,0.794,0.811,6,-8.966,0,0.038,0.0426,1.07e-06,0.101,0.862,116.047,248413,4
2013-07-20,3,We Can't Stop,Miley Cyrus,6bxUnsSGZCmoHHU5auwtps,False,3,3,5,0.613,0.622,1,-5.794,0,0.0334,0.00882,0,0.37,0.484,80.003,231240,4
2013-07-20,4,Radioactive,Imagine Dragons,6bxUnsSGZCmoHHU5auwtps,False,4,3,45,0.448,0.784,9,-3.686,1,0.0627,0.106,0.000108,0.668,0.236,136.245,186813,4
2013-07-20,5,Cruise,Florida Georgia Line Featuring Nelly,6bxUnsSGZCmoHHU5auwtps,False,6,4,40,0.457,0.948,10,-3.364,1,0.0354,0.0191,0,0.0536,0.878,148.0,208960,4
2013-07-20,6,Can't Hold Us,Macklemore & Ryan Lewis Featuring Ray Dalton,6bxUnsSGZCmoHHU5auwtps,False,5,1,22,0.641,0.922,2,-4.457,1,0.0786,0.0291,0,0.0862,0.847,146.078,258343,4
2013-07-20,7,Mirrors,Justin Timberlake,6bxUnsSGZCmoHHU5auwtps,False,7,2,21,0.574,0.512,5,-6.664,0,0.0503,0.234,0,0.0946,0.512,76.899,484147,4
2013-07-20,8,Treasure,Bruno Mars,6bxUnsSGZCmoHHU5auwtps,False,8,8,8,0.874,0.692,5,-5.28,0,0.0431,0.0412,7.24e-05,0.324,0.937,116.017,178560,4
2013-07-20,9,Come & Get It,Selena Gomez,6bxUnsSGZCmoHHU5auwtps,False,9,6,13,0.552,0.783,7,-4.138,0,0.0504,0.00887,0.00026,0.0954,0.575,79.984,231413,4
2013-07-20,10,Cups (Pitch Perfect's When I'm Gone),Anna Kendrick,6bxUnsSGZCmoHHU5auwtps,False,13,10,28,0.878,0.455,0,-8.845,1,0.077,0.0462,0.00484,0.0353,0.79,129.953,128013,4
2013-07-20,11,Just Give Me A Reason,P!nk Featuring Nate Ruess,6bxUnsSGZCmoHHU5auwtps,False,11,1,21,0.778,0.547,2,-7.273,1,0.0489,0.346,0.000302,0.132,0.441,95.002,242733,4
2013-07-20,12,The Way,Ariana Grande Featuring Mac Miller,6bxUnsSGZCmoHHU5auwtps,False,10,9,15,0.645,0.877,5,-3.208,0,0.113,0.294,0,0.0759,0.861,82.324,227027,4
2013-07-20,13,Clarity,Zedd Featuring Foxes,6bxUnsSGZCmoHHU5auwtps,False,14,13,16,0.509,0.781,8,-3.48,1,0.072,0.0398,0,0.0749,0.176,128.0,271427,4
2013-07-20,14,Same Love,Macklemore & Ryan Lewis Featuring Mary Lambert,6bxUnsSGZCmoHHU5auwtps,False,16,14,17,0.688,0.473,8,-9.059,1,0.167,0.716,4.46e-05,0.104,0.299,84.958,318525,4
2013-07-20,15,Love Somebody,Maroon 5,6bxUnsSGZCmoHHU5auwtps,False,18,15,7,0.675,0.792,1,-6.303,1,0.0368,0.145,0,0.12,0.395,120.016,229813,4
2013-07-20,16,I Love It,Icona Pop Featuring Charli XCX,6bxUnsSGZCmoHHU5auwtps,False,12,7,23,0.711,0.906,8,-2.671,1,0.0284,0.00952,1.64e-05,0.153,0.824,125.916,157153,4
2013-07-20,17,#Beautiful,Mariah Carey Featuring Miguel,6bxUnsSGZCmoHHU5auwtps,False,17,15,9,0.677,0.749,4,-5.405,1,0.0391,0.346,0,0.347,0.469,107.042,199867,4
2013-07-20,18,My Songs Know What You Did In The Dark (Light Em Up),Fall Out Boy,6bxUnsSGZCmoHHU5auwtps,False,15,13,22,0.558,0.924,9,-4.341,0,0.064,0.0271,3.32e-06,0.537,0.567,151.99,186827,4
2013-07-20,19,Power Trip,J. Cole Featuring Miguel,6bxUnsSGZCmoHHU5auwtps,False,21,19,21,0.667,0.608,1,-7.054,1,0.216,0.324,0.000198,0.426,0.475,99.992,241160,4
2013-07-20,20,I Need Your Love,Calvin Harris Featuring Ellie Goulding,6bxUnsSGZCmoHHU5auwtps,False,23,20,12,0.695,0.869,8,-5.066,1,0.0483,0.41,0,0.237,0.58,124.989,234507,4
2013-07-20,21,The Other Side,Jason Derulo,6bxUnsSGZCmoHHU5auwtps,False,22,21,12,0.561,0.836,9,-3.939,1,0.1,0.0525,0,0.136,0.517,127.923,226987,4
2013-07-20,22,Boys 'round Here,Blake Shelton Featuring Pistol Annies & Friends,6bxUnsSGZCmoHHU5auwtps,False,20,12,15,0.611,0.688,2,-6.369,1,0.0529,0.251,2.35e-06,0.248,0.649,169.895,288760,4
2013-07-20,23,Stay,Rihanna Featuring Mikky Ekko,6bxUnsSGZCmoHHU5auwtps,False,19,3,22,0.621,0.31,9,-10.164,0,0.0283,0.945,6.12e-05,0.117,0.125,111.893,240707,4
2013-07-20,24,Thrift Shop,Macklemore & Ryan Lewis Featuring Wanz,6bxUnsSGZCmoHHU5auwtps,False,24,1,40,0.781,0.526,6,-6.986,0,0.293,0.0633,0,0.0457,0.665,94.993,235613,4
2013-07-20,25,Body Party,Ciara,6bxUnsSGZCmoHHU5auwtps,False,34,25,11,0.577,0.576,2,-6.299,1,0.0563,0.0143,0,0.602,0.12,133.973,234040,4
2013-07-20,26,I Want Crazy,Hunter Hayes,6bxUnsSGZCmoHHU5auwtps,False,25,19,13,0.562,0.878,8,-4.806,1,0.0387,0.0539,0,0.112,0.558,103.029,236865,4
2013-07-20,27,U.O.E.N.O.,Rocko Featuring Future & Rick Ross,6bxUnsSGZCmoHHU5auwtps,False,30,27,13,0.422,0.641,10,-4.947,0,0.323,0.422,0,0.317,0.654,187.027,260276,3
2013-07-20,28,Crash My Party,Luke Bryan,6bxUnsSGZCmoHHU5auwtps,False,27,18,13,0.526,0.816,7,-4.009,1,0.0421,0.0285,0,0.22,0.414,144.032,234760,4
2013-07-20,29,When I Was Your Man,Bruno Mars,6bxUnsSGZCmoHHU5auwtps,False,26,1,29,0.612,0.28,0,-8.648,1,0.0434,0.932,0,0.088,0.387,72.795,213827,4
2013-07-20,30,Bad,Wale Featuring Tiara Thomas Or Rihanna,6bxUnsSGZCmoHHU5auwtps,False,28,21,21,0.807,0.702,6,-6.594,0,0.0748,0.307,0,0.111,0.447,114.038,238827,4
2013-07-20,31,Safe And Sound,Capital Cities,6bxUnsSGZCmoHHU5auwtps,False,32,31,10,0.655,0.819,0,-4.852,1,0.0316,0.000176,0.00374,0.104,0.766,117.956,192790,5
2013-07-20,32,Wagon Wheel,Darius Rucker,6bxUnsSGZCmoHHU5auwtps,False,29,15,22,0.537,0.66,9,-7.174,1,0.0296,0.455,0,0.135,0.574,148.096,298373,4
2013-07-20,33,"Gone, Gone, Gone",Phillip Phillips,6bxUnsSGZCmoHHU5auwtps,False,31,31,18,0.664,0.642,6,-5.961,1,0.038,0.129,0,0.114,0.501,118.002,209693,4
2013-07-20,34,Runnin' Outta Moonlight,Randy Houser,6bxUnsSGZCmoHHU5auwtps,False,37,34,9,0.526,0.801,2,-3.717,1,0.0393,0.0354,3.17e-06,0.0637,0.769,172.024,193773,4
2013-07-20,35,Sail,AWOLNATION,6bxUnsSGZCmoHHU5auwtps,False,36,30,44,0.825,0.435,1,-9.582,1,0.0568,0.452,0.609,0.0953,0.243,119.038,259102,4
2013-07-20,36,Ho Hey,The Lumineers,6bxUnsSGZCmoHHU5auwtps,False,41,3,57,0.685,0.466,0,-9.074,1,0.0304,0.794,2.06e-06,0.0915,0.353,79.936,163133,4
2013-07-20,37,"Bitch, Don't Kill My Vibe",Kendrick Lamar,6bxUnsSGZCmoHHU5auwtps,False,33,32,20,0.587,0.698,1,-8.948,1,0.0943,0.0152,0,0.442,0.0985,133.954,310720,4
2013-07-20,38,Rich As F**k,Lil Wayne Featuring 2 Chainz,6bxUnsSGZCmoHHU5auwtps,False,40,38,16,0.595,0.359,8,-13.488,1,0.453,0.289,0,0.15,0.886,131.969,229198,4
2013-07-20,39,Don't Ya,Brett Eldredge,6bxUnsSGZCmoHHU5auwtps,False,45,39,7,0.537,0.693,9,-5.256,1,0.0847,0.0566,0,0.146,0.581,176.004,181210,4
2013-07-20,40,No New Friends (SFTB Remix),"DJ Khaled Featuring Drake, Rick Ross & Lil Wayne",6bxUnsSGZCmoHHU5auwtps,False,42,37,11,0.703,0.681,2,-6.356,1,0.133,0.00589,0,0.449,0.245,124.928,308333,4
2013-07-20,41,Started From The Bottom,Drake,6bxUnsSGZCmoHHU5auwtps,False,44,6,22,0.793,0.524,8,-7.827,1,0.156,0.0319,0,0.156,0.579,86.325,174133,4
2013-07-20,42,Feel This Moment,Pitbull Featuring Christina Aguilera,6bxUnsSGZCmoHHU5auwtps,False,39,8,24,0.673,0.758,7,-3.632,1,0.158,0.039,0,0.341,0.542,135.956,229507,4
2013-07-20,43,DONE.,The Band Perry,6bxUnsSGZCmoHHU5auwtps,False,48,43,17,0.65,0.89,1,-2.995,1,0.0366,0.322,0,0.0543,0.757,100.053,205267,4
2013-07-20,44,Suit & Tie,Justin Timberlake Featuring JAY Z,6bxUnsSGZCmoHHU5auwtps,False,47,3,26,0.795,0.596,11,-3.799,0,0.219,0.103,0,0.164,0.357,101.985,326280,4
2013-07-20,45,Tapout,"Rich Gang Featuring Lil Wayne, Birdman, Future, Mack Maine, Nicki Minaj",6bxUnsSGZCmoHHU5auwtps,False,50,45,9,0.762,0.577,8,-5.229,1,0.175,0.0309,0,0.108,0.287,142.055,284587,4
2013-07-20,46,Hey Pretty Girl,Kip Moore,6bxUnsSGZCmoHHU5auwtps,False,51,46,16,0.291,0.4,2,-10.615,1,0.0306,0.145,1.86e-05,0.259,0.0935,83.112,215920,1
2013-07-20,47,Highway Don't Care,Tim McGraw With Taylor Swift,6bxUnsSGZCmoHHU5auwtps,False,43,22,19,0.477,0.791,2,-5.348,1,0.0396,0.0259,0,0.0841,0.505,157.83,279067,4
2013-07-20,48,Heart Attack,Demi Lovato,6bxUnsSGZCmoHHU5auwtps,False,38,10,19,0.504,0.785,8,-4.802,1,0.104,0.0738,0,0.239,0.502,173.968,210840,4
2013-07-20,49,Crazy Kids,Ke$ha Featuring will.i.am Or Juicy J,6bxUnsSGZCmoHHU5auwtps,False,53,49,6,0.742,0.706,0,-4.6,0,0.0433,0.0141,0.00568,0.133,0.478,128.03,230747,4
2013-07-20,50,I'm Out,Ciara Featuring Nicki Minaj,3c7MNgwEBQTnrOWLjU1DHq,True,0,50,1,0.737,0.723,0,-5.834,1,0.261,0.0864,4.47e-06,0.522,0.555,148.113,241613,4
2013-07-20,51,See You Again,Carrie Underwood,3c7MNgwEBQTnrOWLjU1DHq,False,52,51,10,0.514,0.742,8,-2.525,1,0.0258,0.27,1.7e-06,0.085,0.47,101.0,246453,4
2013-07-20,52,Beat It,Sean Kingston Featuring Chris Brown & Wiz Khalifa,3c7MNgwEBQTnrOWLjU1DHq,False,55,52,11,0.477,0.637,1,-5.386,1,0.109,0.00487,0,0.284,0.555,198.12,253453,4
2013-07-20,53,Redneck Crazy,Tyler Farr,3c7MNgwEBQTnrOWLjU1DHq,False,56,53,6,0.487,0.667,7,-4.216,0,0.0309,0.153,0,0.161,0.463,145.854,216040,4
2013-07-20,54,Round Here,Florida Georgia Line,3c7MNgwEBQTnrOWLjU1DHq,False,60,54,4,0.523,0.954,1,-3.051,1,0.0374,0.00385,1.65e-06,0.243,0.901,141.982,215120,4
2013-07-20,55,22,Taylor Swift,3c7MNgwEBQTnrOWLjU1DHq,False,49,20,19,0.658,0.729,7,-6.561,1,0.0378,0.00215,0.0013,0.0752,0.668,104.007,230133,4
2013-07-20,56,Jump Right In,Zac Brown Band,3c7MNgwEBQTnrOWLjU1DHq,False,58,56,11,0.697,0.82,1,-5.108,1,0.0575,0.0888,0,0.143,0.655,104.022,180813,4
2013-07-20,57,Beat This Summer,Brad Paisley,3c7MNgwEBQTnrOWLjU1DHq,False,46,46,17,0.563,0.722,6,-5.252,1,0.0407,0.313,0,0.393,0.801,150.039,281453,4
2013-07-20,58,Crooked Smile,J. Cole Featuring TLC,3c7MNgwEBQTnrOWLjU1DHq,False,66,58,3,0.606,0.784,7,-6.293,1,0.268,0.435,0,0.689,0.48,80.985,278573,4
2013-07-20,59,Here's To Never Growing Up,Avril Lavigne,3c7MNgwEBQTnrOWLjU1DHq,False,35,20,13,0.482,0.873,0,-3.145,1,0.0853,0.0111,0,0.409,0.737,165.084,214320,4
2013-07-20,60,All Over The Road,Easton Corbin,3c7MNgwEBQTnrOWLjU1DHq,False,61,60,9,0.491,0.841,5,-3.579,1,0.0421,0.0471,0,0.0886,0.721,199.851,163067,4
2013-07-20,61,Anywhere With You,Jake Owen,3c7MNgwEBQTnrOWLjU1DHq,False,54,46,16,0.475,0.936,5,-2.545,1,0.0413,0.0418,0,0.0873,0.598,151.988,209587,4
2013-07-20,62,Little Bit Of Everything,Keith Urban,3c7MNgwEBQTnrOWLjU1DHq,False,62,62,7,0.619,0.882,8,-5.99,1,0.0912,0.239,0,0.033,0.897,159.98,205707,4
2013-07-20,63,Right Now,Rihanna Featuring David Guetta,3c7MNgwEBQTnrOWLjU1DHq,False,68,63,3,0.668,0.64,3,-5.208,0,0.0888,0.049,0,0.0675,0.259,130.004,181627,4
2013-07-20,64,Demons,Imagine Dragons,3c7MNgwEBQTnrOWLjU1DHq,False,63,63,16,0.505,0.71,3,-3.015,1,0.0321,0.19,0.00025,0.329,0.428,89.938,175200,4
2013-07-20,65,Next To Me,Emeli Sande,3c7MNgwEBQTnrOWLjU1DHq,False,57,25,20,0.674,0.81,7,-5.117,0,0.0378,0.0923,4.74e-05,0.11,0.391,94.995,196867,4
2013-07-20,66,Hey Girl,Billy Currington,3c7MNgwEBQTnrOWLjU1DHq,False,72,66,7,0.548,0.673,1,-5.29,1,0.0268,0.0158,0,0.0794,0.652,81.947,200533,4
2013-07-20,67,Feds Watching,2 Chainz Featuring Pharrell,07RXBKfyCYIYRMLCvlGWXU,True,0,67,1,0.79,0.875,7,-6.55,1,0.091,0.0476,0,0.312,0.759,139.985,247013,4
2013-07-20,68,Wake Me Up!,Avicii,07RXBKfyCYIYRMLCvlGWXU,False,81,68,2,0.532,0.783,2,-5.697,1,0.0523,0.0038,0.0012,0.161,0.643,124.08,247427,4
2013-07-20,69,How Many Drinks?,Miguel,07RXBKfyCYIYRMLCvlGWXU,False,77,69,12,0.379,0.608,0,-7.011,0,0.134,0.00311,0.000614,0.248,0.241,81.822,272987,4
2013-07-20,70,People Like Us,Kelly Clarkson,07RXBKfyCYIYRMLCvlGWXU,False,65,65,8,0.6,0.787,6,-5.163,1,0.0366,0.043,0,0.358,0.608,127.977,258907,4
2013-07-20,71,Parking Lot Party,Lee Brice,07RXBKfyCYIYRMLCvlGWXU,False,93,71,2,0.54,0.86,1,-5.763,1,0.081,0.00646,0,0.629,0.856,171.72,207893,4
2013-07-20,72,Bubble Butt,"Major Lazer Featuring Bruno Mars, Tyga & Mystic",07RXBKfyCYIYRMLCvlGWXU,False,78,72,4,0.765,0.771,7,-6.99,1,0.347,0.0115,0.00237,0.606,0.394,194.072,227813,4
2013-07-20,73,Lego House,Ed Sheeran,07RXBKfyCYIYRMLCvlGWXU,False,59,42,15,0.592,0.637,11,-8.48,1,0.0992,0.562,0,0.13,0.565,159.701,185093,4
2013-07-20,74,Without Me,Fantasia Featuring Kelly Rowland & Missy Elliott,63lwbZioX7RZzvQ0sJNd7u,True,0,74,1,0.713,0.687,6,-7.518,0,0.21,0.129,0,0.214,0.555,75.014,270787,4
2013-07-20,75,Fine China,Chris Brown,63lwbZioX7RZzvQ0sJNd7u,False,67,31,14,0.654,0.731,10,-4.767,0,0.0568,0.0419,0,0.122,0.59,104.002,213200,4
2013-07-20,76,Ain't Worried About Nothin,French Montana,63lwbZioX7RZzvQ0sJNd7u,False,83,76,3,0.688,0.904,1,-2.234,1,0.106,0.0229,0,0.0909,0.71,127.887,212427,4
2013-07-20,77,What About Love,Austin Mahone,63lwbZioX7RZzvQ0sJNd7u,False,76,74,4,0.632,0.784,2,-7.457,1,0.0393,0.000157,3.6e-05,0.037,0.278,100.019,203344,4
2013-07-20,78,More Than Miles,Brantley Gilbert,63lwbZioX7RZzvQ0sJNd7u,False,73,73,19,0.47,0.778,5,-5.992,1,0.037,0.0295,0.000225,0.354,0.448,152.005,252867,4
2013-07-20,79,It Goes Like This,Thomas Rhett,63lwbZioX7RZzvQ0sJNd7u,False,82,79,4,0.543,0.837,11,-6.448,1,0.0608,0.117,0,0.0872,0.506,168.056,186080,4
2013-07-20,80,Counting Stars,OneRepublic,63lwbZioX7RZzvQ0sJNd7u,False,69,32,3,0.664,0.705,1,-4.972,0,0.0382,0.0654,0,0.115,0.477,122.017,257840,4
2013-07-20,81,Don't Think They Know,Chris Brown Featuring Aaliyah,63lwbZioX7RZzvQ0sJNd7u,False,87,81,2,0.479,0.606,0,-6.424,0,0.0676,0.0241,0,0.33,0.626,88.573,237987,5
2013-07-20,82,Point At You,Justin Moore,63lwbZioX7RZzvQ0sJNd7u,False,84,82,6,0.626,0.805,7,-5.81,1,0.0449,0.0126,0,0.156,0.882,116.03,180720,4
2013-07-20,83,Gentleman,PSY,63lwbZioX7RZzvQ0sJNd7u,False,80,5,13,0.861,0.742,3,-3.292,0,0.148,0.0035,0,0.0643,0.655,126.01,194960,4
2013-07-20,84,High School,Nicki Minaj Featuring Lil Wayne,63lwbZioX7RZzvQ0sJNd7u,False,85,64,14,0.531,0.683,1,-4.093,0,0.333,0.135,0.00265,0.22,0.212,84.817,218747,4
2013-07-20,85,#thatPOWER,will.i.am Featuring Justin Bieber,63lwbZioX7RZzvQ0sJNd7u,False,71,17,16,0.797,0.608,6,-6.096,0,0.0584,0.00112,7.66e-05,0.0748,0.402,127.999,279507,4
2013-07-20,86,We Own It (Fast & Furious),2 Chainz & Wiz Khalifa,63lwbZioX7RZzvQ0sJNd7u,False,75,16,7,0.554,0.899,8,-4.573,1,0.408,0.0521,0,0.0568,0.552,171.966,227893,4
2013-07-20,87,Wop,J. Dash,63lwbZioX7RZzvQ0sJNd7u,False,94,52,5,0.836,0.817,7,-5.672,1,0.0677,0.00968,0,0.114,0.647,112.007,230627,4
2013-07-20,88,Play Hard,David Guetta Featuring Ne-Yo & Akon,63lwbZioX7RZzvQ0sJNd7u,False,99,64,6,0.691,0.921,8,-1.702,0,0.0535,0.174,0,0.331,0.802,130.072,201000,4
2013-07-20,89,LoveHate Thing,Wale Featuring Sam Dew,6kx16R0LMAyoXDvGqddZFy,True,0,89,1,0.736,0.691,8,-6.118,1,0.169,0.0771,0,0.0422,0.18,99.954,267400,4
2013-07-20,90,Royals,Lorde,2dLLR6qlu5UJ5gk0dKz0h3,True,0,90,1,0.674,0.428,7,-9.504,1,0.122,0.121,0,0.132,0.337,84.878,190185,4
2013-07-20,91,Brave,Sara Bareilles,2dLLR6qlu5UJ5gk0dKz0h3,False,91,61,4,0.551,0.836,10,-3.838,0,0.0524,0.00502,2.1e-05,0.0425,0.758,185.063,220573,4
2013-07-20,92,Beneath Your Beautiful,Labrinth Featuring Emeli Sande,2dLLR6qlu5UJ5gk0dKz0h3,False,95,88,4,0.558,0.522,2,-5.857,1,0.036,0.228,0,0.104,0.228,83.977,271813,4
2013-07-20,93,Young And Beautiful,Lana Del Rey,2dLLR6qlu5UJ5gk0dKz0h3,False,88,22,11,0.324,0.416,11,-8.92,0,0.0368,0.262,3.69e-05,0.11,0.151,113.986,236053,4
2013-07-20,94,Ooh La La,Britney Spears,2dLLR6qlu5UJ5gk0dKz0h3,False,92,85,3,0.69,0.568,6,-4.501,1,0.0525,0.0165,6.98e-06,0.111,0.728,128.059,257493,4
2013-07-20,95,Goodbye Town,Lady Antebellum,2dLLR6qlu5UJ5gk0dKz0h3,False,98,95,2,0.678,0.72,4,-6.034,1,0.027,0.165,5.73e-06,0.114,0.538,95.027,288800,4
2013-07-20,96,Sweater Weather,The Neighbourhood,2dLLR6qlu5UJ5gk0dKz0h3,False,96,95,4,0.612,0.807,10,-2.81,1,0.0336,0.0495,0.0177,0.101,0.398,124.053,240400,4
2013-07-20,97,Black Skinhead,Kanye West,2dLLR6qlu5UJ5gk0dKz0h3,False,86,69,3,0.766,0.809,1,-6.123,1,0.279,0.0011,0,0.168,0.325,130.127,188013,4
2013-07-20,98,HeadBand,B.o.B Featuring 2 Chainz,2dLLR6qlu5UJ5gk0dKz0h3,False,0,65,4,0.919,0.506,1,-7.14,1,0.304,0.132,0,0.0771,0.273,97.465,220240,4
2013-07-20,99,Easy,Sheryl Crow,2n5bpmhEqlMJ2jgvWAwD9N,True,0,99,1,0.522,0.571,9,-5.567,1,0.0245,0.0256,1.14e-06,0.0757,0.608,169.994,253360,4
2013-07-20,100,Live For The Night,Krewella,457p7UH7hoHrbA2iI4PSCA,True,0,100,1,0.499,0.843,6,-2.224,1,0.113,0.0138,0,0.124,0.533,127.932,206480,4
