date,position,title,artist,spotify_id,is_new,last_pos,peak_pos,weeks,danceability,energy,key,loudness,mode,speechiness,acousticness,instrumentalness,liveness,valence,tempo,duration_ms,time_signature
2009-03-14,1,Right Round,Flo Rida,7Kpqjspw4Y7HrvItIRcBiW,False,1,1,5,0.72,0.672,7,-6.852,1,0.0551,0.009,0,0.232,0.705,124.986,204640,4
2009-03-14,2,Dead And Gone,T.I. Featuring Justin Timberlake,7Kpqjspw4Y7HrvItIRcBiW,False,2,2,13,0.713,0.746,0,-4.99,1,0.259,0.0402,0,0.601,0.47,135.021,299747,4
2009-03-14,3,Poker Face,Lady Gaga,7Kpqjspw4Y7HrvItIRcBiW,False,6,3,11,0.851,0.806,4,-4.62,1,0.0787,0.118,1.64e-06,0.121,0.787,118.999,237200,4
2009-03-14,4,Kiss Me Thru The Phone,Soulja Boy Tell 'em Featuring Sammie,7Kpqjspw4Y7HrvItIRcBiW,False,9,4,10,0.758,0.712,7,-3.781,1,0.112,0.0185,0,0.0677,0.795,149.998,193387,4
2009-03-14,5,Gives You Hell,The All-American Rejects,7Kpqjspw4Y7HrvItIRcBiW,False,4,4,16,0.718,0.691,4,-6.44,1,0.0387,0.0159,0,0.0627,0.552,100.008,213107,4
2009-03-14,6,Heartless,Kanye West,7Kpqjspw4Y7HrvItIRcBiW,False,3,2,17,0.79,0.647,10,-5.983,0,0.136,0.0515,0,0.248,0.654,87.999,211000,4
2009-03-14,7,Just Dance,Lady Gaga Featuring Colby O'Donis,7Kpqjspw4Y7HrvItIRcBiW,False,7,1,30,0.813,0.74,1,-4.668,0,0.0327,0.0318,1.43e-05,0.166,0.699,118.976,244055,4
2009-03-14,8,Crack A Bottle,"Eminem, Dr. Dre & 50 Cent",7Kpqjspw4Y7HrvItIRcBiW,False,5,1,7,0.516,0.874,9,-2.571,1,0.186,0.0864,0,0.173,0.391,169.561,297520,3
2009-03-14,9,Love Story,Taylor Swift,7Kpqjspw4Y7HrvItIRcBiW,False,8,4,25,0.626,0.79,2,-4.302,1,0.0311,0.135,3.97e-06,0.0989,0.416,119.082,235767,4
2009-03-14,10,My Life Would Suck Without You,Kelly Clarkson,7Kpqjspw4Y7HrvItIRcBiW,False,10,1,7,0.526,0.882,9,-4.006,1,0.0509,0.0014,0,0.144,0.424,144.982,211493,4
2009-03-14,11,Mad,Ne-Yo,7Kpqjspw4Y7HrvItIRcBiW,False,13,11,13,0.727,0.649,0,-5.356,1,0.0338,0.661,0,0.111,0.669,129.992,254533,4
2009-03-14,12,Blame It,Jamie Foxx Featuring T-Pain,7Kpqjspw4Y7HrvItIRcBiW,False,17,12,7,0.673,0.614,7,-5.426,1,0.103,0.0782,0,0.139,0.362,176.052,289747,4
2009-03-14,13,Circus,Britney Spears,7Kpqjspw4Y7HrvItIRcBiW,False,14,3,13,0.791,0.733,6,-5.215,0,0.052,0.147,0.000381,0.0713,0.761,114.98,192360,4
2009-03-14,14,You Found Me,The Fray,7Kpqjspw4Y7HrvItIRcBiW,False,12,7,15,0.338,0.803,8,-5.412,0,0.0413,0.0187,0,0.136,0.4,151.994,241853,4
2009-03-14,15,Jai Ho! (You Are My Destiny),A R Rahman & The Pussycat Dolls Featuring Nicole Scherzinger,7Kpqjspw4Y7HrvItIRcBiW,False,100,15,2,0.657,0.941,8,-3.919,0,0.061,0.0476,0,0.0797,0.879,136.202,222400,4
2009-03-14,16,Single Ladies (Put A Ring On It),Beyonce,7Kpqjspw4Y7HrvItIRcBiW,False,11,1,20,0.426,0.584,1,-5.293,1,0.296,0.0383,0,0.188,0.272,193.437,193213,4
2009-03-14,17,Turnin Me On,Keri Hilson Featuring Lil Wayne,7Kpqjspw4Y7HrvItIRcBiW,False,18,17,11,0.675,0.602,1,-4.688,1,0.0596,0.0034,1.28e-05,0.199,0.092,159.994,247800,4
2009-03-14,18,Sober,P!nk,7Kpqjspw4Y7HrvItIRcBiW,False,15,15,14,0.612,0.797,6,-4.896,1,0.0315,0.0626,0,0.187,0.373,90.95,251533,4
2009-03-14,19,Beautiful,Akon Featuring Colby O'Donis & Kardinal Offishall,7Kpqjspw4Y7HrvItIRcBiW,False,20,19,13,0.743,0.948,0,-4.445,0,0.0893,0.122,0,0.112,0.614,130.024,312987,4
2009-03-14,20,I'm Yours,Jason Mraz,7Kpqjspw4Y7HrvItIRcBiW,False,16,6,46,0.686,0.457,11,-8.322,1,0.0468,0.595,0,0.105,0.718,150.953,242187,4
2009-03-14,21,Diva,Beyonce,7Kpqjspw4Y7HrvItIRcBiW,False,19,19,11,0.875,0.551,6,-6.744,0,0.317,0.0488,0.00728,0.0537,0.861,146.092,200613,4
2009-03-14,22,I Love College,Asher Roth,7Kpqjspw4Y7HrvItIRcBiW,False,28,22,3,0.713,0.826,8,-4.075,1,0.243,0.0897,0,0.421,0.664,86.444,241933,4
2009-03-14,23,I Hate This Part,The Pussycat Dolls,7Kpqjspw4Y7HrvItIRcBiW,False,23,11,14,0.757,0.607,5,-4.335,1,0.0309,0.0723,0,0.305,0.454,111.579,218960,4
2009-03-14,24,Viva La Vida,Coldplay,7Kpqjspw4Y7HrvItIRcBiW,False,25,1,43,0.486,0.617,5,-7.115,0,0.0287,0.0954,3.23e-06,0.109,0.417,138.015,242373,4
2009-03-14,25,Let It Rock,Kevin Rudolf Featuring Lil Wayne,7Kpqjspw4Y7HrvItIRcBiW,False,22,5,27,0.607,0.783,7,-4.41,1,0.0397,0.000683,0,0.0678,0.434,113.172,231173,4
2009-03-14,26,Live Your Life,T.I. Featuring Rihanna,7Kpqjspw4Y7HrvItIRcBiW,False,21,1,23,0.375,0.862,11,-3.363,0,0.255,0.071,0,0.211,0.478,159.841,338853,4
2009-03-14,27,Hot N Cold,Katy Perry,7Kpqjspw4Y7HrvItIRcBiW,False,24,3,31,0.706,0.841,7,-3.956,1,0.0418,7.95e-05,0,0.0688,0.861,132.032,220227,4
2009-03-14,28,Rockin' That Thang,The-Dream,7Kpqjspw4Y7HrvItIRcBiW,False,27,27,10,0.674,0.616,8,-4.757,1,0.0432,0.118,0,0.289,0.63,77.968,221933,4
2009-03-14,29,Untouched,The Veronicas,7Kpqjspw4Y7HrvItIRcBiW,False,26,17,14,0.557,0.783,6,-4.893,0,0.234,0.0171,0.0172,0.151,0.442,177.008,255360,4
2009-03-14,30,White Horse,Taylor Swift,7Kpqjspw4Y7HrvItIRcBiW,False,34,13,16,0.578,0.34,0,-8.027,1,0.0264,0.305,0,0.104,0.223,92.702,234427,4
2009-03-14,31,Thinking Of You,Katy Perry,7Kpqjspw4Y7HrvItIRcBiW,False,29,29,7,0.431,0.803,4,-4.459,1,0.0364,0.00167,0,0.331,0.309,147.048,246410,4
2009-03-14,32,Day 'N' Nite,Kid Cudi,7Kpqjspw4Y7HrvItIRcBiW,False,40,32,7,0.871,0.44,11,-6.25,0,0.0761,0.499,4.15e-06,0.114,0.799,137.996,221267,4
2009-03-14,33,Gotta Be Somebody,Nickelback,7Kpqjspw4Y7HrvItIRcBiW,False,30,10,22,0.536,0.89,0,-5.222,1,0.0601,0.000354,0.00165,0.133,0.205,115.998,252653,4
2009-03-14,34,Sweet Thing,Keith Urban,7Kpqjspw4Y7HrvItIRcBiW,False,38,34,16,0.621,0.888,8,-6.199,1,0.0443,0.19,1.7e-05,0.151,0.651,102.986,228187,4
2009-03-14,35,Whatever You Like,T.I.,7Kpqjspw4Y7HrvItIRcBiW,False,31,1,30,0.68,0.687,9,-6.162,0,0.0709,0.0161,0,0.261,0.467,150.053,249533,4
2009-03-14,36,God Love Her,Toby Keith,7Kpqjspw4Y7HrvItIRcBiW,False,36,36,15,0.551,0.919,10,-3.895,1,0.0529,0.133,8.36e-05,0.0637,0.432,125.025,216627,4
2009-03-14,37,How Do You Sleep?,Jesse McCartney Featuring Ludacris,7Kpqjspw4Y7HrvItIRcBiW,False,39,37,4,0.747,0.878,8,-3.533,1,0.0282,0.343,0,0.0872,0.557,106.004,208333,4
2009-03-14,38,So What,P!nk,7Kpqjspw4Y7HrvItIRcBiW,False,33,1,28,0.534,0.87,11,-3.078,0,0.0425,0.000329,0,0.241,0.462,126.019,215160,4
2009-03-14,39,Green Light,John Legend Featuring Andre 3000,7Kpqjspw4Y7HrvItIRcBiW,False,35,24,26,0.622,0.882,9,-5.59,0,0.119,0.0912,0,0.216,0.762,77.506,284187,4
2009-03-14,40,Womanizer,Britney Spears,7Kpqjspw4Y7HrvItIRcBiW,False,32,1,22,0.724,0.695,11,-5.226,1,0.0622,0.073,0,0.0889,0.235,139.0,224400,4
2009-03-14,41,Halo,Beyonce,7Kpqjspw4Y7HrvItIRcBiW,False,46,41,6,0.508,0.72,11,-5.908,0,0.0628,0.272,0,0.0563,0.472,79.983,261640,4
2009-03-14,42,It Won't Be Like This For Long,Darius Rucker,7Kpqjspw4Y7HrvItIRcBiW,False,52,42,9,0.584,0.524,4,-6.001,1,0.0287,0.335,0,0.11,0.389,143.863,219000,4
2009-03-14,43,Chicken Fried,Zac Brown Band,7Kpqjspw4Y7HrvItIRcBiW,False,43,20,24,0.566,0.713,6,-4.25,1,0.0417,0.645,0,0.114,0.807,169.864,238147,4
2009-03-14,44,Cowgirls Don't Cry,Brooks & Dunn Featuring Reba McEntire,7Kpqjspw4Y7HrvItIRcBiW,False,49,44,16,0.655,0.668,9,-5.251,1,0.0302,0.0626,2.78e-06,0.179,0.619,114.881,219813,4
2009-03-14,45,Disturbia,Rihanna,7Kpqjspw4Y7HrvItIRcBiW,False,37,1,37,0.707,0.813,11,-4.515,0,0.0571,0.0863,0,0.168,0.722,124.921,238627,4
2009-03-14,46,Second Chance,Shinedown,7Kpqjspw4Y7HrvItIRcBiW,False,50,46,14,0.46,0.796,0,-4.501,0,0.0333,0.00107,0,0.106,0.182,100.011,222067,4
2009-03-14,47,Hold Up My Heart,Brooke White,0HZGw30pIUh5drpM20skC2,True,0,47,1,0.314,0.641,2,-4.078,1,0.0387,0.411,0,0.106,0.409,177.211,229227,4
2009-03-14,48,Down The Road,Kenny Chesney With Mac McAnally,0HZGw30pIUh5drpM20skC2,False,47,47,13,0.414,0.584,5,-9.245,1,0.0285,0.801,6.05e-06,0.617,0.579,162.887,189293,4
2009-03-14,49,Miss Independent,Ne-Yo,0HZGw30pIUh5drpM20skC2,False,41,7,28,0.673,0.683,1,-5.693,1,0.115,0.522,0,0.235,0.713,171.86,232000,4
2009-03-14,50,Feel That Fire,Dierks Bentley,0HZGw30pIUh5drpM20skC2,False,45,32,21,0.412,0.833,1,-3.865,1,0.0352,0.371,1.28e-05,0.208,0.669,179.846,201507,4
2009-03-14,51,She's Country,Jason Aldean,0HZGw30pIUh5drpM20skC2,False,57,51,7,0.553,0.872,1,-2.832,0,0.0782,0.198,0,0.0659,0.638,172.138,220573,4
2009-03-14,52,"1, 2, 3, 4",Plain White T's,0HZGw30pIUh5drpM20skC2,False,51,51,6,0.458,0.55,2,-7.092,1,0.0262,0.566,1.39e-05,0.108,0.56,90.56,198360,4
2009-03-14,53,Ain't I,Yung L.A. Featuring Young Dro & T.I.,0HZGw30pIUh5drpM20skC2,False,58,53,5,0.665,0.826,11,-3.126,1,0.116,0.141,0,0.0926,0.541,77.504,252093,4
2009-03-14,54,All The Above,Maino Featuring T-Pain,1z667LebVh3DtYNrVJEao0,True,0,54,1,0.374,0.888,8,-3.197,1,0.12,0.0762,0,0.202,0.365,148.828,319940,4
2009-03-14,55,Stanky Legg,GS Boyz,1z667LebVh3DtYNrVJEao0,False,60,55,4,0.761,0.704,11,-5.975,0,0.059,0.00435,0,0.272,0.738,154.007,233320,4
2009-03-14,56,Lucky,Jason Mraz & Colbie Caillat,1z667LebVh3DtYNrVJEao0,False,56,48,8,0.623,0.417,0,-8.699,1,0.0354,0.296,0,0.135,0.721,130.032,191360,4
2009-03-14,57,Shone,Flo Rida Featuring Pleasure P,0xwWgANkivEPqyPBiYXbzi,True,0,57,1,0.638,0.727,7,-7.385,1,0.237,0.0128,0,0.111,0.303,150.064,253253,4
2009-03-14,58,Beep,Bobby V Featuring Yung Joc,0xwWgANkivEPqyPBiYXbzi,False,55,55,9,0.696,0.573,0,-8.531,1,0.0919,0.104,0,0.135,0.368,79.013,250973,4
2009-03-14,59,Don't Think I Can't Love You,Jake Owen,0xwWgANkivEPqyPBiYXbzi,False,73,59,5,0.435,0.558,10,-5.423,1,0.0342,0.26,0,0.245,0.203,115.742,185107,3
2009-03-14,60,Pop Champagne,Jim Jones & Ron Browz Featuring Juelz Santana,0xwWgANkivEPqyPBiYXbzi,False,53,22,20,0.61,0.431,0,-6.73,1,0.294,0.03,0,0.099,0.463,136.878,215973,3
2009-03-14,61,River Of Love,George Strait,0xwWgANkivEPqyPBiYXbzi,False,64,61,12,0.474,0.814,7,-6.875,1,0.0419,0.604,0.0145,0.15,0.91,79.216,195147,4
2009-03-14,62,Sex On Fire,Kings Of Leon,0xwWgANkivEPqyPBiYXbzi,False,62,56,19,0.542,0.905,9,-5.653,1,0.054,0.00172,0.0104,0.136,0.374,153.398,203347,4
2009-03-14,63,Move (If You 'W'anna),Mims,0xwWgANkivEPqyPBiYXbzi,False,66,63,6,0.728,0.605,8,-7.953,1,0.334,0.0197,2.46e-05,0.0668,0.743,80.545,190667,4
2009-03-14,64,She Got Her Own,Ne-Yo Featuring Jamie Foxx & Fabolous,0xwWgANkivEPqyPBiYXbzi,False,54,54,12,0.65,0.659,11,-9.477,1,0.619,0.356,1.62e-06,0.229,0.352,80.618,202222,4
2009-03-14,65,Don't Trust Me,3OH!3,0xwWgANkivEPqyPBiYXbzi,False,74,56,12,0.757,0.629,7,-5.582,0,0.125,0.018,0,0.339,0.711,129.942,194613,4
2009-03-14,66,I Know You Want Me (Calle Ocho),Pitbull,13plQdOoWSSXPRUSZc5FuM,True,0,66,1,0.817,0.733,2,-6.009,1,0.145,0.0152,4.31e-05,0.107,0.833,127.056,237120,4
2009-03-14,67,She Wouldn't Be Gone,Blake Shelton,13plQdOoWSSXPRUSZc5FuM,False,59,43,19,0.51,0.683,0,-4.338,1,0.0302,0.166,0,0.0795,0.211,159.918,215613,4
2009-03-14,68,I Told You So,Carrie Underwood Featuring Randy Travis,13plQdOoWSSXPRUSZc5FuM,False,77,68,3,0.423,0.522,8,-3.849,1,0.029,0.643,0,0.122,0.236,147.745,257893,4
2009-03-14,69,Use Somebody,Kings Of Leon,13plQdOoWSSXPRUSZc5FuM,False,80,69,5,0.276,0.715,0,-5.356,1,0.0432,0.00552,0.000417,0.201,0.173,137.028,230760,4
2009-03-14,70,I Will Be,Leona Lewis,13plQdOoWSSXPRUSZc5FuM,False,67,66,5,0.47,0.602,7,-4.167,1,0.0284,0.143,0,0.156,0.185,74.993,238840,4
2009-03-14,71,Tonight,Jonas Brothers,13plQdOoWSSXPRUSZc5FuM,False,89,8,4,0.465,0.954,4,-4.536,1,0.0833,0.000532,2.79e-05,0.313,0.756,155.899,209707,4
2009-03-14,72,If U Seek Amy,Britney Spears,13plQdOoWSSXPRUSZc5FuM,False,94,72,3,0.717,0.587,4,-7.296,0,0.0339,0.0192,0,0.0523,0.544,129.954,216520,4
2009-03-14,73,Just Like Me,Jamie Foxx Featuring T.I.,13plQdOoWSSXPRUSZc5FuM,False,69,49,12,0.755,0.713,11,-4.753,0,0.15,0.151,0,0.269,0.741,151.047,206093,5
2009-03-14,74,Freeze,T-Pain Featuring Chris Brown,13plQdOoWSSXPRUSZc5FuM,False,61,38,8,0.734,0.626,0,-6.808,1,0.0714,0.0152,0,0.214,0.458,119.997,216933,4
2009-03-14,75,I'm So Paid,Akon Featuring Lil Wayne & Young Jeezy,13plQdOoWSSXPRUSZc5FuM,False,63,31,20,0.471,0.865,6,-4.179,1,0.325,0.118,0,0.0994,0.516,92.037,263640,4
2009-03-14,76,That's Not My Name,The Ting Tings,13plQdOoWSSXPRUSZc5FuM,False,75,64,8,0.755,0.901,9,-3.152,1,0.0893,0.0451,0.0373,0.363,0.959,145.042,310573,4
2009-03-14,77,Lost,Gorilla Zoe,13plQdOoWSSXPRUSZc5FuM,False,71,71,8,0.722,0.564,0,-7.476,0,0.0668,0.0162,0.176,0.351,0.553,136.039,287187,4
2009-03-14,78,You Complete Me,Keyshia Cole,13plQdOoWSSXPRUSZc5FuM,False,82,78,4,0.681,0.666,2,-4.984,0,0.0491,0.578,0,0.26,0.732,111.401,230920,4
2009-03-14,79,Never Ever,Ciara Featuring Young Jeezy,13plQdOoWSSXPRUSZc5FuM,False,96,79,2,0.669,0.725,11,-6.386,1,0.0337,0.0215,0,0.158,0.287,131.963,272602,4
2009-03-14,80,I'm On A Boat,The Lonely Island Featuring T-Pain,13plQdOoWSSXPRUSZc5FuM,False,90,80,3,0.623,0.871,0,-2.403,1,0.239,0.0465,0,0.111,0.653,150.079,156267,4
2009-03-14,81,Nothin' To Die For,Tim McGraw,13plQdOoWSSXPRUSZc5FuM,False,93,81,3,0.481,0.786,10,-5.654,1,0.0288,0.0538,0,0.0759,0.389,153.105,253640,4
2009-03-14,82,Last Call,Lee Ann Womack,13plQdOoWSSXPRUSZc5FuM,False,85,82,7,0.335,0.584,6,-7.089,1,0.0341,0.794,0.000195,0.0869,0.332,78.51,195467,4
2009-03-14,83,It's America,Rodney Atkins,13plQdOoWSSXPRUSZc5FuM,False,98,83,2,0.612,0.791,6,-3.519,1,0.0291,0.224,0,0.112,0.786,133.977,207040,4
2009-03-14,84,Love Is On Its Way,Jonas Brothers,20ILnt1ckabPVF562uXgpF,True,0,84,1,0.192,0.637,9,-6.241,1,0.0485,0.226,0,0.24,0.102,175.081,223587,3
2009-03-14,85,Prom Queen,Lil Wayne Featuring Shanell AKA SNL,20ILnt1ckabPVF562uXgpF,False,65,15,5,0.514,0.876,7,-4.828,1,0.0625,3.52e-05,2.56e-05,0.17,0.365,144.035,217400,4
2009-03-14,86,"Lions, Tigers & Bears",Jazmine Sullivan,20ILnt1ckabPVF562uXgpF,False,86,86,4,0.576,0.515,6,-6.178,1,0.0295,0.0788,0,0.118,0.407,95.406,251200,3
2009-03-14,88,Angels On The Moon,Thriving Ivory,,False,76,75,7,0.441,0.8,10,-3.268,1,0.0365,0.267,0,0.101,0.204,151.011,252800,4
2009-03-14,89,Here Comes Goodbye,Rascal Flatts,4lhajjgcICdfhRkvWj9Tud,True,0,89,1,0.458,0.585,2,-5.574,1,0.0342,0.324,0,0.231,0.196,145.977,245373,4
2009-03-14,90,Shuttin' Detroit Down,John Rich,3U1hhlhHoEDsvdQumqo8Vb,True,0,90,1,0.515,0.759,7,-2.502,1,0.0304,0.285,0,0.242,0.579,167.875,241640,4
2009-03-14,91,Don't,Billy Currington,3U1hhlhHoEDsvdQumqo8Vb,False,79,52,19,0.571,0.826,1,-4.475,1,0.0362,0.0446,0,0.343,0.713,90.966,189000,4
2009-03-14,92,If This Isn't Love,Jennifer Hudson,0o6IWuQ9Uxt69jKdVZ1eg2,True,0,92,1,0.587,0.778,4,-3.447,1,0.0441,0.21,0,0.106,0.403,129.868,216387,4
2009-03-14,93,O... Saya,M.I.A. & A R Rahman,6WB2gOYkn8VlLGiStQLczC,True,0,93,1,0.685,0.936,4,-7.857,0,0.111,0.0751,0.0506,0.191,0.537,124.4,213827,4
2009-03-14,94,Country Boy,Alan Jackson,6WB2gOYkn8VlLGiStQLczC,False,84,49,18,0.73,0.684,9,-10.803,1,0.0351,0.259,1.53e-06,0.111,0.564,139.037,246080,4
2009-03-14,95,More Like Her,Miranda Lambert,6WB2gOYkn8VlLGiStQLczC,False,91,90,7,0.556,0.393,11,-6.589,1,0.025,0.238,0,0.0979,0.213,132.746,208867,4
2009-03-14,96,Get On Your Boots,U2,6WB2gOYkn8VlLGiStQLczC,False,0,37,3,0.557,0.746,0,-6.171,1,0.0337,6.08e-05,0.00546,0.188,0.601,149.035,205147,4
2009-03-14,97,Rehab,Rihanna,6WB2gOYkn8VlLGiStQLczC,False,81,18,17,0.583,0.792,1,-5.894,1,0.0533,0.00321,4.92e-05,0.315,0.397,80.055,294720,4
2009-03-14,98,Ride,Martina McBride,2FJHCgDZ24gwcRLm5TFpzq,True,0,98,1,0.556,0.836,7,-3.931,1,0.042,0.109,0,0.274,0.559,116.978,232547,4
2009-03-14,99,Wavin' Flag,K'Naan,02WDuAXXKumemrvsmrVBvH,True,0,99,1,0.584,0.768,0,-4.185,1,0.058,0.329,0,0.0587,0.729,152.005,212867,4
2009-03-14,100,Lollipop,Framing Hanley,02WDuAXXKumemrvsmrVBvH,False,0,82,8,0.348,0.893,0,-4.589,1,0.0662,0.000484,6.36e-05,0.281,0.392,148.043,187907,4
