date,position,title,artist,spotify_id,is_new,last_pos,peak_pos,weeks,danceability,energy,key,loudness,mode,speechiness,acousticness,instrumentalness,liveness,valence,tempo,duration_ms,time_signature
2003-02-15,1,All I Have,Jennifer Lopez Featuring LL Cool J,5kDkWHFx0AEvJ1Pfm2i0ac,False,1,1,8,0.699,0.668,1,-5.305,1,0.106,0.265,0,0.141,0.472,83.074,254467,4
2003-02-15,2,Mesmerize,Ja Rule Featuring Ashanti,5kDkWHFx0AEvJ1Pfm2i0ac,False,5,2,8,0.764,0.648,1,-6.639,1,0.206,0.0563,0,0.414,0.391,90.1,278720,4
2003-02-15,3,"Bump, Bump, Bump",B2K & P. Diddy,5kDkWHFx0AEvJ1Pfm2i0ac,False,2,1,12,0.833,0.681,1,-6.028,0,0.215,0.0956,0,0.0414,0.887,95.48,282533,4
2003-02-15,4,In Da Club,50 Cent,5kDkWHFx0AEvJ1Pfm2i0ac,False,11,4,6,0.902,0.72,6,-2.776,0,0.347,0.26,0,0.0749,0.805,90.059,193467,4
2003-02-15,5,Beautiful,Christina Aguilera,5kDkWHFx0AEvJ1Pfm2i0ac,False,3,2,13,0.456,0.573,5,-3.866,0,0.0275,0.578,3.05e-06,0.114,0.0992,76.19,238560,4
2003-02-15,6,I'm With You,Avril Lavigne,5kDkWHFx0AEvJ1Pfm2i0ac,False,4,4,11,0.457,0.406,9,-7.462,1,0.0291,0.08,0,0.117,0.208,151.95,223067,3
2003-02-15,7,Cry Me A River,Justin Timberlake,5kDkWHFx0AEvJ1Pfm2i0ac,False,6,3,9,0.624,0.653,8,-6.582,0,0.176,0.575,0,0.104,0.565,73.884,288333,4
2003-02-15,8,Miss You,Aaliyah,5kDkWHFx0AEvJ1Pfm2i0ac,False,7,7,12,0.515,0.305,1,-11.775,1,0.476,0.436,0,0.182,0.62,82.901,266600,4
2003-02-15,9,Landslide,Dixie Chicks,5kDkWHFx0AEvJ1Pfm2i0ac,False,9,9,22,0.571,0.438,2,-7.007,1,0.0279,0.534,1.56e-05,0.187,0.444,145.948,230549,4
2003-02-15,10,'03 Bonnie & Clyde,Jay-Z Featuring Beyonce Knowles,5kDkWHFx0AEvJ1Pfm2i0ac,False,8,4,17,0.759,0.678,9,-5.148,0,0.314,0.23,0,0.15,0.327,89.64,205560,4
2003-02-15,11,Gossip Folks,"Missy ""Misdemeanor"" Elliott Featuring Ludacris",5kDkWHFx0AEvJ1Pfm2i0ac,False,14,11,8,0.928,0.457,0,-10.443,1,0.524,0.502,1.19e-06,0.188,0.67,122.006,210373,4
2003-02-15,12,Air Force Ones,"Nelly Featuring Kyjuan, Ali & Murphy Lee",5kDkWHFx0AEvJ1Pfm2i0ac,False,10,3,15,0.784,0.459,4,-9.74,0,0.317,0.0847,0,0.079,0.618,164.062,304000,4
2003-02-15,13,Ignition,R. Kelly,5kDkWHFx0AEvJ1Pfm2i0ac,False,13,13,15,0.795,0.523,1,-7.165,1,0.0423,0.061,0,0.0914,0.855,133.024,186067,4
2003-02-15,14,Don't Mess With My Man,Nivea Featuring Brian & Brandon Casey,5kDkWHFx0AEvJ1Pfm2i0ac,False,12,8,28,0.879,0.73,11,-4.369,0,0.164,0.114,0,0.241,0.885,99.925,213227,4
2003-02-15,15,Picture,Kid Rock Featuring Sheryl Crow Or Allison Moorer,5kDkWHFx0AEvJ1Pfm2i0ac,False,16,15,12,0.692,0.496,7,-7.332,1,0.0241,0.172,6.42e-06,0.107,0.376,97.945,298960,4
2003-02-15,16,Wanksta,50 Cent,5kDkWHFx0AEvJ1Pfm2i0ac,False,18,16,12,0.806,0.867,1,-3.538,1,0.157,0.02,0,0.131,0.904,81.033,219400,4
2003-02-15,17,The Game Of Love,Santana Featuring Michelle Branch,5kDkWHFx0AEvJ1Pfm2i0ac,False,17,5,20,0.59,0.929,2,-3.236,1,0.0478,0.0714,0.000153,0.0598,0.674,119.818,254467,4
2003-02-15,18,When I'm Gone,3 Doors Down,5kDkWHFx0AEvJ1Pfm2i0ac,False,24,18,13,0.53,0.768,7,-5.611,1,0.0284,0.00385,0,0.103,0.374,148.095,260333,4
2003-02-15,19,Superman,Eminem,5kDkWHFx0AEvJ1Pfm2i0ac,False,35,19,3,0.802,0.755,4,-3.138,0,0.0564,0.0215,0,0.295,0.58,130.027,350320,4
2003-02-15,20,Lifestyles Of The Rich And Famous,Good Charlotte,5kDkWHFx0AEvJ1Pfm2i0ac,False,22,20,10,0.62,0.93,1,-3.685,1,0.0374,0.00043,0,0.0686,0.609,106.22,190173,4
2003-02-15,21,Your Body Is A Wonderland,John Mayer,5kDkWHFx0AEvJ1Pfm2i0ac,False,21,18,16,0.647,0.729,5,-6.251,1,0.0236,0.0206,0.0489,0.134,0.687,94.01,249627,4
2003-02-15,22,She Hates Me,Puddle Of Mudd,5kDkWHFx0AEvJ1Pfm2i0ac,False,20,13,19,0.58,0.748,4,-5.433,1,0.0323,0.00935,0,0.753,0.584,109.781,216760,4
2003-02-15,23,Lose Yourself,Eminem,5kDkWHFx0AEvJ1Pfm2i0ac,False,15,1,20,0.692,0.744,2,-4.565,1,0.257,0.00868,0.000423,0.359,0.0612,171.374,326467,4
2003-02-15,24,Work It,"Missy ""Misdemeanor"" Elliott",5kDkWHFx0AEvJ1Pfm2i0ac,False,19,2,23,0.869,0.735,10,-6.364,0,0.157,0.228,0,0.0874,0.463,101.909,254813,4
2003-02-15,25,How You Gonna Act Like That,Tyrese,5kDkWHFx0AEvJ1Pfm2i0ac,False,31,25,7,0.733,0.521,3,-3.657,0,0.0457,0.107,0,0.0692,0.525,112.913,294693,4
2003-02-15,26,Love Of My Life (An Ode To Hip Hop),Erykah Badu Featuring Common,5kDkWHFx0AEvJ1Pfm2i0ac,False,26,9,24,0.808,0.404,7,-9.27,1,0.348,0.118,0.000625,0.0913,0.487,87.461,337573,4
2003-02-15,27,Thugz Mansion,2Pac,5kDkWHFx0AEvJ1Pfm2i0ac,False,27,19,11,0.731,0.417,8,-8.708,1,0.168,0.657,0,0.115,0.704,88.161,252293,4
2003-02-15,28,19 Somethin',Mark Wills,5kDkWHFx0AEvJ1Pfm2i0ac,False,23,23,13,0.58,0.816,4,-5.165,1,0.0726,0.132,0,0.0776,0.814,89.938,200467,4
2003-02-15,29,Underneath It All,No Doubt Featuring Lady Saw,5kDkWHFx0AEvJ1Pfm2i0ac,False,28,3,25,0.729,0.731,4,-4.823,1,0.0682,0.235,1.35e-06,0.391,0.838,138.204,302720,4
2003-02-15,30,All The Things She Said,t.A.T.u.,5kDkWHFx0AEvJ1Pfm2i0ac,False,36,30,7,0.603,0.834,5,-5.766,0,0.0417,0.0411,0.00609,0.105,0.376,89.957,214440,4
2003-02-15,31,Family Portrait,P!nk,5kDkWHFx0AEvJ1Pfm2i0ac,False,25,20,14,0.762,0.686,0,-5.26,0,0.049,0.0274,3.62e-06,0.572,0.733,91.816,296960,4
2003-02-15,32,I Just Wanna Be Mad,Terri Clark,5kDkWHFx0AEvJ1Pfm2i0ac,False,33,32,15,0.574,0.896,10,-4.478,1,0.0393,0.0654,0,0.31,0.731,99.974,206400,4
2003-02-15,33,The Baby,Blake Shelton,5kDkWHFx0AEvJ1Pfm2i0ac,False,30,30,11,0.502,0.533,4,-6.983,1,0.0263,0.312,0,0.277,0.281,86.406,234733,4
2003-02-15,34,Tell Me (What's Goin' On),Smilez & Southstar,5kDkWHFx0AEvJ1Pfm2i0ac,False,37,34,7,0.693,0.88,11,-3.228,0,0.0661,0.0901,0,0.211,0.397,88.088,278800,4
2003-02-15,35,I Should Be...,Dru Hill,5kDkWHFx0AEvJ1Pfm2i0ac,False,32,25,11,0.383,0.749,1,-3.931,0,0.084,0.199,0,0.204,0.466,122.141,297627,4
2003-02-15,36,Jenny From The Block,Jennifer Lopez Featuring Styles & Jadakiss,5kDkWHFx0AEvJ1Pfm2i0ac,False,29,3,19,0.844,0.754,6,-5.46,1,0.207,0.00833,3.42e-06,0.0575,0.961,100.002,187840,4
2003-02-15,37,Sick Of Being Lonely,Field Mob,5kDkWHFx0AEvJ1Pfm2i0ac,False,46,37,10,0.692,0.921,8,-4.853,1,0.105,0.0016,2.05e-05,0.299,0.856,173.837,229160,4
2003-02-15,38,You Can't Hide Beautiful,Aaron Lines,5kDkWHFx0AEvJ1Pfm2i0ac,False,41,38,8,0.448,0.572,5,-9.351,1,0.0292,0.186,0,0.151,0.303,157.979,230800,4
2003-02-15,39,Fall Into Me,Emerson Drive,5kDkWHFx0AEvJ1Pfm2i0ac,False,34,34,14,0.501,0.813,2,-5.01,1,0.0342,0.238,0,0.39,0.595,96.986,168867,4
2003-02-15,40,Man To Man,Gary Allan,5kDkWHFx0AEvJ1Pfm2i0ac,False,45,40,7,0.578,0.779,10,-8.908,1,0.0384,0.00479,6.47e-06,0.284,0.695,111.653,220960,4
2003-02-15,41,Fabulous,Jaheim Featuring Tha Rayne,5kDkWHFx0AEvJ1Pfm2i0ac,False,39,28,14,0.657,0.464,4,-7.573,0,0.0614,0.548,0,0.161,0.598,75.982,227067,4
2003-02-15,42,Don't Know Why,Norah Jones,5kDkWHFx0AEvJ1Pfm2i0ac,False,50,42,21,0.732,0.198,5,-11.775,1,0.028,0.883,1.1e-05,0.0659,0.618,88.174,186147,4
2003-02-15,43,Cry,Faith Hill,5kDkWHFx0AEvJ1Pfm2i0ac,False,48,33,25,0.512,0.645,8,-5.631,1,0.029,0.141,0,0.0987,0.283,111.015,226307,3
2003-02-15,44,dontchange,Musiq,5kDkWHFx0AEvJ1Pfm2i0ac,False,47,17,24,0.58,0.526,6,-6.664,0,0.0313,0.221,0,0.0959,0.2,101.89,304427,4
2003-02-15,45,Blowin' Me Up (With Her Love),JC Chasez,5kDkWHFx0AEvJ1Pfm2i0ac,False,51,45,7,0.785,0.783,2,-3.982,1,0.187,0.00877,0.00454,0.072,0.592,98.132,290200,4
2003-02-15,46,Paradise,LL Cool J Featuring Amerie,5kDkWHFx0AEvJ1Pfm2i0ac,False,40,36,10,0.78,0.824,5,-2.988,0,0.2,0.0153,5.13e-05,0.15,0.845,97.884,275067,4
2003-02-15,47,She'll Leave You With A Smile,George Strait,5kDkWHFx0AEvJ1Pfm2i0ac,False,44,23,20,0.635,0.6,4,-7.233,1,0.0229,0.59,0.000198,0.254,0.516,97.983,178773,4
2003-02-15,48,Do That...,Baby Featuring P. Diddy,5kDkWHFx0AEvJ1Pfm2i0ac,False,42,33,14,0.86,0.783,1,-4.821,1,0.248,0.358,0,0.248,0.71,101.992,301187,4
2003-02-15,49,Satisfaction,Eve,5kDkWHFx0AEvJ1Pfm2i0ac,False,43,27,12,0.843,0.553,11,-3.198,0,0.437,0.236,0,0.0523,0.631,93.384,258733,4
2003-02-15,50,Travelin' Soldier,Dixie Chicks,5kDkWHFx0AEvJ1Pfm2i0ac,False,62,50,3,0.569,0.365,9,-7.047,1,0.0265,0.691,0,0.17,0.508,145.859,343497,4
2003-02-15,51,Always,Saliva,5kDkWHFx0AEvJ1Pfm2i0ac,False,52,51,10,0.363,0.906,1,-4.415,1,0.0615,0.0122,0,0.172,0.371,181.964,231200,4
2003-02-15,52,Beautiful,Snoop Dogg Featuring Pharrell & Uncle Charlie Wilson,5kDkWHFx0AEvJ1Pfm2i0ac,False,69,52,2,0.893,0.74,11,-4.936,0,0.132,0.299,0,0.0881,0.963,101.025,299147,4
2003-02-15,53,Excuse Me Miss,JAY-Z,0ZHu7jkSSrT0eK4OxuG4O5,True,0,53,1,0.714,0.862,6,-5.531,1,0.286,0.0305,0,0.0884,0.887,92.849,281240,4
2003-02-15,54,Angel,Amanda Perez,0ZHu7jkSSrT0eK4OxuG4O5,False,59,54,3,0.631,0.496,9,-8.279,0,0.0598,0.428,1.01e-06,0.107,0.365,143.735,217627,4
2003-02-15,55,Brokenheartsville,Joe Nichols,0ZHu7jkSSrT0eK4OxuG4O5,False,58,55,4,0.686,0.631,10,-5.182,1,0.0232,0.126,0.000183,0.107,0.509,103.953,230360,4
2003-02-15,56,No One Knows,Queens Of The Stone Age,0ZHu7jkSSrT0eK4OxuG4O5,False,56,56,8,0.507,0.588,0,-4.881,1,0.0641,0.0359,0.000129,0.373,0.637,170.889,278707,4
2003-02-15,57,These Days,Rascal Flatts,0ZHu7jkSSrT0eK4OxuG4O5,False,54,23,20,0.587,0.778,7,-4.233,1,0.0343,0.31,0,0.318,0.319,81.943,254493,4
2003-02-15,58,Made You Look,Nas,0ZHu7jkSSrT0eK4OxuG4O5,False,38,32,9,0.658,0.936,5,-5.105,0,0.3,0.172,0,0.321,0.711,95.439,203000,4
2003-02-15,59,Something,Lasgo,0ZHu7jkSSrT0eK4OxuG4O5,False,49,35,16,0.643,0.981,7,-6.644,0,0.0439,0.0271,8.93e-05,0.11,0.38,140.01,220973,4
2003-02-15,60,The Jump Off,Lil' Kim Featuring Mr. Cheeks,0ZHu7jkSSrT0eK4OxuG4O5,False,66,60,2,0.837,0.736,10,-8.367,0,0.378,0.225,0,0.0549,0.905,104.907,234093,4
2003-02-15,61,Who's Your Daddy?,Toby Keith,0ZHu7jkSSrT0eK4OxuG4O5,False,55,22,20,0.684,0.872,9,-4.307,1,0.0402,0.283,0.0289,0.049,0.849,126.381,238013,4
2003-02-15,62,Clocks,Coldplay,0ZHu7jkSSrT0eK4OxuG4O5,False,67,62,3,0.577,0.749,5,-7.215,0,0.0279,0.599,0.0115,0.183,0.255,130.97,307880,4
2003-02-15,63,I Wish You'd Stay,Brad Paisley,0ZHu7jkSSrT0eK4OxuG4O5,False,63,62,5,0.472,0.29,7,-10.238,1,0.0257,0.286,7.22e-05,0.287,0.0906,93.694,377867,4
2003-02-15,64,Make It Clap,Busta Rhymes Featuring Spliff Star,0ZHu7jkSSrT0eK4OxuG4O5,False,53,46,15,0.736,0.741,1,-4.458,0,0.392,0.0691,0,0.053,0.95,121.328,243040,5
2003-02-15,65,The Red,Chevelle,0ZHu7jkSSrT0eK4OxuG4O5,False,61,56,12,0.509,0.843,1,-3.318,0,0.0488,0.000671,0.000803,0.348,0.332,140.055,238400,3
2003-02-15,66,Fine Again,Seether,0ZHu7jkSSrT0eK4OxuG4O5,False,64,61,8,0.442,0.855,6,-2.985,0,0.0288,0.00049,0.0137,0.273,0.363,175.543,243640,4
2003-02-15,67,That'd Be Alright,Alan Jackson,0ZHu7jkSSrT0eK4OxuG4O5,False,74,67,2,0.672,0.731,2,-8.791,1,0.0282,0.228,0,0.0661,0.913,134.376,221760,4
2003-02-15,68,Can't Stop,Red Hot Chili Peppers,0ZHu7jkSSrT0eK4OxuG4O5,False,68,68,2,0.618,0.938,9,-3.442,1,0.0456,0.0179,0,0.167,0.875,91.455,269000,4
2003-02-15,69,I'd Do Anything,Simple Plan,4uVjbl6daCwjhDur7qLddu,True,0,69,1,0.395,0.917,8,-6.86,1,0.133,0.00143,0,0.261,0.563,169.088,197640,4
2003-02-15,70,Disease,matchbox twenty,4uVjbl6daCwjhDur7qLddu,False,57,29,18,0.561,0.849,8,-3.913,0,0.0466,0.00289,0,0.288,0.829,115.04,220067,4
2003-02-15,71,No Letting Go,Wayne Wonder,4uVjbl6daCwjhDur7qLddu,False,71,68,6,0.495,0.819,5,-5.656,0,0.0444,0.0479,0.000215,0.177,0.318,100.213,202013,4
2003-02-15,72,All My Life,Foo Fighters,4uVjbl6daCwjhDur7qLddu,False,60,43,16,0.577,0.604,5,-5.703,1,0.0495,0.000218,0.000579,0.477,0.637,167.719,263440,4
2003-02-15,73,Up!,Shania Twain,4uVjbl6daCwjhDur7qLddu,False,73,73,3,0.657,0.755,5,-4.067,1,0.0374,0.0143,0,0.556,0.707,125.974,172973,4
2003-02-15,74,I Drove All Night,Celine Dion,3zN4OLeBAN7LwAr442bB8E,True,0,74,1,0.566,0.912,11,-4.198,1,0.0629,0.00051,0,0.215,0.644,134.994,240600,4
2003-02-15,75,Come Close To Me,Common Featuring Mary J. Blige,3zN4OLeBAN7LwAr442bB8E,False,65,65,9,0.6,0.407,5,-14.738,0,0.0657,0.0437,0.000281,0.068,0.797,83.893,219221,4
2003-02-15,76,A.D.I.D.A.S.,Killer Mike Featuring Big Boi,1skUOgRMfsioJFVcXi9BHq,True,0,76,1,0.927,0.828,10,-2.631,0,0.23,0.00948,1.34e-06,0.183,0.682,93.024,207760,4
2003-02-15,77,What Happened To That Boy,Baby Featuring Clipse,20Sp7dNLM3NjIu3TInDqjq,True,0,77,1,0.764,0.873,2,-6.21,1,0.291,0.0608,0.000363,0.0757,0.719,93.073,258067,4
2003-02-15,78,Breathe,Telepopmusik,20Sp7dNLM3NjIu3TInDqjq,False,78,78,8,0.684,0.684,1,-13.337,1,0.0418,0.385,0.29,0.106,0.616,113.988,282240,4
2003-02-15,79,Beautiful Goodbye,Jennifer Hanson,20Sp7dNLM3NjIu3TInDqjq,False,79,79,5,0.623,0.878,2,-3.662,1,0.0372,0.146,0.00191,0.137,0.608,113.225,258360,4
2003-02-15,80,Can't Stop Loving You,Phil Collins,20Sp7dNLM3NjIu3TInDqjq,False,76,76,3,0.604,0.778,0,-5.686,1,0.0259,0.00726,1.33e-05,0.114,0.419,100.155,256453,4
2003-02-15,81,In A Little While,Uncle Kracker,20Sp7dNLM3NjIu3TInDqjq,False,75,59,16,0.596,0.935,2,-2.412,1,0.0741,0.127,0,0.294,0.912,205.984,249760,4
2003-02-15,82,You Know You're Right,Nirvana,20Sp7dNLM3NjIu3TInDqjq,False,70,45,18,0.289,0.716,5,-6.53,0,0.106,0.0407,0.00123,0.135,0.344,168.049,217000,4
2003-02-15,83,Emotional Rollercoaster,Vivian Green,7IsSXaTgBu8ChPx9jLgx28,True,0,83,1,0.692,0.562,6,-6.034,0,0.0924,0.0973,0,0.304,0.504,122.937,196373,4
2003-02-15,84,Bother,Stone Sour,7IsSXaTgBu8ChPx9jLgx28,False,77,56,16,0.272,0.281,1,-7.634,1,0.0287,0.388,2.29e-05,0.158,0.141,89.914,240400,4
2003-02-15,85,B R Right,Trina Featuring Ludacris,7IsSXaTgBu8ChPx9jLgx28,False,89,85,6,0.702,0.78,9,-5.379,1,0.168,0.0956,0,0.105,0.375,135.991,261987,4
2003-02-15,86,I'm Gonna Getcha Good!,Shania Twain,7IsSXaTgBu8ChPx9jLgx28,False,84,34,18,0.723,0.789,1,-4.813,1,0.0302,0.0441,0,0.0612,0.946,124.013,269400,4
2003-02-15,87,Unusually Unusual,Lonestar,7IsSXaTgBu8ChPx9jLgx28,False,72,66,4,0.582,0.766,10,-6.972,1,0.0398,0.0538,0,0.0794,0.548,147.338,215867,4
2003-02-15,88,Red Rag Top,Tim McGraw,7IsSXaTgBu8ChPx9jLgx28,False,83,40,19,0.484,0.463,7,-11.98,1,0.0279,0.0677,0.598,0.246,0.247,77.009,244051,4
2003-02-15,89,A Lot Of Things Different,Kenny Chesney,7IsSXaTgBu8ChPx9jLgx28,False,80,55,12,0.589,0.279,2,-13.693,1,0.0285,0.129,0.0192,0.149,0.212,74.847,283867,4
2003-02-15,90,Cochise,Audioslave,7IsSXaTgBu8ChPx9jLgx28,False,86,69,13,0.452,0.873,9,-4.867,1,0.0613,0.000519,0,0.0592,0.433,80.473,222027,4
2003-02-15,91,One Of Those Days,Whitney Houston,7IsSXaTgBu8ChPx9jLgx28,False,81,72,14,0.679,0.708,0,-3.844,1,0.0818,0.312,0,0.0878,0.82,91.983,255733,4
2003-02-15,92,Talkin' To Me,Amerie,7IsSXaTgBu8ChPx9jLgx28,False,82,51,11,0.744,0.406,8,-6.378,0,0.0722,0.113,0,0.0316,0.725,89.942,234707,4
2003-02-15,93,X Gon' Give It To Ya,DMX,7IsSXaTgBu8ChPx9jLgx28,False,93,93,2,0.761,0.899,10,-3.09,0,0.183,0.0135,0,0.0719,0.673,95.027,217587,4
2003-02-15,94,Spin,Lifehouse,7IsSXaTgBu8ChPx9jLgx28,False,88,71,14,0.467,0.893,1,-3.514,1,0.0556,0.00027,0.000147,0.0541,0.328,134.772,291600,4
2003-02-15,95,Thug Holiday,Trick Daddy Featuring LaTocha Scott,7IsSXaTgBu8ChPx9jLgx28,False,90,87,9,0.767,0.654,1,-9.088,0,0.289,0.372,0,0.147,0.546,138.062,294067,4
2003-02-15,96,"Ma, I Don't Love Her",Clipse Featuring Faith Evans,3VbPE4nMEkIB9PWWquCSGB,True,0,96,1,0.802,0.757,6,-3.152,0,0.271,0.4,0,0.0389,0.922,97.181,257493,4
2003-02-15,97,Take You Home,Angie Martinez Featuring Kelis,3VbPE4nMEkIB9PWWquCSGB,False,85,85,4,0.595,0.639,7,-3.159,1,0.275,0.0663,0,0.0588,0.7,95.912,233227,4
2003-02-15,98,He Is,Heather Headley,3VbPE4nMEkIB9PWWquCSGB,False,91,90,11,0.609,0.767,1,-4.663,1,0.176,0.0849,0,0.0554,0.624,75.027,226893,4
2003-02-15,99,All I Need,Fat Joe Featuring Tony Sunshine & Armageddon,2ohHVfGDGcawWjx2KwP8dF,True,0,99,1,0.52,0.915,6,-2.743,1,0.238,0.00928,0,0.215,0.583,170.677,278627,4
2003-02-15,100,I'd Rather,Luther Vandross,2ohHVfGDGcawWjx2KwP8dF,False,94,83,17,0.705,0.467,0,-8.456,1,0.0298,0.236,0,0.113,0.522,119.938,259693,4
