date,position,title,artist,spotify_id,is_new,last_pos,peak_pos,weeks,danceability,energy,key,loudness,mode,speechiness,acousticness,instrumentalness,liveness,valence,tempo,duration_ms,time_signature
2014-01-11,1,The Monster,Eminem Featuring Rihanna,01e8dGbulrphX8j3fZDQYk,False,1,1,9,0.781,0.853,1,-3.68,0,0.0715,0.0525,0,0.12,0.624,110.049,250189,4
2014-01-11,2,Timber,Pitbull Featuring Ke$ha,01e8dGbulrphX8j3fZDQYk,False,2,2,12,0.581,0.963,11,-4.087,1,0.0981,0.0295,0,0.139,0.788,129.992,204160,4
2014-01-11,3,Counting Stars,OneRepublic,01e8dGbulrphX8j3fZDQYk,False,3,3,28,0.664,0.705,1,-4.972,0,0.0382,0.0654,0,0.115,0.477,122.017,257840,4
2014-01-11,4,Royals,Lorde,01e8dGbulrphX8j3fZDQYk,False,5,1,26,0.674,0.428,7,-9.504,1,0.122,0.121,0,0.132,0.337,84.878,190185,4
2014-01-11,5,Say Something,A Great Big World & Christina Aguilera,01e8dGbulrphX8j3fZDQYk,False,4,4,8,0.407,0.147,2,-8.822,1,0.0355,0.857,2.89e-06,0.0913,0.0765,141.284,229400,3
2014-01-11,6,Demons,Imagine Dragons,01e8dGbulrphX8j3fZDQYk,False,6,6,36,0.505,0.71,3,-3.015,1,0.0321,0.19,0.00025,0.329,0.428,89.938,175200,4
2014-01-11,7,Let Her Go,Passenger,01e8dGbulrphX8j3fZDQYk,False,7,7,22,0.479,0.545,7,-7.346,1,0.0688,0.365,0,0.0963,0.243,74.897,252733,4
2014-01-11,8,Roar,Katy Perry,01e8dGbulrphX8j3fZDQYk,False,11,1,21,0.554,0.772,7,-4.821,0,0.0418,0.00487,6.6e-06,0.354,0.455,179.984,223546,4
2014-01-11,9,Story Of My Life,One Direction,01e8dGbulrphX8j3fZDQYk,False,10,6,9,0.6,0.663,3,-5.802,1,0.0477,0.225,0,0.119,0.286,121.07,245493,4
2014-01-11,10,Wake Me Up!,Avicii,01e8dGbulrphX8j3fZDQYk,False,8,4,27,0.532,0.783,2,-5.697,1,0.0523,0.0038,0.0012,0.161,0.643,124.08,247427,4
2014-01-11,11,Dark Horse,Katy Perry Featuring Juicy J,01e8dGbulrphX8j3fZDQYk,False,14,11,15,0.645,0.585,6,-6.122,1,0.0513,0.00314,0,0.165,0.353,131.931,215672,4
2014-01-11,12,Wrecking Ball,Miley Cyrus,01e8dGbulrphX8j3fZDQYk,False,9,1,19,0.53,0.422,5,-6.262,1,0.0342,0.407,0,0.107,0.349,119.964,221360,4
2014-01-11,13,Burn,Ellie Goulding,01e8dGbulrphX8j3fZDQYk,False,15,13,17,0.395,0.775,1,-4.802,1,0.0526,0.298,0,0.105,0.273,116.073,231212,5
2014-01-11,14,23,"Mike WiLL Made-It Featuring Miley Cyrus, Wiz Khalifa & Juicy J",01e8dGbulrphX8j3fZDQYk,False,20,11,15,0.859,0.599,9,-5.254,1,0.0614,0.000362,8.2e-06,0.13,0.319,140.005,252520,4
2014-01-11,15,"Hold On, We're Going Home",Drake Featuring Majid Jordan,01e8dGbulrphX8j3fZDQYk,False,13,4,21,0.777,0.414,6,-7.44,0,0.0946,0.00421,2.73e-05,0.0724,0.287,100.002,227880,4
2014-01-11,16,Sweater Weather,The Neighbourhood,01e8dGbulrphX8j3fZDQYk,False,17,14,29,0.612,0.807,10,-2.81,1,0.0336,0.0495,0.0177,0.101,0.398,124.053,240400,4
2014-01-11,17,Drunk In Love,Beyonce Featuring Jay Z,01e8dGbulrphX8j3fZDQYk,False,12,12,2,0.589,0.621,5,-6.902,0,0.0468,0.00969,0.00104,0.181,0.401,140.03,323480,4
2014-01-11,18,White Walls,Macklemore & Ryan Lewis Featuring ScHoolboy Q & Hollis,01e8dGbulrphX8j3fZDQYk,False,19,15,15,0.768,0.782,7,-5.545,1,0.141,0.0545,0,0.338,0.842,116.492,220319,4
2014-01-11,19,Team,Lorde,01e8dGbulrphX8j3fZDQYk,False,18,18,14,0.69,0.578,6,-7.436,1,0.0929,0.167,0,0.305,0.416,99.961,193059,4
2014-01-11,20,Unconditionally,Katy Perry,01e8dGbulrphX8j3fZDQYk,False,23,14,10,0.432,0.725,7,-4.862,1,0.0431,0.00273,0,0.208,0.353,128.902,228879,4
2014-01-11,21,Pompeii,Bastille,01e8dGbulrphX8j3fZDQYk,False,21,21,20,0.679,0.715,9,-6.383,1,0.0407,0.0755,0,0.271,0.571,127.435,214148,4
2014-01-11,22,Adore You,Miley Cyrus,01e8dGbulrphX8j3fZDQYk,False,0,22,3,0.583,0.655,0,-5.407,1,0.0315,0.111,3.57e-06,0.113,0.201,119.759,278747,4
2014-01-11,23,Do What U Want,Lady Gaga Featuring R. Kelly,01e8dGbulrphX8j3fZDQYk,False,16,13,10,0.778,0.801,9,-4.65,1,0.086,0.345,1.18e-06,0.0881,0.534,97.47,216573,4
2014-01-11,24,My Hitta,YG Featuring Jeezy & Rich Homie Quan,01e8dGbulrphX8j3fZDQYk,False,24,19,13,0.764,0.504,10,-6.781,0,0.106,0.135,0,0.143,0.678,85.545,236093,4
2014-01-11,25,Radioactive,Imagine Dragons,01e8dGbulrphX8j3fZDQYk,False,31,3,70,0.448,0.784,9,-3.686,1,0.0627,0.106,0.000108,0.668,0.236,136.245,186813,4
2014-01-11,26,Applause,Lady Gaga,01e8dGbulrphX8j3fZDQYk,False,25,4,20,0.669,0.78,7,-4.287,0,0.053,0.0265,1.63e-06,0.143,0.738,139.945,212333,4
2014-01-11,27,Stay The Night,Zedd Featuring Hayley Williams,01e8dGbulrphX8j3fZDQYk,False,22,19,15,0.596,0.738,8,-3.109,1,0.0411,0.109,0,0.0947,0.461,127.961,217347,4
2014-01-11,28,Blurred Lines,Robin Thicke Featuring T.I. + Pharrell,01e8dGbulrphX8j3fZDQYk,False,27,1,37,0.853,0.599,7,-4.756,1,0.0411,0.00334,7.93e-06,0.0759,0.843,119.993,263827,4
2014-01-11,29,Holy Grail,Jay Z Featuring Justin Timberlake,01e8dGbulrphX8j3fZDQYk,False,28,4,25,0.676,0.534,2,-6.901,0,0.0831,0.0594,8.59e-06,0.256,0.156,145.082,338413,4
2014-01-11,30,Gas Pedal,Sage The Gemini Featuring IamSu!,01e8dGbulrphX8j3fZDQYk,False,33,29,23,0.843,0.538,1,-8.028,1,0.0833,0.0273,0,0.124,0.428,97.49,208160,4
2014-01-11,31,Stay,Florida Georgia Line,01e8dGbulrphX8j3fZDQYk,False,30,28,11,0.494,0.936,1,-2.989,1,0.0418,0.0744,0,0.148,0.582,141.939,199320,4
2014-01-11,32,Let It Go,Idina Menzel,01e8dGbulrphX8j3fZDQYk,False,54,32,5,0.543,0.485,8,-6.85,1,0.0305,0.558,0,0.12,0.371,136.961,223840,4
2014-01-11,33,Rap God,Eminem,01e8dGbulrphX8j3fZDQYk,False,38,7,11,0.708,0.843,7,-2.66,1,0.314,0.397,0,0.799,0.625,148.14,363521,4
2014-01-11,34,That's My Kind Of Night,Luke Bryan,01e8dGbulrphX8j3fZDQYk,False,56,15,20,0.661,0.751,7,-2.909,1,0.0481,0.0571,0,0.105,0.875,109.995,190187,4
2014-01-11,35,Sail,AWOLNATION,01e8dGbulrphX8j3fZDQYk,False,39,17,69,0.825,0.435,1,-9.582,1,0.0568,0.452,0.609,0.0953,0.243,119.038,259102,4
2014-01-11,36,Brave,Sara Bareilles,01e8dGbulrphX8j3fZDQYk,False,35,26,29,0.551,0.836,10,-3.838,0,0.0524,0.00502,2.1e-05,0.0425,0.758,185.063,220573,4
2014-01-11,37,Drink A Beer,Luke Bryan,01e8dGbulrphX8j3fZDQYk,False,34,34,8,0.483,0.431,8,-7.656,1,0.0343,0.836,5.19e-05,0.199,0.296,78.26,202627,4
2014-01-11,38,Turn Down For What,DJ Snake & Lil Jon,67awxiNHNyjMXhVgsHuIrs,True,0,38,1,0.818,0.799,1,-4.1,0,0.156,0.00107,0.128,0.057,0.0815,100.014,213733,4
2014-01-11,39,Marry Me,Jason Derulo,67awxiNHNyjMXhVgsHuIrs,False,41,26,13,0.575,0.632,7,-5.623,1,0.0269,0.033,0,0.144,0.229,105.047,225027,4
2014-01-11,40,Replay,Zendaya,67awxiNHNyjMXhVgsHuIrs,False,49,40,19,0.688,0.723,6,-6.682,0,0.121,0.0416,0.0002,0.302,0.618,140.023,209187,4
2014-01-11,41,All Me,Drake Featuring 2 Chainz & Big Sean,67awxiNHNyjMXhVgsHuIrs,False,37,20,14,0.67,0.515,1,-6.977,1,0.397,0.0705,0,0.25,0.422,122.006,270867,4
2014-01-11,42,Show Me,Kid Ink Featuring Chris Brown,67awxiNHNyjMXhVgsHuIrs,False,29,29,8,0.711,0.508,7,-7.299,1,0.0494,0.0354,0,0.141,0.665,98.098,217800,4
2014-01-11,43,Let It Go,Demi Lovato,67awxiNHNyjMXhVgsHuIrs,False,61,43,5,0.505,0.624,7,-6.513,1,0.0371,0.0235,0,0.5,0.215,139.849,224387,4
2014-01-11,44,Love More,Chris Brown Featuring Nicki Minaj,67awxiNHNyjMXhVgsHuIrs,False,32,23,23,0.882,0.621,1,-6.652,1,0.0461,0.000463,0.00055,0.0784,0.487,104.954,189707,4
2014-01-11,45,Safe And Sound,Capital Cities,67awxiNHNyjMXhVgsHuIrs,False,42,8,35,0.655,0.819,0,-4.852,1,0.0316,0.000176,0.00374,0.104,0.766,117.956,192790,5
2014-01-11,46,Whatever She's Got,David Nail,67awxiNHNyjMXhVgsHuIrs,False,40,40,13,0.527,0.723,1,-6.134,1,0.0411,0.217,0,0.037,0.888,160.465,236800,4
2014-01-11,47,Wasting All These Tears,Cassadee Pope,67awxiNHNyjMXhVgsHuIrs,False,46,37,17,0.465,0.772,5,-3.932,0,0.0378,0.0959,1.04e-05,0.167,0.257,155.83,215640,4
2014-01-11,48,Berzerk,Eminem,67awxiNHNyjMXhVgsHuIrs,False,77,3,18,0.739,0.872,11,-4.059,0,0.333,0.0217,0,0.26,0.684,95.084,238746,4
2014-01-11,49,It Won't Stop,Sevyn Streeter Featuring Chris Brown,67awxiNHNyjMXhVgsHuIrs,False,36,30,13,0.657,0.574,1,-9.484,0,0.0407,0.016,8.1e-05,0.172,0.211,119.992,281080,4
2014-01-11,50,Carolina,Parmalee,67awxiNHNyjMXhVgsHuIrs,False,47,36,15,0.434,0.75,10,-3.53,1,0.0293,0.0107,0,0.106,0.488,159.824,201347,4
2014-01-11,51,Chillin' It,Cole Swindell,67awxiNHNyjMXhVgsHuIrs,False,53,48,11,0.576,0.849,9,-3.057,1,0.0386,0.511,3.89e-05,0.109,0.666,137.982,196747,4
2014-01-11,52,Best Day Of My Life,American Authors,67awxiNHNyjMXhVgsHuIrs,False,44,35,7,0.673,0.902,2,-2.392,1,0.0346,0.0591,0.000262,0.0558,0.538,100.012,194240,4
2014-01-11,53,HeadBand,B.o.B Featuring 2 Chainz,67awxiNHNyjMXhVgsHuIrs,False,60,53,29,0.919,0.506,1,-7.14,1,0.304,0.132,0,0.0771,0.273,97.465,220240,4
2014-01-11,54,Best Song Ever,One Direction,67awxiNHNyjMXhVgsHuIrs,False,82,2,21,0.652,0.877,1,-2.986,1,0.0465,0.0227,0,0.0789,0.486,118.491,200107,4
2014-01-11,55,Animals,Martin Garrix,67awxiNHNyjMXhVgsHuIrs,False,59,51,15,0.675,0.868,1,-6.36,1,0.0392,0.00107,0.715,0.374,0.0376,128.007,304229,4
2014-01-11,56,Drunk Last Night,Eli Young Band,67awxiNHNyjMXhVgsHuIrs,False,43,41,17,0.528,0.856,7,-4.605,1,0.0351,0.052,0,0.0988,0.572,87.019,219213,4
2014-01-11,57,When She Says Baby,Jason Aldean,67awxiNHNyjMXhVgsHuIrs,False,57,57,5,0.673,0.76,0,-5.126,1,0.0361,0.0682,0.000116,0.309,0.807,113.063,171120,4
2014-01-11,58,The Fox,Ylvis,67awxiNHNyjMXhVgsHuIrs,False,98,6,17,0.703,0.867,6,-4.292,1,0.0453,0.107,0,0.119,0.546,128.008,213708,4
2014-01-11,59,All That Matters,Justin Bieber,67awxiNHNyjMXhVgsHuIrs,False,85,24,5,0.696,0.513,6,-5.567,0,0.0424,0.00508,0,0.0682,0.144,129.859,191173,4
2014-01-11,60,TKO,Justin Timberlake,67awxiNHNyjMXhVgsHuIrs,False,74,36,15,0.611,0.678,3,-6.723,0,0.243,0.00701,8.43e-06,0.431,0.493,137.864,424147,4
2014-01-11,61,Sweet Annie,Zac Brown Band,67awxiNHNyjMXhVgsHuIrs,False,52,47,11,0.635,0.434,6,-7.986,1,0.0298,0.171,1.1e-06,0.106,0.171,139.976,278693,4
2014-01-11,62,Love Me Again,John Newman,67awxiNHNyjMXhVgsHuIrs,False,70,62,6,0.495,0.894,2,-4.814,0,0.0441,0.00453,0.000596,0.103,0.213,126.03,239894,4
2014-01-11,63,The Language,Drake,67awxiNHNyjMXhVgsHuIrs,False,68,51,10,0.831,0.651,1,-8.363,1,0.437,0.0125,0,0.0809,0.502,120.065,224013,4
2014-01-11,64,Survival,Eminem,67awxiNHNyjMXhVgsHuIrs,False,96,16,12,0.459,0.899,2,-2.978,1,0.21,0.0038,0,0.126,0.437,176.384,272417,4
2014-01-11,65,Do You Want To Build A Snowman?,"Kristen Bell, Agatha Lee Monn & Katie Lopez",2yi7HZrBOC4bMUSTcs4VK6,True,0,65,1,0.306,0.121,0,-15.551,0,0.0554,0.85,0.000176,0.257,0.166,174.053,206507,4
2014-01-11,66,Hey Brother,Avicii,2yi7HZrBOC4bMUSTcs4VK6,False,63,63,4,0.545,0.78,7,-4.867,0,0.0436,0.0309,4.64e-05,0.0828,0.458,125.014,255093,4
2014-01-11,67,We Were Us,Keith Urban And Miranda Lambert,2yi7HZrBOC4bMUSTcs4VK6,False,73,26,16,0.578,0.937,2,-5.685,1,0.0481,0.0294,0,0.122,0.479,102.983,191747,4
2014-01-11,68,All Of Me,John Legend,2yi7HZrBOC4bMUSTcs4VK6,False,55,52,12,0.422,0.264,8,-7.064,1,0.0322,0.922,0,0.132,0.331,119.93,269560,4
2014-01-11,69,Don't Let Me Be Lonely,The Band Perry,2yi7HZrBOC4bMUSTcs4VK6,False,62,59,11,0.601,0.682,1,-4.548,1,0.0282,0.159,0,0.0786,0.337,111.006,251227,4
2014-01-11,70,Friday Night,Eric Paslay,2yi7HZrBOC4bMUSTcs4VK6,False,65,62,11,0.657,0.841,9,-4.188,1,0.0452,0.16,0,0.177,0.722,120.009,167213,4
2014-01-11,71,Alone Together,Fall Out Boy,2yi7HZrBOC4bMUSTcs4VK6,False,81,71,5,0.552,0.915,4,-3.713,1,0.0559,0.0013,3.74e-05,0.206,0.606,90.013,203413,4
2014-01-11,72,Compass,Lady Antebellum,2yi7HZrBOC4bMUSTcs4VK6,False,75,65,8,0.56,0.77,0,-4.694,1,0.0256,0.096,6.39e-06,0.108,0.521,100.013,183067,4
2014-01-11,73,XO,Beyonce,2yi7HZrBOC4bMUSTcs4VK6,False,66,66,2,0.47,0.792,0,-8.932,1,0.26,0.171,1.28e-06,0.313,0.214,170.085,215947,4
2014-01-11,74,For The First Time In Forever,Kristen Bell & Idina Menzel,70b5Sq3ePOu3Gqg0hjlOtR,True,0,74,1,0.354,0.411,0,-6.018,1,0.0344,0.815,1e-06,0.106,0.43,90.831,225080,4
2014-01-11,75,Radio,Darius Rucker,70b5Sq3ePOu3Gqg0hjlOtR,False,71,65,11,0.72,0.848,0,-6.834,1,0.0589,0.123,0,0.0728,0.965,92.999,189053,4
2014-01-11,76,I Luv This Sh*t,August Alsina Featuring Trinidad James,70b5Sq3ePOu3Gqg0hjlOtR,False,72,48,17,0.643,0.592,1,-6.684,0,0.277,0.00475,1.54e-06,0.222,0.405,123.942,267920,4
2014-01-11,77,Sunny And 75,Joe Nichols,70b5Sq3ePOu3Gqg0hjlOtR,False,80,39,18,0.531,0.893,0,-4.422,1,0.055,0.184,1.01e-06,0.101,0.323,120.045,206947,4
2014-01-11,78,Up All Night,Jon Pardi,70b5Sq3ePOu3Gqg0hjlOtR,False,67,67,7,0.549,0.713,9,-4.935,1,0.0306,0.185,0,0.112,0.463,162.989,209640,4
2014-01-11,79,See You Tonight,Scotty McCreery,70b5Sq3ePOu3Gqg0hjlOtR,False,86,79,5,0.497,0.816,9,-6.489,1,0.0563,0.217,0,0.171,0.512,169.966,226320,4
2014-01-11,80,Bottoms Up,Brantley Gilbert,70b5Sq3ePOu3Gqg0hjlOtR,False,58,58,2,0.474,0.857,7,-5.734,1,0.0435,0.113,0,0.134,0.545,170.006,220200,4
2014-01-11,81,Bounce It,Juicy J Featuring Wale & Trey Songz,70b5Sq3ePOu3Gqg0hjlOtR,False,91,74,18,0.785,0.572,11,-9.383,1,0.0859,0.00811,0,0.111,0.477,140.032,260560,4
2014-01-11,82,Mine,Beyonce Featuring Drake,70b5Sq3ePOu3Gqg0hjlOtR,False,99,82,2,0.557,0.428,5,-11.299,1,0.137,0.0673,0.0019,0.139,0.0996,103.009,378600,4
2014-01-11,83,Everybody's Got Somebody But Me,Hunter Hayes Featuring Jason Mraz,70b5Sq3ePOu3Gqg0hjlOtR,False,92,77,8,0.638,0.53,5,-6.928,1,0.063,0.337,0,0.179,0.882,151.618,159347,4
2014-01-11,84,Up Down (Do This All Day),T-Pain Featuring B.o.B,70b5Sq3ePOu3Gqg0hjlOtR,False,79,79,6,0.763,0.53,5,-5.554,0,0.0577,0.272,0,0.16,0.469,97.033,231893,4
2014-01-11,85,Talk Dirty,Jason Derulo Featuring 2 Chainz,70b5Sq3ePOu3Gqg0hjlOtR,False,89,85,2,0.76,0.652,6,-7.321,1,0.232,0.0348,0,0.307,0.759,100.315,177685,4
2014-01-11,86,Helluva Life,Frankie Ballard,70b5Sq3ePOu3Gqg0hjlOtR,False,84,84,4,0.564,0.76,6,-5.667,1,0.0277,0.0676,0,0.144,0.528,134.015,231693,4
2014-01-11,87,Waiting For Superman,Daughtry,70b5Sq3ePOu3Gqg0hjlOtR,False,95,70,7,0.555,0.682,0,-5.711,1,0.0269,0.0029,0,0.0662,0.383,105.987,266960,4
2014-01-11,88,Heart Attack,Enrique Iglesias,70b5Sq3ePOu3Gqg0hjlOtR,False,0,88,2,0.427,0.895,4,-4.059,1,0.109,0.0717,0,0.409,0.414,154.048,170147,4
2014-01-11,89,Gorilla,Bruno Mars,70b5Sq3ePOu3Gqg0hjlOtR,False,0,22,16,0.717,0.544,7,-6.598,1,0.0371,0.445,5.16e-06,0.0973,0.641,139.959,244493,4
2014-01-11,90,Honest,Future,70b5Sq3ePOu3Gqg0hjlOtR,False,88,55,16,0.719,0.477,6,-6.439,0,0.178,0.0326,0,0.218,0.297,140.141,200493,4
2014-01-11,91,Perfume,Britney Spears,70b5Sq3ePOu3Gqg0hjlOtR,False,90,76,5,0.39,0.557,3,-6.344,1,0.0521,0.452,0,0.125,0.317,79.34,239973,4
2014-01-11,92,Do I Wanna Know?,Arctic Monkeys,70b5Sq3ePOu3Gqg0hjlOtR,False,83,83,4,0.548,0.532,5,-7.596,1,0.0323,0.186,0.000263,0.217,0.405,85.03,272394,4
2014-01-11,93,The Heart Of Dixie,Danielle Bradbery,70b5Sq3ePOu3Gqg0hjlOtR,False,0,58,4,0.456,0.637,6,-4.773,1,0.0354,0.0171,0,0.194,0.436,155.95,209453,4
2014-01-11,94,I Hold On,Dierks Bentley,70b5Sq3ePOu3Gqg0hjlOtR,False,100,94,2,0.614,0.715,0,-6.451,1,0.0445,0.0849,0.000316,0.102,0.231,117.956,279533,4
2014-01-11,95,Worst Behavior,Drake,70b5Sq3ePOu3Gqg0hjlOtR,False,94,89,3,0.78,0.799,9,-6.359,1,0.15,0.158,0,0.209,0.414,109.944,270187,4
2014-01-11,96,Neon Lights,Demi Lovato,34MJ07N9Bhu6iKPaxSVnCT,True,0,96,1,0.631,0.819,9,-4.24,1,0.122,0.0767,0,0.1,0.733,125.928,233173,4
2014-01-11,97,Lolly,Maejor Ali Featuring Juicy J & Justin Bieber,34MJ07N9Bhu6iKPaxSVnCT,False,0,19,4,0.751,0.573,5,-12.494,0,0.153,0.00108,0.883,0.103,0.0688,75.126,221231,4
2014-01-11,98,Paranoid,Ty Dolla $ign Featuring B.o.B,34MJ07N9Bhu6iKPaxSVnCT,False,97,97,2,0.858,0.398,1,-11.306,1,0.0598,0.00888,0,0.112,0.258,97.476,216520,4
2014-01-11,99,Bound 2,Kanye West,34MJ07N9Bhu6iKPaxSVnCT,False,87,12,6,0.367,0.665,1,-2.821,1,0.0465,0.145,0,0.113,0.31,148.913,229147,4
2014-01-11,100,Old School Love,Lupe Fiasco Featuring Ed Sheeran,34MJ07N9Bhu6iKPaxSVnCT,False,93,93,4,0.701,0.781,5,-8.493,1,0.134,0.0908,1.75e-06,0.358,0.459,86.006,273904,4
