date,position,title,artist,spotify_id,is_new,last_pos,peak_pos,weeks,danceability,energy,key,loudness,mode,speechiness,acousticness,instrumentalness,liveness,valence,tempo,duration_ms,time_signature
1994-02-05,1,All For Love,Bryan Adams/Rod Stewart/Sting,76nvqWPFucUra1xCkN1tnD,False,1,1,11,0.511,0.42,2,-11.577,1,0.0261,0.269,0.815,0.148,0.423,78.087,269437,4
1994-02-05,2,Hero,Mariah Carey,76nvqWPFucUra1xCkN1tnD,False,2,1,16,0.501,0.378,4,-9.37,1,0.029,0.735,0,0.119,0.178,119.987,257733,4
1994-02-05,3,The Power Of Love,Celine Dion,76nvqWPFucUra1xCkN1tnD,False,4,3,11,0.546,0.519,8,-9.072,1,0.0291,0.36,0.00046,0.24,0.247,140.054,342400,4
1994-02-05,4,Breathe Again,Toni Braxton,76nvqWPFucUra1xCkN1tnD,False,3,3,17,0.689,0.677,0,-6.36,1,0.0326,0.0704,0,0.0877,0.259,153.919,269173,4
1994-02-05,5,The Sign,Ace Of Base,76nvqWPFucUra1xCkN1tnD,False,16,5,6,0.808,0.786,4,-6.897,0,0.0447,0.00928,0.0701,0.0574,0.899,96.987,191240,4
1994-02-05,6,All That She Wants,Ace Of Base,76nvqWPFucUra1xCkN1tnD,False,7,2,21,0.798,0.625,11,-9.689,1,0.0548,0.00547,7.98e-05,0.103,0.858,93.764,211213,4
1994-02-05,7,Said I Loved You...But I Lied,Michael Bolton,76nvqWPFucUra1xCkN1tnD,False,6,6,14,0.547,0.569,10,-8.644,1,0.0271,0.189,7.05e-06,0.156,0.432,159.713,304867,4
1994-02-05,8,Again,Janet Jackson,76nvqWPFucUra1xCkN1tnD,False,5,1,16,0.359,0.287,0,-9.51,1,0.0303,0.882,0.00607,0.186,0.189,130.135,227133,4
1994-02-05,9,Please Forgive Me,Bryan Adams,76nvqWPFucUra1xCkN1tnD,False,8,7,16,0.587,0.456,9,-7.011,1,0.0262,0.516,0,0.104,0.144,134.11,355640,4
1994-02-05,10,Shoop,Salt-N-Pepa,76nvqWPFucUra1xCkN1tnD,False,9,4,18,0.939,0.675,0,-7.232,1,0.211,0.0915,0,0.0565,0.795,96.918,248573,4
1994-02-05,11,Getto Jam,Domino,76nvqWPFucUra1xCkN1tnD,False,11,11,11,0.802,0.547,9,-12.085,1,0.131,0.0312,1.34e-06,0.326,0.492,86.576,259280,4
1994-02-05,12,Linger,The Cranberries,76nvqWPFucUra1xCkN1tnD,False,12,12,16,0.439,0.434,7,-14.918,1,0.0265,0.0783,4.87e-05,0.14,0.204,94.845,274707,4
1994-02-05,13,Understanding,Xscape,76nvqWPFucUra1xCkN1tnD,False,13,13,7,0.7,0.465,7,-10.43,1,0.0562,0.36,0.000157,0.143,0.306,137.823,340962,4
1994-02-05,14,Because The Night,"10,000 Maniacs",76nvqWPFucUra1xCkN1tnD,False,14,14,14,0.408,0.79,11,-8.138,0,0.103,0.26,0.00027,0.765,0.347,122.624,223373,4
1994-02-05,15,Can We Talk,Tevin Campbell,76nvqWPFucUra1xCkN1tnD,False,10,9,17,0.658,0.711,2,-7.424,0,0.0425,0.0759,1.77e-05,0.0446,0.614,172.365,284587,4
1994-02-05,16,Whatta Man,Salt-N-Pepa Featuring En Vogue,76nvqWPFucUra1xCkN1tnD,False,22,16,3,0.757,0.544,5,-10.722,1,0.219,0.154,6.07e-05,0.226,0.921,173.208,308360,4
1994-02-05,17,Never Keeping Secrets,Babyface,76nvqWPFucUra1xCkN1tnD,False,15,15,16,0.693,0.648,11,-6.411,0,0.0248,0.0949,0,0.14,0.319,113.117,293267,4
1994-02-05,18,Cry For You,Jodeci,76nvqWPFucUra1xCkN1tnD,False,20,18,11,0.65,0.496,5,-12.349,0,0.0331,0.305,0,0.33,0.576,115.775,300907,4
1994-02-05,19,"I Can See Clearly Now (From ""Cool Runnings"")",Jimmy Cliff,76nvqWPFucUra1xCkN1tnD,False,18,18,14,0.799,0.662,7,-8.585,1,0.0347,0.00482,0.000505,0.0484,0.717,120.082,196000,4
1994-02-05,20,Whoomp! (There It Is),Tag Team,76nvqWPFucUra1xCkN1tnD,False,21,2,37,0.8,0.639,4,-7.406,0,0.0439,0.00123,0,0.0803,0.45,129.443,226027,4
1994-02-05,21,Mr. Vain,Culture Beat,76nvqWPFucUra1xCkN1tnD,False,17,17,14,0.703,0.997,9,-7.666,0,0.0399,0.0726,0.0235,0.123,0.391,132.872,257467,4
1994-02-05,22,Because Of Love,Janet Jackson,76nvqWPFucUra1xCkN1tnD,False,29,22,2,0.764,0.878,5,-5.647,0,0.0523,0.287,0.00356,0.18,0.825,112.37,260907,4
1994-02-05,23,So Much In Love,All-4-One,76nvqWPFucUra1xCkN1tnD,False,31,23,6,0.322,0.25,0,-11.451,0,0.03,0.892,0,0.12,0.352,137.714,212640,4
1994-02-05,24,Amazing,Aerosmith,76nvqWPFucUra1xCkN1tnD,False,28,24,10,0.308,0.747,0,-5.434,1,0.037,0.0645,8.27e-05,0.431,0.278,139.454,356160,4
1994-02-05,25,Found Out About You,Gin Blossoms,76nvqWPFucUra1xCkN1tnD,False,30,25,12,0.539,0.826,7,-8.037,1,0.0276,0.00224,0.0451,0.0832,0.669,134.718,233400,4
1994-02-05,26,Jessie,Joshua Kadison,76nvqWPFucUra1xCkN1tnD,False,26,26,18,0.648,0.464,7,-11.592,1,0.0287,0.426,4.93e-06,0.262,0.512,142.924,319027,4
1994-02-05,27,U.N.I.T.Y.,Queen Latifah,76nvqWPFucUra1xCkN1tnD,False,23,23,11,0.679,0.468,4,-11.768,0,0.386,0.0149,1.46e-06,0.203,0.503,94.126,250840,4
1994-02-05,28,Choose,Color Me Badd,76nvqWPFucUra1xCkN1tnD,False,32,28,4,0.58,0.858,6,-7.049,1,0.0313,0.277,0.0135,0.106,0.715,93.689,263907,4
1994-02-05,29,Dreams,Gabrielle,76nvqWPFucUra1xCkN1tnD,False,27,26,18,0.619,0.719,9,-8.502,1,0.0465,0.0185,0,0.17,0.57,98.799,221400,4
1994-02-05,30,Cantaloop (Flip Fantasia),US3,76nvqWPFucUra1xCkN1tnD,False,33,30,11,0.852,0.655,5,-11.498,0,0.0645,0.107,2.07e-05,0.137,0.952,115.962,279360,4
1994-02-05,31,Rock And Roll Dreams Come Through,Meat Loaf,76nvqWPFucUra1xCkN1tnD,False,48,31,2,0.564,0.888,0,-3.389,1,0.0329,0.169,0.000101,0.182,0.461,112.234,350867,4
1994-02-05,32,Gangsta Lean,DRS,76nvqWPFucUra1xCkN1tnD,False,19,4,17,0.742,0.258,3,-11.885,0,0.0339,0.451,0,0.0926,0.476,82.576,322142,3
1994-02-05,33,Stay,Eternal,76nvqWPFucUra1xCkN1tnD,False,45,33,4,0.591,0.727,10,-8.058,0,0.054,0.00411,1.6e-06,0.0289,0.845,98.525,237533,4
1994-02-05,34,Now And Forever,Richard Marx,76nvqWPFucUra1xCkN1tnD,False,38,34,3,0.441,0.258,7,-11.227,1,0.0276,0.661,0,0.106,0.172,77.988,214827,1
1994-02-05,36,Groove Thang,Zhane,,False,36,36,4,0.906,0.486,9,-7.189,0,0.0408,0.0227,0.000757,0.0725,0.821,102.031,236507,4
1994-02-05,37,Keep Ya Head Up,2Pac,,False,24,12,15,0.598,0.732,4,-7.013,1,0.425,0.144,0,0.508,0.595,172.329,262507,4
1994-02-05,38,What's My Name?,Snoop Dogg,,False,25,8,10,0.692,0.833,7,-3.974,1,0.0492,0.000136,1.98e-05,0.515,0.692,96.814,246320,4
1994-02-05,39,What Is Love,Haddaway,,False,35,11,24,0.683,0.772,7,-7.907,0,0.0311,0.0222,0.0149,0.203,0.737,123.871,270373,4
1994-02-05,40,(Lay Your Head On My) Pillow,Tony Toni Tone,,False,43,40,4,0.907,0.645,7,-4.38,1,0.0976,0.043,0,0.18,0.562,103.312,299507,4
1994-02-05,41,Will You Be There (In The Morning),Heart,,False,44,41,7,0.553,0.743,9,-6.794,1,0.0281,0.0365,1.65e-05,0.194,0.528,166.499,269800,4
1994-02-05,42,Life (Everybody Needs Somebody To Love),Haddaway,,False,42,42,7,0.595,0.847,10,-8.495,1,0.0333,0.00601,0.445,0.215,0.596,128.479,257360,4
1994-02-05,43,Having A Party,Rod Stewart,,False,47,43,6,0.648,0.789,4,-9.47,1,0.103,0.147,0,0.972,0.711,129.587,286027,4
1994-02-05,44,Miss You In A Heartbeat,Def Leppard,,False,39,39,9,0.603,0.394,10,-10.02,1,0.0288,0.551,3.98e-05,0.104,0.239,134.083,244611,4
1994-02-05,45,I'd Do Anything For Love (But I Won't Do That),Meat Loaf,,False,34,1,21,0.419,0.672,2,-6.353,1,0.092,0.623,0,0.412,0.304,105.212,316467,4
1994-02-05,46,Dreamlover,Mariah Carey,,False,37,1,27,0.701,0.705,5,-6.18,1,0.0357,0.18,0,0.141,0.71,100.669,232960,4
1994-02-05,47,Everyday,Phil Collins,,False,49,47,2,0.701,0.469,3,-9.63,1,0.0305,0.534,0.00105,0.121,0.384,94.699,343893,4
1994-02-05,48,I'm In The Mood,CeCe Peniston,,False,54,48,6,0.743,0.787,6,-8.722,0,0.0535,0.116,9.59e-06,0.204,0.752,102.723,252027,4
1994-02-05,49,Just Kickin' It,Xscape,,False,41,2,21,0.694,0.365,1,-12.294,0,0.0635,0.054,3.43e-05,0.401,0.693,80.904,204133,4
1994-02-05,50,Hey Mr. D.J.,Zhane,,False,40,6,24,0.865,0.645,2,-6.939,1,0.071,0.0836,0.00117,0.109,0.89,101.313,255027,4
1994-02-05,51,Mary Jane's Last Dance,Tom Petty And The Heartbreakers,,False,56,51,7,0.464,0.655,7,-9.058,0,0.0608,0.0272,1.34e-06,0.328,0.531,169.515,273600,4
1994-02-05,52,All About Soul,Billy Joel,,False,46,29,14,0.555,0.86,2,-5.965,0,0.038,0.0386,0,0.325,0.468,108.594,361307,4
1994-02-05,53,Goody Goody,Lisette Melendez,,False,57,53,9,0.736,0.914,8,-6.408,0,0.0365,0.0982,0.173,0.0466,0.881,99.221,251926,4
1994-02-05,54,Slow And Easy,Zapp & Roger,,False,52,43,15,0.759,0.66,5,-8.964,1,0.0658,0.105,0,0.114,0.778,140.68,311333,4
1994-02-05,55,Cannonball,The Breeders,,False,63,55,10,0.502,0.758,3,-9.76,1,0.0407,0.00915,0.783,0.284,0.729,112.499,213693,4
1994-02-05,56,Always On My Mind,SWV,,False,62,56,5,0.621,0.583,1,-10.127,0,0.0345,0.0116,0,0.115,0.452,137.534,317360,4
1994-02-05,57,Sex Me (Parts I & II),R. Kelly,,False,55,20,15,0.709,0.475,1,-10.823,1,0.131,0.116,0,0.208,0.526,125.818,687493,4
1994-02-05,58,Loser,Beck,,False,75,58,2,0.654,0.611,2,-10.45,1,0.119,0.0337,0.000178,0.405,0.786,85.387,235000,4
1994-02-05,59,Bump N' Grind,R. Kelly,0DBIL8arX0Zo6eAuxNIpik,True,0,59,1,0.621,0.481,11,-8.016,1,0.0371,0.0984,0,0.241,0.679,65.004,256133,4
1994-02-05,60,"Never Should've Let You Go (From ""Sister Act 2"")",Hi-Five,0DBIL8arX0Zo6eAuxNIpik,False,51,30,17,0.777,0.565,10,-10.315,1,0.0318,0.532,0,0.0719,0.825,108.062,281467,3
1994-02-05,61,U Send Me Swingin',Mint Condition,0DBIL8arX0Zo6eAuxNIpik,False,68,61,3,0.608,0.569,6,-5.835,0,0.0283,0.123,0,0.151,0.346,72.076,314538,4
1994-02-05,62,"Stay (Faraway, So Close!)",U2,0DBIL8arX0Zo6eAuxNIpik,False,61,61,8,0.561,0.51,8,-12.175,1,0.0258,0.186,0.0575,0.0674,0.719,94.079,298427,4
1994-02-05,63,Time And Chance,Color Me Badd,0DBIL8arX0Zo6eAuxNIpik,False,59,23,15,0.642,0.51,4,-10.207,1,0.0259,0.217,0,0.291,0.49,99.179,259627,4
1994-02-05,64,Award Tour,A Tribe Called Quest,0DBIL8arX0Zo6eAuxNIpik,False,58,47,14,0.812,0.6,7,-9.414,1,0.254,0.00308,8.38e-06,0.173,0.555,97.338,226440,4
1994-02-05,65,I'll Be Loving You,Collage,0DBIL8arX0Zo6eAuxNIpik,False,67,56,11,0.701,0.923,11,-4.69,0,0.0413,0.0567,7.67e-05,0.282,0.813,125.778,250093,4
1994-02-05,66,Funk Dat/Why Is It?,Sagat,0DBIL8arX0Zo6eAuxNIpik,False,65,65,6,0.886,0.436,3,-15.295,0,0.103,0.466,0.0241,0.045,0.775,118.976,259800,4
1994-02-05,67,(I Know I Got) Skillz,Shaquille O'Neal,0DBIL8arX0Zo6eAuxNIpik,False,64,35,16,0.68,0.988,3,-2.579,0,0.0941,0.00303,4.39e-05,0.299,0.176,144.03,203750,4
1994-02-05,68,Dunkie Butt (Please Please Please),12 Gauge,0DBIL8arX0Zo6eAuxNIpik,False,70,68,5,0.863,0.747,7,-7.22,1,0.15,0.0894,0,0.0733,0.582,143.333,258933,4
1994-02-05,69,You Don't Have To Worry,Mary J. Blige,0DBIL8arX0Zo6eAuxNIpik,False,69,69,6,0.514,0.564,5,-5.788,1,0.0281,0.204,0,0.0861,0.16,106.713,309467,4
1994-02-05,71,Higher Ground,UB40,,False,60,45,18,0.799,0.504,2,-12.874,1,0.045,0.074,0.000609,0.118,0.92,101.067,261240,4
1994-02-05,72,Gin And Juice,Snoop Doggy Dogg,,False,77,72,2,0.549,0.845,7,-4.279,1,0.2,0.0287,0.000492,0.67,0.351,94.491,211493,4
1994-02-05,74,Wild World,Mr. Big,,False,71,27,18,0.573,0.722,5,-6.518,1,0.0295,0.182,0,0.29,0.59,144.209,208560,4
1994-02-05,75,Zunga Zeng,K7,,False,86,75,2,0.846,0.657,1,-9.642,1,0.14,0.0478,0.000363,0.0392,0.619,103.743,273000,4
1994-02-05,76,Laid,James,2L8kaqJ2YHbKlcX1e1rKnf,True,0,76,1,0.477,0.965,0,-5.735,1,0.0361,0.0196,0.000126,0.138,0.642,116.251,156867,4
1994-02-05,77,Real Muthaphuckkin G's,Eazy-E,2L8kaqJ2YHbKlcX1e1rKnf,False,72,42,13,0.724,0.853,11,-3.895,0,0.283,0.0164,0,0.65,0.775,170.51,332733,4
1994-02-05,78,John Deere Green,Joe Diffie,2L8kaqJ2YHbKlcX1e1rKnf,False,83,69,7,0.685,0.817,2,-5.683,1,0.0298,0.15,0,0.242,0.768,130.41,273000,4
1994-02-05,79,Anniversary,Tony Toni Tone,2L8kaqJ2YHbKlcX1e1rKnf,False,74,10,20,0.711,0.505,8,-9.675,0,0.0343,0.0472,0,0.317,0.55,89.004,271200,4
1994-02-05,80,Mmm Mmm Mmm Mmm,Crash Test Dummies,2L8kaqJ2YHbKlcX1e1rKnf,False,91,80,2,0.58,0.575,3,-7.72,1,0.0231,0.25,1.83e-05,0.0813,0.37,92.934,235173,4
1994-02-05,81,One On One,To Be Continued...,2L8kaqJ2YHbKlcX1e1rKnf,False,84,81,3,0.698,0.422,10,-12.575,1,0.113,0.647,0.0335,0.198,0.681,105.742,147027,4
1994-02-05,82,We Ain't Goin' Out Like That,Cypress Hill,2L8kaqJ2YHbKlcX1e1rKnf,False,79,65,5,0.68,0.641,6,-8.548,1,0.03,0.000275,0.00134,0.227,0.518,102.007,283467,4
1994-02-05,83,Give It Up,The Goodmen,2L8kaqJ2YHbKlcX1e1rKnf,False,81,71,11,0.596,0.479,1,-7.024,0,0.0981,0.000605,0.909,0.191,0.0555,127.996,316752,4
1994-02-05,84,Yours,Shai,2L8kaqJ2YHbKlcX1e1rKnf,False,78,63,9,0.433,0.478,2,-6.641,1,0.0725,0.191,0,0.32,0.173,179.98,230000,4
1994-02-05,85,If That's Your Boyfriend (He Wasn't Last Night),MeShell Ndegeocello,7vx3QnBgX1RpmMATFIiNA3,True,0,85,1,0.815,0.723,10,-6.903,0,0.126,0.0524,0.0068,0.0508,0.781,106.031,271813,4
1994-02-05,86,Both Sides Of The Story,Phil Collins,7vx3QnBgX1RpmMATFIiNA3,False,80,25,15,0.524,0.706,8,-6.91,1,0.0427,0.0383,0.000111,0.0737,0.425,127.645,403920,4
1994-02-05,87,"I Love Music (From ""Carlito's Way"")",Rozalla,7vx3QnBgX1RpmMATFIiNA3,False,76,76,7,0.714,0.686,2,-8.428,0,0.0294,0.0376,0.0043,0.0853,0.842,125.982,290000,4
1994-02-05,88,Come Clean,Jeru The Damaja,7vx3QnBgX1RpmMATFIiNA3,False,89,88,2,0.812,0.778,10,-13.957,0,0.292,0.6,4.39e-05,0.11,0.599,87.713,297040,4
1994-02-05,89,I Never Knew Love,Doug Stone,7vx3QnBgX1RpmMATFIiNA3,False,94,81,6,0.575,0.332,6,-12.19,1,0.0311,0.523,0,0.101,0.366,135.01,210467,4
1994-02-05,90,Sentimental,Kenny G,7vx3QnBgX1RpmMATFIiNA3,False,82,72,9,0.426,0.269,8,-14.857,1,0.029,0.0348,0.0593,0.101,0.135,139.813,395040,4
1994-02-05,91,True Love,Elton John & Kiki Dee,7vx3QnBgX1RpmMATFIiNA3,False,87,56,11,0.589,0.421,6,-10.209,1,0.0257,0.324,1.6e-06,0.162,0.214,105.234,213067,3
1994-02-05,92,Boom Shak A-Tack,Born Jamericans,7vx3QnBgX1RpmMATFIiNA3,False,88,88,2,0.684,0.583,11,-9.979,1,0.17,0.00427,0,0.195,0.59,173.375,249333,4
1994-02-05,93,Sound Of Da Police,KRS-One,3Y6XWs8xMlCngyIxNOFnsp,True,0,93,1,0.794,0.95,1,-8.78,1,0.294,0.124,7.71e-05,0.133,0.324,94.984,258507,4
1994-02-05,94,Runaway Love,Johnny O,3Y6XWs8xMlCngyIxNOFnsp,False,90,90,2,0.594,0.588,9,-9.453,0,0.0789,0.00209,0.086,0.0711,0.407,128.65,313312,4
1994-02-05,95,I'm In Love,Lisa Keith,3Y6XWs8xMlCngyIxNOFnsp,False,85,84,3,0.845,0.829,6,-5.794,0,0.0335,0.0587,0.059,0.111,0.886,119.375,272533,4
1994-02-05,96,"Indo Smoke (From ""Poetic Justice"")",Mista Grimm,3Y6XWs8xMlCngyIxNOFnsp,False,97,56,20,0.785,0.556,0,-11.7,0,0.271,0.0288,0,0.482,0.601,98.836,322227,4
1994-02-05,97,Fast As You,Dwight Yoakam,3Y6XWs8xMlCngyIxNOFnsp,False,95,70,9,0.628,0.801,4,-7.926,1,0.0282,0.000479,0.0897,0.396,0.843,125.954,285200,4
1994-02-05,98,Really Doe,Ice Cube,3Y6XWs8xMlCngyIxNOFnsp,False,96,54,9,0.773,0.737,8,-8.314,1,0.146,0.00993,0.0234,0.295,0.691,96.909,268160,4
1994-02-05,99,Into Your Arms,The Lemonheads,3Y6XWs8xMlCngyIxNOFnsp,False,93,67,13,0.504,0.782,2,-9.27,1,0.0301,0.0661,1.31e-06,0.115,0.619,123.883,164706,4
1994-02-05,100,Looking For Mr. Do Right,Jade,3Y6XWs8xMlCngyIxNOFnsp,False,92,69,14,0.635,0.409,11,-11.253,1,0.0314,0.122,0,0.103,0.297,99.932,377373,4
