date,position,title,artist,spotify_id,is_new,last_pos,peak_pos,weeks,danceability,energy,key,loudness,mode,speechiness,acousticness,instrumentalness,liveness,valence,tempo,duration_ms,time_signature
1997-02-08,1,Un-Break My Heart,Toni Braxton,0pSaDwrMLM7F82LWJg9v6s,False,1,1,16,0.625,0.426,2,-8.392,0,0.0271,0.413,0,0.116,0.112,110.018,270333,4
1997-02-08,2,Don't Let Go (Love),En Vogue,0pSaDwrMLM7F82LWJg9v6s,False,2,2,14,0.618,0.688,5,-5.867,0,0.0477,0.409,6.32e-06,0.3,0.561,78.311,291880,4
1997-02-08,3,"I Believe I Can Fly (From ""Space Jam"")",R. Kelly,0pSaDwrMLM7F82LWJg9v6s,False,3,2,9,0.572,0.538,7,-5.241,1,0.0279,0.151,0,0.0754,0.0584,120.455,284800,4
1997-02-08,4,Wannabe,Spice Girls,0pSaDwrMLM7F82LWJg9v6s,False,6,4,3,0.768,0.864,11,-6.145,1,0.0324,0.101,0,0.162,0.891,110.008,173027,4
1997-02-08,5,"I Believe In You And Me (From ""The Preacher's Wife"")",Whitney Houston,0pSaDwrMLM7F82LWJg9v6s,False,4,4,7,0.434,0.268,1,-11.52,0,0.0355,0.785,0,0.0881,0.121,119.804,241960,4
1997-02-08,6,Nobody,Keith Sweat Featuring Athena Cage,0pSaDwrMLM7F82LWJg9v6s,False,5,3,19,0.699,0.492,9,-9.449,0,0.0318,0.484,0,0.0482,0.388,117.907,264773,4
1997-02-08,9,No Diggity,BLACKstreet (Featuring Dr. Dre),,False,7,1,18,0.849,0.379,1,-10.546,0,0.0614,0.139,0.0917,0.0448,0.44,89.007,267053,4
1997-02-08,10,I'm Still In Love With You,New Edition,,False,8,7,14,0.741,0.519,8,-4.683,0,0.0351,0.426,0,0.318,0.418,134.294,279667,4
1997-02-08,11,Every Time I Close My Eyes,Babyface,,False,19,11,2,0.654,0.417,5,-7.699,1,0.025,0.0624,0,0.0963,0.279,143.676,296267,4
1997-02-08,12,Ooh Aah... Just A Little Bit,Gina G,,False,12,12,11,0.647,0.942,1,-7.101,1,0.0341,0.626,0.168,0.0411,0.937,130.978,203120,4
1997-02-08,13,Cold Rock A Party,MC Lyte,,False,15,13,11,0.896,0.744,11,-5.239,0,0.246,0.192,1.19e-06,0.108,0.744,92.91,247307,4
1997-02-08,14,Mouth,Merril Bainbridge,,False,10,4,23,0.695,0.499,1,-9.201,1,0.218,0.702,5.85e-05,0.154,0.78,175.896,205733,4
1997-02-08,15,On & On,Erykah Badu,,False,27,15,3,0.762,0.403,11,-10.423,0,0.158,0.0396,0.0113,0.256,0.346,80.476,226133,4
1997-02-08,16,Where Do You Go,No Mercy,,False,13,5,32,0.734,0.828,10,-11.018,0,0.0318,0.0346,0.118,0.071,0.964,127.06,272093,4
1997-02-08,17,In My Bed,Dru Hill,,False,25,17,5,0.828,0.654,10,-7.674,0,0.226,0.106,0,0.0689,0.817,95.254,242360,4
1997-02-08,18,It's All Coming Back To Me Now,Celine Dion,,False,14,2,26,0.384,0.438,0,-9.149,1,0.0362,0.753,0,0.101,0.287,87.903,456867,4
1997-02-08,19,If It Makes You Happy,Sheryl Crow,,False,16,10,21,0.543,0.681,7,-7.091,1,0.0289,0.0482,8.43e-05,0.104,0.292,95.415,323400,4
1997-02-08,20,When You Love A Woman,Journey,,False,17,12,16,0.513,0.514,1,-5.819,1,0.0274,0.255,0,0.258,0.216,132.157,246987,4
1997-02-08,21,No Time,Lil' Kim Featuring Puff Daddy,,False,24,18,14,0.627,0.814,5,-5.863,0,0.304,0.256,1.15e-06,0.285,0.799,90.42,300667,4
1997-02-08,22,I Love You Always Forever,Donna Lewis,,False,18,2,34,0.744,0.453,5,-11.977,1,0.0348,0.627,0.421,0.0898,0.122,103.773,239960,4
1997-02-08,23,"I Finally Found Someone (From ""The Mirror Has Two Faces"")",Barbra Streisand & Bryan Adams,,False,22,8,12,0.562,0.224,6,-15.069,1,0.0289,0.674,0,0.127,0.0707,139.009,221973,4
1997-02-08,24,"Last Night (From ""The Nutty Professor"")",Az Yet,,False,21,9,25,0.555,0.543,3,-8.874,0,0.0272,0.428,0,0.105,0.359,164.021,269027,4
1997-02-08,25,"Fly Like An Eagle (From ""Space Jam"")",Seal,,False,20,10,8,0.623,0.836,7,-4.729,1,0.0595,0.00697,3.41e-06,0.0687,0.631,97.14,254773,4
1997-02-08,27,Pony,Ginuwine,,False,23,6,23,0.749,0.605,8,-9.359,0,0.086,0.00186,0.0381,0.115,0.966,142.024,251733,4
1997-02-08,29,Twisted,Keith Sweat,,False,26,2,34,0.615,0.514,11,-9.759,1,0.0466,0.393,0,0.248,0.822,175.849,260667,4
1997-02-08,30,I Like It,The Blackout Allstars,,False,34,30,10,0.71,0.927,5,-6.433,0,0.0447,3.69e-05,0.203,0.651,0.616,128.069,291027,4
1997-02-08,31,This Is Your Night,Amber,,False,28,24,35,0.674,0.908,9,-3.262,0,0.0325,0.0714,0.000104,0.121,0.861,127.99,238160,4
1997-02-08,32,"You Must Love Me (From ""Evita"")",Madonna,,False,33,18,13,0.357,0.161,10,-14.789,1,0.0436,0.926,3.47e-05,0.146,0.267,88.746,170840,4
1997-02-08,33,Change The World,Eric Clapton,,False,31,5,30,0.721,0.558,9,-8.8,1,0.0246,0.492,0.00563,0.113,0.542,96.887,234867,4
1997-02-08,34,Barely Breathing,Duncan Sheik,,False,37,34,11,0.482,0.807,0,-6.976,1,0.0457,0.0281,0,0.177,0.516,187.918,254547,4
1997-02-08,35,Counting Blue Cars,Dishwalla,,False,32,15,45,0.454,0.79,11,-4.361,0,0.0285,0.00604,3.09e-05,0.225,0.362,100.225,291907,4
1997-02-08,37,What Kind Of Man Would I Be,Mint Condition,,False,35,17,23,0.651,0.498,0,-8.868,0,0.0318,0.39,0,0.143,0.423,109.906,264600,4
1997-02-08,38,"Nothin' But The Cavi Hit (From ""Rhyme & Reason"")",Mack 10 & Tha Dogg Pound,,False,38,38,9,0.852,0.741,1,-5.435,0,0.134,0.0247,0.00106,0.0974,0.535,97.894,241360,4
1997-02-08,39,What They Do,The Roots,,False,49,39,5,0.885,0.414,0,-10.539,1,0.168,0.341,0.000289,0.0891,0.683,92.727,357200,4
1997-02-08,40,Thirty-Three,The Smashing Pumpkins,,False,39,39,11,0.607,0.333,6,-12.717,1,0.0324,0.000968,0.4,0.151,0.0802,126.619,250293,4
1997-02-08,42,Da' Dip,Freak Nasty,,False,56,42,6,0.953,0.428,8,-17.199,1,0.298,0.0079,0.0302,0.224,0.723,131.737,237000,4
1997-02-08,43,"Watch Me Do My Thing (From ""All That"")",Immature Featuring Smooth And Ed From Good Burger,,False,76,43,2,0.697,0.853,8,-6.264,1,0.0528,0.00189,1.37e-06,0.243,0.765,93.799,231533,4
1997-02-08,44,Macarena (Bayside Boys Mix),Los Del Rio,,False,42,1,60,0.927,0.721,8,-12.561,1,0.0908,0.422,4.36e-05,0.0422,0.965,103.018,249382,4
1997-02-08,45,It's Your Body,Johnny Gill Featuring Roger Troutman,,False,54,45,9,0.647,0.536,0,-10.733,1,0.045,0.524,0,0.0798,0.316,125.222,333867,4
1997-02-08,46,Key West Intermezzo (I Saw You First),John Mellencamp,,False,40,14,24,0.673,0.858,11,-6.511,1,0.027,0.005,1.92e-05,0.274,0.959,116.477,294293,4
1997-02-08,47,Without Love,Donna Lewis,,False,41,41,9,0.66,0.604,5,-8.318,1,0.0323,0.00646,0.0104,0.0907,0.779,91.671,222440,4
1997-02-08,48,Desperately Wanting,Better Than Ezra,,False,53,48,8,0.494,0.913,0,-5.289,1,0.0378,0.000165,0.00898,0.247,0.478,99.92,277493,4
1997-02-08,49,"Space Jam (From ""Space Jam"")",Quad City DJ's,,False,46,37,8,0.798,0.952,11,-4.78,0,0.0401,0.064,0.000513,0.287,0.843,132.031,304960,4
1997-02-08,50,This Is For The Lover In You,"Babyface Featuring LL Cool J, Howard Hewett, Jody Watley & Jeffrey Daniels",,False,43,6,16,0.887,0.416,1,-7.346,1,0.0518,0.0295,1.06e-05,0.066,0.761,94.013,239733,4
1997-02-08,51,I'm Not Giving You Up,Gloria Estefan,,False,47,40,10,0.753,0.488,10,-8.259,0,0.0247,0.769,0,0.0851,0.607,97.943,258893,4
1997-02-08,52,Come See Me,112,,False,45,33,14,0.701,0.378,5,-9.259,0,0.0664,0.0263,0,0.0649,0.604,83.796,265760,4
1997-02-08,53,Naked Eye,Luscious Jackson,,False,57,53,8,0.737,0.657,4,-10.962,0,0.0284,0.0863,0.0339,0.0953,0.76,131.022,280693,4
1997-02-08,54,Never Leave Me Alone,Nate Dogg Featuring Snoop Doggy Dogg,,False,58,33,14,0.821,0.549,8,-3.591,1,0.0371,0.0437,0,0.0737,0.963,100.023,360507,4
1997-02-08,55,"Ain't Nobody (From ""Beavis And Butt-Head Do America"")",LL Cool J,,False,55,46,7,0.788,0.746,10,-6.405,0,0.185,0.0723,3.43e-06,0.279,0.519,99.873,277440,4
1997-02-08,56,Luchini aka (This Is It),Camp Lo,,False,65,56,6,0.721,0.949,6,-5.685,1,0.278,0.0495,0,0.327,0.835,83.028,240093,4
1997-02-08,57,Falling,Montell Jordan,,False,60,18,19,0.742,0.424,0,-5.696,1,0.0457,0.119,0.0104,0.263,0.414,79.956,241533,4
1997-02-08,58,If We Fall In Love Tonight,Rod Stewart,,False,62,55,13,0.51,0.44,2,-11.015,1,0.0293,0.125,0,0.0994,0.135,74.8,281200,4
1997-02-08,59,Firestarter,The Prodigy,,False,66,59,4,0.545,0.948,11,-5.098,1,0.0779,0.00335,0.364,0.226,0.355,141.507,279800,4
1997-02-08,60,Between You And Me,dc Talk,,False,50,29,13,0.554,0.912,9,-4.315,0,0.0376,0.14,0.0421,0.064,0.515,99.712,298760,4
1997-02-08,61,It's All About U,SWV,,False,61,61,4,0.838,0.401,0,-9.808,1,0.0506,0.111,0.00811,0.0478,0.74,93.49,224800,4
1997-02-08,62,Get Up,Lost Boyz,,False,67,62,6,0.813,0.572,9,-6.469,1,0.162,0.0266,0,0.0372,0.655,94.825,243760,4
1997-02-08,63,Tears,The Isley Brothers,,False,68,63,5,0.532,0.516,1,-9.847,1,0.103,0.755,0.00019,0.328,0.545,150.372,285600,4
1997-02-08,64,Let Me Clear My Throat,DJ Kool,,False,77,64,2,0.697,0.901,7,-7.154,1,0.259,0.169,0,0.356,0.535,103.145,290160,4
1997-02-08,65,Bow Down,Westside Connection,,False,59,21,20,0.897,0.458,9,-11.01,1,0.279,0.0208,0,0.419,0.513,92.928,206827,4
1997-02-08,66,Please Don't Go,No Mercy,6TF2LthEA2BqImvYKToR0V,True,0,66,1,0.715,0.838,7,-10.541,0,0.0341,0.169,3.67e-05,0.395,0.962,124.625,240093,4
1997-02-08,67,ATLiens,OutKast,6TF2LthEA2BqImvYKToR0V,False,63,35,11,0.918,0.734,11,-2.832,0,0.269,0.0296,8.01e-06,0.191,0.608,97.044,230693,4
1997-02-08,68,Knocks Me Off My Feet,Donell Jones,6TF2LthEA2BqImvYKToR0V,False,69,49,15,0.469,0.594,7,-8.209,1,0.0403,0.0663,0,0.0806,0.485,167.223,222760,4
1997-02-08,69,Friends,John Michael Montgomery,6TF2LthEA2BqImvYKToR0V,False,70,69,7,0.62,0.401,9,-10.279,1,0.0288,0.23,0,0.0745,0.238,143.961,234000,4
1997-02-08,70,"It's Alright, It's Ok",Leah Andreone,6TF2LthEA2BqImvYKToR0V,False,73,70,3,0.734,0.67,0,-5.838,0,0.0321,0.0113,1.25e-06,0.224,0.656,110.022,265133,4
1997-02-08,71,Street Dreams,Nas,6TF2LthEA2BqImvYKToR0V,False,64,22,14,0.752,0.611,11,-8.681,0,0.315,0.21,0,0.778,0.746,90.993,279933,4
1997-02-08,72,I Fell In Love,Rockell,6TF2LthEA2BqImvYKToR0V,False,74,61,14,0.825,0.858,9,-7.586,1,0.08,0.0102,0.0373,0.0543,0.92,135.027,273093,4
1997-02-08,74,Hero Of The Day,Metallica,,False,71,60,14,0.351,0.9,8,-7.146,1,0.0357,0.000107,0.0262,0.11,0.777,116.023,261693,4
1997-02-08,75,I Always Feel Like (Somebody's Watching Me),Tru Featuring Ice Cream Man (Master P),00ggjWewjwpWHNd1wRJgY3,True,0,75,1,0.832,0.456,6,-10.108,0,0.193,0.00201,0.00351,0.366,0.285,93.585,306480,4
1997-02-08,76,Don't Stop Movin',Livin' Joy,00ggjWewjwpWHNd1wRJgY3,False,79,76,3,0.703,0.723,2,-10.816,0,0.0445,0.0287,0.00337,0.297,0.867,129.992,215227,4
1997-02-08,77,Colour Of Love,Amber,00ggjWewjwpWHNd1wRJgY3,False,81,77,4,0.642,0.754,1,-7.649,1,0.0272,0.116,0.0375,0.0601,0.736,127.025,212693,4
1997-02-08,78,We Danced Anyway,Deana Carter,4fOFOwrAHA9PdhOL7lciok,True,0,78,1,0.629,0.721,6,-3.722,1,0.0277,0.502,0,0.307,0.651,94.054,202533,4
1997-02-08,79,"How Could You (From ""Bulletproof"")",K-Ci & JoJo,4fOFOwrAHA9PdhOL7lciok,False,78,53,13,0.618,0.49,6,-6.99,1,0.0321,0.147,0,0.267,0.471,147.948,297827,4
1997-02-08,80,Setting Sun,The Chemical Brothers,4fOFOwrAHA9PdhOL7lciok,False,80,80,3,0.446,0.995,6,-1.169,1,0.223,0.000738,0.13,0.354,0.248,135.041,328733,4
1997-02-08,81,Let's Ride,Richie Rich,4fOFOwrAHA9PdhOL7lciok,False,75,67,11,0.746,0.738,0,-4.867,1,0.159,0.0143,0,0.128,0.653,88.917,275360,4
1997-02-08,82,You Don't Have To Love Me,Monifah,4fOFOwrAHA9PdhOL7lciok,False,82,82,6,0.628,0.426,5,-8.084,0,0.0313,0.197,0.0011,0.0919,0.529,185.963,275533,3
1997-02-08,83,I Can Make It Better,Luther Vandross,4fOFOwrAHA9PdhOL7lciok,False,83,80,8,0.714,0.497,0,-7.643,1,0.0344,0.285,0,0.0668,0.671,95.817,335480,3
1997-02-08,85,When Boy Meets Girl,Total,,False,88,50,16,0.681,0.542,6,-8.602,0,0.0422,0.412,0,0.0629,0.862,94.904,258573,4
1997-02-08,86,The Moment,Kenny G,,False,87,63,13,0.265,0.31,10,-12.247,1,0.0359,0.64,0.00349,0.185,0.194,181.174,361467,4
1997-02-08,87,"Bohemian Rhapsody (From ""High School High"")",The Braids,,False,84,42,17,0.523,0.627,5,-6.454,0,0.101,0.0134,0.000317,0.152,0.559,167.993,238386,4
1997-02-08,88,All I Want,Susanna Hoffs,,False,85,77,11,0.617,0.559,4,-5.738,1,0.0269,0.0359,0,0.141,0.664,111.747,198373,4
1997-02-08,90,You Can Make History (Young Again),Elton John,,False,86,70,16,0.664,0.739,2,-9.005,1,0.0262,0.106,0.0542,0.333,0.458,92.257,293973,4
1997-02-08,91,"Another You, Another Me",Brady Seals,,False,91,91,3,0.611,0.406,0,-8.71,1,0.03,0.323,0,0.0841,0.154,123.492,232773,4
1997-02-08,92,Nowhere To Go,Melissa Etheridge,,False,90,40,18,0.51,0.421,4,-11.24,1,0.0268,0.173,1.64e-05,0.187,0.215,102.577,353040,4
1997-02-08,93,Birmingham,Amanda Marshall,,False,92,43,20,0.525,0.726,7,-8.381,1,0.0306,0.04,0.00332,0.0564,0.686,185.513,321067,4
1997-02-08,95,Fired Up!,Funky Green Dogs,59cOkSYMBzajxog2tMyQCT,True,0,95,1,0.878,0.912,0,-7.716,1,0.0458,0.0601,0.00268,0.0707,0.966,122.953,485160,4
1997-02-08,96,Whateva Man,Redman,59cOkSYMBzajxog2tMyQCT,False,96,96,2,0.581,0.712,6,-7.803,0,0.476,0.27,0,0.895,0.709,172.573,188547,4
1997-02-08,97,At Night I Pray,Wild Orchid,59cOkSYMBzajxog2tMyQCT,False,95,63,20,0.608,0.785,2,-5.992,0,0.0891,0.439,0,0.0786,0.403,155.458,256600,4
1997-02-08,98,Passion,K5,3cHxfNznhPp0GRBTm4pcW7,True,0,98,1,0.726,0.667,8,-7.576,1,0.058,0.136,0.858,0.0768,0.584,127.004,246013,4
1997-02-08,99,Dance Into The Light,Phil Collins,3cHxfNznhPp0GRBTm4pcW7,False,98,45,16,0.612,0.84,7,-5.342,1,0.0422,0.0252,0.00262,0.042,0.907,87.862,264827,3
1997-02-08,100,One And One,Robert Miles Featuring Maria Nayler,3cHxfNznhPp0GRBTm4pcW7,False,99,54,19,0.64,0.727,2,-9.532,0,0.0297,0.0436,0.00161,0.641,0.76,120.061,236227,4
