date,position,title,artist,spotify_id,is_new,last_pos,peak_pos,weeks,danceability,energy,key,loudness,mode,speechiness,acousticness,instrumentalness,liveness,valence,tempo,duration_ms,time_signature
2010-03-20,1,Break Your Heart,Taio Cruz Featuring Ludacris,3mSAhPW73pyeKoquI7E8B3,False,53,1,2,0.666,0.899,8,-4.676,1,0.028,0.00155,0,0.0677,0.629,122.05,186267,4
2010-03-20,2,Need You Now,Lady Antebellum,3mSAhPW73pyeKoquI7E8B3,False,3,2,30,0.587,0.622,4,-5.535,1,0.0303,0.0927,0.000636,0.2,0.231,107.943,277573,4
2010-03-20,3,BedRock,Young Money Featuring Lloyd,3mSAhPW73pyeKoquI7E8B3,False,2,2,15,0.733,0.664,8,-6.163,1,0.295,0.102,0,0.191,0.557,148.005,288133,4
2010-03-20,4,Rude Boy,Rihanna,3mSAhPW73pyeKoquI7E8B3,False,8,4,4,0.563,0.75,11,-4.496,1,0.127,0.113,0,0.0788,0.812,173.906,222920,4
2010-03-20,5,Imma Be,The Black Eyed Peas,3mSAhPW73pyeKoquI7E8B3,False,1,1,14,0.597,0.517,0,-6.963,1,0.365,0.179,0,0.307,0.412,92.035,257560,4
2010-03-20,6,TiK ToK,Ke$ha,3mSAhPW73pyeKoquI7E8B3,False,4,1,22,0.755,0.837,2,-2.718,0,0.142,0.0991,0,0.289,0.714,120.028,199693,4
2010-03-20,7,"Hey, Soul Sister",Train,3mSAhPW73pyeKoquI7E8B3,False,6,6,23,0.673,0.886,1,-4.44,0,0.0431,0.185,0,0.0826,0.795,97.012,216773,4
2010-03-20,8,In My Head,Jason Derulo,3mSAhPW73pyeKoquI7E8B3,False,10,8,13,0.762,0.748,0,-4.15,0,0.033,0.0266,0,0.348,0.851,110.009,199027,4
2010-03-20,9,Bad Romance,Lady Gaga,3mSAhPW73pyeKoquI7E8B3,False,5,2,19,0.696,0.921,0,-3.755,1,0.0363,0.00314,5.24e-05,0.0842,0.714,119.001,294573,4
2010-03-20,10,How Low,Ludacris,3mSAhPW73pyeKoquI7E8B3,False,7,6,13,0.785,0.498,1,-6.977,1,0.0533,0.00248,1.23e-06,0.224,0.418,143.96,201587,4
2010-03-20,11,Telephone,Lady Gaga Featuring Beyonce,3mSAhPW73pyeKoquI7E8B3,False,12,11,15,0.825,0.832,5,-5.853,0,0.0403,0.00587,0.000789,0.114,0.713,122.021,220627,4
2010-03-20,12,Say Aah,Trey Songz Featuring Fabolous,3mSAhPW73pyeKoquI7E8B3,False,9,9,17,0.724,0.87,1,-3.614,0,0.113,0.00453,0,0.833,0.81,93.01,207547,4
2010-03-20,13,Blah Blah Blah,Ke$ha Featuring 3OH!3,3mSAhPW73pyeKoquI7E8B3,False,11,7,9,0.752,0.836,10,-3.173,1,0.115,0.0843,0.000425,0.424,0.519,120.003,172053,4
2010-03-20,14,Baby,Justin Bieber Featuring Ludacris,3mSAhPW73pyeKoquI7E8B3,False,13,5,7,0.813,0.708,2,-6.34,1,0.0504,0.117,0,0.0796,0.756,130.039,215453,4
2010-03-20,15,Carry Out,Timbaland Featuring Justin Timberlake,3mSAhPW73pyeKoquI7E8B3,False,15,11,14,0.531,0.574,10,-6.693,0,0.113,0.114,0.0308,0.256,0.272,115.68,232467,5
2010-03-20,16,Nothin' On You,B.o.B Featuring Bruno Mars,3mSAhPW73pyeKoquI7E8B3,False,16,16,6,0.688,0.853,10,-5.814,1,0.0493,0.386,0,0.0862,0.743,103.993,268320,4
2010-03-20,17,Sexy Chick,David Guetta Featuring Akon,3mSAhPW73pyeKoquI7E8B3,False,14,5,31,0.809,0.562,11,-7.694,0,0.0534,0.0816,0.000418,0.105,0.798,130.003,194347,4
2010-03-20,18,According To You,Orianthi,3mSAhPW73pyeKoquI7E8B3,False,17,17,14,0.619,0.917,5,-2.582,1,0.0507,0.0233,1.21e-05,0.0986,0.552,131.002,200347,4
2010-03-20,19,Breakeven,The Script,3mSAhPW73pyeKoquI7E8B3,False,19,19,14,0.63,0.698,10,-4.51,1,0.0244,0.173,0,0.0789,0.529,94.023,261427,4
2010-03-20,20,Live Like We're Dying,Kris Allen,3mSAhPW73pyeKoquI7E8B3,False,18,18,19,0.589,0.893,0,-2.948,1,0.0397,0.0273,0,0.343,0.94,92.011,212507,4
2010-03-20,21,Never Let You Go,Justin Bieber,01BlGnXpLuC0BjgUxVYZFb,True,0,21,1,0.66,0.811,0,-4.852,1,0.0357,0.00141,1.17e-06,0.251,0.675,103.191,264400,4
2010-03-20,22,Tie Me Down,New Boyz Featuring Ray J,01BlGnXpLuC0BjgUxVYZFb,False,22,22,21,0.42,0.787,8,-4.467,1,0.294,0.0104,0,0.198,0.38,97.967,178808,4
2010-03-20,23,All The Right Moves,OneRepublic,01BlGnXpLuC0BjgUxVYZFb,False,25,23,22,0.529,0.948,0,-3.522,1,0.0475,0.259,1.01e-05,0.283,0.651,146.02,238000,4
2010-03-20,24,Replay,Iyaz,01BlGnXpLuC0BjgUxVYZFb,False,20,2,29,0.706,0.751,9,-6.323,1,0.0708,0.173,0,0.168,0.195,91.031,182307,4
2010-03-20,25,Whataya Want From Me,Adam Lambert,01BlGnXpLuC0BjgUxVYZFb,False,24,24,12,0.44,0.683,11,-4.732,0,0.0489,0.00706,0,0.0593,0.445,185.948,227320,4
2010-03-20,26,I Gotta Feeling,The Black Eyed Peas,01BlGnXpLuC0BjgUxVYZFb,False,21,1,39,0.744,0.774,0,-6.399,1,0.0268,0.0751,0,0.512,0.649,127.958,289187,4
2010-03-20,27,Say Something,Timbaland Featuring Drake,01BlGnXpLuC0BjgUxVYZFb,False,26,26,9,0.555,0.713,11,-4.549,1,0.0911,0.0845,0,0.712,0.725,79.934,240920,4
2010-03-20,28,Empire State Of Mind,Jay-Z + Alicia Keys,01BlGnXpLuC0BjgUxVYZFb,False,23,1,26,0.491,0.956,11,-1.538,1,0.392,0.0295,0,0.46,0.811,173.585,276920,4
2010-03-20,29,Haven't Met You Yet,Michael Buble,01BlGnXpLuC0BjgUxVYZFb,False,28,25,23,0.615,0.733,8,-4.808,1,0.0335,0.152,0,0.109,0.796,122.58,244587,4
2010-03-20,30,Today Was A Fairytale,Taylor Swift,01BlGnXpLuC0BjgUxVYZFb,False,31,2,7,0.491,0.703,7,-4.5,1,0.0319,0.0307,5.72e-06,0.167,0.344,157.988,242480,4
2010-03-20,31,Do You Remember,Jay Sean Featuring Sean Paul & Lil Jon,01BlGnXpLuC0BjgUxVYZFb,False,27,10,18,0.855,0.668,11,-4.892,1,0.0644,0.0242,0,0.102,0.803,125.846,210307,4
2010-03-20,32,Down,Jay Sean Featuring Lil Wayne,01BlGnXpLuC0BjgUxVYZFb,False,30,1,36,0.657,0.695,2,-4.493,1,0.0321,0.0108,0,0.0822,0.683,65.997,212107,4
2010-03-20,33,Ridin' Solo,Jason Derulo,58tkYzuI1IXGmoQ3r2cPL0,True,0,33,1,0.505,0.679,9,-3.697,1,0.144,0.195,0,0.107,0.529,81.567,224907,4
2010-03-20,34,Hey Daddy (Daddy's Home),Usher Featuring Plies,58tkYzuI1IXGmoQ3r2cPL0,False,40,34,8,0.59,0.698,11,-4.262,1,0.0286,0.000176,0,0.107,0.352,95.975,224093,4
2010-03-20,35,Two Is Better Than One,Boys Like Girls Featuring Taylor Swift,58tkYzuI1IXGmoQ3r2cPL0,False,29,18,20,0.521,0.702,0,-5.189,1,0.0331,0.189,0,0.0962,0.25,127.976,242840,4
2010-03-20,36,You Belong With Me,Taylor Swift,58tkYzuI1IXGmoQ3r2cPL0,False,33,2,46,0.687,0.783,6,-4.44,1,0.0386,0.162,1.35e-05,0.114,0.443,129.964,231133,4
2010-03-20,37,Heartbreak Warfare,John Mayer,58tkYzuI1IXGmoQ3r2cPL0,False,39,37,13,0.624,0.554,2,-8.113,1,0.0225,0.191,0.00131,0.299,0.311,97.031,269720,4
2010-03-20,38,Fireflies,Owl City,58tkYzuI1IXGmoQ3r2cPL0,False,32,1,29,0.512,0.662,3,-6.797,1,0.0439,0.0275,0,0.118,0.472,180.114,228347,4
2010-03-20,39,Life After You,Daughtry,58tkYzuI1IXGmoQ3r2cPL0,False,41,39,14,0.396,0.796,5,-3.253,1,0.0357,0.0597,0,0.407,0.362,154.037,207213,3
2010-03-20,40,On To The Next One,Jay-Z + Swizz Beatz,58tkYzuI1IXGmoQ3r2cPL0,False,37,37,8,0.546,0.908,10,-1.655,0,0.417,0.215,9.47e-06,0.107,0.59,116.885,256133,5
2010-03-20,41,Hillbilly Bone,Blake Shelton Featuring Trace Adkins,58tkYzuI1IXGmoQ3r2cPL0,False,50,41,11,0.611,0.964,7,-3.076,1,0.0464,0.0441,7.37e-05,0.109,0.9,144.014,225280,4
2010-03-20,42,Whatcha Say,Jason Derulo,58tkYzuI1IXGmoQ3r2cPL0,False,35,1,30,0.615,0.711,11,-5.507,1,0.0779,0.0444,0,0.145,0.711,144.036,221253,4
2010-03-20,43,Lil Freak,Usher Featuring Nicki Minaj,2sdarYql1R0GAdFsdb4LDM,True,0,43,1,0.834,0.628,7,-6.616,1,0.0626,0.000879,0.000192,0.292,0.766,139.958,234253,4
2010-03-20,44,My Chick Bad,Ludacris Featuring Nicki Minaj,2sdarYql1R0GAdFsdb4LDM,False,46,44,2,0.624,0.723,1,-6.782,1,0.378,0.172,0,0.483,0.757,84.789,216933,4
2010-03-20,45,Why Don't We Just Dance,Josh Turner,2sdarYql1R0GAdFsdb4LDM,False,38,35,17,0.677,0.776,5,-5.933,1,0.0386,0.42,0.000689,0.0954,0.642,121.834,192800,4
2010-03-20,46,All The Way Turnt Up,Roscoe Dash Featuring Soulja Boy Tell'em,2sdarYql1R0GAdFsdb4LDM,False,61,46,6,0.512,0.965,11,-2.862,0,0.0842,0.000889,0,0.264,0.743,132.007,293720,4
2010-03-20,47,American Honey,Lady Antebellum,2sdarYql1R0GAdFsdb4LDM,False,57,47,8,0.588,0.684,1,-5.154,1,0.0288,0.508,0,0.141,0.121,85.997,224867,4
2010-03-20,48,Temporary Home,Carrie Underwood,2sdarYql1R0GAdFsdb4LDM,False,52,48,11,0.416,0.354,0,-6.357,1,0.0263,0.731,1e-06,0.0925,0.181,80.767,268560,4
2010-03-20,49,A Little More Country Than That,Easton Corbin,2sdarYql1R0GAdFsdb4LDM,False,62,49,9,0.64,0.6,11,-8.534,1,0.0318,0.0795,1.5e-06,0.106,0.593,84.969,172227,4
2010-03-20,50,Halfway Gone,Lifehouse,2sdarYql1R0GAdFsdb4LDM,False,55,50,13,0.543,0.919,1,-4.831,0,0.0415,0.000449,0,0.243,0.498,125.023,195307,4
2010-03-20,51,Hard,Rihanna Featuring Jeezy,2sdarYql1R0GAdFsdb4LDM,False,34,8,16,0.31,0.746,1,-3.599,1,0.111,0.0121,0,0.649,0.163,182.032,250600,4
2010-03-20,52,Try Sleeping With A Broken Heart,Alicia Keys,2sdarYql1R0GAdFsdb4LDM,False,47,27,16,0.496,0.82,5,-5.155,1,0.112,0.158,0.246,0.13,0.549,110.977,249013,5
2010-03-20,53,I Made It (Cash Money Heroes),"Kevin Rudolf Featuring Birdman, Jay Sean, & Lil Wayne",2sdarYql1R0GAdFsdb4LDM,False,67,53,5,0.592,0.944,7,-2.94,1,0.111,0.043,0,0.365,0.574,124.42,249547,5
2010-03-20,54,Naturally,Selena Gomez & The Scene,2sdarYql1R0GAdFsdb4LDM,False,43,29,11,0.605,0.902,10,-5.406,0,0.0511,0.0185,1.01e-06,0.0534,0.875,132.612,202587,4
2010-03-20,55,Highway 20 Ride,Zac Brown Band,2sdarYql1R0GAdFsdb4LDM,False,56,55,8,0.55,0.402,3,-7.195,1,0.0339,0.551,1.38e-05,0.105,0.428,76.105,229280,4
2010-03-20,56,Sex Therapy,Robin Thicke,2sdarYql1R0GAdFsdb4LDM,False,54,54,12,0.702,0.53,3,-4.384,1,0.0296,0.679,0,0.241,0.319,112.036,275147,4
2010-03-20,57,That's How Country Boys Roll,Billy Currington,2sdarYql1R0GAdFsdb4LDM,False,60,57,14,0.677,0.919,2,-3.009,1,0.0344,0.054,1.48e-06,0.113,0.902,120.961,224267,4
2010-03-20,58,It Kills Me,Melanie Fiona,2sdarYql1R0GAdFsdb4LDM,False,51,43,16,0.618,0.764,8,-4.375,1,0.0411,0.228,0,0.0972,0.479,107.452,250413,4
2010-03-20,59,Young Forever,Jay-Z + Mr. Hudson,2sdarYql1R0GAdFsdb4LDM,False,78,41,8,0.637,0.69,9,-3.214,0,0.0693,0.417,0,0.211,0.103,140.329,253907,4
2010-03-20,60,Lemonade,Gucci Mane,2sdarYql1R0GAdFsdb4LDM,False,66,60,5,0.741,0.658,7,-7.758,1,0.0853,0.643,3.43e-06,0.307,0.746,142.057,246013,4
2010-03-20,61,I Am,Mary J. Blige,2sdarYql1R0GAdFsdb4LDM,False,59,55,13,0.449,0.715,11,-3.636,0,0.271,0.11,0,0.532,0.516,169.916,203520,4
2010-03-20,62,The Truth,Jason Aldean,2sdarYql1R0GAdFsdb4LDM,False,58,40,18,0.496,0.577,9,-5.305,1,0.0257,0.234,2.4e-06,0.109,0.381,143.014,238413,4
2010-03-20,63,Everything To Me,Monica,2sdarYql1R0GAdFsdb4LDM,False,73,63,4,0.308,0.529,7,-5.319,0,0.0874,0.479,0,0.441,0.485,80.794,196960,4
2010-03-20,64,'Til Summer Comes Around,Keith Urban,2sdarYql1R0GAdFsdb4LDM,False,69,64,8,0.57,0.629,9,-7.608,0,0.0331,0.593,0.000136,0.77,0.308,127.907,331467,4
2010-03-20,65,Solo,Iyaz,2sdarYql1R0GAdFsdb4LDM,False,72,43,4,0.73,0.728,11,-3.113,1,0.0291,0.197,0,0.197,0.68,130.061,194267,4
2010-03-20,66,We Are The World 25: For Haiti,Artists For Haiti,2sdarYql1R0GAdFsdb4LDM,False,36,2,4,0.348,0.717,4,-5.634,1,0.0882,0.311,0,0.0786,0.28,66.21,416778,4
2010-03-20,67,Steady Mobbin',Young Money Featuring Gucci Mane,2sdarYql1R0GAdFsdb4LDM,False,71,48,9,0.488,0.691,0,-8.09,0,0.279,0.0219,0,0.501,0.697,156.141,310733,4
2010-03-20,68,Unstoppable,Rascal Flatts,2sdarYql1R0GAdFsdb4LDM,False,64,52,5,0.473,0.799,3,-4.798,1,0.0483,0.0738,0,0.121,0.506,155.892,227720,4
2010-03-20,69,If You Only Knew,Shinedown,2sdarYql1R0GAdFsdb4LDM,False,68,42,19,0.449,0.956,9,-4.011,0,0.0398,0.000347,0,0.325,0.321,97.011,226640,4
2010-03-20,70,Let It Be,Kris Allen,2sdarYql1R0GAdFsdb4LDM,False,63,63,2,0.498,0.183,10,-16.074,1,0.0643,0.948,0.771,0.115,0.259,136.069,183197,4
2010-03-20,71,Alice,Avril Lavigne,4gLVsEaNMpzkCAM0hXgDoi,True,0,71,1,0.536,0.824,0,-4.403,1,0.0767,0.0458,0.000199,0.174,0.172,119.004,300987,4
2010-03-20,72,Neighbors Know My Name,Trey Songz,4gLVsEaNMpzkCAM0hXgDoi,False,88,72,2,0.663,0.693,7,-5.776,0,0.0635,0.0379,0,0.162,0.391,120.026,186307,4
2010-03-20,73,Ain't Back Yet,Kenny Chesney,5jjoS9t9LgIsSGbVrtoKR7,True,0,73,1,0.602,0.944,10,-4.238,1,0.0427,0.0308,0.00256,0.436,0.797,106.958,239813,4
2010-03-20,74,Cryin' Like A Bitch!,Godsmack,4a9i7rCLfPjbS1sNamZeQN,True,0,74,1,0.543,0.808,10,-5.484,1,0.0407,7.19e-05,0.00336,0.114,0.472,95.19,201667,4
2010-03-20,75,History In The Making,Darius Rucker,4a9i7rCLfPjbS1sNamZeQN,False,65,61,19,0.475,0.718,0,-5.638,1,0.034,0.0373,0,0.326,0.453,157.722,209480,4
2010-03-20,76,Someday,Rob Thomas,4a9i7rCLfPjbS1sNamZeQN,False,76,72,18,0.573,0.905,10,-5.954,1,0.0343,0.0408,0,0.113,0.683,135.943,247800,4
2010-03-20,77,Soldier Of Love,Sade,4a9i7rCLfPjbS1sNamZeQN,False,70,52,8,0.775,0.572,0,-8.427,0,0.0633,0.0117,0.0293,0.0847,0.64,90.023,356653,4
2010-03-20,79,American Saturday Night,Brad Paisley,,False,74,67,13,0.487,0.938,4,-5.466,1,0.0533,0.0721,2.63e-05,0.522,0.733,157.795,274200,4
2010-03-20,80,O Let's Do It,Waka Flocka Flame,,False,84,80,4,0.682,0.513,1,-6.312,0,0.396,0.0128,0,0.212,0.338,130.085,248533,4
2010-03-20,81,When I Look At You,Miley Cyrus,,False,79,79,4,0.459,0.545,6,-4.874,1,0.0282,0.142,0,0.105,0.194,137.946,248587,3
2010-03-20,82,My Best Days Are Ahead Of Me,Danny Gokey,5w7GCrY0J4oTI9jWlma82d,True,0,82,1,0.615,0.822,11,-4.499,1,0.0399,0.109,0,0.127,0.398,119.997,186133,4
2010-03-20,83,Shots,LMFAO Featuring Lil Jon,5w7GCrY0J4oTI9jWlma82d,False,95,68,13,0.825,0.856,1,-1.912,1,0.0476,0.00851,1.4e-06,0.127,0.207,128.016,222133,4
2010-03-20,84,Gimmie That Girl,Joe Nichols,5w7GCrY0J4oTI9jWlma82d,False,98,84,2,0.5,0.9,2,-3.577,1,0.117,0.205,0.000251,0.694,0.675,162.249,185453,4
2010-03-20,85,I Invented Sex,Trey Songz Featuring Drake,5w7GCrY0J4oTI9jWlma82d,False,81,42,20,0.69,0.76,0,-4.778,1,0.0587,0.0678,0,0.184,0.468,89.958,247933,4
2010-03-20,86,Drop The World,Lil Wayne Featuring Eminem,5w7GCrY0J4oTI9jWlma82d,False,86,18,10,0.663,0.91,1,-1.629,1,0.317,0.0719,0,0.244,0.342,144.993,229227,4
2010-03-20,87,Fearless,Taylor Swift,5w7GCrY0J4oTI9jWlma82d,False,94,9,9,0.594,0.712,5,-4.418,1,0.0273,0.04,0,0.309,0.476,99.972,241987,4
2010-03-20,88,"Women Lie, Men Lie",Yo Gotti Featuring Lil Wayne,5w7GCrY0J4oTI9jWlma82d,False,93,88,2,0.647,0.767,6,-6.497,1,0.203,0.00417,0,0.103,0.537,157.925,216773,4
2010-03-20,89,Follow Me Down,3OH!3 Featuring Neon Hitch,5w7GCrY0J4oTI9jWlma82d,False,0,89,2,0.779,0.671,0,-8.524,1,0.0402,0.00232,0.000291,0.104,0.714,113.036,203800,4
2010-03-20,90,I Wanna Rock,Snoop Dogg,5w7GCrY0J4oTI9jWlma82d,False,75,41,13,0.521,0.849,5,-3.238,1,0.318,0.168,0,0.289,0.431,122.852,235987,5
2010-03-20,91,All I Do Is Win,"DJ Khaled Featuring T-Pain, Ludacris, Snoop Dogg & Rick Ross",5w7GCrY0J4oTI9jWlma82d,False,80,64,3,0.545,0.781,10,-3.616,1,0.185,0.0139,0,0.161,0.277,150.097,232507,4
2010-03-20,92,Bulletproof,La Roux,6lUY6MoqGgPnA27PHYxem5,True,0,92,1,0.674,0.882,3,-2.771,0,0.0477,0.000441,6.47e-05,0.068,0.682,123.016,205733,4
2010-03-20,93,One Day,Matisyahu,6lUY6MoqGgPnA27PHYxem5,False,90,90,2,0.346,0.61,0,-5.818,1,0.15,0.198,0,0.117,0.235,68.552,207573,4
2010-03-20,94,Just Breathe,Pearl Jam,6lUY6MoqGgPnA27PHYxem5,False,92,88,8,0.473,0.348,0,-11.1,1,0.0288,0.721,7.42e-05,0.0823,0.283,107.819,215853,4
2010-03-20,95,Shut It Down,Pitbull Featuring Akon,6lUY6MoqGgPnA27PHYxem5,False,87,42,14,0.754,0.693,9,-6.483,0,0.0844,0.0059,1.59e-06,0.0515,0.411,128.062,226093,4
2010-03-20,96,Backwoods,Justin Moore,6lUY6MoqGgPnA27PHYxem5,False,100,96,2,0.497,0.932,8,-5.029,1,0.0527,0.0678,2.5e-06,0.116,0.774,157.884,155893,4
2010-03-20,97,Knockout,Lil Wayne Featuring Nicki Minaj,6lUY6MoqGgPnA27PHYxem5,False,83,44,5,0.488,0.821,7,-3.729,1,0.0482,0.00263,0.000514,0.287,0.354,159.992,249307,4
2010-03-20,98,The Man I Want To Be,Chris Young,28Sc21lrWcZD9Ov4rRkPJq,True,0,98,1,0.639,0.678,7,-5.02,1,0.0278,0.44,1.45e-06,0.221,0.531,106.966,212133,4
2010-03-20,99,Keep On Lovin' You,Steel Magnolia,5mrpWeULubsdBHpQVcXLqB,True,0,99,1,0.511,0.781,9,-4.681,1,0.0479,0.0719,0,0.265,0.512,159.953,182587,4
2010-03-20,100,Hell On The Heart,Eric Church,5XcMzuskwO305UC7RBm9Zu,True,0,100,1,0.637,0.89,0,-3.877,1,0.0312,0.0832,1.9e-06,0.0892,0.928,123.002,164733,4
