date,position,title,artist,spotify_id,is_new,last_pos,peak_pos,weeks,danceability,energy,key,loudness,mode,speechiness,acousticness,instrumentalness,liveness,valence,tempo,duration_ms,time_signature
1993-04-10,1,Informer,Snow,,False,1,1,14,0.763,0.742,6,-10.975,0,0.188,0.0984,0,0.38,0.483,98.145,268910,4
1993-04-10,2,Freak Me,Silk,,False,2,2,8,0.697,0.608,4,-10.976,0,0.0463,0.0295,0,0.276,0.725,133.879,274533,4
1993-04-10,3,"Nuthin' But A ""G"" Thang",Dr. Dre,,False,3,2,11,0.801,0.699,11,-8.18,0,0.279,0.00575,0,0.146,0.655,94.605,238467,4
1993-04-10,4,I Have Nothing,Whitney Houston,,False,4,4,7,0.541,0.401,0,-10.499,1,0.0365,0.576,0,0.164,0.24,152.943,289160,3
1993-04-10,5,Don't Walk Away,Jade,,False,5,4,17,0.831,0.915,10,-7.501,0,0.128,0.147,0.00571,0.196,0.881,102.979,216373,4
1993-04-10,6,Cat's In The Cradle,Ugly Kid Joe,,False,9,6,9,0.511,0.517,8,-9.653,1,0.0328,0.13,0,0.074,0.433,75.67,241893,4
1993-04-10,7,Two Princes,Spin Doctors,,False,11,7,11,0.543,0.912,7,-10.71,1,0.0601,0.00162,2.1e-06,0.0565,0.836,103.731,256733,4
1993-04-10,8,"Love Is (From ""Beverly Hills, 90210"")",Vanessa Williams/Brian McKnight,,False,15,8,12,0.487,0.361,1,-9.97,1,0.0236,0.379,2.88e-05,0.12,0.177,79.857,284960,4
1993-04-10,9,Mr. Wendal,Arrested Development,,False,8,6,17,0.884,0.37,8,-11.353,1,0.112,0.0188,0.00423,0.026,0.883,109.997,247507,4
1993-04-10,10,Bed Of Roses,Bon Jovi,,False,10,10,12,0.31,0.596,5,-5.599,1,0.0293,0.101,0,0.21,0.16,164.613,394400,3
1993-04-10,11,Comforter,Shai,,False,13,11,12,0.725,0.384,7,-12.64,1,0.0317,0.00569,0.00022,0.158,0.497,121.9,250600,4
1993-04-10,12,Ordinary World,Duran Duran,,False,7,3,14,0.472,0.652,1,-10.171,0,0.0305,0.0131,1.12e-05,0.14,0.401,140.124,340200,4
1993-04-10,13,"I'm Every Woman (From ""The Bodyguard"")",Whitney Houston,,False,6,4,14,0.665,0.847,5,-8.314,0,0.0535,0.0178,0.00288,0.126,0.4,119.555,285107,4
1993-04-10,14,Hip Hop Hooray,Naughty By Nature,,False,14,8,11,0.862,0.642,6,-13.652,0,0.101,0.102,0,0.272,0.765,99.201,267267,4
1993-04-10,15,I Got A Man,Positive K,,False,18,14,17,0.812,0.753,7,-13.252,1,0.118,0.0774,0,0.341,0.787,103.754,232773,4
1993-04-10,16,I'm So Into You,SWV,,False,16,16,10,0.85,0.513,7,-10.663,1,0.0513,0.0624,0.00249,0.0689,0.623,99.01,278333,4
1993-04-10,17,Ditty,Paperboy,,False,19,17,17,0.838,0.452,11,-15.219,0,0.0547,0.0509,0,0.0666,0.708,99.075,245030,4
1993-04-10,18,Looking Through Patient Eyes,P.M. Dawn,,False,24,18,4,0.786,0.372,8,-17.765,1,0.0536,0.19,5.9e-06,0.129,0.685,102.237,249667,4
1993-04-10,19,A Whole New World (Aladdin's Theme),Peabo Bryson & Regina Belle,,False,12,1,17,0.516,0.32,2,-10.487,1,0.0303,0.627,0,0.144,0.131,107.894,243493,4
1993-04-10,20,"The Right Kind Of Love (From ""Beverly Hills, 90210"")",Jeremy Jordan,,False,17,14,18,0.717,0.634,5,-7.736,0,0.036,0.115,0,0.0782,0.896,178.064,273933,4
1993-04-10,21,That's What Love Can Do,Boy Krazy,,False,21,18,12,0.783,0.773,5,-7.541,0,0.0493,0.0103,0.000162,0.0349,0.744,117.471,202000,4
1993-04-10,22,Forever In Love,Kenny G,,False,20,18,17,0.331,0.318,5,-14.901,1,0.0313,0.336,0.158,0.17,0.111,82.427,299493,4
1993-04-10,23,Angel,Jon Secada,,False,23,23,11,0.485,0.477,0,-8.948,1,0.0262,0.295,3.35e-05,0.202,0.134,151.704,275040,4
1993-04-10,24,If I Ever Lose My Faith In You,Sting,,False,26,24,8,0.575,0.727,2,-9.539,1,0.0281,0.00952,0.00754,0.054,0.504,97.995,270533,4
1993-04-10,25,It Was A Good Day,Ice Cube,,False,31,25,6,0.798,0.744,7,-5.328,0,0.136,0.33,0.000106,0.292,0.794,82.356,260000,4
1993-04-10,26,I Will Always Love You,Whitney Houston,,False,22,1,22,0.332,0.214,4,-12.518,1,0.0349,0.845,5.62e-06,0.0839,0.11,67.531,271093,4
1993-04-10,27,Rebirth Of Slick (Cool Like Dat),Digable Planets,,False,25,15,13,0.884,0.334,1,-18.943,0,0.228,0.0476,0.0588,0.107,0.571,98.315,261267,4
1993-04-10,28,Sweet Thing,Mary J. Blige,,False,28,28,9,0.69,0.651,9,-7.86,1,0.101,0.343,9.56e-05,0.178,0.691,79.305,225333,4
1993-04-10,29,Down With The King,Run-D.M.C.,,False,33,29,4,0.786,0.637,1,-12.149,1,0.205,0.07,1.31e-05,0.415,0.762,96.023,302627,4
1993-04-10,30,"The Crying Game (From ""The Crying Game"")",Boy George,,False,35,30,5,0.593,0.54,4,-13.302,0,0.0299,0.076,0.00108,0.111,0.577,99.995,202973,4
1993-04-10,31,Man On The Moon,R.E.M.,,False,30,30,10,0.667,0.699,7,-7.574,1,0.026,0.42,0.000442,0.201,0.655,118.567,314173,4
1993-04-10,32,Nothin' My Love Can't Fix,Joey Lawrence,,False,34,32,6,0.657,0.909,7,-6.322,1,0.0918,0.0131,0.000623,0.211,0.606,106.122,243267,4
1993-04-10,33,7,Prince And The New Power Generation,,False,27,7,20,0.747,0.749,9,-6.255,1,0.0563,0.0917,0,0.0444,0.562,100.721,310467,4
1993-04-10,34,Here We Go Again!,Portrait,,False,29,11,22,0.771,0.745,11,-10.217,0,0.0904,0.0256,0.000374,0.107,0.599,106.709,235200,4
1993-04-10,35,Heal The World,Michael Jackson,,False,32,27,18,0.545,0.485,9,-8.045,1,0.0485,0.537,1.8e-06,0.104,0.101,80.948,384307,4
1993-04-10,36,Simple Life,Elton John,,False,40,36,7,0.663,0.788,5,-7.484,1,0.0314,0.00838,0.143,0.19,0.476,101.779,386000,4
1993-04-10,37,So Alone,Men At Large,,False,41,37,8,0.629,0.364,9,-12.721,0,0.0286,0.0754,0,0.0258,0.471,122.083,447547,4
1993-04-10,38,Rhythm Is A Dancer,Snap!,,False,38,5,35,0.794,0.745,9,-11.367,0,0.037,0.273,0.000414,0.143,0.706,124.249,225882,4
1993-04-10,39,Love U More,Sunscreem,,False,47,39,7,0.602,0.821,2,-8.844,1,0.0332,0.191,0,0.265,0.493,126.085,251693,4
1993-04-10,40,Dazzey Duks,Duice,,False,43,40,14,0.884,0.464,1,-12.876,1,0.222,0.000925,4.36e-06,0.0366,0.868,132.172,244867,4
1993-04-10,41,If I Ever Fall In Love,Shai,,False,37,2,26,0.402,0.205,6,-11.232,1,0.038,0.758,0,0.147,0.42,143.994,189027,4
1993-04-10,42,Get Away,Bobby Brown,,False,36,14,13,0.816,0.765,1,-6.538,0,0.0378,0.0264,1.66e-05,0.0389,0.856,111.751,310497,4
1993-04-10,43,Do You Believe In Us,Jon Secada,,False,44,13,29,0.662,0.891,3,-7.245,1,0.0349,0.0103,3.64e-06,0.634,0.743,107.75,239267,4
1993-04-10,44,Who Is It,Michael Jackson,4HWcWgleTuUAWnVPNwW4CM,True,0,44,1,0.861,0.594,5,-4.658,1,0.121,0.0153,0.000326,0.104,0.506,103.159,393307,4
1993-04-10,45,Supermodel (You Better Work),RuPaul,4HWcWgleTuUAWnVPNwW4CM,False,53,45,9,0.792,0.562,7,-11.379,1,0.0929,0.0152,7.48e-05,0.428,0.592,126.222,239933,4
1993-04-10,46,Beautiful Girl,INXS,4HWcWgleTuUAWnVPNwW4CM,False,50,46,8,0.675,0.666,11,-6.067,1,0.027,0.0187,0.692,0.112,0.434,120.558,207547,4
1993-04-10,47,I'm Gonna Get You,Bizarre Inc,4HWcWgleTuUAWnVPNwW4CM,False,52,47,12,0.742,0.734,1,-11.393,1,0.04,0.0153,0.728,0.0493,0.723,126.988,319493,4
1993-04-10,48,Rump Shaker,Wreckx-N-Effect,4HWcWgleTuUAWnVPNwW4CM,False,45,2,28,0.888,0.822,5,-6.843,0,0.219,0.0025,0.0197,0.303,0.233,102.753,312360,4
1993-04-10,49,Dedicated,R. Kelly & Public Announcement,4HWcWgleTuUAWnVPNwW4CM,False,54,49,7,0.677,0.495,8,-10.482,1,0.0263,0.139,8.21e-06,0.0351,0.45,136.136,277907,4
1993-04-10,50,Romeo,Dolly Parton & Friends,4HWcWgleTuUAWnVPNwW4CM,False,55,50,5,0.685,0.661,7,-11.741,1,0.0528,0.241,0,0.0683,0.745,115.862,214027,4
1993-04-10,51,I Feel You,Depeche Mode,4HWcWgleTuUAWnVPNwW4CM,False,46,37,6,0.454,0.933,2,-6.539,1,0.0912,0.024,0.0421,0.493,0.141,122.913,276080,3
1993-04-10,52,Connected,Stereo MC's,4HWcWgleTuUAWnVPNwW4CM,False,69,52,3,0.647,0.798,1,-12.142,0,0.0366,0.0497,0.00235,0.0723,0.709,100.631,314133,4
1993-04-10,53,Hat 2 Da Back,TLC,4HWcWgleTuUAWnVPNwW4CM,False,42,30,10,0.701,0.697,10,-12.643,0,0.0912,0.000888,0.485,0.301,0.617,108.554,256427,4
1993-04-10,54,Three Little Pigs,Green Jelly,4HWcWgleTuUAWnVPNwW4CM,False,66,54,3,0.449,0.95,7,-4.978,1,0.225,0.0115,3.66e-05,0.514,0.339,144.469,353640,4
1993-04-10,55,I See Your Smile,Gloria Estefan,4HWcWgleTuUAWnVPNwW4CM,False,48,48,8,0.403,0.457,9,-8.984,1,0.0272,0.237,0,0.185,0.231,79.188,274133,4
1993-04-10,56,"Tarzan Boy (From ""Teenage Mutant Ninja Turtles III"")",Baltimora,4HWcWgleTuUAWnVPNwW4CM,False,61,13,29,0.684,0.573,5,-12.3,1,0.0261,0.318,0.028,0.306,0.716,107.363,378947,4
1993-04-10,57,How I'm Comin',LL Cool J,4HWcWgleTuUAWnVPNwW4CM,False,57,57,2,0.755,0.974,11,-8.68,1,0.208,0.0605,0,0.323,0.309,97.094,305893,4
1993-04-10,58,Bad Girl,Madonna,4HWcWgleTuUAWnVPNwW4CM,False,39,36,8,0.645,0.484,11,-11.233,0,0.0396,0.0211,3.88e-06,0.0495,0.52,146.897,323333,4
1993-04-10,59,Love Don't Love You,En Vogue,4HWcWgleTuUAWnVPNwW4CM,False,65,59,3,0.832,0.643,5,-6.754,0,0.0302,0.138,7.68e-05,0.246,0.779,107.964,238173,4
1993-04-10,60,Come In Out Of The Rain,Wendy Moten,4HWcWgleTuUAWnVPNwW4CM,False,60,60,8,0.59,0.559,5,-8.916,1,0.0269,0.158,3.96e-06,0.361,0.311,114.327,257800,4
1993-04-10,61,What You Won't Do For Love,Go West,4HWcWgleTuUAWnVPNwW4CM,False,63,61,5,0.59,0.803,4,-7.088,0,0.0485,0.293,1.49e-05,0.0691,0.809,169.127,266800,4
1993-04-10,62,"In The Still Of The Nite (From ""The Jacksons"")",Boyz II Men,4HWcWgleTuUAWnVPNwW4CM,False,51,3,20,0.537,0.184,9,-15.886,1,0.0381,0.792,0,0.126,0.217,77.817,169840,4
1993-04-10,63,The Morning Papers,Prince And The New Power Generation,4HWcWgleTuUAWnVPNwW4CM,False,77,63,2,0.514,0.719,0,-5.381,0,0.0443,0.175,4.09e-05,0.197,0.438,131.635,237373,4
1993-04-10,64,"Give It Up, Turn It Loose",En Vogue,4HWcWgleTuUAWnVPNwW4CM,False,59,15,19,0.836,0.58,1,-8.778,1,0.0692,0.19,0.000271,0.0379,0.939,93.015,312040,4
1993-04-10,65,Buddy X,Neneh Cherry,4HWcWgleTuUAWnVPNwW4CM,False,73,65,3,0.782,0.804,10,-6.895,0,0.0791,9.01e-05,0.298,0.0455,0.573,124.004,392517,4
1993-04-10,66,Easy,Faith No More,4HWcWgleTuUAWnVPNwW4CM,False,58,58,4,0.506,0.554,10,-6.743,0,0.0339,0.339,0.000355,0.112,0.375,124.724,186960,4
1993-04-10,67,Livin' On The Edge,Aerosmith,4avSaixVwu8uqfSs7zgoj3,True,0,67,1,0.399,0.881,2,-4.341,1,0.0347,0.0019,0.00429,0.39,0.272,84.58,380893,4
1993-04-10,68,Tap The Bottle,Young Black Teenagers,4avSaixVwu8uqfSs7zgoj3,False,56,56,6,0.889,0.608,11,-9.396,1,0.287,0.00134,0,0.0852,0.569,104.005,240107,4
1993-04-10,69,Tell Me What You Dream,Restless Heart Featuring Warren Hill,4avSaixVwu8uqfSs7zgoj3,False,71,69,3,0.666,0.464,0,-10.131,0,0.0257,0.117,0.00182,0.328,0.439,94.151,284173,4
1993-04-10,70,Shoop Shoop (Never Stop Givin' You Love),Michael Cooper,4avSaixVwu8uqfSs7zgoj3,False,67,67,5,0.702,0.573,2,-10.421,1,0.0375,0.12,0,0.0893,0.627,136.443,256307,4
1993-04-10,71,Somebody Love Me,Michael W. Smith,4avSaixVwu8uqfSs7zgoj3,False,72,71,5,0.441,0.538,9,-8.597,1,0.0253,0.241,0,0.105,0.302,151.82,238267,4
1993-04-10,72,Closer,Remedy,4avSaixVwu8uqfSs7zgoj3,False,76,72,3,0.513,0.505,7,-11.304,0,0.0356,0.0603,4.03e-06,0.107,0.361,139.651,282320,4
1993-04-10,73,Candy Everybody Wants,"10,000 Maniacs",4avSaixVwu8uqfSs7zgoj3,False,68,68,6,0.622,0.876,10,-6.31,1,0.0305,0.0193,0.00684,0.0987,0.867,104.97,185960,4
1993-04-10,74,Passionate Kisses,Mary Chapin Carpenter,4avSaixVwu8uqfSs7zgoj3,False,62,57,9,0.625,0.819,2,-6.142,1,0.0361,0.589,0,0.201,0.733,139.642,201907,4
1993-04-10,75,Everything's Gonna Be Alright,Father M.C.,4avSaixVwu8uqfSs7zgoj3,False,64,37,19,0.796,0.735,6,-6.998,0,0.205,0.221,0,0.685,0.806,108.234,223840,4
1993-04-10,76,She's Not Cryin' Anymore,Billy Ray Cyrus,4avSaixVwu8uqfSs7zgoj3,False,70,70,5,0.611,0.309,2,-12.084,1,0.0246,0.344,1.82e-06,0.338,0.606,88.556,205773,4
1993-04-10,77,I'll Never Get Over You (Getting Over Me),Expose,4avSaixVwu8uqfSs7zgoj3,False,82,77,3,0.323,0.311,8,-12.671,1,0.0312,0.643,0,0.349,0.146,166.943,230933,4
1993-04-10,78,Good Ol' Days,Levert,4avSaixVwu8uqfSs7zgoj3,False,80,78,4,0.651,0.753,7,-9.143,1,0.0456,0.216,0.000119,0.105,0.915,87.052,245133,4
1993-04-10,79,Tonight,Def Leppard,4avSaixVwu8uqfSs7zgoj3,False,91,79,2,0.477,0.607,2,-8.768,1,0.0262,0.0816,5.21e-06,0.113,0.534,176.09,243321,4
1993-04-10,80,Typical Reasons (Swing My Way),Prince Markie Dee And The Soul Convention,4avSaixVwu8uqfSs7zgoj3,False,94,80,2,0.674,0.565,1,-13.902,1,0.0537,0.161,0,0.0939,0.827,102.556,267812,4
1993-04-10,81,Show Me Love,Robin S.,4avSaixVwu8uqfSs7zgoj3,False,95,81,2,0.811,0.833,5,-4.259,1,0.153,0.014,2.06e-05,0.0769,0.567,120.258,252107,4
1993-04-10,82,If I Could,Regina Belle,4avSaixVwu8uqfSs7zgoj3,False,98,82,2,0.264,0.534,5,-7.4,1,0.0331,0.153,0,0.347,0.158,81.516,240267,4
1993-04-10,83,Funky Child,Lords Of The Underground,4avSaixVwu8uqfSs7zgoj3,False,84,83,3,0.859,0.635,10,-9.532,0,0.193,0.0356,0.00346,0.13,0.53,96.571,271067,4
1993-04-10,84,Touch My Light,Big Mountain,0iUdZc9LHtkIwLjStiG6Le,True,0,84,1,0.711,0.805,2,-5.329,1,0.0862,0.285,3.21e-05,0.214,0.576,77.995,256923,4
1993-04-10,86,Kiss Of Life,Sade,,False,83,83,4,0.723,0.47,6,-11.302,0,0.028,0.633,0.0373,0.0968,0.783,97.107,251333,4
1993-04-10,87,Murder She Wrote,Chaka Demus & Pliers,,False,75,57,15,0.883,0.733,11,-9.153,0,0.128,0.161,0.00026,0.334,0.947,95.103,245000,4
1993-04-10,88,Reminisce,Mary J. Blige,,False,90,57,17,0.647,0.699,9,-8.122,0,0.0668,0.0397,3.15e-05,0.154,0.53,91.435,323133,4
1993-04-10,89,Save Your Love,Bad Boys Blue,,False,89,81,5,0.552,0.87,7,-10.393,0,0.0348,0.0026,0.0282,0.153,0.905,122.018,243333,4
1993-04-10,90,Knock-N-Boots,Wreckx-N-Effect,,False,87,72,8,0.849,0.848,8,-5.636,0,0.284,0.149,0,0.0746,0.626,103.778,291027,4
1993-04-10,91,Knockin' Da Boots,H-Town,6x53SJOV1PAZ8ZUwH4NFXQ,True,0,91,1,0.726,0.501,1,-13.884,0,0.154,0.155,0,0.0893,0.582,128.099,330945,4
1993-04-10,92,Love Me Or Leave Me Alone,Brand Nubian,6x53SJOV1PAZ8ZUwH4NFXQ,False,92,92,2,0.748,0.626,6,-12.123,0,0.157,0.0284,9.52e-05,0.0796,0.602,97.666,275600,4
1993-04-10,93,Throw Ya Gunz,Onyx,6x53SJOV1PAZ8ZUwH4NFXQ,False,81,81,2,0.824,0.595,1,-11.954,1,0.283,0.00212,0,0.106,0.711,93.993,196373,4
1993-04-10,94,Tell The Truth,Jude Cole,6x53SJOV1PAZ8ZUwH4NFXQ,False,85,57,12,0.532,0.609,10,-9.312,1,0.0268,0.145,1.49e-06,0.059,0.426,79.877,327267,4
1993-04-10,95,Homies,Lighter Shade Of Brown,6x53SJOV1PAZ8ZUwH4NFXQ,False,74,57,18,0.779,0.386,7,-14.384,1,0.301,0.221,0.00071,0.115,0.376,193.574,211800,4
1993-04-10,96,Born 2 B.R.E.E.D.,Monie Love,6x53SJOV1PAZ8ZUwH4NFXQ,False,93,89,5,0.633,0.827,5,-8.859,0,0.125,0.338,2.16e-05,0.335,0.807,102.879,233093,4
1993-04-10,98,No Mistakes,Patty Smyth,,False,88,33,16,0.691,0.6,9,-9.015,1,0.026,0.0364,0,0.174,0.518,111.366,323427,4
1993-04-10,99,Little Bird,Annie Lennox,,False,79,49,12,0.767,0.521,9,-9.145,1,0.0351,0.247,0.00124,0.303,0.672,124.995,292426,4
