date,position,title,artist,spotify_id,is_new,last_pos,peak_pos,weeks,danceability,energy,key,loudness,mode,speechiness,acousticness,instrumentalness,liveness,valence,tempo,duration_ms,time_signature
1991-06-08,1,More Than Words,Extreme,4hAx5iTGvFrF7GxyFyLvJR,False,2,1,12,0.626,0.134,6,-14.898,1,0.0298,0.467,0,0.113,0.239,91.893,334107,4
1991-06-08,2,"I Wanna Sex You Up (From ""New Jack City"")",Color Me Badd,4hAx5iTGvFrF7GxyFyLvJR,False,3,2,10,0.551,0.591,6,-8.404,0,0.12,0.00549,6.55e-06,0.0416,0.474,201.81,236947,4
1991-06-08,3,Rush Rush,Paula Abdul,4hAx5iTGvFrF7GxyFyLvJR,False,5,3,5,0.706,0.44,4,-11.577,1,0.0493,0.763,0,0.0958,0.395,90.012,292933,4
1991-06-08,4,I Don't Wanna Cry,Mariah Carey,4hAx5iTGvFrF7GxyFyLvJR,False,1,1,10,0.641,0.504,7,-12.486,1,0.031,0.197,9.62e-05,0.288,0.275,130.786,288827,4
1991-06-08,5,Love Is A Wonderful Thing,Michael Bolton,4hAx5iTGvFrF7GxyFyLvJR,False,4,4,8,0.727,0.824,2,-8.915,1,0.0394,0.00812,1.58e-06,0.0922,0.935,125.104,282933,4
1991-06-08,6,Losing My Religion,R.E.M.,4hAx5iTGvFrF7GxyFyLvJR,False,7,6,10,0.666,0.855,9,-5.051,0,0.0295,0.179,1.2e-06,0.0987,0.803,125.639,268427,4
1991-06-08,7,I Like The Way (The Kissing Game),Hi-Five,4hAx5iTGvFrF7GxyFyLvJR,False,6,1,16,0.724,0.692,1,-5.109,1,0.0333,0.0595,0.0108,0.0316,0.732,104.086,350267,4
1991-06-08,8,Unbelievable,EMF,4hAx5iTGvFrF7GxyFyLvJR,False,12,8,9,0.637,0.849,1,-6.855,1,0.0362,0.000341,0.0386,0.141,0.936,104.074,209813,4
1991-06-08,9,Miracle,Whitney Houston,4hAx5iTGvFrF7GxyFyLvJR,False,11,9,9,0.627,0.55,6,-9.52,1,0.0242,0.273,7.87e-06,0.262,0.5,111.003,342667,4
1991-06-08,10,Power Of Love/Love Power,Luther Vandross,4hAx5iTGvFrF7GxyFyLvJR,False,17,10,7,0.602,0.911,0,-6.615,1,0.0387,0.0174,3.47e-05,0.0735,0.851,92.357,402413,4
1991-06-08,11,Strike It Up,Black Box,4hAx5iTGvFrF7GxyFyLvJR,False,16,11,10,0.875,0.862,6,-7.694,0,0.062,0.0116,0.000281,0.0658,0.915,118.398,298691,4
1991-06-08,12,Silent Lucidity,Queensryche,4hAx5iTGvFrF7GxyFyLvJR,False,9,9,12,0.462,0.628,7,-5.659,1,0.0274,0.0534,0.00025,0.12,0.0981,140.049,347760,4
1991-06-08,13,Touch Me (All Night Long),Cathy Dennis,4hAx5iTGvFrF7GxyFyLvJR,False,8,2,15,0.656,0.773,10,-10.309,0,0.0328,0.00293,0.0651,0.316,0.473,118.01,208867,4
1991-06-08,14,Rhythm Of My Heart,Rod Stewart,4hAx5iTGvFrF7GxyFyLvJR,False,10,5,13,0.582,0.54,1,-11.021,1,0.0321,0.0621,0,0.178,0.433,94.955,254867,4
1991-06-08,15,Couple Days Off,Huey Lewis & The News,4hAx5iTGvFrF7GxyFyLvJR,False,20,15,7,0.464,0.939,9,-4.906,1,0.0582,0.000554,0,0.0633,0.623,162.251,196813,4
1991-06-08,16,Written All Over Your Face,The Rude Boys,4hAx5iTGvFrF7GxyFyLvJR,False,18,16,14,0.769,0.724,2,-6.374,1,0.0601,0.178,0,0.215,0.746,133.957,383600,4
1991-06-08,17,Playground,Another Bad Creation,4hAx5iTGvFrF7GxyFyLvJR,False,23,17,7,0.788,0.774,6,-11.399,1,0.111,0.101,0,0.94,0.784,110.491,249836,4
1991-06-08,19,Baby Baby,Amy Grant,,False,15,1,16,0.702,0.901,1,-4.45,1,0.0264,0.426,0.00153,0.0368,0.919,97.862,236973,4
1991-06-08,20,Don't Treat Me Bad,Firehouse,,False,19,19,14,0.616,0.807,8,-11.4,1,0.0348,0.000303,2.37e-05,0.193,0.637,111.054,235360,4
1991-06-08,21,I Touch Myself,Divinyls,,False,13,4,14,0.66,0.711,5,-10.211,1,0.0334,0.181,7.47e-06,0.0647,0.726,109.328,227640,4
1991-06-08,22,Mama Said Knock You Out,LL Cool J,,False,25,22,9,0.791,0.759,10,-7.378,0,0.129,0.0314,0.674,0.255,0.619,102.382,289693,4
1991-06-08,23,"Right Here, Right Now",Jesus Jones,,False,29,23,9,0.657,0.608,2,-13.565,1,0.0287,0.0088,3.45e-06,0.103,0.723,106.862,189293,4
1991-06-08,24,Do You Want Me,Salt-N-Pepa,,False,26,24,12,0.899,0.451,11,-14.009,0,0.0511,0.0756,3.22e-05,0.044,0.973,121.575,232267,4
1991-06-08,25,Here I Am (Come And Take Me),UB40,,False,27,25,12,0.802,0.621,5,-7.932,0,0.0377,0.0975,0.0256,0.0627,0.81,95.906,242093,4
1991-06-08,26,We Want The Funk,Gerardo,,False,31,26,6,0.771,0.852,9,-9.335,1,0.0882,0.0046,0,0.312,0.774,106.607,251093,4
1991-06-08,27,Walking In Memphis,Marc Cohn,,False,30,27,11,0.567,0.512,0,-8.831,1,0.0357,0.545,0,0.296,0.334,130.271,252613,4
1991-06-08,28,What Comes Naturally,Sheena Easton,,False,22,19,11,0.785,0.914,2,-7.102,0,0.0536,0.241,0,0.243,0.808,104.893,270730,4
1991-06-08,29,Joyride,Roxette,,False,21,1,15,0.631,0.77,2,-5.315,1,0.0267,0.0457,0,0.481,0.734,102.348,263093,4
1991-06-08,30,Love At First Sight,Styx,,False,32,30,10,0.62,0.608,10,-8.665,1,0.0294,0.318,0,0.0809,0.566,115.826,276440,4
1991-06-08,31,How Can I Ease The Pain,Lisa Fischer,,False,34,31,9,0.634,0.577,4,-7.579,0,0.0303,0.143,1.78e-05,0.183,0.4,116.212,319880,4
1991-06-08,32,Gypsy Woman (She's Homeless),Crystal Waters,,False,37,32,6,0.484,0.641,5,-12.612,1,0.0377,0.000779,0.278,0.0738,0.181,119.981,451827,4
1991-06-08,33,Place In This World,Michael W. Smith,,False,42,33,6,0.446,0.559,4,-8.319,1,0.0285,0.388,1.78e-05,0.153,0.372,145.419,240173,4
1991-06-08,34,I'll Never Let You Go,Steelheart,,False,39,34,13,0.341,0.651,1,-9.829,1,0.0423,0.0119,0.148,0.0875,0.31,143.934,306560,4
1991-06-08,35,Never Gonna Let You Down,Surface,,False,40,35,7,0.56,0.363,3,-11.9,1,0.0307,0.55,0,0.205,0.186,124.45,227227,4
1991-06-08,36,You Don't Have To Go Home Tonight,The Triplets,,False,24,14,13,0.575,0.874,9,-7.352,1,0.0446,0.00527,0,0.167,0.61,132.418,239333,4
1991-06-08,37,A Better Love,Londonbeat,,False,45,37,5,0.616,0.6,9,-14.772,1,0.0331,0.0944,0.000121,0.336,0.792,95.743,240400,4
1991-06-08,38,Piece Of My Heart,Tara Kemp,,False,48,38,5,0.536,0.823,1,-10.696,1,0.0687,0.111,0.000432,0.0543,0.916,200.128,289740,4
1991-06-08,39,Voices That Care,Voices That Care,,False,33,11,13,0.471,0.289,3,-13.061,1,0.0266,0.873,0.562,0.0997,0.255,150.415,285000,4
1991-06-08,41,(If There Was) Any Other Way,Celine Dion,,False,35,35,10,0.615,0.467,1,-9.883,1,0.0327,0.314,0,0.099,0.177,119.919,273667,4
1991-06-08,42,My Heart Is Failing Me,Riff,,False,28,25,12,0.617,0.578,6,-10.632,1,0.0255,0.173,0,0.129,0.518,90.502,260133,4
1991-06-08,43,Does Anybody Really Fall In Love Anymore?,Kane Roberts,,False,49,43,7,0.38,0.657,5,-8.379,1,0.0329,0.0537,0.000239,0.0808,0.547,176.676,265430,4
1991-06-08,44,Dream Lover,The Rebel Pebbles,,False,47,44,8,0.528,0.819,4,-8.211,1,0.0389,0.00911,2.68e-05,0.322,0.757,140.055,237293,4
1991-06-08,45,People Are Still Having Sex,LaTour,,False,43,35,10,0.849,0.694,11,-10.677,0,0.0402,5.91e-05,0.845,0.0362,0.857,125.095,316467,4
1991-06-08,46,Cry For Help,Rick Astley,,False,41,7,17,0.564,0.628,0,-6.933,1,0.0221,0.522,0,0.0891,0.462,89.977,245640,4
1991-06-08,47,More Than Ever,Nelson,,False,36,14,14,0.509,0.876,0,-6.535,1,0.037,0.0393,0,0.437,0.532,97.281,208964,4
1991-06-08,48,She Talks To Angels,The Black Crowes,,False,38,30,13,0.584,0.521,4,-5.782,1,0.0295,0.06,7.56e-05,0.22,0.317,160.058,329400,4
1991-06-08,49,P.A.S.S.I.O.N.,Rhythm Syndicate,,False,73,49,2,0.737,0.753,2,-8.416,0,0.0399,0.0135,0.0562,0.0738,0.562,110.89,217993,4
1991-06-08,50,The Dream Is Still Alive,Wilson Phillips,,False,71,50,2,0.582,0.676,5,-7.496,1,0.0265,0.303,0,0.234,0.496,108.291,248800,4
1991-06-08,51,Temptation,Corina,,False,61,51,4,0.609,0.771,7,-10.663,1,0.0428,0.000274,0.05,0.038,0.565,118.352,241533,4
1991-06-08,53,See The Lights,Simple Minds,,False,59,53,4,0.569,0.559,1,-8.459,1,0.0283,0.0218,0.241,0.215,0.201,125.089,261875,4
1991-06-08,54,Life Goes On,Poison,,False,58,54,6,0.404,0.779,1,-3.199,1,0.0298,0.0181,0.00139,0.0929,0.373,78.838,287533,4
1991-06-08,55,You Can't Play With My Yo-Yo,Yo-Yo Featuring Ice Cube,,False,70,55,3,0.739,0.758,9,-6.128,0,0.217,0.0999,0,0.0781,0.765,96.717,304667,4
1991-06-08,56,I'll Be There,The Escape Club,,False,65,56,3,0.57,0.385,1,-12.027,0,0.0251,0.383,0.0012,0.0924,0.188,99.86,347867,4
1991-06-08,57,Come Again,Damn Yankees,,False,50,50,8,0.222,0.681,9,-10.832,0,0.0469,0.126,8.03e-05,0.128,0.388,130.689,339560,4
1991-06-08,58,It's A Shame (My Sister),Monie Love Featuring True Image,,False,46,26,13,0.858,0.609,1,-10.695,1,0.113,0.0542,9.04e-05,0.315,0.478,107.978,222840,4
1991-06-08,59,Exclusivity,Damian Dame,,False,66,59,4,0.728,0.803,11,-10.57,0,0.0568,0.0211,1.18e-05,0.0267,0.791,104.179,299667,4
1991-06-08,60,"Part Of Me, Part Of You",Glenn Frey,,False,57,57,5,0.663,0.694,9,-8.333,1,0.0282,0.0494,3.41e-05,0.0581,0.401,127.305,358000,4
1991-06-08,61,Kissing You,Keith Washington,,False,76,61,3,0.494,0.495,7,-8.855,1,0.0312,0.184,0,0.127,0.233,126.515,260013,4
1991-06-08,62,Save Some Love,Keedy,,False,44,15,13,0.67,0.558,5,-12.301,1,0.0335,0.0578,0.00311,0.322,0.738,119.887,257180,4
1991-06-08,63,This Time Make It Funky,Tracie Spencer,,False,67,63,4,0.776,0.83,0,-9.532,1,0.0812,0.0269,0.00267,0.0416,0.792,113.624,326400,4
1991-06-08,64,It Ain't Over 'til It's Over,Lenny Kravitz,6VnpKLtfNH4Dk09YSGPSyR,True,0,64,1,0.679,0.568,6,-10.74,1,0.0423,0.422,0.00928,0.322,0.93,159.69,242640,4
1991-06-08,65,Kisses In The Night,Brandon,6VnpKLtfNH4Dk09YSGPSyR,False,68,65,5,0.787,0.699,10,-12.66,0,0.0858,0.277,0.122,0.104,0.551,119.267,573720,4
1991-06-08,66,Over And Over,Timmy T.,6VnpKLtfNH4Dk09YSGPSyR,False,63,63,5,0.656,0.995,5,-2.332,0,0.0765,0.00334,0.486,0.106,0.168,150.012,275200,4
1991-06-08,67,I've Been Thinking About You,Londonbeat,6VnpKLtfNH4Dk09YSGPSyR,False,51,1,18,0.63,0.595,11,-14.986,0,0.038,0.0434,0.0363,0.0902,0.878,113.561,317933,4
1991-06-08,68,Whatever You Want,Tony Toni Tone,6VnpKLtfNH4Dk09YSGPSyR,False,55,48,9,0.694,0.47,6,-13.302,1,0.0315,0.0438,0,0.0557,0.754,77.967,290933,4
1991-06-08,69,Hold You Tight,Tara Kemp,6VnpKLtfNH4Dk09YSGPSyR,False,60,3,21,0.739,0.675,1,-9.194,1,0.0444,0.0545,0.0112,0.0632,0.643,100.054,284345,4
1991-06-08,70,Round And Round,Tevin Campbell,6VnpKLtfNH4Dk09YSGPSyR,False,64,12,27,0.79,0.591,7,-8.805,1,0.0935,0.00335,0.00733,0.0338,0.725,107.197,293053,4
1991-06-08,71,I Don't Want To Lose Your Love,B Angie B,6VnpKLtfNH4Dk09YSGPSyR,False,56,54,7,0.698,0.831,1,-3.999,1,0.0394,0.00159,0.00197,0.297,0.32,124.937,269573,4
1991-06-08,72,You're In Love,Wilson Phillips,6VnpKLtfNH4Dk09YSGPSyR,False,53,1,18,0.688,0.679,1,-11.05,0,0.0259,0.319,0.000301,0.29,0.536,101.872,291867,4
1991-06-08,73,"Nights Like This (From ""The Five Heartbeats"")",After 7,6VnpKLtfNH4Dk09YSGPSyR,False,74,73,3,0.707,0.644,8,-7.017,1,0.0287,0.174,0,0.069,0.576,97.127,242000,4
1991-06-08,74,Higher Than Hope,Daryl Braithwaite,6VnpKLtfNH4Dk09YSGPSyR,False,78,74,2,0.705,0.635,1,-11.835,1,0.0369,0.0268,0.000518,0.104,0.599,109.99,299667,4
1991-06-08,76,Where The Streets Have No Name,Pet Shop Boys,,False,83,76,3,0.493,0.978,0,-6.37,0,0.0763,0.0115,0.154,0.109,0.183,128.288,272373,4
1991-06-08,77,Elevate My Mind,Stereo MC's,,False,88,77,2,0.845,0.591,9,-14.87,1,0.0627,0.137,0.65,0.129,0.765,115.139,196827,4
1991-06-08,78,Feel The Groove,Cartouche,,False,75,66,9,0.792,0.873,8,-11.034,0,0.0627,0.000429,0.39,0.183,0.667,123.019,340000,4
1991-06-08,79,Wind Of Change,Scorpions,,False,91,79,2,0.452,0.524,0,-10.108,1,0.0351,0.315,0,0.103,0.246,151.505,312360,4
1991-06-08,80,Iesha,Another Bad Creation,,False,62,9,22,0.751,0.761,8,-8.151,1,0.147,0.0145,2.96e-06,0.0305,0.661,111.819,260400,4
1991-06-08,82,Love Desire,Sandee,,False,89,82,2,0.837,0.549,2,-12.576,1,0.0502,0.0819,0.0501,0.115,0.707,106.996,332493,4
1991-06-08,83,"Just The Way It Is, Baby",The Rembrandts,,False,72,14,18,0.793,0.612,3,-8.711,1,0.0295,0.329,2.72e-06,0.0764,0.822,110.738,243893,4
1991-06-08,84,Dirty Love,Thunder,,False,95,84,2,0.459,0.935,6,-10.083,0,0.0423,0.00853,0.000176,0.171,0.778,119.111,315587,4
1991-06-08,85,My Body Says Yes,Titiyo,0xmNtl2Ih0jomhIO993E9w,True,0,85,1,0.751,0.558,7,-14.87,1,0.0486,0.00581,3.77e-05,0.3,0.88,113.365,249867,4
1991-06-08,86,"New Jack Hustler (Nino's Theme) (From ""New Jack City"")",Ice-T,0xmNtl2Ih0jomhIO993E9w,False,79,67,7,0.83,0.859,7,-9.213,1,0.124,0.000971,0,0.214,0.654,109.321,283307,4
1991-06-08,87,Forever Amo'r,D'zyre,6Dy9ADyJYhwUT2wVqBRqBD,True,0,87,1,0.762,0.955,9,-4.35,0,0.0501,0.143,0.0181,0.0889,0.891,116.944,115093,4
1991-06-08,88,Someone,The Rembrandts,6Dy9ADyJYhwUT2wVqBRqBD,False,93,88,3,0.48,0.53,11,-7.214,1,0.0258,0.406,0,0.18,0.532,79.598,229707,4
1991-06-08,89,Lift Me Up,Yes,6Dy9ADyJYhwUT2wVqBRqBD,False,90,89,2,0.518,0.82,9,-7.988,1,0.0329,0.184,1.53e-05,0.168,0.474,92.189,390307,4
1991-06-08,90,Can't Forget You,Gloria Estefan,10gSqWsX6e6pVplEG2ovYt,True,0,90,1,0.565,0.426,2,-10.705,1,0.0343,0.339,0,0.365,0.28,142.179,254173,4
1991-06-08,91,Together Forever,Lisette Melendez,10gSqWsX6e6pVplEG2ovYt,False,87,35,19,0.682,0.963,11,-4.046,1,0.057,0.0186,0.0719,0.344,0.71,118.937,345800,4
1991-06-08,93,Crazy,Daisy Dee,,False,84,73,11,0.748,0.96,4,-7.475,0,0.0561,0.000815,0.00229,0.033,0.754,124.571,332787,4
1991-06-08,94,Surrender,Trixter,4EEAHK0c3M7CCgcQt9bfts,True,0,94,1,0.577,0.385,3,-14.092,1,0.0372,0.0267,3.04e-05,0.27,0.203,125.917,350960,4
1991-06-08,95,Mercy Mercy Me (The Ecology)/I Want You,Robert Palmer,4EEAHK0c3M7CCgcQt9bfts,False,80,16,17,0.584,0.949,1,-7.673,0,0.0465,0.197,0.00163,0.0738,0.854,99.061,357347,4
1991-06-08,96,How Much Is Enough,The Fixx,4EEAHK0c3M7CCgcQt9bfts,False,69,35,11,0.627,0.918,0,-8.268,1,0.0585,0.119,2.19e-06,0.173,0.655,110.929,230560,4
1991-06-08,97,One More Try,Timmy T.,4EEAHK0c3M7CCgcQt9bfts,False,86,1,25,0.641,0.573,9,-9.198,1,0.0485,0.191,0,0.317,0.5,149.826,209427,5
1991-06-08,98,Something In My Heart,Michel'le,4EEAHK0c3M7CCgcQt9bfts,False,92,31,22,0.698,0.434,8,-12.892,0,0.0272,0.166,0.000566,0.0658,0.386,130.295,353000,4
1991-06-08,99,Sadeness Part 1,Enigma,4EEAHK0c3M7CCgcQt9bfts,False,81,5,18,0.607,0.478,7,-13.677,1,0.0354,0.0866,0.106,0.0983,0.51,95.721,260400,4
1991-06-08,100,Bitter Tears,INXS,4EEAHK0c3M7CCgcQt9bfts,False,82,46,10,0.579,0.925,0,-2.217,1,0.044,0.155,8.85e-06,0.234,0.815,114.288,228820,4
