date,position,title,artist,spotify_id,is_new,last_pos,peak_pos,weeks,danceability,energy,key,loudness,mode,speechiness,acousticness,instrumentalness,liveness,valence,tempo,duration_ms,time_signature
2008-05-03,1,Lollipop,Lil Wayne Featuring Static Major,6JH9yWhgbm0y9iAJhCslNc,False,2,1,6,0.829,0.428,0,-9.469,1,0.0831,0.056,0.00413,0.137,0.45,148.075,299333,4
2008-05-03,2,Bleeding Love,Leona Lewis,6JH9yWhgbm0y9iAJhCslNc,False,1,1,10,0.638,0.656,5,-5.886,1,0.0357,0.188,0,0.146,0.225,104.036,262467,4
2008-05-03,3,No Air,Jordin Sparks Duet With Chris Brown,6JH9yWhgbm0y9iAJhCslNc,False,3,3,16,0.475,0.501,11,-5.125,1,0.0309,0.715,0,0.0666,0.371,159.972,253693,4
2008-05-03,4,Love In This Club,Usher Featuring Young Jeezy,6JH9yWhgbm0y9iAJhCslNc,False,4,1,10,0.573,0.712,0,-5.976,1,0.0732,0.0572,0,0.167,0.346,140.012,259720,4
2008-05-03,5,Touch My Body,Mariah Carey,6JH9yWhgbm0y9iAJhCslNc,False,5,1,10,0.714,0.665,4,-7.736,0,0.0509,0.0996,0,0.226,0.842,78.515,204733,4
2008-05-03,6,4 Minutes,Madonna Featuring Justin Timberlake & Timbaland,6JH9yWhgbm0y9iAJhCslNc,False,7,3,5,0.753,0.931,2,-4.922,1,0.0652,0.00994,0.00696,0.234,0.767,113.029,189693,4
2008-05-03,7,Sexy Can I,Ray J & Yung Berg,6JH9yWhgbm0y9iAJhCslNc,False,6,3,12,0.575,0.686,1,-6.008,1,0.319,0.296,0,0.617,0.926,172.167,204040,4
2008-05-03,8,Love Song,Sara Bareilles,6JH9yWhgbm0y9iAJhCslNc,False,9,4,25,0.583,0.786,2,-3.142,0,0.0301,0.0208,0,0.188,0.573,123.055,258827,4
2008-05-03,9,With You,Chris Brown,6JH9yWhgbm0y9iAJhCslNc,False,8,2,21,0.662,0.693,3,-4.298,1,0.0698,0.134,0,0.145,0.655,86.009,252120,4
2008-05-03,10,See You Again,Miley Cyrus,6JH9yWhgbm0y9iAJhCslNc,False,11,10,20,0.692,0.911,9,-5.098,0,0.177,0.015,7.71e-05,0.112,0.8,138.975,190453,4
2008-05-03,11,Low,Flo Rida Featuring T-Pain,6JH9yWhgbm0y9iAJhCslNc,False,10,1,26,0.918,0.609,10,-5.64,0,0.0791,0.0928,0,0.139,0.304,128.008,231400,4
2008-05-03,12,Say,John Mayer,6JH9yWhgbm0y9iAJhCslNc,False,35,12,15,0.485,0.723,10,-6.565,1,0.0317,0.541,1.12e-06,0.075,0.541,167.845,230213,4
2008-05-03,13,Don't Stop The Music,Rihanna,6JH9yWhgbm0y9iAJhCslNc,False,12,3,22,0.835,0.669,6,-5.582,0,0.0643,0.0336,6.92e-05,0.0535,0.542,122.668,267080,4
2008-05-03,14,Damaged,Danity Kane,6JH9yWhgbm0y9iAJhCslNc,False,20,14,6,0.774,0.653,8,-5.158,0,0.05,0.0912,0,0.151,0.818,120.01,244267,4
2008-05-03,15,Stop And Stare,OneRepublic,6JH9yWhgbm0y9iAJhCslNc,False,13,12,19,0.492,0.859,4,-4.274,1,0.0332,0.0659,0,0.0756,0.251,92.474,223853,4
2008-05-03,16,Pocketful Of Sunshine,Natasha Bedingfield,6JH9yWhgbm0y9iAJhCslNc,False,25,16,10,0.721,0.88,9,-3.896,0,0.0454,0.191,0,0.0769,0.655,110.021,202907,4
2008-05-03,17,The Boss,Rick Ross Featuring T-Pain,6JH9yWhgbm0y9iAJhCslNc,False,21,17,10,0.423,0.842,7,-4.072,1,0.357,0.00876,0,0.309,0.611,83.59,225653,4
2008-05-03,18,Apologize,Timbaland Featuring OneRepublic,6JH9yWhgbm0y9iAJhCslNc,False,14,2,38,0.657,0.609,8,-6.025,1,0.0291,0.0357,0,0.0973,0.0893,118.013,184400,4
2008-05-03,19,Independent,Webbie Featuring Lil' Phat & Lil' Boosie,6JH9yWhgbm0y9iAJhCslNc,False,17,9,22,0.725,0.431,1,-5.988,0,0.0707,0.00113,0,0.14,0.199,174.083,250027,4
2008-05-03,20,Sorry,Buckcherry,6JH9yWhgbm0y9iAJhCslNc,False,19,9,20,0.54,0.773,2,-3.627,1,0.0288,0.0315,0,0.176,0.381,130.952,228387,4
2008-05-03,21,No One,Alicia Keys,6JH9yWhgbm0y9iAJhCslNc,False,15,1,33,0.644,0.548,1,-5.416,0,0.0286,0.0209,8.68e-06,0.134,0.166,90.042,253813,4
2008-05-03,22,Superstar,Lupe Fiasco Featuring Matthew Santos,6JH9yWhgbm0y9iAJhCslNc,False,16,10,19,0.572,0.822,11,-6.015,0,0.361,0.207,0,0.359,0.472,94.812,289000,4
2008-05-03,23,Bye Bye,Mariah Carey,7q587HLz90L2PFrhKZjIYa,True,0,23,1,0.788,0.585,10,-4.884,1,0.0558,0.297,0,0.346,0.84,136.003,266827,4
2008-05-03,24,You're Gonna Miss This,Trace Adkins,7q587HLz90L2PFrhKZjIYa,False,22,12,12,0.5,0.665,8,-7.157,1,0.0355,0.0237,6.41e-05,0.0994,0.32,154.997,224960,4
2008-05-03,25,Elevator,Flo Rida Featuring Timbaland,7q587HLz90L2PFrhKZjIYa,False,23,16,10,0.812,0.874,6,-6.015,0,0.0905,0.109,2.48e-05,0.214,0.47,120.025,229973,4
2008-05-03,26,Feels Like Tonight,Daughtry,7q587HLz90L2PFrhKZjIYa,False,24,24,13,0.483,0.907,6,-3.166,1,0.045,0.000822,0,0.117,0.352,130.984,238701,4
2008-05-03,27,She Got It,2 Pistols Featuring T-Pain & Tay Dizm,7q587HLz90L2PFrhKZjIYa,False,26,24,10,0.53,0.745,10,-6.19,0,0.106,0.00436,0,0.345,0.269,134.068,274053,4
2008-05-03,28,Our Song,Taylor Swift,7q587HLz90L2PFrhKZjIYa,False,28,16,30,0.668,0.672,2,-4.931,1,0.0303,0.111,0,0.329,0.539,89.011,201107,4
2008-05-03,29,Picture To Burn,Taylor Swift,7q587HLz90L2PFrhKZjIYa,False,36,29,10,0.658,0.877,7,-2.098,1,0.0323,0.173,0,0.0962,0.821,105.586,173067,4
2008-05-03,30,Just Got Started Lovin' You,James Otto,7q587HLz90L2PFrhKZjIYa,False,30,30,9,0.705,0.606,7,-7.047,1,0.0243,0.159,0.00149,0.242,0.876,98.001,234640,4
2008-05-03,31,What You Got,Colby O'Donis Featuring Akon,7q587HLz90L2PFrhKZjIYa,False,33,31,8,0.775,0.641,1,-6.718,1,0.038,0.0327,0,0.18,0.305,119.974,243013,4
2008-05-03,32,Bust It Baby Part 2,Plies Featuring Ne-Yo,7q587HLz90L2PFrhKZjIYa,False,38,32,4,0.713,0.548,8,-11.495,1,0.052,0.052,0,0.239,0.927,158.025,235506,4
2008-05-03,33,I Saw God Today,George Strait,7q587HLz90L2PFrhKZjIYa,False,34,33,9,0.588,0.587,3,-6.89,1,0.0302,0.599,0,0.162,0.381,147.897,203200,4
2008-05-03,34,Realize,Colbie Caillat,7q587HLz90L2PFrhKZjIYa,False,42,34,11,0.693,0.594,1,-6.408,1,0.0325,0.13,0,0.115,0.192,123.932,244107,4
2008-05-03,35,Whatever It Takes,Lifehouse,7q587HLz90L2PFrhKZjIYa,False,39,35,14,0.439,0.874,0,-4.165,1,0.0299,0.00571,0,0.176,0.527,150.036,207240,4
2008-05-03,36,Bubbly,Colbie Caillat,7q587HLz90L2PFrhKZjIYa,False,37,5,43,0.697,0.474,9,-6.663,1,0.0351,0.603,0,0.11,0.249,127.904,196280,4
2008-05-03,37,Paralyzer,Finger Eleven,7q587HLz90L2PFrhKZjIYa,False,31,6,46,0.644,0.939,11,-3.486,0,0.0456,0.157,0,0.233,0.861,106.031,208107,4
2008-05-03,38,Teardrops On My Guitar,Taylor Swift,7q587HLz90L2PFrhKZjIYa,False,29,13,46,0.621,0.417,10,-6.941,1,0.0231,0.288,0,0.119,0.289,99.953,203040,4
2008-05-03,39,Killa,Cherish Featuring Yung Joc,7q587HLz90L2PFrhKZjIYa,False,40,39,11,0.796,0.705,5,-4.82,0,0.0358,0.0332,2.14e-06,0.0809,0.774,113.964,228973,4
2008-05-03,40,Party People,Nelly Featuring Fergie,7q587HLz90L2PFrhKZjIYa,False,81,40,4,0.64,0.849,1,-3.994,1,0.357,0.354,0,0.587,0.666,163.925,238573,4
2008-05-03,41,I'm Still A Guy,Brad Paisley,7q587HLz90L2PFrhKZjIYa,False,54,41,6,0.494,0.599,2,-6.836,1,0.0316,0.104,0,0.0882,0.457,163.729,248787,3
2008-05-03,42,Tattoo,Jordin Sparks,7q587HLz90L2PFrhKZjIYa,False,32,8,30,0.566,0.766,2,-5.036,1,0.0399,0.431,0,0.101,0.547,168.005,233467,4
2008-05-03,43,What About Now,Daughtry,7q587HLz90L2PFrhKZjIYa,False,18,18,2,0.387,0.862,9,-2.219,0,0.0457,0.107,0,0.103,0.337,161.984,251627,4
2008-05-03,44,The Way That I Love You,Ashanti,7q587HLz90L2PFrhKZjIYa,False,53,44,7,0.544,0.895,3,-4.124,0,0.114,0.0188,0.00132,0.0571,0.463,79.788,267680,4
2008-05-03,45,Like You'll Never See Me Again,Alicia Keys,7q587HLz90L2PFrhKZjIYa,False,41,12,24,0.562,0.658,7,-8.072,1,0.0314,0.174,0.000285,0.102,0.268,127.81,315360,4
2008-05-03,46,Break The Ice,Britney Spears,7q587HLz90L2PFrhKZjIYa,False,46,46,8,0.712,0.911,5,-3.866,0,0.0445,0.689,8.02e-06,0.107,0.85,117.533,196053,4
2008-05-03,47,Take You There,Sean Kingston,7q587HLz90L2PFrhKZjIYa,False,44,7,25,0.752,0.921,5,-4.321,0,0.0696,0.0182,0,0.256,0.634,115.033,236693,4
2008-05-03,48,It's Not My Time,3 Doors Down,7q587HLz90L2PFrhKZjIYa,False,61,48,9,0.532,0.935,0,-4.798,1,0.0619,0.00133,8.37e-06,0.106,0.309,128.025,241960,4
2008-05-03,49,Suffocate,J. Holiday,7q587HLz90L2PFrhKZjIYa,False,48,18,24,0.458,0.445,9,-8.391,0,0.361,0.64,0,0.118,0.447,82.82,220053,5
2008-05-03,50,I Remember,Keyshia Cole,7q587HLz90L2PFrhKZjIYa,False,49,24,19,0.422,0.736,5,-4.426,0,0.049,0.203,0,0.102,0.303,129.278,260093,4
2008-05-03,51,All-American Girl,Carrie Underwood,7q587HLz90L2PFrhKZjIYa,False,55,27,16,0.624,0.805,9,-2.632,1,0.029,0.0466,0,0.328,0.77,123.991,212173,4
2008-05-03,52,Falsetto,The-Dream,7q587HLz90L2PFrhKZjIYa,False,50,30,15,0.732,0.549,0,-4.194,1,0.0312,0.163,6.01e-05,0.122,0.479,131.006,271173,4
2008-05-03,53,When You Look Me In The Eyes,Jonas Brothers,7q587HLz90L2PFrhKZjIYa,False,45,25,13,0.399,0.767,2,-3.732,1,0.0328,0.0242,0,0.306,0.507,135.943,249693,4
2008-05-03,54,Shawty Get Loose,Lil Mama Featuring Chris Brown & T-Pain,7q587HLz90L2PFrhKZjIYa,False,52,10,9,0.886,0.724,1,-4.229,1,0.246,0.165,0,0.095,0.619,115.072,209507,4
2008-05-03,55,Shake It,Metro Station,7q587HLz90L2PFrhKZjIYa,False,74,55,3,0.618,0.955,4,-3.836,1,0.0798,0.00221,3.09e-06,0.486,0.79,150.034,179947,4
2008-05-03,56,In Love With A Girl,Gavin DeGraw,7q587HLz90L2PFrhKZjIYa,False,67,56,7,0.439,0.906,3,-4.8,1,0.0439,0.0193,0,0.373,0.687,161.905,206000,4
2008-05-03,57,What Kinda Gone,Chris Cagle,7q587HLz90L2PFrhKZjIYa,False,56,54,14,0.494,0.861,5,-5.236,1,0.0365,0.257,0,0.103,0.668,172.052,181613,4
2008-05-03,58,Love Don't Live Here,Lady Antebellum,7q587HLz90L2PFrhKZjIYa,False,78,58,8,0.653,0.871,1,-3.83,1,0.0315,0.0625,3.61e-06,0.144,0.619,139.934,230400,4
2008-05-03,59,Nine In The Afternoon,Panic! At The Disco,7q587HLz90L2PFrhKZjIYa,False,51,51,12,0.405,0.689,10,-5.75,1,0.0365,0.0843,0,0.207,0.397,155.189,191560,4
2008-05-03,60,Won't Go Home Without You,Maroon 5,7q587HLz90L2PFrhKZjIYa,False,65,48,19,0.737,0.615,3,-3.76,1,0.0317,0.0149,0,0.102,0.41,110.023,231173,4
2008-05-03,61,Every Day,Rascal Flatts,7q587HLz90L2PFrhKZjIYa,False,68,61,6,0.296,0.725,8,-5.466,1,0.0461,0.0347,0,0.0881,0.247,113.031,254213,4
2008-05-03,62,Dey Know,Shawty Lo,7q587HLz90L2PFrhKZjIYa,False,57,31,15,0.431,0.747,8,-6.37,1,0.454,0.0166,0,0.651,0.816,114.049,178240,3
2008-05-03,63,Love Is A Beautiful Thing,Phil Vassar,7q587HLz90L2PFrhKZjIYa,False,69,63,9,0.583,0.791,0,-3.955,1,0.0348,0.318,0,0.123,0.488,81.362,237147,4
2008-05-03,64,All Around Me,Flyleaf,7q587HLz90L2PFrhKZjIYa,False,70,64,7,0.473,0.871,9,-4.893,1,0.0456,0.0216,0,0.0525,0.47,146.975,198507,4
2008-05-03,65,Last Name,Carrie Underwood,7q587HLz90L2PFrhKZjIYa,False,75,65,3,0.395,0.869,3,-3.154,1,0.109,0.194,0,0.0874,0.688,159.833,241053,4
2008-05-03,66,New Soul,Yael Naim,7q587HLz90L2PFrhKZjIYa,False,60,7,12,0.769,0.371,0,-8.522,1,0.0326,0.733,3.73e-05,0.106,0.653,100.001,225107,4
2008-05-03,67,Small Town Southern Man,Alan Jackson,7q587HLz90L2PFrhKZjIYa,False,66,42,16,0.683,0.438,3,-12.433,1,0.0264,0.12,8.49e-06,0.269,0.568,132.951,280267,4
2008-05-03,68,The Anthem,Pitbull Featuring Lil Jon,7q587HLz90L2PFrhKZjIYa,False,64,36,16,0.793,0.781,10,-4.277,0,0.186,0.00459,1.68e-06,0.0846,0.883,123.996,245055,4
2008-05-03,69,Hollywood's Not America,Ferras,7q587HLz90L2PFrhKZjIYa,False,77,69,5,0.478,0.617,5,-6.162,1,0.0343,0.244,0,0.131,0.598,156.058,195067,4
2008-05-03,70,Psycho,Puddle Of Mudd,7q587HLz90L2PFrhKZjIYa,False,72,69,12,0.573,0.897,1,-3.549,1,0.0553,0.00473,0,0.278,0.463,126.034,210653,4
2008-05-03,71,Laughed Until We Cried,Jason Aldean,7q587HLz90L2PFrhKZjIYa,False,63,61,14,0.547,0.485,7,-5.368,1,0.0292,0.467,0,0.0736,0.243,145.057,202520,4
2008-05-03,72,Better As A Memory,Kenny Chesney,7q587HLz90L2PFrhKZjIYa,False,87,72,2,0.576,0.302,2,-11.845,1,0.033,0.433,3.3e-05,0.133,0.145,70.932,252707,4
2008-05-03,73,Inside The Fire,Disturbed,7q587HLz90L2PFrhKZjIYa,False,79,73,4,0.463,0.962,7,-6.43,1,0.0704,0.000233,0.109,0.0906,0.66,94.003,231573,4
2008-05-03,74,Umma Do Me,Rocko,7q587HLz90L2PFrhKZjIYa,False,76,66,11,0.475,0.605,2,-5.096,1,0.215,0.0833,0,0.267,0.291,137.074,230547,4
2008-05-03,75,YAHHH!,Soulja Boy Tell'em Featuring Arab,7q587HLz90L2PFrhKZjIYa,False,73,48,12,0.72,0.81,4,-1.748,1,0.225,0.118,0,0.234,0.794,154.028,190187,4
2008-05-03,76,I Won't Tell,Fat Joe Featuring J. Holiday,7q587HLz90L2PFrhKZjIYa,False,71,37,15,0.61,0.768,1,-7.932,1,0.397,0.0334,0,0.253,0.352,183.83,229627,4
2008-05-03,77,Handlebars,Flobots,7q587HLz90L2PFrhKZjIYa,False,100,77,2,0.704,0.571,5,-7.136,1,0.0969,0.0222,0,0.101,0.524,141.888,206813,4
2008-05-03,78,Customer,Raheem DeVaughn,7q587HLz90L2PFrhKZjIYa,False,85,78,3,0.635,0.518,1,-7.131,1,0.0439,0.463,0,0.169,0.513,124.044,245067,4
2008-05-03,79,Take A Bow,Rihanna,7q587HLz90L2PFrhKZjIYa,False,97,79,2,0.697,0.467,9,-7.536,1,0.0715,0.248,0,0.0941,0.572,82.082,229413,4
2008-05-03,80,Beat It,Fall Out Boy Featuring John Mayer,7q587HLz90L2PFrhKZjIYa,False,58,19,4,0.557,0.936,0,-3.694,1,0.0681,0.0195,1.5e-06,0.305,0.841,149.954,229400,4
2008-05-03,81,She's A Hottie,Toby Keith,7q587HLz90L2PFrhKZjIYa,False,92,81,3,0.569,0.893,0,-3.162,1,0.0442,0.103,0,0.2,0.703,94.933,188920,4
2008-05-03,82,Never,Jaheim,7q587HLz90L2PFrhKZjIYa,False,83,76,17,0.537,0.337,4,-8.117,1,0.0728,0.224,0,0.107,0.605,105.367,266320,4
2008-05-03,83,Home,Blake Shelton,7q587HLz90L2PFrhKZjIYa,False,91,83,2,0.576,0.455,7,-7.587,1,0.0267,0.583,2.73e-05,0.0912,0.206,127.856,227040,4
2008-05-03,84,Back When I Knew It All,Montgomery Gentry,7q587HLz90L2PFrhKZjIYa,False,90,84,3,0.533,0.732,2,-5.592,1,0.034,0.00499,2.25e-06,0.125,0.516,148.261,228587,4
2008-05-03,85,Trying To Stop Your Leaving,Dierks Bentley,7q587HLz90L2PFrhKZjIYa,False,89,85,3,0.617,0.57,7,-5.562,1,0.0302,0.00847,5.15e-05,0.0985,0.395,111.846,218147,4
2008-05-03,86,Last Time,Trey Songz,7q587HLz90L2PFrhKZjIYa,False,93,86,3,0.629,0.624,2,-7.957,1,0.0915,0.209,0,0.215,0.66,119.964,261707,4
2008-05-03,87,Stronger Woman,Jewel,7q587HLz90L2PFrhKZjIYa,False,84,84,6,0.444,0.802,2,-4.097,1,0.0473,0.161,0,0.266,0.54,170.112,242693,4
2008-05-03,88,Boyfriend/Girlfriend,C-Side Featuring Keyshia Cole,7q587HLz90L2PFrhKZjIYa,False,95,88,3,0.782,0.637,0,-6.357,1,0.126,0.0414,0,0.0955,0.328,124.014,207600,4
2008-05-03,89,Feedback,Janet,7q587HLz90L2PFrhKZjIYa,False,82,19,17,0.846,0.649,1,-6.849,0,0.0534,0.000341,0,0.0623,0.496,114.976,218213,4
2008-05-03,90,Te Quiero,Flex,7q587HLz90L2PFrhKZjIYa,False,96,90,6,0.536,0.598,1,-9.608,1,0.0424,0.00314,0,0.319,0.465,83.954,199110,4
2008-05-03,91,Shiftwork,Kenny Chesney Duet With George Strait,7q587HLz90L2PFrhKZjIYa,False,86,47,16,0.847,0.576,0,-9.199,1,0.0359,0.0922,0.00331,0.0373,0.882,128.992,269507,4
2008-05-03,92,Migrate,Mariah Carey Featuring T-Pain,6JTWpLuDTujTnBaNjEHydI,True,0,92,1,0.367,0.745,8,-6.949,1,0.353,0.0101,0,0.0825,0.542,78.612,257893,4
2008-05-03,93,I'm Yours,Jason Mraz,1EzrEOXmMH3G43AXT1y7pA,True,0,93,1,0.686,0.457,11,-8.322,1,0.0468,0.595,0,0.105,0.718,150.953,242187,4
2008-05-03,94,Praying For Time,Carrie Underwood,1EzrEOXmMH3G43AXT1y7pA,False,27,27,2,0.41,0.311,4,-7.044,1,0.0391,0.799,1.87e-06,0.123,0.217,130.617,213368,4
2008-05-03,95,Closer,Ne-Yo,2XbfY2O2v3xwedUJ0J2kkr,True,0,95,1,0.711,0.753,4,-6.461,0,0.0766,0.028,2.96e-05,0.152,0.588,126.051,234360,4
2008-05-03,96,We Weren't Crazy,Josh Gracin,2XbfY2O2v3xwedUJ0J2kkr,False,88,82,3,0.418,0.84,0,-2.622,1,0.041,0.21,1.38e-06,0.162,0.659,164.02,227307,4
2008-05-03,97,Rise Above This,Seether,4dZ4iHhsqQAQ4em4abLB6C,True,0,97,1,0.533,0.83,1,-3.092,1,0.0324,0.011,2.98e-06,0.0801,0.249,120.028,203893,4
2008-05-03,98,American Boy,Estelle Featuring Kanye West,22UDw8rSfLbUsaAGTXQ4Z8,True,0,98,1,0.727,0.729,0,-2.99,1,0.326,0.171,0,0.07,0.512,117.932,284733,4
2008-05-03,99,Take You Down,Chris Brown,1vwUsp52io0AGQ5yv470IC,True,0,99,1,0.387,0.64,11,-5.817,0,0.081,0.107,0,0.319,0.617,59.989,245933,4
2008-05-03,100,I Will Possess Your Heart,Death Cab For Cutie,1vwUsp52io0AGQ5yv470IC,False,0,89,2,0.605,0.619,9,-8.971,0,0.0261,0.423,0.313,0.0732,0.578,133.074,505773,4
