date,position,title,artist,spotify_id,is_new,last_pos,peak_pos,weeks,danceability,energy,key,loudness,mode,speechiness,acousticness,instrumentalness,liveness,valence,tempo,duration_ms,time_signature
1992-01-25,1,All 4 Love,Color Me Badd,5gfy2vyy0SmXEwOgSfMjec,False,2,1,12,0.807,0.75,2,-8.29,1,0.0315,0.0346,0.000179,0.149,0.797,106.389,211493,4
1992-01-25,2,Can't Let Go,Mariah Carey,5gfy2vyy0SmXEwOgSfMjec,False,3,2,11,0.478,0.533,10,-11.048,1,0.0404,0.591,0.00704,0.139,0.181,162.369,266560,4
1992-01-25,3,Don't Let The Sun Go Down On Me,George Michael/Elton John,5gfy2vyy0SmXEwOgSfMjec,False,4,3,8,0.601,0.329,0,-11.636,1,0.0294,0.816,1.52e-05,0.129,0.28,139.917,322884,4
1992-01-25,4,Black Or White,Michael Jackson,5gfy2vyy0SmXEwOgSfMjec,False,1,1,10,0.741,0.894,4,-3.826,1,0.0496,0.0814,0.0527,0.089,0.96,114.879,202853,4
1992-01-25,5,Finally,CeCe Peniston,5gfy2vyy0SmXEwOgSfMjec,False,5,5,18,0.791,0.658,7,-11.128,1,0.0445,0.00653,0,0.0472,0.842,120.066,245000,4
1992-01-25,6,Diamonds And Pearls,Prince And The N.P.G.,5gfy2vyy0SmXEwOgSfMjec,False,6,6,8,0.549,0.547,7,-10.119,1,0.0328,0.0532,0.321,0.0655,0.287,81.051,285267,4
1992-01-25,7,I Love Your Smile,Shanice,5gfy2vyy0SmXEwOgSfMjec,False,7,7,10,0.713,0.827,10,-9.759,0,0.113,0.0108,5.74e-06,0.134,0.738,93.934,259627,4
1992-01-25,8,Smells Like Teen Spirit,Nirvana,5gfy2vyy0SmXEwOgSfMjec,False,9,6,8,0.502,0.912,1,-4.556,1,0.0564,2.55e-05,0.000173,0.106,0.72,116.761,301920,4
1992-01-25,9,Mysterious Ways,U2,5gfy2vyy0SmXEwOgSfMjec,False,15,9,10,0.674,0.659,8,-8.049,1,0.0277,0.00156,0.00765,0.108,0.697,99.768,243587,4
1992-01-25,10,I'm Too Sexy,Right Said Fred,5gfy2vyy0SmXEwOgSfMjec,False,31,10,6,0.683,0.739,11,-12.831,0,0.0495,4.91e-05,0.0122,0.293,0.836,122.113,170467,4
1992-01-25,11,2 Legit 2 Quit,M.C. Hammer,5gfy2vyy0SmXEwOgSfMjec,False,11,5,12,0.853,0.884,1,-6.771,1,0.0836,0.0394,6.83e-06,0.0313,0.668,124.542,333624,4
1992-01-25,12,Tell Me What You Want Me To Do,Tevin Campbell,5gfy2vyy0SmXEwOgSfMjec,False,16,12,12,0.609,0.551,6,-7.93,1,0.0291,0.0233,0,0.234,0.512,127.956,256040,4
1992-01-25,13,No Son Of Mine,Genesis,5gfy2vyy0SmXEwOgSfMjec,False,12,12,13,0.658,0.595,4,-8.704,0,0.0251,0.133,0.000358,0.0978,0.256,103.975,399107,4
1992-01-25,14,The Way I Feel About You,Karyn White,5gfy2vyy0SmXEwOgSfMjec,False,17,14,9,0.673,0.888,1,-7.056,1,0.0364,0.261,0.000134,0.234,0.801,110.772,275467,4
1992-01-25,15,It's So Hard To Say Goodbye To Yesterday,Boyz II Men,5gfy2vyy0SmXEwOgSfMjec,False,8,2,19,0.3,0.225,4,-11.079,1,0.0264,0.915,0,0.159,0.294,87.698,168627,4
1992-01-25,16,Addams Groove,M.C. Hammer,5gfy2vyy0SmXEwOgSfMjec,False,10,7,8,0.912,0.582,11,-9.408,0,0.271,0.0333,0,0.0572,0.842,119.996,239040,4
1992-01-25,17,Set Adrift On Memory Bliss,P.M. Dawn,5gfy2vyy0SmXEwOgSfMjec,False,13,1,15,0.795,0.705,5,-8.552,0,0.0715,0.00118,0.00658,0.136,0.482,100.025,235800,4
1992-01-25,18,Wildside,Marky Mark & The Funky Bunch,5gfy2vyy0SmXEwOgSfMjec,False,14,10,12,0.767,0.356,8,-15.502,0,0.106,0.166,0.309,0.101,0.271,105.404,307267,4
1992-01-25,19,Keep It Comin',Keith Sweat,5gfy2vyy0SmXEwOgSfMjec,False,26,19,9,0.667,0.899,11,-7.084,0,0.0809,0.0371,4.12e-06,0.541,0.738,101.477,246373,4
1992-01-25,20,Broken Arrow,Rod Stewart,5gfy2vyy0SmXEwOgSfMjec,False,22,20,15,0.569,0.486,2,-10.64,1,0.0248,0.364,0.000326,0.267,0.509,83.213,261093,4
1992-01-25,21,That's What Love Is For,Amy Grant,5gfy2vyy0SmXEwOgSfMjec,False,20,7,18,0.544,0.699,9,-4.148,1,0.0341,0.258,0,0.144,0.293,141.844,257293,4
1992-01-25,22,When A Man Loves A Woman,Michael Bolton,5gfy2vyy0SmXEwOgSfMjec,False,19,1,16,0.476,0.363,1,-10.706,1,0.0296,0.2,0,0.055,0.243,164.555,231067,3
1992-01-25,23,To Be With You,Mr. Big,5gfy2vyy0SmXEwOgSfMjec,False,50,23,6,0.688,0.375,4,-9.601,1,0.0535,0.286,0,0.133,0.45,83.635,210480,4
1992-01-25,24,Live For Loving You,Gloria Estefan,5gfy2vyy0SmXEwOgSfMjec,False,23,22,16,0.728,0.613,7,-12.704,1,0.0369,0.093,0.00419,0.0448,0.521,114.926,276893,4
1992-01-25,25,Keep Coming Back,Richard Marx,5gfy2vyy0SmXEwOgSfMjec,False,21,12,13,0.72,0.478,9,-11.074,1,0.0239,0.115,2.27e-05,0.104,0.672,97.073,409360,4
1992-01-25,26,Love Me All Up,Stacy Earl,5gfy2vyy0SmXEwOgSfMjec,False,30,26,11,0.702,0.859,11,-10.922,1,0.0467,0.0468,0.0928,0.245,0.657,122.879,297360,4
1992-01-25,27,Blowing Kisses In The Wind,Paula Abdul,5gfy2vyy0SmXEwOgSfMjec,False,18,6,15,0.524,0.544,6,-9.059,0,0.0337,0.574,0,0.236,0.261,147.674,281840,4
1992-01-25,28,I've Got A Lot To Learn About Love,The Storm,5gfy2vyy0SmXEwOgSfMjec,False,34,28,14,0.583,0.742,9,-8.621,0,0.0255,0.00532,1.08e-06,0.0752,0.57,110.671,265467,4
1992-01-25,29,I Can't Make You Love Me,Bonnie Raitt,5gfy2vyy0SmXEwOgSfMjec,False,39,29,10,0.588,0.149,7,-16.728,0,0.0319,0.846,9.65e-05,0.236,0.113,124.689,332960,4
1992-01-25,30,Uhh Ahh,Boyz II Men,5gfy2vyy0SmXEwOgSfMjec,False,35,30,7,0.722,0.661,2,-8.236,1,0.0844,0.151,0,0.233,0.643,126.007,228867,4
1992-01-25,31,Change,Lisa Stansfield,5gfy2vyy0SmXEwOgSfMjec,False,27,27,13,0.677,0.845,2,-8.27,0,0.0379,0.0253,0.00102,0.325,0.639,105.893,274747,4
1992-01-25,32,Good For Me,Amy Grant,5gfy2vyy0SmXEwOgSfMjec,False,69,32,2,0.594,0.883,5,-4.279,1,0.0451,0.329,8.33e-05,0.276,0.863,89.997,239493,4
1992-01-25,33,Hearts Don't Think (They Feel),Natural Selection,5gfy2vyy0SmXEwOgSfMjec,False,46,33,8,0.511,0.73,7,-9.266,0,0.0496,0.0911,0.000295,0.0559,0.895,196.112,256667,4
1992-01-25,34,In My Dreams,The Party,5gfy2vyy0SmXEwOgSfMjec,False,44,34,11,0.615,0.955,1,-8.336,0,0.0587,0.0355,0.00273,0.427,0.58,121.883,217038,4
1992-01-25,35,Forever My Lady,Jodeci,5gfy2vyy0SmXEwOgSfMjec,False,29,25,14,0.707,0.5,9,-15.198,0,0.0387,0.136,0,0.237,0.77,117.997,320360,4
1992-01-25,36,Is It Good To You,Heavy D & The Boyz,5gfy2vyy0SmXEwOgSfMjec,False,32,32,10,0.711,0.595,1,-12.99,1,0.036,0.0484,0.0327,0.208,0.836,107.473,292227,4
1992-01-25,37,O.P.P.,Naughty By Nature,5gfy2vyy0SmXEwOgSfMjec,False,28,6,21,0.848,0.838,4,-11.949,0,0.0723,0.0326,4.63e-06,0.124,0.774,97.735,271067,4
1992-01-25,38,Can't Stop This Thing We Started,Bryan Adams,5gfy2vyy0SmXEwOgSfMjec,False,25,2,20,0.497,0.93,9,-3.902,1,0.0444,0.0112,0,0.354,0.47,113.086,195933,4
1992-01-25,39,I'll Get By,Eddie Money,5gfy2vyy0SmXEwOgSfMjec,False,54,39,6,0.477,0.563,9,-6.089,1,0.0279,0.578,0,0.0702,0.19,69.964,212200,4
1992-01-25,40,Don't Cry,Guns N' Roses,5gfy2vyy0SmXEwOgSfMjec,False,24,10,19,0.456,0.59,11,-8.638,1,0.0327,0.00182,0.00379,0.104,0.243,124.635,283733,4
1992-01-25,41,Too Blind To See It,Kym Sims,5gfy2vyy0SmXEwOgSfMjec,False,47,41,11,0.773,0.668,11,-8.678,0,0.117,0.00187,9.17e-06,0.308,0.698,95.27,227699,4
1992-01-25,42,There Will Never Be Another Tonight,Bryan Adams,5gfy2vyy0SmXEwOgSfMjec,False,55,42,6,0.517,0.918,9,-6.965,1,0.0489,0.0591,0,0.296,0.641,137.136,280133,4
1992-01-25,43,Save Up All Your Tears,Cher,5gfy2vyy0SmXEwOgSfMjec,False,40,37,15,0.609,0.773,5,-9.166,1,0.0389,0.075,0,0.188,0.352,113.443,238160,4
1992-01-25,44,Send Me An Angel,Scorpions,5gfy2vyy0SmXEwOgSfMjec,False,48,44,12,0.153,0.417,1,-11.587,1,0.0318,0.434,0.000622,0.211,0.166,80.87,273333,3
1992-01-25,45,Vibeology,Paula Abdul,5gfy2vyy0SmXEwOgSfMjec,False,65,45,2,0.722,0.758,1,-9.33,1,0.0622,0.00485,0.00246,0.0768,0.645,117.975,316333,4
1992-01-25,46,Spending My Time,Roxette,5gfy2vyy0SmXEwOgSfMjec,False,38,32,14,0.42,0.574,4,-5.149,1,0.0292,0.238,0.000115,0.127,0.218,170.549,275667,4
1992-01-25,47,Set The Night To Music,Roberta Flack With Maxi Priest,5gfy2vyy0SmXEwOgSfMjec,False,36,6,19,0.678,0.37,5,-16.073,1,0.0301,0.38,3.5e-05,0.128,0.622,121.595,323880,4
1992-01-25,48,Live And Let Die,Guns N' Roses,5gfy2vyy0SmXEwOgSfMjec,False,41,41,6,0.262,0.777,11,-8.671,1,0.0632,0.0109,0.113,0.12,0.264,152.5,182733,4
1992-01-25,49,Home Sweet Home,Motley Crue,5gfy2vyy0SmXEwOgSfMjec,False,37,37,12,0.403,0.777,5,-6.416,1,0.0354,0.0999,3.28e-06,0.124,0.149,76.329,240933,4
1992-01-25,50,The Unforgiven,Metallica,5gfy2vyy0SmXEwOgSfMjec,False,43,35,8,0.539,0.597,7,-9.581,1,0.0258,0.0108,0.00552,0.134,0.251,139.444,387133,4
1992-01-25,51,On A Sunday Afternoon,Lighter Shade Of Brown,5gfy2vyy0SmXEwOgSfMjec,False,52,43,9,0.784,0.765,1,-3.545,1,0.212,0.095,0,0.182,0.845,94.812,212880,4
1992-01-25,52,Cream,Prince And The N.P.G.,5gfy2vyy0SmXEwOgSfMjec,False,33,1,18,0.861,0.604,5,-8.44,0,0.0719,0.0974,0.366,0.0467,0.853,115.589,253067,4
1992-01-25,53,Remember The Time,Michael Jackson,4jnFqNWeJCeCRHc4HCdxfd,True,0,53,1,0.831,0.921,5,-2.383,0,0.0582,0.153,0.00224,0.305,0.795,108.002,239227,4
1992-01-25,54,Angel Baby,Angelica,4jnFqNWeJCeCRHc4HCdxfd,False,42,29,15,0.866,0.391,0,-7.632,1,0.0453,0.197,0.000377,0.0822,0.462,126.434,240867,4
1992-01-25,56,Mind Playing Tricks On Me,Geto Boys,,False,45,23,17,0.886,0.512,10,-11.825,0,0.237,0.207,0,0.0991,0.454,93.997,308733,4
1992-01-25,57,Kiss You Back,Digital Underground,,False,51,40,11,0.844,0.648,9,-10.685,0,0.113,0.0386,0,0.223,0.794,113.074,221467,4
1992-01-25,58,Tender Kisses,Tracie Spencer,,False,57,42,15,0.594,0.521,0,-11.033,1,0.0417,0.161,0.00556,0.0382,0.789,167.569,328240,4
1992-01-25,59,Breakin' My Heart (Pretty Brown Eyes),Mint Condition,,False,73,59,4,0.672,0.52,7,-9.965,0,0.0407,0.0985,1.28e-06,0.0365,0.551,137.213,356960,4
1992-01-25,60,Ain't Gonna Hurt Nobody,Kid 'N Play,,False,53,51,11,0.776,0.735,6,-14.78,0,0.183,0.0532,0.00687,0.286,0.619,110.105,298814,4
1992-01-25,61,I Want You,Jody Watley,,False,61,61,9,0.76,0.611,9,-8.862,0,0.0661,0.000178,0.0157,0.0685,0.646,110.006,260533,4
1992-01-25,62,Move Any Mountain,The Shamen,,False,66,62,7,0.66,0.991,7,-5.288,1,0.055,0.0031,0.000122,0.061,0.796,121.467,208560,4
1992-01-25,63,Street Of Dreams,Nia Peeples,,False,59,12,16,0.753,0.628,0,-10.54,0,0.0466,0.00747,0.000123,0.263,0.94,110.516,263533,4
1992-01-25,64,All She Wrote,Firehouse,,False,58,58,11,0.603,0.759,8,-10.393,1,0.0322,3.85e-05,0.0162,0.148,0.376,121.214,267427,4
1992-01-25,65,The Comfort Zone,Vanessa Williams,,False,62,62,8,0.861,0.716,6,-13.518,1,0.104,0.0564,4.59e-05,0.388,0.59,105.049,240200,4
1992-01-25,66,Paper Doll,P.M. Dawn,,False,79,66,2,0.725,0.894,6,-9.122,0,0.0838,0.00476,0.259,0.0489,0.529,105.723,293427,4
1992-01-25,67,In Paradise,Laissez Faire,,False,70,67,8,0.71,0.846,7,-6.677,1,0.0835,0.00881,0.0274,0.347,0.78,122.718,349893,4
1992-01-25,68,Stay,Jodeci,,False,67,62,4,0.657,0.369,7,-13.153,0,0.037,0.0706,0,0.494,0.619,129.965,312040,4
1992-01-25,70,Ring My Bell,D.J. Jazzy Jeff & The Fresh Prince,,False,56,20,16,0.808,0.612,10,-12.453,0,0.0726,0.00548,0.00145,0.456,0.701,118.121,284867,4
1992-01-25,71,Top Of The World,Van Halen,,False,63,27,16,0.546,0.785,9,-8.788,1,0.0297,0.0354,3.6e-06,0.0935,0.804,127.957,232867,4
1992-01-25,72,Until Your Love Comes Back Around,RTZ,,False,96,72,2,0.55,0.534,8,-10.6,1,0.0331,0.229,0,0.0714,0.311,134.662,360400,4
1992-01-25,73,The Rush,Luther Vandross,,False,77,73,4,0.628,0.932,1,-8.914,1,0.0508,0.000996,0.309,0.0511,0.969,187.925,404760,4
1992-01-25,76,Whispers,Corina,,False,71,51,18,0.652,0.803,4,-12.688,0,0.0546,0.00942,0.00183,0.349,0.441,122.699,287893,4
1992-01-25,77,Oochie Coochie,M.C. Brains,,False,87,77,2,0.818,0.801,7,-9.08,1,0.188,0.0359,0,0.257,0.58,119.707,222293,4
1992-01-25,78,Shot Of Poison,Lita Ford,,False,72,45,13,0.578,0.855,5,-8.057,1,0.0414,0.0388,5.56e-06,0.345,0.732,126.264,210733,4
1992-01-25,79,Missing You Now,Michael Bolton,7ho5FKdNqmmbCpXYcyDH8c,True,0,79,1,0.62,0.508,7,-11.621,1,0.0272,0.118,0,0.187,0.289,95.01,273307,4
1992-01-25,81,Beauty And The Beast,Celine Dion And Peabo Bryson,,False,88,81,2,0.463,0.4,6,-9.999,0,0.0308,0.643,2.46e-05,0.131,0.121,77.314,249240,4
1992-01-25,82,There's No Other Way,Blur,,False,90,82,3,0.575,0.937,2,-5.858,1,0.0496,0.0563,1.06e-05,0.178,0.634,112.045,204867,4
1992-01-25,83,Every Road Leads Back To You,Bette Midler,,False,78,78,6,0.574,0.251,11,-14.57,1,0.0293,0.388,0,0.166,0.128,126.139,227907,4
1992-01-25,84,Hold On (Tighter To Love),Clubland,,False,93,84,4,0.796,0.688,7,-7.932,0,0.0558,0.00131,0.361,0.0888,0.573,119.768,404074,4
1992-01-25,85,A Day In My Life (Without You),Lisette Melendez,,False,80,49,18,0.606,0.947,6,-4.446,0,0.0371,0.000874,0.314,0.0514,0.789,119.104,235040,4
1992-01-25,86,She Ain't Pretty,The Northern Pikes,,False,94,86,4,0.623,0.787,4,-8.519,0,0.0356,0.112,0,0.139,0.769,133.91,163773,4
1992-01-25,87,Within My Heart,Voyce,,False,82,77,9,0.69,0.942,1,-5.798,0,0.0729,0.00231,3.38e-05,0.199,0.575,120.533,240824,4
1992-01-25,88,Can't Truss It,Public Enemy,,False,68,50,15,0.802,0.872,11,-7.651,1,0.139,0.00196,0,0.132,0.607,101.664,321573,4
1992-01-25,89,Insatiable,Prince And The N.P.G.,,False,86,77,7,0.736,0.339,9,-11.956,0,0.0453,0.441,0.00553,0.0778,0.374,121.782,399667,3
1992-01-25,92,Pop That Coochie,The 2 Live Crew,,False,83,58,13,0.904,0.89,7,-6.708,1,0.176,0.000246,0.00174,0.113,0.647,127.811,257800,4
1992-01-25,93,Stars,Simply Red,5QJSD5GQOq72OmwLV5IHUV,True,0,93,1,0.716,0.818,7,-7.456,1,0.0256,0.154,0.000806,0.236,0.817,103.668,248600,4
1992-01-25,94,All Through The Night,Tone-Loc,5QJSD5GQOq72OmwLV5IHUV,False,89,80,7,0.699,0.577,6,-12.375,1,0.172,0.00243,0.0268,0.0581,0.802,177.213,295067,4
1992-01-25,95,Give It Away,Red Hot Chili Peppers,5QJSD5GQOq72OmwLV5IHUV,False,85,76,6,0.666,0.936,7,-9.919,1,0.0476,0.00244,0.086,0.153,0.776,91.577,282907,4
1992-01-25,96,What Goes Around Comes Around,Giggles,2dOb3DaZRbiGfruiDODvdd,True,0,96,1,0.744,0.819,7,-10.303,1,0.0546,0.0259,0.00229,0.178,0.87,120.355,223467,4
1992-01-25,97,I'll Take You There,BeBe & CeCe Winans Featuring Mavis Staples,2dOb3DaZRbiGfruiDODvdd,False,99,90,4,0.701,0.674,7,-10.153,1,0.0526,0.0416,0.000138,0.0874,0.88,99.019,259867,4
1992-01-25,98,Everlasting Love,Tony Terry,36VqMzrUe5lAWgfVwaLECE,True,0,98,1,0.535,0.644,7,-11.232,1,0.0345,0.0329,0,0.104,0.629,154.062,318933,4
1992-01-25,100,No More Tears,Ozzy Osbourne,,False,81,71,9,0.346,0.749,6,-6.506,1,0.035,0.00167,8.86e-05,0.648,0.315,102.591,443240,4
