date,position,title,artist,spotify_id,is_new,last_pos,peak_pos,weeks,danceability,energy,key,loudness,mode,speechiness,acousticness,instrumentalness,liveness,valence,tempo,duration_ms,time_signature
2001-07-14,1,U Remind Me,Usher,,False,1,1,5,0.657,0.629,6,-4.938,1,0.0782,0.194,0,0.254,0.726,93.985,266893,4
2001-07-14,2,Hanging By A Moment,Lifehouse,,False,3,2,23,0.541,0.864,1,-4.915,1,0.0357,0.00118,0,0.0896,0.435,124.557,216067,4
2001-07-14,3,Lady Marmalade,"Christina Aguilera, Lil' Kim, Mya & P!nk",,False,2,1,14,0.756,0.808,5,-3.655,1,0.0541,0.0175,3.67e-06,0.66,0.638,109.902,264847,4
2001-07-14,4,Let Me Blow Ya Mind,Eve Featuring Gwen Stefani,,False,5,4,12,0.908,0.557,8,-4.243,0,0.107,0.242,0,0.0709,0.897,90.032,230133,4
2001-07-14,5,Hit 'Em Up Style (Oops!),Blu Cantrell,,False,44,5,11,0.667,0.773,5,-4.983,0,0.0586,0.201,0,0.404,0.667,89.976,250707,4
2001-07-14,6,Peaches & Cream,112,,False,4,4,14,0.677,0.52,4,-6.255,0,0.334,0.00277,0,0.0532,0.768,203.862,193093,4
2001-07-14,7,Drops Of Jupiter (Tell Me),Train,,False,6,5,18,0.468,0.64,0,-5.862,1,0.0275,0.154,0,0.154,0.499,79.297,259933,4
2001-07-14,8,Bootylicious,Destiny's Child,,False,12,8,6,0.84,0.835,1,-4.386,0,0.275,0.00281,1.11e-06,0.152,0.637,103.376,207907,4
2001-07-14,9,Ride Wit Me,Nelly Featuring City Spud,,False,7,3,21,0.85,0.7,7,-6.49,1,0.0478,0.0616,1.8e-06,0.244,0.722,101.875,291782,4
2001-07-14,10,Drive,Incubus,,False,14,10,22,0.645,0.792,4,-7.34,0,0.036,0.0562,0.0121,0.119,0.666,90.565,232453,4
2001-07-14,11,Get Ur Freak On,"Missy ""Misdemeanor"" Elliott",,False,8,7,17,0.687,0.693,6,-8.83,1,0.0891,0.0563,0.134,0.168,0.425,177.894,242536,4
2001-07-14,12,Superwoman Pt. II,Lil' Mo Featuring Fabolous,,False,11,11,16,0.768,0.541,6,-5.183,0,0.1,0.286,0,0.107,0.645,95.715,265588,4
2001-07-14,13,Follow Me,Uncle Kracker,,False,15,5,19,0.817,0.585,5,-4.688,1,0.0301,0.439,0,0.147,0.916,105.014,218440,4
2001-07-14,14,What Would You Do?,City High,,False,16,8,17,0.733,0.794,7,-6.909,1,0.223,0.259,0,0.483,0.832,95.877,175560,4
2001-07-14,15,Irresistible,Jessica Simpson,,False,17,15,9,0.659,0.966,8,-2.783,0,0.0538,0.0279,8.25e-05,0.0489,0.687,93.008,193600,4
2001-07-14,16,Fiesta,R. Kelly Featuring Jay-Z,,False,10,6,16,0.92,0.487,10,-5.578,0,0.182,0.0103,0,0.0411,0.806,92.836,241400,4
2001-07-14,17,All Or Nothing,O-Town,,False,18,17,6,0.641,0.453,0,-4.98,1,0.0281,0.262,0,0.284,0.216,126.872,248867,4
2001-07-14,18,There You'll Be,Faith Hill,,False,13,10,8,0.325,0.532,8,-7.208,1,0.0308,0.496,0,0.134,0.162,129.021,220840,4
2001-07-14,19,Fill Me In,Craig David,,False,19,19,6,0.683,0.748,8,-6.981,1,0.0366,0.373,0.00881,0.06,0.828,132.486,257200,4
2001-07-14,20,It's Been Awhile,Staind,,False,22,20,14,0.509,0.774,6,-4.054,1,0.0338,0.00189,0.000549,0.143,0.0824,116.529,264707,4
2001-07-14,21,Where The Party At,Jagged Edge With Nelly,,False,28,21,7,0.808,0.593,7,-8.097,1,0.0912,0.0951,0,0.154,0.861,97.105,254987,4
2001-07-14,22,Music,Erick Sermon Featuring Marvin Gaye,,False,23,22,7,0.897,0.466,10,-9.053,0,0.203,0.187,1.35e-06,0.0757,0.884,100.01,223133,4
2001-07-14,23,Someone To Call My Lover,Janet,,False,29,23,4,0.738,0.914,2,-4.203,1,0.0434,0.144,0.00099,0.182,0.935,127.885,272360,4
2001-07-14,24,My Baby,Lil' Romeo,,False,9,3,9,0.82,0.761,1,-2.714,1,0.219,0.0481,0,0.218,0.584,97.423,221000,4
2001-07-14,25,When It's Over,Sugar Ray,,False,26,25,7,0.675,0.775,4,-5.772,1,0.0522,0.0387,0,0.383,0.933,99.945,217853,4
2001-07-14,26,Purple Hills,D12,,False,45,26,4,0.762,0.714,1,-4.999,1,0.211,0.0182,0,0.353,0.696,125.28,303667,4
2001-07-14,27,More Than That,Backstreet Boys,,False,27,27,8,0.58,0.729,4,-6.705,0,0.0287,0.0102,0,0.0805,0.483,80.061,224933,4
2001-07-14,28,Thank You,Dido,,False,20,3,27,0.722,0.595,1,-9.928,0,0.0415,0.284,0.000538,0.0694,0.738,79.98,217827,4
2001-07-14,29,I'm Like A Bird,Nelly Furtado,,False,24,9,20,0.622,0.608,10,-5.085,1,0.036,0.138,5.38e-06,0.273,0.607,89.661,243160,4
2001-07-14,30,She's All I Got,Jimmy Cozier,,False,38,30,5,0.768,0.522,1,-8.555,1,0.0604,0.343,2.12e-06,0.163,0.186,99.957,211133,4
2001-07-14,31,Pop,'N Sync,,False,25,19,7,0.706,0.861,11,-6.684,1,0.154,0.0341,0,0.127,0.923,119.946,238427,4
2001-07-14,32,All For You,Janet,,False,21,1,18,0.753,0.934,2,-3.011,1,0.0736,0.0174,0.065,0.128,0.73,113.525,329933,3
2001-07-14,33,I'm Already There,Lonestar,,False,33,24,11,0.377,0.395,3,-8.622,1,0.0332,0.61,0,0.295,0.221,133.296,253373,4
2001-07-14,34,Here's To The Night,Eve 6,,False,34,34,6,0.583,0.652,7,-6.255,1,0.0244,0.0405,0.000378,0.0781,0.352,97.469,249840,4
2001-07-14,35,Wait A Minute,Ray J Featuring Lil' Kim,,False,30,30,8,0.892,0.698,7,-4.833,1,0.168,0.0738,0,0.172,0.728,100.031,230800,4
2001-07-14,36,I Wanna Be Bad,Willa Ford,,False,36,36,6,0.647,0.818,9,-3.47,0,0.0647,0.234,1.89e-05,0.216,0.816,180.019,183560,4
2001-07-14,37,She Couldn't Change Me,Montgomery Gentry,,False,37,37,15,0.67,0.823,5,-10.592,1,0.033,0.00436,0.000192,0.318,0.787,117.44,260133,4
2001-07-14,38,There She Goes,Babyface,,False,31,31,10,0.789,0.654,0,-5.284,1,0.118,0.035,1.65e-05,0.0658,0.83,104.993,270884,4
2001-07-14,39,The Space Between,Dave Matthews Band,,False,39,39,9,0.406,0.73,9,-6.278,1,0.0315,0.0471,0,0.229,0.207,170.032,242000,4
2001-07-14,40,I'm Real,Jennifer Lopez Featuring Ja Rule,,False,66,40,2,0.708,0.587,11,-7.93,0,0.151,0.273,0,0.0718,0.554,83.46,262133,4
2001-07-14,41,I Do!!,Toya,,False,32,32,7,0.781,0.583,6,-7.83,0,0.0628,0.0859,0.00216,0.058,0.91,156.264,213493,4
2001-07-14,42,I Could Not Ask For More,Sara Evans,,False,35,35,13,0.584,0.509,8,-10.338,1,0.0279,0.0234,0.00017,0.0808,0.387,138.022,287733,4
2001-07-14,43,I Hope You Dance,Lee Ann Womack,,False,40,14,45,0.385,0.443,7,-9.627,0,0.0295,0.0632,0,0.0898,0.275,151.278,294533,4
2001-07-14,44,If You're Gone,matchbox twenty,,False,43,5,39,0.544,0.659,9,-7.191,1,0.0298,0.427,1.33e-06,0.126,0.361,109.933,274933,4
2001-07-14,45,Fallin',Alicia Keys,,False,71,45,5,0.653,0.609,11,-7.519,0,0.037,0.263,0.00101,0.233,0.482,95.982,210200,3
2001-07-14,46,Austin,Blake Shelton,,False,56,46,8,0.605,0.609,7,-7.063,1,0.0278,0.188,0,0.0982,0.275,119.914,230333,4
2001-07-14,47,When I Think About Angels,Jamie O'Neal,,False,51,47,6,0.507,0.843,11,-3.421,1,0.108,0.274,0,0.295,0.504,193.708,182613,4
2001-07-14,48,Ain't Nothing 'Bout You,Brooks & Dunn,,False,42,25,19,0.325,0.887,0,-4.199,1,0.0569,0.144,1.35e-06,0.431,0.705,202.339,199413,4
2001-07-14,49,Flavor Of The Weak,American Hi-Fi,,False,55,49,4,0.39,0.967,10,-1.946,1,0.0644,0.000758,1.74e-05,0.302,0.488,151.944,188840,4
2001-07-14,50,Grown Men Don't Cry,Tim McGraw,,False,41,25,16,0.657,0.513,10,-8.514,1,0.024,0.199,0,0.0994,0.56,101.815,235760,4
2001-07-14,51,If You Can Do Anything Else,George Strait,,False,52,51,14,0.681,0.62,3,-7.68,1,0.0268,0.601,0.000318,0.128,0.482,116.983,246667,4
2001-07-14,52,When Somebody Loves You,Alan Jackson,,False,54,52,12,0.686,0.306,0,-12.811,1,0.0256,0.759,9.18e-05,0.108,0.192,83.849,207573,4
2001-07-14,53,Two People Fell In Love,Brad Paisley,,False,60,53,12,0.6,0.44,0,-10.79,1,0.0291,0.332,0,0.148,0.381,80.334,247173,4
2001-07-14,54,Don't Happen Twice,Kenny Chesney,,False,48,26,19,0.499,0.708,7,-7.029,1,0.0301,0.00626,1.15e-05,0.0423,0.617,158.785,203067,4
2001-07-14,55,Loverboy,Mariah Carey Featuring Cameo,,False,59,55,4,0.731,0.897,1,-2.845,1,0.113,0.195,0,0.391,0.832,103.001,270400,4
2001-07-14,56,I'm Just Talkin' About Tonight,Toby Keith,,False,65,56,5,0.672,0.864,7,-3.669,1,0.0453,0.286,0,0.144,0.812,123.903,165133,4
2001-07-14,57,Where The Blacktop Ends,Keith Urban,,False,67,57,5,0.496,0.94,2,-3.332,1,0.0373,0.289,0,0.251,0.95,158.967,186293,4
2001-07-14,58,Heard It All Before,Sunshine Anderson,,False,57,18,19,0.698,0.925,3,-4.209,0,0.222,0.0611,0,0.095,0.676,96.953,295827,4
2001-07-14,59,We Need A Resolution,Aaliyah Featuring Timbaland,,False,62,59,7,0.725,0.52,6,-9.347,0,0.297,0.315,0,0.123,0.84,147.159,242267,4
2001-07-14,60,Play,Jennifer Lopez,,False,53,18,15,0.775,0.729,1,-4.229,0,0.162,0.0303,0.00247,0.0361,0.895,104.719,211493,4
2001-07-14,61,It's A Great Day To Be Alive,Travis Tritt,,False,63,33,20,0.595,0.653,7,-4.935,1,0.0265,0.246,0,0.264,0.542,128.93,241533,4
2001-07-14,62,Never Had A Dream Come True,S Club 7,,False,64,10,20,0.636,0.531,5,-5.593,1,0.0273,0.508,0,0.0952,0.496,122.918,240640,4
2001-07-14,63,Can't Believe,Faith Evans Featuring Carl Thomas,,False,68,63,11,0.779,0.495,7,-4.492,1,0.0498,0.0765,0,0.147,0.527,89.58,244107,4
2001-07-14,64,What I Really Meant To Say,Cyndi Thomson,,False,74,64,7,0.503,0.671,1,-5.717,1,0.0284,0.093,3.37e-05,0.176,0.381,140.115,200093,4
2001-07-14,65,Downtime,Jo Dee Messina,,False,69,65,5,0.566,0.887,6,-3.583,1,0.034,0.137,0,0.081,0.704,109.806,224400,4
2001-07-14,66,Take It To Da House,Trick Daddy Featuring The SNS Express,,False,73,50,19,0.935,0.781,6,-5.795,0,0.197,0.0158,0,0.164,0.918,123.894,226160,4
2001-07-14,67,I Cry,Ja Rule Featuring Lil' Mo,,False,58,40,11,0.634,0.551,10,-5.698,1,0.208,0.265,0,0.204,0.343,72.202,317733,4
2001-07-14,68,Contagious,The Isley Brothers Featuring Ronald Isley,7HjJQunSPwkXXVnGeItUEH,True,0,68,1,0.709,0.449,4,-7.251,0,0.04,0.24,0,0.134,0.204,113.023,346467,4
2001-07-14,69,The Way,Jill Scott,7HjJQunSPwkXXVnGeItUEH,False,84,69,2,0.717,0.402,1,-9.712,1,0.0316,0.0187,0.0113,0.0994,0.453,140.418,255733,4
2001-07-14,70,Survivor,Destiny's Child,7HjJQunSPwkXXVnGeItUEH,False,61,2,18,0.514,0.911,1,-2.027,0,0.41,0.0559,0,0.775,0.619,161.109,254027,4
2001-07-14,71,Schism,Tool,7HjJQunSPwkXXVnGeItUEH,False,76,71,4,0.567,0.714,9,-8.512,0,0.0302,0.0012,0.417,0.186,0.191,107.441,403533,3
2001-07-14,72,I Like Them Girls,Tyrese,7HjJQunSPwkXXVnGeItUEH,False,70,48,15,0.77,0.854,1,-0.949,0,0.0539,0.00503,9.31e-05,0.319,0.807,90.006,264093,4
2001-07-14,73,Just In Case,Jaheim,7HjJQunSPwkXXVnGeItUEH,False,80,73,3,0.78,0.572,0,-6.797,1,0.0951,0.0618,0,0.0495,0.695,100.999,263866,4
2001-07-14,74,"Baby, Come Over (This Is Our Night)",Samantha Mumba,7HjJQunSPwkXXVnGeItUEH,False,72,49,10,0.7,0.753,2,-6.543,0,0.0773,0.0561,4.51e-05,0.115,0.942,95.03,184120,4
2001-07-14,75,One Minute Man,"Missy ""Misdemeanor"" Elliott",5ONjjxFYoBzp7v2PMHBAvT,True,0,75,1,0.911,0.589,9,-12.47,1,0.217,0.057,1.57e-05,0.145,0.544,93.884,237653,4
2001-07-14,76,Only Time,Enya,6FLwmdmW77N1Pxb1aWsZmO,True,0,76,1,0.418,0.249,3,-13.744,1,0.0301,0.841,0.661,0.112,0.213,82.803,218547,4
2001-07-14,77,What It Is,Violator Featuring Busta Rhymes,6FLwmdmW77N1Pxb1aWsZmO,False,78,77,3,0.931,0.484,5,-7.735,0,0.221,0.218,1.54e-05,0.0705,0.664,100.967,218560,4
2001-07-14,78,Laredo,Chris Cagle,6FLwmdmW77N1Pxb1aWsZmO,False,83,78,2,0.47,0.794,1,-5.784,1,0.0438,0.16,0,0.0927,0.673,159.983,229573,4
2001-07-14,79,While You Loved Me,Rascal Flatts,6FLwmdmW77N1Pxb1aWsZmO,False,79,79,3,0.504,0.596,5,-4.412,1,0.0279,0.239,0,0.0972,0.168,142.051,209933,4
2001-07-14,80,La Bomba,Azul Azul,6FLwmdmW77N1Pxb1aWsZmO,False,82,70,15,0.923,0.768,1,-7.321,1,0.0674,0.119,0,0.0689,0.96,94.013,123960,4
2001-07-14,81,"So Fresh, So Clean",OutKast,6FLwmdmW77N1Pxb1aWsZmO,False,77,30,20,0.725,0.64,5,-7.905,0,0.332,0.0281,0,0.099,0.915,166.028,240027,3
2001-07-14,82,This Is Me,Dream,6FLwmdmW77N1Pxb1aWsZmO,False,75,39,10,0.662,0.926,8,-5.202,1,0.156,0.0632,3.28e-06,0.308,0.918,78.053,192493,4
2001-07-14,83,Mad Season,matchbox twenty,6FLwmdmW77N1Pxb1aWsZmO,False,81,48,11,0.278,0.87,10,-5.368,1,0.0547,0.13,0,0.286,0.577,171.992,302107,4
2001-07-14,84,Area Codes,Ludacris Featuring Nate Dogg,3lcC9CnN7Rpo1ugATzmYjY,True,0,84,1,0.86,0.688,9,-7.203,0,0.434,0.399,0,0.67,0.622,100.934,303027,4
2001-07-14,85,Right Where I Need To Be,Gary Allan,3lcC9CnN7Rpo1ugATzmYjY,False,86,42,15,0.522,0.747,1,-4.789,1,0.0297,0.235,1.06e-05,0.0964,0.645,82.85,182103,4
2001-07-14,86,Angel,Lionel Richie,3lcC9CnN7Rpo1ugATzmYjY,False,89,70,11,0.725,0.822,9,-10.059,1,0.0402,0.0111,0,0.0938,0.581,127.969,223040,4
2001-07-14,87,Maybe I Deserve,Tank,3lcC9CnN7Rpo1ugATzmYjY,False,90,38,18,0.738,0.378,6,-7.231,1,0.0443,0.202,0,0.103,0.427,93.985,299974,4
2001-07-14,89,Midwest Swing,St. Lunatics,,False,98,89,3,0.846,0.58,10,-6.533,0,0.0432,0.0346,4.53e-05,0.285,0.271,94.945,275389,4
2001-07-14,90,Playas Gon' Play,3LW,,False,87,81,7,0.656,0.724,6,-5.465,0,0.124,0.00395,4.98e-05,0.269,0.62,185.748,283533,4
2001-07-14,91,Yellow,Coldplay,,False,95,48,19,0.429,0.661,11,-7.227,1,0.0281,0.00239,0.000121,0.234,0.285,173.372,266773,4
2001-07-14,92,Until The End Of Time,2Pac,,False,85,52,13,0.757,0.706,8,-6.665,1,0.203,0.0267,0,0.197,0.375,96.976,266507,4
2001-07-14,94,Dream On,Depeche Mode,,False,93,85,10,0.811,0.563,10,-9.452,0,0.0412,0.271,0.00158,0.132,0.631,127.986,260680,4
2001-07-14,95,Lay Low,"Snoop Dogg Featuring Master P, Nate Dogg, Butch Cassidy & Tha Eastsidaz",,False,92,50,17,0.87,0.653,0,-4.353,1,0.326,0.151,0,0.303,0.755,94.84,223000,4
2001-07-14,96,If I Fall You're Going Down With Me,Dixie Chicks,,False,96,38,18,0.722,0.81,8,-7.463,1,0.0336,0.119,7.13e-06,0.377,0.561,123.272,183200,4
2001-07-14,97,Video,India.Arie,,False,94,47,16,0.652,0.604,9,-8.766,0,0.227,0.111,1.01e-05,0.0409,0.675,170.003,249960,4
2001-07-14,98,Miss California,Dante Thomas Featuring Pras,1pCo7S7sooCe3Y4e3X6F4o,True,0,98,1,0.565,0.946,6,-4.938,0,0.288,0.451,0,0.145,0.755,111.209,182133,4
2001-07-14,99,Just A Baby Boy,Snoop Dogg Featuring Tyrese & Mr. Tan,0YDYMz9BP602o75O9jgr6l,True,0,99,1,0.849,0.61,6,-7.295,0,0.288,0.0294,0,0.271,0.673,94.836,256440,4
2001-07-14,100,My Way,Limp Bizkit,0YDYMz9BP602o75O9jgr6l,False,99,75,12,0.576,0.864,6,-3.981,1,0.0462,0.02,1.68e-06,0.683,0.609,97.225,272973,4
