date,position,title,artist,spotify_id,is_new,last_pos,peak_pos,weeks,danceability,energy,key,loudness,mode,speechiness,acousticness,instrumentalness,liveness,valence,tempo,duration_ms,time_signature
1998-07-18,1,The Boy Is Mine,Brandy & Monica,,False,1,1,8,0.704,0.707,1,-6.537,0,0.0391,0.539,0.00106,0.318,0.761,93.145,294787,4
1998-07-18,2,You're Still The One,Shania Twain,,False,2,2,23,0.585,0.494,3,-8.751,1,0.0353,0.363,0,0.0886,0.634,133.822,212200,4
1998-07-18,3,My Way,Usher,,False,4,3,5,0.815,0.521,5,-8.178,0,0.136,0.0105,0,0.0509,0.887,90.079,214853,4
1998-07-18,4,Too Close,Next,,False,3,1,23,0.847,0.402,7,-9.952,1,0.0641,0.0118,0,0.283,0.752,99.693,259440,4
1998-07-18,5,Adia,Sarah McLachlan,,False,6,5,8,0.526,0.37,3,-10.535,1,0.025,0.722,0,0.157,0.251,76.002,244667,4
1998-07-18,6,Come With Me,Puff Daddy Featuring Jimmy Page,,False,7,6,4,0.549,0.847,0,-3.918,1,0.0462,0.047,4.66e-06,0.19,0.765,164.147,364173,3
1998-07-18,7,Ray Of Light,Madonna,,False,5,5,2,0.561,0.909,3,-7.878,1,0.0312,0.00118,0.46,0.0713,0.71,127.172,320693,4
1998-07-18,8,Make It Hot,"Nicole Featuring Missy ""Misdemeanor"" Elliott & Mocha",,False,11,8,4,0.76,0.458,7,-8.834,1,0.19,0.376,0.000229,0.143,0.581,84.08,267093,4
1998-07-18,9,My All,Mariah Carey,,False,8,1,11,0.607,0.317,7,-10.244,0,0.029,0.732,4.53e-05,0.086,0.111,108.122,230933,4
1998-07-18,10,Everybody [Backstreet's Back],Backstreet Boys,,False,10,4,14,0.735,0.873,10,-3.493,0,0.0402,0.025,3.27e-06,0.265,0.586,108.021,224960,4
1998-07-18,11,They Don't Know,Jon B,,False,9,7,25,0.699,0.388,6,-10.722,1,0.0531,0.588,1.98e-06,0.0658,0.566,125.858,274667,4
1998-07-18,12,Say It,Voices Of Theory,,False,13,12,16,0.381,0.415,0,-10.298,1,0.0691,0.675,0,0.0795,0.257,61.908,269467,3
1998-07-18,13,All My Life,K-Ci & JoJo,,False,12,1,17,0.629,0.511,1,-8.651,1,0.0326,0.114,3.91e-06,0.0588,0.181,128.038,331240,4
1998-07-18,14,Truly Madly Deeply,Savage Garden,,False,14,1,33,0.555,0.698,0,-8.874,1,0.0287,0.403,0,0.0851,0.816,168.12,277267,4
1998-07-18,15,When The Lights Go Out,Five,,False,19,15,7,0.854,0.827,5,-6.424,1,0.0335,0.0636,0,0.123,0.961,104.001,249600,4
1998-07-18,16,Ghetto Supastar (That Is What You Are),Pras Michel Feat. Ol' Dirty Bastard & Introducing Mya,,False,17,16,4,0.795,0.639,1,-8.805,0,0.23,0.0479,1.49e-06,0.135,0.588,100.027,265333,4
1998-07-18,17,Sex And Candy,Marcy Playground,,False,15,8,15,0.55,0.702,11,-5.693,0,0.0281,0.046,1.4e-06,0.119,0.515,159.968,172486,4
1998-07-18,18,Stop,Spice Girls,,False,21,16,5,0.722,0.845,2,-4.446,0,0.0308,0.287,0,0.0561,0.965,130.13,204754,4
1998-07-18,19,Looking Through Your Eyes,LeAnn Rimes,,False,20,18,14,0.487,0.271,10,-11.566,1,0.0283,0.618,0,0.16,0.194,80.126,245467,4
1998-07-18,20,I Got The Hook Up!,Master P Featuring Sons Of Funk,,False,18,16,15,0.706,0.632,1,-7.017,1,0.192,0.026,0,0.362,0.277,148.015,182938,4
1998-07-18,21,I Get Lonely,Janet Featuring BLACKstreet,,False,16,3,9,0.799,0.514,7,-6.794,0,0.0478,0.291,0,0.518,0.455,125.104,317560,4
1998-07-18,22,Friend Of Mine,Kelly Price,35irxCsC8QXJ1IN0eioD3H,True,0,22,1,0.737,0.366,10,-8.346,0,0.032,0.35,0,0.0707,0.395,109.876,377507,4
1998-07-18,23,Whatcha Gone Do?,Link,35irxCsC8QXJ1IN0eioD3H,False,23,23,7,0.765,0.613,11,-7.935,1,0.0319,0.171,2.19e-05,0.163,0.937,93.811,259162,4
1998-07-18,24,Nobody Does It Better,Nate Dogg Featuring Warren G,35irxCsC8QXJ1IN0eioD3H,False,54,24,2,0.736,0.561,0,-8.16,1,0.05,0.446,0,0.128,0.122,92.06,274440,4
1998-07-18,25,The Arms Of The One Who Loves You,Xscape,35irxCsC8QXJ1IN0eioD3H,False,22,7,12,0.657,0.456,0,-8.917,1,0.0345,0.311,0,0.0922,0.182,115.4,260427,4
1998-07-18,26,Still Not A Player,Big Punisher Featuring Joe,35irxCsC8QXJ1IN0eioD3H,False,26,26,6,0.9,0.619,4,-6.518,0,0.312,0.203,0.00156,0.0647,0.864,94.121,236800,4
1998-07-18,27,Shorty (You Keep Playin' With My Mind),Imajin Featuring Keith Murray,35irxCsC8QXJ1IN0eioD3H,False,25,25,8,0.848,0.698,11,-4.885,0,0.241,0.0181,4.07e-06,0.203,0.895,101.074,294960,4
1998-07-18,28,This Kiss,Faith Hill,35irxCsC8QXJ1IN0eioD3H,False,31,26,18,0.398,0.804,11,-5.559,1,0.0451,0.175,0,0.181,0.709,186.752,194307,4
1998-07-18,29,How Do I Live,LeAnn Rimes,35irxCsC8QXJ1IN0eioD3H,False,29,2,57,0.577,0.462,2,-7.989,1,0.0279,0.128,0,0.0822,0.258,128.303,266973,4
1998-07-18,30,Gettin' Jiggy Wit It,Will Smith,35irxCsC8QXJ1IN0eioD3H,False,24,1,21,0.881,0.874,6,-4.505,1,0.139,0.0175,1.14e-06,0.154,0.858,107.891,227933,4
1998-07-18,31,Turn It Up [Remix]/Fire It Up,Busta Rhymes,35irxCsC8QXJ1IN0eioD3H,False,30,10,11,0.817,0.84,2,-8.598,1,0.0922,0.00506,0.00034,0.288,0.89,104.295,237907,4
1998-07-18,32,Cleopatra's Theme,Cleopatra,35irxCsC8QXJ1IN0eioD3H,False,51,32,3,0.705,0.673,6,-8.347,1,0.0502,0.137,0,0.423,0.814,103.809,249200,4
1998-07-18,33,Crush,Jennifer Paige,35irxCsC8QXJ1IN0eioD3H,False,48,33,3,0.733,0.706,1,-5.652,0,0.0292,0.0262,0,0.0881,0.598,115.04,199960,4
1998-07-18,34,Let's Ride,Montell Jordan Feat. Master P & Silkk The Shocker,35irxCsC8QXJ1IN0eioD3H,False,28,2,20,0.59,0.538,1,-5.949,1,0.247,0.0272,0,0.17,0.578,121.929,294600,4
1998-07-18,35,How's It Going To Be,Third Eye Blind,35irxCsC8QXJ1IN0eioD3H,False,27,9,33,0.562,0.593,5,-9.362,1,0.0263,0.00327,0.00139,0.0967,0.574,80.289,253413,4
1998-07-18,36,Make Em' Say Uhh!,"Master P Feat. Fiend, Silkk The Shocker, Mia X & Mystikal",35irxCsC8QXJ1IN0eioD3H,False,37,16,25,0.711,0.729,6,-5.432,0,0.49,0.00513,0,0.0615,0.488,169.845,302507,4
1998-07-18,37,Cruel Summer,Ace Of Base,4AxVXHgv0clBuS4dl4S7Gw,True,0,37,1,0.721,0.842,1,-1.97,0,0.0279,0.013,0.00187,0.076,0.882,109.966,215360,4
1998-07-18,38,I Want You Back,'N Sync,4AxVXHgv0clBuS4dl4S7Gw,False,32,13,20,0.758,0.93,8,-3.22,0,0.0425,0.0503,0.000226,0.325,0.853,112.042,202107,4
1998-07-18,39,Together Again,Janet,4AxVXHgv0clBuS4dl4S7Gw,False,35,1,31,0.873,0.593,7,-8.942,1,0.103,0.078,0.00697,0.104,0.495,123.091,301200,4
1998-07-18,40,"No, No, No",Destiny's Child,4AxVXHgv0clBuS4dl4S7Gw,False,33,3,34,0.67,0.582,1,-3.574,1,0.224,0.3,0,0.0845,0.675,181.841,207467,4
1998-07-18,41,To The Moon And Back,Savage Garden,4AxVXHgv0clBuS4dl4S7Gw,False,46,37,22,0.584,0.76,0,-7.369,0,0.0359,0.0205,7.25e-06,0.1,0.325,104.101,341067,4
1998-07-18,42,I Don't Want To Wait,Paula Cole,4AxVXHgv0clBuS4dl4S7Gw,False,36,11,38,0.41,0.468,11,-8.177,1,0.0553,0.298,1.19e-05,0.0426,0.475,177.508,320027,4
1998-07-18,43,Heaven's What I Feel,Gloria Estefan,4AxVXHgv0clBuS4dl4S7Gw,False,39,27,9,0.62,0.903,5,-5.045,1,0.0383,0.18,0,0.12,0.427,130.992,301600,4
1998-07-18,44,Raise The Roof,Luke Featuring No Good But So Good,4AxVXHgv0clBuS4dl4S7Gw,False,40,26,17,0.737,0.892,2,-5.607,1,0.358,0.0436,0,0.0798,0.662,173.786,310827,4
1998-07-18,45,Ooh La La,Rod Stewart,4AxVXHgv0clBuS4dl4S7Gw,False,45,45,3,0.405,0.681,5,-8.755,0,0.0359,0.0213,0,0.0748,0.598,151.235,256133,4
1998-07-18,46,Body Bumpin' Yippie-Yi-Yo,Public Announcement,4AxVXHgv0clBuS4dl4S7Gw,False,34,5,22,0.782,0.363,2,-7.744,1,0.0441,0.0472,0,0.149,0.27,121.986,273667,4
1998-07-18,47,Cheers 2 U,Playa,4AxVXHgv0clBuS4dl4S7Gw,False,43,38,17,0.728,0.334,0,-11.11,1,0.0725,0.177,1.31e-06,0.103,0.478,127.053,311427,4
1998-07-18,48,Candle In The Wind 1997/Something About The Way You Look Tonight,Elton John,4AxVXHgv0clBuS4dl4S7Gw,False,47,1,41,0.48,0.628,6,-7.643,1,0.0262,0.174,3.28e-05,0.0753,0.541,143.412,240547,4
1998-07-18,49,There's Your Trouble,Dixie Chicks,4AxVXHgv0clBuS4dl4S7Gw,False,57,49,10,0.737,0.869,2,-5.433,1,0.0267,0.481,0,0.308,0.898,126.628,193065,4
1998-07-18,50,Do Your Thing,7 Mile,4AxVXHgv0clBuS4dl4S7Gw,False,60,50,13,0.7,0.216,3,-8.921,0,0.0402,0.0193,0.836,0.0577,0.416,59.994,291107,4
1998-07-18,51,It's All About Me,Mya & Sisqo,4AxVXHgv0clBuS4dl4S7Gw,False,38,6,19,0.812,0.5,2,-6.842,1,0.084,0.209,0,0.174,0.521,137.041,264933,4
1998-07-18,52,Who Am I,Beenie Man,4AxVXHgv0clBuS4dl4S7Gw,False,41,40,19,0.628,0.753,11,-8.778,1,0.468,0.211,0,0.12,0.559,86.194,196000,4
1998-07-18,53,Ava Adore,The Smashing Pumpkins,4AxVXHgv0clBuS4dl4S7Gw,False,42,42,3,0.604,0.844,8,-6.003,1,0.0597,0.000401,0.214,0.0484,0.791,160.318,270893,4
1998-07-18,54,Frozen,Madonna,4AxVXHgv0clBuS4dl4S7Gw,False,44,2,18,0.602,0.616,1,-10.917,1,0.0353,0.662,0.0153,0.149,0.31,108.017,367333,4
1998-07-18,55,Black Ice (Sky High),Goodie Mob Featuring Outkast,4AxVXHgv0clBuS4dl4S7Gw,False,59,55,4,0.927,0.678,11,-5.41,0,0.362,0.0471,0,0.0479,0.374,101.18,205107,4
1998-07-18,57,There You Are,Sam Salter,,False,70,57,5,0.63,0.52,11,-8.162,0,0.0289,0.257,0,0.0577,0.375,137.792,258400,4
1998-07-18,58,You Won't Forget Me,La Bouche,,False,55,48,7,0.722,0.91,1,-4.135,1,0.032,0.0182,1.17e-06,0.0872,0.687,133.045,196347,4
1998-07-18,59,Landslide,Fleetwood Mac,5ihS6UUlyQAfmp48eSkxuQ,True,0,59,1,0.414,0.161,7,-22.32,0,0.0318,0.883,0.000223,0.117,0.423,159.375,199493,4
1998-07-18,60,"The Cup Of Life (The Official Song Of The World Cup, France '98)",Ricky Martin,5ihS6UUlyQAfmp48eSkxuQ,False,62,60,4,0.709,0.911,5,-6.945,0,0.0433,0.0387,0.000132,0.391,0.661,126.984,279920,4
1998-07-18,61,Woof Woof,69 Boyz,1bg4iNalDl3bUBClWGmK2b,True,0,61,1,0.886,0.807,11,-8.19,1,0.118,0.155,9.73e-06,0.0681,0.617,135.009,271933,4
1998-07-18,62,Destiny,Myron,51o406VX7fJ7XezEDC8wq3,True,0,62,1,0.8,0.475,1,-8.732,1,0.176,0.235,0,0.133,0.612,83.669,241867,4
1998-07-18,63,Freak Out,Nutta Butta Featuring Teddy Riley And Anonymous,51o406VX7fJ7XezEDC8wq3,False,63,63,5,0.834,0.948,6,-4.022,1,0.157,0.0947,5.68e-06,0.326,0.738,99.53,295373,4
1998-07-18,64,If You Ever Have Forever In Mind,Vince Gill,51o406VX7fJ7XezEDC8wq3,False,75,64,3,0.293,0.251,5,-10.808,1,0.0281,0.854,0.000266,0.0963,0.297,182.237,279827,3
1998-07-18,65,I'm Alright,Jo Dee Messina,51o406VX7fJ7XezEDC8wq3,False,64,43,19,0.676,0.733,0,-7.745,1,0.0294,0.191,0,0.192,0.591,98.234,199040,3
1998-07-18,66,Spark,Tori Amos,51o406VX7fJ7XezEDC8wq3,False,58,49,4,0.351,0.738,4,-4.309,0,0.038,0.0797,5.21e-05,0.0829,0.475,138.025,253413,3
1998-07-18,67,Ninety Nine [Flash The Message],John Forte,51o406VX7fJ7XezEDC8wq3,False,69,59,8,0.882,0.52,4,-10.899,0,0.315,0.0589,0,0.313,0.447,96.846,223533,4
1998-07-18,68,Horse & Carriage,Cam'Ron Featuring Mase,00RYiT3a2lNQ1wTKBQXWSw,True,0,68,1,0.85,0.687,0,-5.995,0,0.308,0.213,0,0.0724,0.502,149.989,207013,4
1998-07-18,69,One Heart At A Time,Various Artists,00RYiT3a2lNQ1wTKBQXWSw,False,71,56,8,0.669,0.487,10,-9.823,1,0.0264,0.0975,0.191,0.292,0.475,104.688,242655,4
1998-07-18,71,Can't We Try,Rockell [Duet With Collage],,False,73,71,3,0.744,0.769,0,-8.674,1,0.0395,0.0355,0.00142,0.113,0.95,132.074,257107,4
1998-07-18,72,Wishlist,Pearl Jam,,False,67,47,9,0.623,0.342,0,-8.694,1,0.038,0.0134,0.00412,0.106,0.101,115.032,206587,4
1998-07-18,74,I Do [Cherish You],Mark Wills,,False,80,72,11,0.586,0.477,6,-8.136,1,0.0243,0.593,0,0.0935,0.308,82.991,199707,4
1998-07-18,75,Push It,Garbage,,False,66,52,11,0.564,0.909,0,-6.471,1,0.0311,0.00034,0.11,0.0746,0.892,123.895,242533,4
1998-07-18,77,Recover Your Soul,Elton John,,False,72,55,14,0.725,0.653,7,-9.365,1,0.0238,0.134,0.00675,0.272,0.582,103.003,318040,4
1998-07-18,78,I Just Want To Dance With You,George Strait,,False,83,61,13,0.715,0.469,0,-8.674,1,0.0279,0.439,8.69e-05,0.104,0.502,113.991,210867,4
1998-07-18,80,Victory,Puff Daddy & The Family Featuring The Notorious B.I.G. & Busta Rh,,False,52,19,18,0.609,0.731,9,-6.846,1,0.322,0.397,0,0.664,0.685,91.778,296267,4
1998-07-18,81,The Actual,All City,,False,87,81,2,0.905,0.809,2,-3.751,1,0.225,0.128,0,0.096,0.74,90.522,251933,4
1998-07-18,82,A Man Holdin' On (To A Woman Lettin' Go),Ty Herndon,,False,84,81,7,0.606,0.403,9,-7.95,1,0.0288,0.555,1.23e-06,0.0954,0.202,128.122,217160,4
1998-07-18,83,Bitter Sweet Symphony,The Verve,,False,74,12,17,0.356,0.917,9,-6.006,1,0.0479,0.0335,0,0.406,0.518,171.176,357267,4
1998-07-18,84,Now That I Found You,Terri Clark,,False,79,72,9,0.593,0.461,2,-7.549,1,0.0236,0.356,0,0.183,0.27,90.399,217360,4
1998-07-18,86,I Honestly Love You (David Foster Vers.),Olivia Newton-John,,False,78,67,8,0.637,0.329,10,-11.362,1,0.0272,0.613,2.36e-06,0.14,0.152,112.075,246147,4
1998-07-18,87,I'm From The Country,Tracy Byrd,,False,97,63,16,0.687,0.898,2,-3.93,1,0.042,0.206,0,0.284,0.952,129.542,213973,4
1998-07-18,88,Stepping Stone,Lari White,,False,94,88,2,0.639,0.667,7,-6.005,1,0.0272,0.226,0,0.123,0.744,79.181,209040,4
1998-07-18,89,Money Ain't A Thang,JD Featuring Jay-Z,,False,77,77,3,0.843,0.734,6,-7.348,0,0.248,0.0496,0,0.124,0.849,100.016,253827,4
1998-07-18,90,Imagination,Tamia,,False,68,37,18,0.895,0.495,9,-7.186,0,0.178,0.0998,6.28e-05,0.0583,0.593,99.233,213973,4
1998-07-18,91,So Into You,Tamia,3c6afiysmB7OnxQzzSqRfD,True,0,91,1,0.656,0.479,7,-7.055,0,0.0348,0.0665,0.00272,0.168,0.708,184.374,261867,4
1998-07-18,92,Baby Be There,Nu Flavor,3c6afiysmB7OnxQzzSqRfD,False,100,83,6,0.615,0.516,4,-8.31,0,0.0238,0.601,3.33e-05,0.0524,0.329,83.75,255840,4
1998-07-18,93,There Goes My Baby,Trisha Yearwood,4ke1a35DUJFvPeqINRunaJ,True,0,93,1,0.67,0.626,0,-5.579,1,0.0236,0.479,0,0.112,0.593,108.84,233000,4
1998-07-18,94,Here We Go Again,Aretha Franklin,2LOOazstxedsL3dBhfo5zF,True,0,94,1,0.774,0.722,9,-8.56,0,0.168,0.216,0,0.0589,0.793,99.267,210400,4
1998-07-18,95,Sin So Well,Rebekah,2LOOazstxedsL3dBhfo5zF,False,93,80,5,0.727,0.629,6,-5.022,0,0.0331,0.288,0,0.107,0.518,119.663,219360,4
1998-07-18,96,The Mummers' Dance,Loreena McKennitt,2LOOazstxedsL3dBhfo5zF,False,90,18,20,0.548,0.456,0,-11.53,0,0.0289,0.425,0.116,0.0892,0.294,120.274,367440,4
1998-07-18,97,Clock Strikes,Timbaland & Magoo,2LOOazstxedsL3dBhfo5zF,False,86,37,12,0.787,0.714,6,-8.63,0,0.131,0.0641,0.436,0.273,0.81,165.465,291120,4
1998-07-18,98,Do For Love,2Pac Featuring Eric Williams,2LOOazstxedsL3dBhfo5zF,False,82,21,18,0.874,0.63,1,-3.585,1,0.298,0.0578,0.00479,0.0582,0.717,95.0,281600,4
1998-07-18,99,Second Round K.O.,Canibus,2LOOazstxedsL3dBhfo5zF,False,81,28,15,0.74,0.537,7,-11.337,1,0.457,0.0159,0,0.564,0.686,94.025,277533,4
1998-07-18,100,You Only Have To Say You Love Me,Hannah Jones,2LOOazstxedsL3dBhfo5zF,False,88,88,6,0.737,0.957,2,-6.877,0,0.0421,0.00216,0.000819,0.353,0.961,130.005,360160,4
