date,position,title,artist,spotify_id,is_new,last_pos,peak_pos,weeks,danceability,energy,key,loudness,mode,speechiness,acousticness,instrumentalness,liveness,valence,tempo,duration_ms,time_signature
1991-11-09,1,Cream,Prince And The N.P.G.,,False,3,1,7,0.861,0.604,5,-8.44,0,0.0719,0.0974,0.366,0.0467,0.853,115.589,253067,4
1991-11-09,2,Romantic,Karyn White,,False,1,1,13,0.68,0.941,1,-7.509,0,0.0374,0.484,7.43e-05,0.0656,0.823,110.264,247160,4
1991-11-09,3,Can't Stop This Thing We Started,Bryan Adams,,False,5,3,9,0.497,0.93,9,-3.902,1,0.0444,0.0112,0,0.354,0.47,113.086,195933,4
1991-11-09,4,Real Real Real,Jesus Jones,,False,7,4,12,0.596,0.547,0,-13.136,1,0.0331,0.0478,4.92e-05,0.157,0.697,110.209,188760,4
1991-11-09,5,When A Man Loves A Woman,Michael Bolton,,False,15,5,5,0.476,0.363,1,-10.706,1,0.0296,0.2,0,0.055,0.243,164.555,231067,3
1991-11-09,6,O.P.P.,Naughty By Nature,,False,8,6,10,0.848,0.838,4,-11.949,0,0.0723,0.0326,4.63e-06,0.124,0.774,97.735,271067,4
1991-11-09,7,Emotions,Mariah Carey,,False,2,1,11,0.74,0.752,9,-7.008,0,0.0359,0.0409,0.00125,0.0233,0.939,114.851,248093,4
1991-11-09,8,It's So Hard To Say Goodbye To Yesterday,Boyz II Men,,False,12,8,8,0.3,0.225,4,-11.079,1,0.0264,0.915,0,0.159,0.294,87.698,168627,4
1991-11-09,9,Do Anything,Natural Selection,,False,4,2,14,0.654,0.749,11,-9.221,0,0.0537,0.0746,0,0.114,0.663,93.847,237373,4
1991-11-09,10,Set The Night To Music,Roberta Flack With Maxi Priest,,False,11,10,8,0.678,0.37,5,-16.073,1,0.0301,0.38,3.5e-05,0.128,0.622,121.595,323880,4
1991-11-09,11,Set Adrift On Memory Bliss,P.M. Dawn,,False,25,11,4,0.795,0.705,5,-8.552,0,0.0715,0.00118,0.00658,0.136,0.482,100.025,235800,4
1991-11-09,12,The One And Only,Chesney Hawkes,,False,10,10,15,0.681,0.697,4,-11.063,1,0.0327,0.357,0,0.388,0.775,119.956,223667,4
1991-11-09,13,Don't Cry,Guns N' Roses,,False,14,13,8,0.456,0.59,11,-8.638,1,0.0327,0.00182,0.00379,0.104,0.243,124.635,283733,4
1991-11-09,14,Hole Hearted,Extreme,,False,6,4,15,0.4,0.747,6,-9.438,1,0.045,0.163,0,0.0774,0.674,203.396,219289,4
1991-11-09,15,Don't Want To Be A Fool,Luther Vandross,,False,9,9,15,0.632,0.576,7,-8.345,1,0.0234,0.482,0,0.151,0.323,95.321,275133,4
1991-11-09,16,I Wonder Why,Curtis Stigers,,False,17,16,10,0.549,0.62,0,-8.971,1,0.0306,0.0573,0,0.591,0.288,135.112,267240,3
1991-11-09,17,That's What Love Is For,Amy Grant,,False,20,17,7,0.544,0.699,9,-4.148,1,0.0341,0.258,0,0.144,0.293,141.844,257293,4
1991-11-09,18,With You,Tony Terry,,False,16,16,20,0.619,0.492,8,-9.532,1,0.0328,0.455,0,0.106,0.553,131.888,305827,4
1991-11-09,20,Let's Talk About Sex,Salt-N-Pepa,,False,21,20,12,0.863,0.543,6,-13.497,1,0.13,0.0507,0,0.241,0.799,106.929,213267,4
1991-11-09,21,Blowing Kisses In The Wind,Paula Abdul,,False,27,21,4,0.524,0.544,6,-9.059,0,0.0337,0.574,0,0.236,0.261,147.674,281840,4
1991-11-09,22,Street Of Dreams,Nia Peeples,,False,30,22,5,0.753,0.628,0,-10.54,0,0.0466,0.00747,0.000123,0.263,0.94,110.516,263533,4
1991-11-09,23,Get A Leg Up,John Mellencamp,,False,29,23,6,0.6,0.914,2,-4.748,1,0.0468,0.00518,1.84e-06,0.0649,0.736,138.586,227200,4
1991-11-09,24,Enter Sandman,Metallica,,False,22,16,12,0.579,0.824,6,-8.71,0,0.03,0.00206,0.00903,0.059,0.635,123.331,331573,4
1991-11-09,25,Something To Talk About,Bonnie Raitt,,False,19,5,17,0.795,0.64,1,-13.478,1,0.0294,0.0631,2.13e-06,0.0692,0.954,102.633,227573,4
1991-11-09,26,Ring My Bell,D.J. Jazzy Jeff & The Fresh Prince,,False,33,26,5,0.808,0.612,10,-12.453,0,0.0726,0.00548,0.00145,0.456,0.701,118.121,284867,4
1991-11-09,27,Lies,EMF,,False,31,27,7,0.543,0.864,8,-9.874,1,0.0381,0.000611,0.00223,0.207,0.759,113.952,259667,4
1991-11-09,28,My Heart Belongs To You,Russ Irwin,,False,32,28,9,0.491,0.34,3,-12.18,1,0.0293,0.645,1.46e-06,0.112,0.226,133.305,240933,4
1991-11-09,29,Running Back To You,Vanessa Williams,,False,18,18,14,0.723,0.865,5,-10.517,1,0.0451,0.0358,0.51,0.335,0.875,115.303,280000,4
1991-11-09,30,Love Of A Lifetime,Firehouse,,False,28,5,20,0.472,0.48,1,-11.893,1,0.0308,0.000204,0.00275,0.0914,0.126,123.023,286573,4
1991-11-09,31,Good Vibrations,Marky Mark & The Funky Bunch Featuring Loleatta Holloway,,False,23,1,17,0.711,0.951,1,-8.406,1,0.0537,0.00189,0.366,0.0229,0.903,121.656,269307,4
1991-11-09,32,Something Got Me Started,Simply Red,,False,35,32,7,0.698,0.91,2,-6.563,1,0.0459,0.019,7.73e-05,0.11,0.715,112.112,240706,4
1991-11-09,33,Everybody Plays The Fool,Aaron Neville,,False,24,8,17,0.789,0.352,10,-14.022,1,0.143,0.224,0.00147,0.0536,0.431,87.894,266107,4
1991-11-09,34,Keep Coming Back,Richard Marx,,False,47,34,2,0.72,0.478,9,-11.074,1,0.0239,0.115,2.27e-05,0.104,0.672,97.073,409360,4
1991-11-09,35,Rush,Big Audio,,False,39,35,8,0.791,0.768,9,-9.348,1,0.0957,0.137,3.85e-06,0.307,0.722,124.077,257133,4
1991-11-09,36,Top Of The World,Van Halen,,False,40,36,5,0.546,0.785,9,-8.788,1,0.0297,0.0354,3.6e-06,0.0935,0.804,127.957,232867,4
1991-11-09,37,All 4 Love,Color Me Badd,4XmsMIMjvDIFEjeY3ycMzW,True,0,37,1,0.807,0.75,2,-8.29,1,0.0315,0.0346,0.000179,0.149,0.797,106.389,211493,4
1991-11-09,38,Mind Playing Tricks On Me,Geto Boys,4XmsMIMjvDIFEjeY3ycMzW,False,38,38,6,0.886,0.512,10,-11.825,0,0.237,0.207,0,0.0991,0.454,93.997,308733,4
1991-11-09,39,Finally,CeCe Peniston,4XmsMIMjvDIFEjeY3ycMzW,False,43,39,7,0.791,0.658,7,-11.128,1,0.0445,0.00653,0,0.0472,0.842,120.066,245000,4
1991-11-09,40,No Son Of Mine,Genesis,4XmsMIMjvDIFEjeY3ycMzW,False,53,40,2,0.658,0.595,4,-8.704,0,0.0251,0.133,0.000358,0.0978,0.256,103.975,399107,4
1991-11-09,41,I Adore Mi Amor,Color Me Badd,4XmsMIMjvDIFEjeY3ycMzW,False,26,1,16,0.683,0.476,3,-9.995,0,0.027,0.243,0,0.0787,0.725,91.99,289200,4
1991-11-09,42,Just Want To Hold You,Jasmine Guy,4XmsMIMjvDIFEjeY3ycMzW,False,34,34,15,0.611,0.368,8,-13.701,1,0.0362,0.3,4.05e-05,0.0567,0.451,161.986,251867,4
1991-11-09,43,Broken Arrow,Rod Stewart,4XmsMIMjvDIFEjeY3ycMzW,False,45,43,4,0.569,0.486,2,-10.64,1,0.0248,0.364,0.000326,0.267,0.509,83.213,261093,4
1991-11-09,44,Groovy Train,The Farm,4XmsMIMjvDIFEjeY3ycMzW,False,44,44,7,0.663,0.663,7,-16.943,1,0.0351,0.00286,1.78e-05,0.0233,0.782,115.858,244467,4
1991-11-09,45,Live For Loving You,Gloria Estefan,4XmsMIMjvDIFEjeY3ycMzW,False,48,45,5,0.728,0.613,7,-12.704,1,0.0369,0.093,0.00419,0.0448,0.521,114.926,276893,4
1991-11-09,46,Forever My Lady,Jodeci,4XmsMIMjvDIFEjeY3ycMzW,False,57,46,3,0.707,0.5,9,-15.198,0,0.0387,0.136,0,0.237,0.77,117.997,320360,4
1991-11-09,47,Wildside,Marky Mark & The Funky Bunch,2U25Ne3teRZLF1wsRnjcfW,True,0,47,1,0.767,0.356,8,-15.502,0,0.106,0.166,0.309,0.101,0.271,105.404,307267,4
1991-11-09,48,Angel Baby,Angelica,2U25Ne3teRZLF1wsRnjcfW,False,58,48,4,0.866,0.391,0,-7.632,1,0.0453,0.197,0.000377,0.0822,0.462,126.434,240867,4
1991-11-09,49,A Day In My Life (Without You),Lisette Melendez,2U25Ne3teRZLF1wsRnjcfW,False,50,49,7,0.606,0.947,6,-4.446,0,0.0371,0.000874,0.314,0.0514,0.789,119.104,235040,4
1991-11-09,50,Motownphilly,Boyz II Men,2U25Ne3teRZLF1wsRnjcfW,False,36,3,22,0.754,0.857,2,-9.699,1,0.0605,0.0143,2.14e-05,0.278,0.785,114.144,235227,4
1991-11-09,51,Tender Kisses,Tracie Spencer,2U25Ne3teRZLF1wsRnjcfW,False,64,51,4,0.594,0.521,0,-11.033,1,0.0417,0.161,0.00556,0.0382,0.789,167.569,328240,4
1991-11-09,52,Can't Truss It,Public Enemy,2U25Ne3teRZLF1wsRnjcfW,False,55,52,4,0.802,0.872,11,-7.651,1,0.139,0.00196,0,0.132,0.607,101.664,321573,4
1991-11-09,53,Spending My Time,Roxette,2U25Ne3teRZLF1wsRnjcfW,False,66,53,3,0.42,0.574,4,-5.149,1,0.0292,0.238,0.000115,0.127,0.218,170.549,275667,4
1991-11-09,56,Whispers,Corina,,False,51,51,7,0.652,0.803,4,-12.688,0,0.0546,0.00942,0.00183,0.349,0.441,122.699,287893,4
1991-11-09,57,Walk Through Fire,Bad Company,,False,41,28,12,0.626,0.698,7,-10.311,1,0.0325,0.00316,0.0211,0.331,0.72,122.965,288560,4
1991-11-09,58,Now That We Found Love,Heavy D & The Boyz,,False,42,11,20,0.744,0.697,8,-14.753,1,0.0631,0.039,0,0.171,0.683,119.955,258200,4
1991-11-09,59,Save Up All Your Tears,Cher,,False,68,59,4,0.609,0.773,5,-9.166,1,0.0389,0.075,0,0.188,0.352,113.443,238160,4
1991-11-09,60,(Everything I Do) I Do It For You,Bryan Adams,,False,46,1,20,0.508,0.834,2,-6.205,1,0.0386,0.0183,0,0.0732,0.774,139.131,216053,4
1991-11-09,61,2 Legit 2 Quit,M.C. Hammer,4ZnKSrukEcPuMxGrcZEEh1,True,0,61,1,0.853,0.884,1,-6.771,1,0.0836,0.0394,6.83e-06,0.0313,0.668,124.542,333624,4
1991-11-09,62,Change,Lisa Stansfield,4ZnKSrukEcPuMxGrcZEEh1,False,92,62,2,0.677,0.845,2,-8.27,0,0.0379,0.0253,0.00102,0.325,0.639,105.893,274747,4
1991-11-09,63,Gett Off,Prince And The N.P.G.,4ZnKSrukEcPuMxGrcZEEh1,False,49,21,13,0.655,0.628,10,-11.407,0,0.0947,0.00448,0.000751,0.29,0.602,99.842,271667,4
1991-11-09,64,Shot Of Poison,Lita Ford,4ZnKSrukEcPuMxGrcZEEh1,False,78,64,2,0.578,0.855,5,-8.057,1,0.0414,0.0388,5.56e-06,0.345,0.732,126.264,210733,4
1991-11-09,65,Pop That Coochie,The 2 Live Crew,4ZnKSrukEcPuMxGrcZEEh1,False,70,65,2,0.904,0.89,7,-6.708,1,0.176,0.000246,0.00174,0.113,0.647,127.811,257800,4
1991-11-09,66,Love. . .Thy Will Be Done,Martika,4ZnKSrukEcPuMxGrcZEEh1,False,37,10,14,0.663,0.34,2,-10.995,1,0.0286,0.4,0.00363,0.163,0.269,91.38,302773,4
1991-11-09,67,Wind Of Change,Scorpions,4ZnKSrukEcPuMxGrcZEEh1,False,63,4,24,0.452,0.524,0,-10.108,1,0.0351,0.315,0,0.103,0.246,151.505,312360,4
1991-11-09,68,I've Got A Lot To Learn About Love,The Storm,4ZnKSrukEcPuMxGrcZEEh1,False,82,68,3,0.583,0.742,9,-8.621,0,0.0255,0.00532,1.08e-06,0.0752,0.57,110.671,265467,4
1991-11-09,69,Straight To Your Heart,Bad English,4ZnKSrukEcPuMxGrcZEEh1,False,52,42,11,0.564,0.825,8,-7.081,1,0.0365,0.0877,7.47e-06,0.246,0.585,127.112,249027,4
1991-11-09,70,What Time Is Love?,The KLF,4ZnKSrukEcPuMxGrcZEEh1,False,87,70,3,0.642,0.88,6,-5.216,1,0.134,0.00233,3.07e-05,0.916,0.576,120.099,235852,4
1991-11-09,71,Conviction Of The Heart,Kenny Loggins,4ZnKSrukEcPuMxGrcZEEh1,False,79,71,3,0.491,0.5,7,-12.097,0,0.0377,0.439,5.63e-06,0.114,0.406,96.7,411267,4
1991-11-09,72,Home Sweet Home,Motley Crue,4zXvB4MoQD8onk0NCZbeHG,True,0,72,1,0.403,0.777,5,-6.416,1,0.0354,0.0999,3.28e-06,0.124,0.149,76.329,240933,4
1991-11-09,73,The Devil Came Up To Michigan,K.M.C. KRU,4zXvB4MoQD8onk0NCZbeHG,False,60,46,11,0.86,0.636,2,-15.511,1,0.145,0.172,4.9e-05,0.368,0.842,128.012,226933,4
1991-11-09,74,The Fly,U2,4nBln1vXTHnJzXvNgvXyIA,True,0,74,1,0.507,0.934,11,-8.888,0,0.0553,3.52e-05,0.0253,0.161,0.417,108.345,269053,4
1991-11-09,75,Power Windows,Billy Falcon,4nBln1vXTHnJzXvNgvXyIA,False,59,35,13,0.716,0.568,9,-10.478,1,0.0293,0.0743,0,0.0536,0.393,103.027,244373,4
1991-11-09,76,Too Many Walls,Cathy Dennis,4nBln1vXTHnJzXvNgvXyIA,False,65,8,19,0.729,0.578,10,-11.04,1,0.0267,0.377,2.44e-05,0.0886,0.649,97.146,264680,4
1991-11-09,77,Try A Little Tenderness,The Commitments,4nBln1vXTHnJzXvNgvXyIA,False,67,67,3,0.366,0.387,1,-13.329,0,0.044,0.0105,8.63e-05,0.213,0.124,107.131,272667,4
1991-11-09,78,Do You Feel Like I Feel?,Belinda Carlisle,4nBln1vXTHnJzXvNgvXyIA,False,81,78,3,0.579,0.895,2,-6.603,1,0.0395,7.22e-05,1.72e-05,0.293,0.695,122.98,273333,4
1991-11-09,79,Fall At Your Feet,Crowded House,4nBln1vXTHnJzXvNgvXyIA,False,76,76,4,0.65,0.371,0,-13.623,0,0.026,0.457,0.0116,0.102,0.561,102.583,198800,4
1991-11-09,80,For You,Michael W. Smith,4nBln1vXTHnJzXvNgvXyIA,False,69,60,9,0.576,0.627,4,-9.273,0,0.0292,0.388,4.25e-06,0.142,0.858,169.563,248093,4
1991-11-09,81,Stand By My Woman,Lenny Kravitz,4nBln1vXTHnJzXvNgvXyIA,False,85,81,4,0.505,0.409,2,-10.726,1,0.0307,0.14,0.233,0.106,0.252,122.261,260400,4
1991-11-09,82,Send Me An Angel,Scorpions,1bKQ48M9onID2kbSpRy8kK,True,0,82,1,0.153,0.417,1,-11.587,1,0.0318,0.434,0.000622,0.211,0.166,80.87,273333,3
1991-11-09,83,Kiss Them For Me,Siouxsie & The Banshees,1bKQ48M9onID2kbSpRy8kK,False,54,23,13,0.6,0.949,7,-5.473,0,0.0556,0.187,0.00539,0.105,0.752,99.387,277147,4
1991-11-09,84,Superman's Song,Crash Test Dummies,1bKQ48M9onID2kbSpRy8kK,False,56,56,6,0.406,0.124,10,-19.825,1,0.0342,0.613,1.08e-06,0.108,0.316,168.4,271600,4
1991-11-09,86,For Your Mind,Robbie Nevil,,False,90,86,3,0.746,0.562,10,-13.898,0,0.0445,0.106,1.16e-05,0.0801,0.763,111.141,229467,4
1991-11-09,88,True Companion,Marc Cohn,,False,94,88,2,0.465,0.16,9,-18.027,1,0.0407,0.813,1.08e-06,0.109,0.292,114.589,249960,4
1991-11-09,90,I'll Be There,The Escape Club,,False,71,8,25,0.57,0.385,1,-12.027,0,0.0251,0.383,0.0012,0.0924,0.188,99.86,347867,4
1991-11-09,91,Monsters And Angels,Voice Of The Beehive,,False,99,91,2,0.573,0.557,9,-9.778,1,0.0283,0.000247,2.26e-05,0.271,0.519,81.536,218146,4
1991-11-09,92,I'm Not Your Puppet,Hi-C,,False,91,63,13,0.718,0.729,0,-5.389,0,0.267,0.0403,0,0.171,0.651,188.51,360480,4
1991-11-09,93,Tell Me What You Want Me To Do,Tevin Campbell,0IhHkW1fnUSMEcLSHmKhrJ,True,0,93,1,0.609,0.551,6,-7.93,1,0.0291,0.0233,0,0.234,0.512,127.956,256040,4
1991-11-09,94,Thinking Of You,Grandmaster Slice,0IhHkW1fnUSMEcLSHmKhrJ,False,86,86,3,0.755,0.347,2,-13.853,0,0.0792,0.154,2.99e-05,0.115,0.634,138.673,240067,4
1991-11-09,95,Ballad Of Youth,Richie Sambora,0IhHkW1fnUSMEcLSHmKhrJ,False,73,63,7,0.522,0.769,4,-9.9,0,0.0383,0.123,0.00417,0.128,0.335,114.96,232840,4
1991-11-09,96,Forever More,Stevie B,0IhHkW1fnUSMEcLSHmKhrJ,False,97,96,3,0.612,0.794,10,-11.589,0,0.0497,0.157,6.35e-05,0.121,0.765,107.988,252693,4
1991-11-09,97,You're The Story Of My Life,Desmond Child,0IhHkW1fnUSMEcLSHmKhrJ,False,74,74,6,0.291,0.546,1,-10.473,1,0.039,0.0247,0,0.0731,0.203,134.676,298293,4
1991-11-09,98,I Can't Wait Another Minute,Hi-Five,0IhHkW1fnUSMEcLSHmKhrJ,False,75,8,21,0.625,0.644,8,-8.801,1,0.0287,0.357,0,0.102,0.638,147.435,301640,4
1991-11-09,99,Double Good Everything,Smokey Robinson,5USui5pZvkB9Uc1MucCQjJ,True,0,99,1,0.479,0.289,2,-12.582,1,0.0297,0.62,5.26e-05,0.23,0.133,119.861,155067,4
1991-11-09,100,"Time, Love And Tenderness",Michael Bolton,5USui5pZvkB9Uc1MucCQjJ,False,72,7,18,0.51,0.808,6,-8.649,0,0.0475,0.0281,0,0.295,0.738,170.037,330307,4
