date,position,title,artist,spotify_id,is_new,last_pos,peak_pos,weeks,danceability,energy,key,loudness,mode,speechiness,acousticness,instrumentalness,liveness,valence,tempo,duration_ms,time_signature
2019-08-24,1,Bad Guy,Billie Eilish,4j6GMcVcqZf1r0GDqMtYp6,False,2,1,20,0.701,0.425,7,-10.965,1,0.375,0.328,0.13,0.1,0.562,135.128,194088,4
2019-08-24,2,Senorita,Shawn Mendes & Camila Cabello,4j6GMcVcqZf1r0GDqMtYp6,False,3,2,8,0.759,0.54,9,-6.039,0,0.0287,0.037,0,0.0945,0.75,116.947,190960,4
2019-08-24,3,Old Town Road,Lil Nas X Featuring Billy Ray Cyrus,4j6GMcVcqZf1r0GDqMtYp6,False,1,1,24,0.878,0.619,6,-5.56,1,0.102,0.0533,0,0.113,0.639,136.041,157067,4
2019-08-24,4,Truth Hurts,Lizzo,4j6GMcVcqZf1r0GDqMtYp6,False,4,4,15,0.715,0.624,4,-3.046,0,0.114,0.11,0,0.123,0.412,158.087,173325,4
2019-08-24,5,Talk,Khalid,4j6GMcVcqZf1r0GDqMtYp6,False,5,3,27,0.901,0.4,0,-8.575,1,0.126,0.051,0,0.0599,0.346,135.984,197573,4
2019-08-24,6,No Guidance,Chris Brown Featuring Drake,4j6GMcVcqZf1r0GDqMtYp6,False,6,6,10,0.696,0.454,1,-6.756,0,0.153,0.123,0,0.155,0.136,92.928,260640,4
2019-08-24,7,I Don't Care,Ed Sheeran & Justin Bieber,4j6GMcVcqZf1r0GDqMtYp6,False,7,2,14,0.798,0.675,6,-5.041,1,0.0442,0.0912,0,0.0894,0.842,101.956,219947,4
2019-08-24,8,Ran$om,Lil Tecca,4j6GMcVcqZf1r0GDqMtYp6,False,10,8,11,0.536,0.715,7,-6.577,1,0.287,0.571,0.000418,0.471,0.391,179.631,60070,4
2019-08-24,9,Goodbyes,Post Malone Featuring Young Thug,4j6GMcVcqZf1r0GDqMtYp6,False,9,3,6,0.548,0.653,5,-3.875,1,0.081,0.456,0,0.103,0.163,150.068,174853,4
2019-08-24,10,If I Can't Have You,Shawn Mendes,4j6GMcVcqZf1r0GDqMtYp6,False,11,2,15,0.69,0.809,2,-4.198,1,0.0603,0.524,0,0.147,0.864,123.912,190800,4
2019-08-24,11,Hot Girl Summer,"Megan Thee Stallion, Nicki Minaj & Ty Dolla $ign",5N1o6d8zGcSZSeMFkOUQOk,True,0,11,1,0.872,0.814,0,-4.568,1,0.155,0.00485,1.96e-06,0.214,0.57,98.985,199427,4
2019-08-24,12,Sucker,Jonas Brothers,5N1o6d8zGcSZSeMFkOUQOk,False,12,1,24,0.842,0.734,1,-5.065,0,0.0588,0.0427,0,0.106,0.952,137.958,181027,4
2019-08-24,13,Money In The Grave,Drake Featuring Rick Ross,5N1o6d8zGcSZSeMFkOUQOk,False,13,7,9,0.831,0.502,10,-4.045,0,0.046,0.101,0,0.122,0.101,100.541,205427,4
2019-08-24,14,Someone You Loved,Lewis Capaldi,5N1o6d8zGcSZSeMFkOUQOk,False,17,14,14,0.501,0.405,1,-5.679,1,0.0319,0.751,0,0.105,0.446,109.891,182161,4
2019-08-24,15,Sunflower (Spider-Man: Into The Spider-Verse),Post Malone & Swae Lee,5N1o6d8zGcSZSeMFkOUQOk,False,14,1,43,0.76,0.479,2,-5.574,1,0.0466,0.556,0,0.0703,0.913,89.911,158040,4
2019-08-24,16,Suge,DaBaby,5N1o6d8zGcSZSeMFkOUQOk,False,15,7,20,0.876,0.662,2,-6.482,0,0.426,0.0608,0,0.127,0.844,75.445,163320,4
2019-08-24,17,The Git Up,Blanco Brown,5N1o6d8zGcSZSeMFkOUQOk,False,16,14,10,0.847,0.678,9,-8.635,1,0.109,0.0669,0,0.274,0.811,97.984,200594,4
2019-08-24,18,You Need To Calm Down,Taylor Swift,5N1o6d8zGcSZSeMFkOUQOk,False,18,2,9,0.771,0.671,2,-5.617,1,0.0553,0.00929,0,0.0637,0.714,85.026,171360,4
2019-08-24,19,Boyfriend,Ariana Grande & Social House,5N1o6d8zGcSZSeMFkOUQOk,False,8,8,2,0.4,0.795,10,-3.731,0,0.461,0.119,0,0.159,0.702,190.097,186107,4
2019-08-24,20,Beautiful People,Ed Sheeran Featuring Khalid,5N1o6d8zGcSZSeMFkOUQOk,False,22,19,7,0.64,0.648,5,-8.113,0,0.187,0.124,0,0.0802,0.548,92.977,197867,4
2019-08-24,21,"Hey Look Ma, I Made It",Panic! At The Disco,5N1o6d8zGcSZSeMFkOUQOk,False,19,16,18,0.577,0.833,5,-3.337,1,0.0695,0.0137,0,0.121,0.58,107.936,169667,4
2019-08-24,22,Dancing With A Stranger,Sam Smith & Normani,5N1o6d8zGcSZSeMFkOUQOk,False,20,7,31,0.741,0.52,8,-7.513,1,0.0656,0.45,1.97e-06,0.222,0.347,102.998,171030,4
2019-08-24,23,Beer Never Broke My Heart,Luke Combs,5N1o6d8zGcSZSeMFkOUQOk,False,21,21,15,0.538,0.863,1,-4.483,1,0.0481,0.0139,0,0.0874,0.637,77.001,186733,4
2019-08-24,24,Pop Out,Polo G Featuring Lil Tjay,5N1o6d8zGcSZSeMFkOUQOk,False,25,11,21,0.772,0.639,1,-7.119,1,0.467,0.15,0,0.0698,0.261,168.112,166560,4
2019-08-24,25,Without Me,Halsey,5N1o6d8zGcSZSeMFkOUQOk,False,24,1,45,0.752,0.488,6,-7.05,1,0.0705,0.297,9.11e-06,0.0936,0.533,136.041,201661,4
2019-08-24,26,Wow.,Post Malone,5N1o6d8zGcSZSeMFkOUQOk,False,23,2,34,0.829,0.539,11,-7.359,0,0.208,0.136,1.78e-06,0.103,0.388,99.96,149547,4
2019-08-24,27,The London,"Young Thug, J. Cole & Travis Scott",5N1o6d8zGcSZSeMFkOUQOk,False,27,12,12,0.796,0.586,4,-6.946,0,0.147,0.0247,0,0.132,0.179,97.981,200107,4
2019-08-24,28,Speechless,Dan + Shay,5N1o6d8zGcSZSeMFkOUQOk,False,28,24,34,0.616,0.438,1,-5.968,1,0.0298,0.356,0,0.24,0.386,135.929,213387,4
2019-08-24,29,7 Rings,Ariana Grande,5N1o6d8zGcSZSeMFkOUQOk,False,30,1,30,0.778,0.317,1,-10.732,0,0.334,0.592,0,0.0881,0.327,140.048,178627,4
2019-08-24,30,Happier,Marshmello & Bastille,5N1o6d8zGcSZSeMFkOUQOk,False,26,2,52,0.687,0.792,5,-2.749,1,0.0452,0.191,0,0.167,0.671,100.015,214290,4
2019-08-24,31,All To Myself,Dan + Shay,5N1o6d8zGcSZSeMFkOUQOk,False,33,31,15,0.646,0.781,1,-4.616,1,0.0313,0.208,0,0.125,0.565,94.975,169920,4
2019-08-24,32,Knockin' Boots,Luke Bryan,5N1o6d8zGcSZSeMFkOUQOk,False,32,32,16,0.739,0.682,2,-3.728,1,0.205,0.129,0,0.328,0.634,131.983,199382,4
2019-08-24,33,My Type,Saweetie,5N1o6d8zGcSZSeMFkOUQOk,False,35,33,7,0.899,0.811,2,-6.294,1,0.258,0.000677,0,0.0672,0.587,105.038,126446,4
2019-08-24,34,Baby,Lil Baby & DaBaby,5N1o6d8zGcSZSeMFkOUQOk,False,45,34,4,0.97,0.463,10,-7.259,1,0.366,0.0957,0,0.151,0.46,108.003,142417,4
2019-08-24,35,God's Country,Blake Shelton,5N1o6d8zGcSZSeMFkOUQOk,False,29,17,20,0.538,0.752,10,-5.106,1,0.0396,0.0608,5.39e-06,0.118,0.217,139.984,205107,4
2019-08-24,36,Panini,Lil Nas X,5N1o6d8zGcSZSeMFkOUQOk,False,31,16,8,0.717,0.598,5,-5.613,0,0.0809,0.22,0,0.122,0.496,153.905,151040,4
2019-08-24,37,How Do You Sleep?,Sam Smith,5N1o6d8zGcSZSeMFkOUQOk,False,37,29,4,0.477,0.682,1,-4.931,0,0.0925,0.153,0,0.0763,0.345,110.567,202205,5
2019-08-24,38,Whiskey Glasses,Morgan Wallen,5N1o6d8zGcSZSeMFkOUQOk,False,36,17,24,0.614,0.68,6,-4.58,1,0.0289,0.369,1.84e-06,0.115,0.707,149.959,234347,4
2019-08-24,39,Cash Shit,Megan Thee Stallion Featuring DaBaby,5N1o6d8zGcSZSeMFkOUQOk,False,41,39,8,0.921,0.635,1,-4.904,1,0.416,0.0218,0,0.0946,0.549,130.028,192540,4
2019-08-24,40,Shotta Flow,NLE Choppa,5N1o6d8zGcSZSeMFkOUQOk,False,39,36,17,0.894,0.511,2,-4.768,1,0.42,0.0251,0,0.14,0.568,120.08,176632,4
2019-08-24,41,Rearview Town,Jason Aldean,5N1o6d8zGcSZSeMFkOUQOk,False,40,40,12,0.526,0.85,10,-4.47,0,0.0313,0.023,0,0.0948,0.338,141.973,184173,4
2019-08-24,42,Sweet But Psycho,Ava Max,5N1o6d8zGcSZSeMFkOUQOk,False,34,10,35,0.72,0.706,1,-4.719,1,0.0473,0.0684,0,0.166,0.62,133.002,187436,4
2019-08-24,43,Otro Trago,"Sech, Darell, Nicky Jam, Ozuna & Anuel AA",5N1o6d8zGcSZSeMFkOUQOk,False,44,34,10,0.725,0.79,0,-2.331,1,0.197,0.0711,1.14e-06,0.0602,0.763,175.988,287773,4
2019-08-24,44,China,"Anuel AA, Daddy Yankee, Karol G, Ozuna & J Balvin",5N1o6d8zGcSZSeMFkOUQOk,False,43,43,4,0.786,0.808,7,-3.702,1,0.0882,0.0846,0.000289,0.0822,0.609,105.027,301714,4
2019-08-24,45,Better,Khalid,5N1o6d8zGcSZSeMFkOUQOk,False,42,8,48,0.596,0.552,0,-10.278,0,0.097,0.0765,0.334,0.104,0.112,97.949,229320,4
2019-08-24,46,One Thing Right,Marshmello & Kane Brown,5N1o6d8zGcSZSeMFkOUQOk,False,62,46,8,0.659,0.623,4,-2.253,1,0.0451,0.0667,0,0.582,0.439,88.042,181824,4
2019-08-24,47,Trampoline,SHAED,5N1o6d8zGcSZSeMFkOUQOk,False,52,47,11,0.689,0.412,7,-7.523,0,0.0301,0.488,0.00016,0.0659,0.537,126.754,184060,4
2019-08-24,48,Going Bad,Meek Mill Featuring Drake,5N1o6d8zGcSZSeMFkOUQOk,False,47,6,37,0.889,0.496,4,-6.365,0,0.0905,0.259,0,0.252,0.544,86.003,180522,4
2019-08-24,49,Queen Of Mean,Sarah Jeffery,5N1o6d8zGcSZSeMFkOUQOk,False,67,49,2,0.543,0.787,8,-6.52,1,0.241,0.248,0,0.0778,0.343,173.702,189397,4
2019-08-24,50,Never Really Over,Katy Perry,5N1o6d8zGcSZSeMFkOUQOk,False,38,15,11,0.77,0.882,8,-4.792,1,0.0602,0.194,0,0.316,0.385,99.991,223523,4
2019-08-24,51,Clout,Offset Featuring Cardi B,5N1o6d8zGcSZSeMFkOUQOk,False,50,39,19,0.919,0.622,1,-7.384,1,0.0997,0.228,4.24e-06,0.122,0.424,140.022,205803,4
2019-08-24,52,The Ones That Didn't Make It Back Home,Justin Moore,5N1o6d8zGcSZSeMFkOUQOk,False,46,46,9,0.537,0.784,3,-4.869,1,0.034,0.0979,0,0.224,0.468,137.995,191018,4
2019-08-24,53,Only Human,Jonas Brothers,5N1o6d8zGcSZSeMFkOUQOk,False,63,53,9,0.795,0.496,0,-5.883,1,0.0722,0.108,0,0.0645,0.874,94.01,183000,4
2019-08-24,54,Callaita,Bad Bunny & Tainy,5N1o6d8zGcSZSeMFkOUQOk,False,53,52,10,0.61,0.624,2,-4.773,1,0.309,0.6,2.12e-06,0.243,0.244,176.169,250534,4
2019-08-24,55,Raised On Country,Chris Young,5N1o6d8zGcSZSeMFkOUQOk,False,54,54,11,0.572,0.794,2,-3.224,1,0.0455,0.395,0,0.23,0.79,148.095,175595,4
2019-08-24,56,Easier,5 Seconds Of Summer,5N1o6d8zGcSZSeMFkOUQOk,False,55,48,12,0.562,0.46,5,-4.173,1,0.259,0.476,0,0.107,0.623,176.055,158099,4
2019-08-24,57,Go Loko,"YG, Tyga & Jon Z",5N1o6d8zGcSZSeMFkOUQOk,False,51,49,15,0.88,0.67,2,-5.177,1,0.0468,0.325,4.17e-06,0.0662,0.131,101.008,299227,4
2019-08-24,58,Talk You Out Of It,Florida Georgia Line,5N1o6d8zGcSZSeMFkOUQOk,False,57,57,26,0.651,0.708,4,-4.791,1,0.0376,0.582,0,0.0796,0.558,119.964,202920,4
2019-08-24,59,Gold Roses,Rick Ross Featuring Drake,5N1o6d8zGcSZSeMFkOUQOk,False,73,39,3,0.502,0.633,1,-5.8,1,0.419,0.00991,0,0.389,0.552,83.226,349600,4
2019-08-24,60,Call You Mine,The Chainsmokers & Bebe Rexha,5N1o6d8zGcSZSeMFkOUQOk,False,56,56,11,0.585,0.696,4,-5.6,0,0.0307,0.204,0,0.344,0.522,104.01,217640,4
2019-08-24,61,Press,Cardi B,5N1o6d8zGcSZSeMFkOUQOk,False,64,16,11,0.888,0.525,1,-5.665,1,0.305,0.029,5.68e-06,0.137,0.243,133.983,143792,4
2019-08-24,62,I Don't Know About You,Chris Lane,5N1o6d8zGcSZSeMFkOUQOk,False,69,62,6,0.593,0.81,1,-5.733,1,0.0625,0.602,0,0.119,0.712,144.011,207933,4
2019-08-24,63,ME!,Taylor Swift Featuring Brendon Urie,5N1o6d8zGcSZSeMFkOUQOk,False,66,2,17,0.61,0.83,0,-4.105,1,0.0571,0.033,0,0.118,0.728,182.162,193000,4
2019-08-24,64,Mac 10,Trippie Redd Featuring Lil Baby & Lil Duke,4e34Qq2lkp92egwgjacVcT,True,0,64,1,0.79,0.629,9,-7.172,1,0.138,0.179,0,0.356,0.833,124.063,127742,4
2019-08-24,65,Time,NF,4e34Qq2lkp92egwgjacVcT,False,79,65,4,0.677,0.688,0,-4.058,0,0.0633,0.138,0,0.114,0.198,98.049,240429,4
2019-08-24,66,Soltera,"Lunay, Daddy Yankee & Bad Bunny",4e34Qq2lkp92egwgjacVcT,False,70,66,14,0.795,0.783,5,-4.271,1,0.0432,0.361,0,0.437,0.799,92.01,266087,4
2019-08-24,67,Living,Dierks Bentley,4e34Qq2lkp92egwgjacVcT,False,72,67,3,0.517,0.813,1,-6.325,1,0.0558,0.0153,0,0.106,0.444,83.005,222147,4
2019-08-24,68,Southbound,Carrie Underwood,4e34Qq2lkp92egwgjacVcT,False,76,68,5,0.614,0.884,0,-4.019,1,0.0402,0.00122,0,0.077,0.721,100.531,202853,4
2019-08-24,69,Just Us,DJ Khaled Featuring SZA,4e34Qq2lkp92egwgjacVcT,False,59,43,13,0.639,0.859,9,-2.758,0,0.147,0.135,0,0.129,0.566,93.132,221379,4
2019-08-24,70,Lalala,Y2K & bbno$,4e34Qq2lkp92egwgjacVcT,False,71,68,7,0.843,0.391,2,-7.899,1,0.0845,0.181,0,0.137,0.496,129.972,160627,4
2019-08-24,71,No Me Conoce,"Jhay Cortez, J Balvin & Bad Bunny",4e34Qq2lkp92egwgjacVcT,False,78,71,6,0.804,0.786,10,-3.837,0,0.0735,0.144,0,0.0928,0.575,91.992,309120,4
2019-08-24,72,It's You,Ali Gatie,4e34Qq2lkp92egwgjacVcT,False,75,70,9,0.732,0.463,11,-6.972,0,0.0287,0.374,0,0.194,0.397,95.971,212607,4
2019-08-24,73,Hate Me,Ellie Goulding & Juice WRLD,4e34Qq2lkp92egwgjacVcT,False,74,73,4,0.657,0.768,8,-4.628,1,0.0507,0.108,0,0.144,0.759,75.025,186223,4
2019-08-24,74,Some Of It,Eric Church,4e34Qq2lkp92egwgjacVcT,False,65,43,12,0.56,0.736,0,-7.306,1,0.0446,0.341,9.81e-06,0.155,0.824,79.843,195147,4
2019-08-24,75,Love You Too Late,Cole Swindell,4e34Qq2lkp92egwgjacVcT,False,94,75,2,0.542,0.797,9,-4.45,0,0.0379,0.00111,0,0.0906,0.593,113.95,204720,4
2019-08-24,76,EARFQUAKE,"Tyler, The Creator",4e34Qq2lkp92egwgjacVcT,False,77,13,13,0.554,0.498,9,-8.866,1,0.0685,0.23,5.98e-06,0.795,0.413,79.635,190067,4
2019-08-24,77,Tip Of My Tongue,Kenny Chesney,4e34Qq2lkp92egwgjacVcT,False,86,77,5,0.669,0.56,5,-5.003,1,0.0251,0.0821,0,0.0703,0.49,95.0,199413,4
2019-08-24,78,Daddy,Blueface & Rich The Kid,4e34Qq2lkp92egwgjacVcT,False,98,78,3,0.869,0.59,11,-8.214,1,0.257,0.07,0,0.236,0.479,107.934,151147,4
2019-08-24,79,Ballin',Mustard & Roddy Ricch,4e34Qq2lkp92egwgjacVcT,False,89,79,4,0.809,0.545,7,-6.678,1,0.0735,0.392,0,0.151,0.244,97.008,180435,4
2019-08-24,80,We Were,Keith Urban,4e34Qq2lkp92egwgjacVcT,False,90,80,2,0.44,0.803,5,-6.162,1,0.0512,0.127,0,0.128,0.633,79.312,189104,4
2019-08-24,81,Small Talk,Katy Perry,4NmE2ytXI8S2svTRSmEdpO,True,0,81,1,0.846,0.631,5,-5.547,1,0.1,0.203,0,0.455,0.602,115.999,161963,4
2019-08-24,82,Prayed For You,Matt Stell,4NmE2ytXI8S2svTRSmEdpO,False,99,82,2,0.6,0.698,9,-5.86,1,0.0355,0.0724,1.64e-06,0.113,0.57,140.032,210373,4
2019-08-24,83,Right Back,Khalid Featuring A Boogie Wit da Hoodie,4NmE2ytXI8S2svTRSmEdpO,False,81,81,3,0.786,0.428,5,-10.011,0,0.31,0.0933,1.1e-06,0.156,0.556,97.001,255000,4
2019-08-24,84,Night Falls,"Dove Cameron, Sofia Carson, Booboo Stewart, Cameron Boyce, Thomas Doherty, China Anne McClain & Dylan Playfair",3doNvO8zrwzcM0PJrcn8Rb,True,0,84,1,0.72,0.87,3,-5.155,0,0.142,0.0682,0,0.144,0.802,160.039,188218,4
2019-08-24,85,What Happens In A Small Town,Brantley Gilbert + Lindsay Ell,3doNvO8zrwzcM0PJrcn8Rb,False,97,85,2,0.496,0.775,11,-5.304,1,0.0411,0.000927,0,0.14,0.478,138.165,202587,4
2019-08-24,86,On Chill,Wale Featuring Jeremih,5z51HY4ei5QhTjcvwq5Msw,True,0,86,1,0.597,0.733,1,-6.017,1,0.41,0.134,0,0.159,0.639,171.016,214035,4
2019-08-24,87,Snake Skin,Trippie Redd,1usK5eLBzpQTMwDt8SR2dr,True,0,87,1,0.669,0.557,8,-8.835,0,0.0498,0.0574,0,0.0662,0.553,144.043,186944,4
2019-08-24,88,24/7,Meek Mill Featuring Ella Mai,1usK5eLBzpQTMwDt8SR2dr,False,83,54,19,0.657,0.711,0,-5.355,1,0.374,0.0135,0,0.221,0.368,86.957,221522,4
2019-08-24,89,Uno,Ambjaay,1usK5eLBzpQTMwDt8SR2dr,False,82,82,2,0.978,0.477,8,-8.159,1,0.155,0.000143,0,0.133,0.196,110.002,109091,4
2019-08-24,90,Buy My Own Drinks,Runaway June,3WBY2lhKzkxaG5bNscQrOG,True,0,90,1,0.686,0.9,5,-4.406,1,0.0614,0.068,0,0.0985,0.962,155.963,206293,4
2019-08-24,91,Love Ain't,Eli Young Band,3WBY2lhKzkxaG5bNscQrOG,False,87,50,18,0.6,0.851,11,-4.645,1,0.0388,0.00566,9.78e-06,0.0891,0.727,98.007,186119,4
2019-08-24,92,F.N,Lil Tjay,0RLLvYBopDwooCyvnTwgYu,True,0,92,1,0.567,0.515,6,-10.265,0,0.247,0.354,0,0.078,0.321,120.1,224000,1
2019-08-24,93,Baby Sitter,DaBaby Featuring Offset,7f1zjZG77S891Uv4O68yfk,True,0,93,1,0.852,0.73,1,-5.803,1,0.0579,0.0219,0,0.336,0.394,92.506,157693,4
2019-08-24,94,Sanguine Paradise,Lil Uzi Vert,7f1zjZG77S891Uv4O68yfk,False,0,28,16,0.729,0.603,6,-6.736,0,0.0666,0.0948,0,0.113,0.207,134.972,243976,4
2019-08-24,95,Rodeo,Lil Nas X & Cardi B Or Nas,7f1zjZG77S891Uv4O68yfk,False,96,22,8,0.706,0.679,9,-5.614,1,0.0324,0.139,6.98e-05,0.465,0.657,140.081,158707,4
2019-08-24,96,What If I Never Get Over You,Lady Antebellum,7f1zjZG77S891Uv4O68yfk,False,0,86,3,0.576,0.724,0,-5.147,1,0.0274,0.016,0,0.107,0.34,93.029,206598,4
2019-08-24,97,Tap,NAV Featuring Meek Mill,7f1zjZG77S891Uv4O68yfk,False,92,87,10,0.901,0.676,2,-7.033,1,0.251,0.0646,0,0.0863,0.452,85.018,148278,4
2019-08-24,98,La La Land,Bryce Vine Featuring YG,7f1zjZG77S891Uv4O68yfk,False,91,75,11,0.774,0.473,1,-5.122,0,0.0569,0.221,0,0.222,0.416,97.953,177253,4
2019-08-24,99,Que Pretendes,J Balvin & Bad Bunny,7f1zjZG77S891Uv4O68yfk,False,0,65,5,0.639,0.791,10,-4.443,0,0.254,0.0275,0,0.362,0.933,92.603,222347,4
2019-08-24,100,Single Again,Big Sean,7f1zjZG77S891Uv4O68yfk,False,84,64,3,0.635,0.677,10,-5.548,1,0.0909,0.161,0,0.154,0.253,94.95,213733,4
