date,position,title,artist,spotify_id,is_new,last_pos,peak_pos,weeks,danceability,energy,key,loudness,mode,speechiness,acousticness,instrumentalness,liveness,valence,tempo,duration_ms,time_signature
2018-12-29,1,"Thank U, Next",Ariana Grande,74CEfiZthUGX5yUNNUM4bj,False,1,1,7,0.717,0.653,1,-5.634,1,0.0658,0.229,0,0.101,0.412,106.966,207320,4
2018-12-29,2,Without Me,Halsey,74CEfiZthUGX5yUNNUM4bj,False,2,2,11,0.752,0.488,6,-7.05,1,0.0705,0.297,9.11e-06,0.0936,0.533,136.041,201661,4
2018-12-29,3,Sicko Mode,Travis Scott,74CEfiZthUGX5yUNNUM4bj,False,3,1,20,0.834,0.73,8,-3.714,1,0.222,0.00513,0,0.124,0.446,155.008,312820,4
2018-12-29,4,Sunflower (Spider-Man: Into The Spider-Verse),Post Malone & Swae Lee,74CEfiZthUGX5yUNNUM4bj,False,7,4,9,0.76,0.479,2,-5.574,1,0.0466,0.556,0,0.0703,0.913,89.911,158040,4
2018-12-29,5,Happier,Marshmello & Bastille,74CEfiZthUGX5yUNNUM4bj,False,4,3,18,0.687,0.792,5,-2.749,1,0.0452,0.191,0,0.167,0.671,100.015,214290,4
2018-12-29,6,High Hopes,Panic! At The Disco,74CEfiZthUGX5yUNNUM4bj,False,5,5,20,0.579,0.904,5,-2.729,1,0.0618,0.193,0,0.064,0.681,82.014,190947,4
2018-12-29,7,All I Want For Christmas Is You,Mariah Carey,74CEfiZthUGX5yUNNUM4bj,False,6,6,29,0.695,0.652,11,-7.828,0,0.0751,0.000441,5.66e-06,0.0667,0.744,128.024,401680,4
2018-12-29,8,ZEZE,Kodak Black Featuring Travis Scott & Offset,74CEfiZthUGX5yUNNUM4bj,False,9,2,10,0.861,0.603,8,-5.788,0,0.176,0.0521,0,0.0924,0.504,98.043,228760,4
2018-12-29,9,Drip Too Hard,Lil Baby & Gunna,74CEfiZthUGX5yUNNUM4bj,False,8,4,14,0.897,0.662,1,-6.903,0,0.292,0.0852,0,0.534,0.389,112.511,145543,4
2018-12-29,10,It's The Most Wonderful Time Of The Year,Andy Williams,74CEfiZthUGX5yUNNUM4bj,False,13,10,9,0.24,0.598,7,-8.435,1,0.0369,0.766,0,0.117,0.776,201.629,151933,3
2018-12-29,11,Rockin' Around The Christmas Tree,Brenda Lee,74CEfiZthUGX5yUNNUM4bj,False,18,11,26,0.589,0.472,8,-8.749,1,0.0502,0.614,0,0.505,0.898,67.196,126267,4
2018-12-29,12,A Holly Jolly Christmas,Burl Ives,74CEfiZthUGX5yUNNUM4bj,False,21,12,9,0.683,0.375,0,-13.056,1,0.0303,0.579,0,0.076,0.888,140.467,135533,4
2018-12-29,13,Jingle Bell Rock,Bobby Helms,74CEfiZthUGX5yUNNUM4bj,False,15,13,24,0.754,0.424,2,-8.463,1,0.0363,0.643,0,0.0652,0.806,119.705,130973,4
2018-12-29,14,Wake Up In The Sky,Gucci Mane X Bruno Mars X Kodak Black,74CEfiZthUGX5yUNNUM4bj,False,11,11,14,0.8,0.578,4,-5.144,0,0.0485,0.00381,0,0.359,0.367,143.01,204665,4
2018-12-29,15,Girls Like You,Maroon 5 Featuring Cardi B,74CEfiZthUGX5yUNNUM4bj,False,10,1,30,0.609,0.529,0,-6.859,1,0.106,0.545,0,0.127,0.474,60.349,235680,4
2018-12-29,16,Mo Bamba,Sheck Wes,74CEfiZthUGX5yUNNUM4bj,False,12,6,17,0.729,0.625,4,-5.266,1,0.0315,0.194,0.00986,0.248,0.261,146.034,183907,4
2018-12-29,17,The Christmas Song (Merry Christmas To You),Nat King Cole,74CEfiZthUGX5yUNNUM4bj,False,24,17,16,0.319,0.21,1,-15.231,1,0.0341,0.92,8.06e-05,0.138,0.209,78.696,192160,4
2018-12-29,18,Eastside,"benny blanco, Halsey & Khalid",74CEfiZthUGX5yUNNUM4bj,False,16,16,23,0.56,0.68,6,-7.648,0,0.321,0.555,0,0.116,0.319,89.391,173800,4
2018-12-29,19,Breathin,Ariana Grande,74CEfiZthUGX5yUNNUM4bj,False,14,12,18,0.568,0.656,8,-5.413,1,0.0433,0.0211,1.37e-05,0.213,0.364,100.049,198160,4
2018-12-29,20,Youngblood,5 Seconds Of Summer,74CEfiZthUGX5yUNNUM4bj,False,22,7,29,0.596,0.854,7,-5.114,0,0.463,0.0169,0,0.124,0.152,120.274,203418,4
2018-12-29,21,Better Now,Post Malone,74CEfiZthUGX5yUNNUM4bj,False,20,3,34,0.68,0.578,10,-5.804,1,0.04,0.331,0,0.135,0.341,145.038,231267,4
2018-12-29,22,Going Bad,Meek Mill Featuring Drake,74CEfiZthUGX5yUNNUM4bj,False,17,6,3,0.889,0.496,4,-6.365,0,0.0905,0.259,0,0.252,0.544,86.003,180522,4
2018-12-29,23,Lucid Dreams,Juice WRLD,74CEfiZthUGX5yUNNUM4bj,False,19,2,32,0.511,0.566,6,-7.23,0,0.2,0.349,0,0.34,0.218,83.903,239836,4
2018-12-29,24,Imagine,Ariana Grande,39LmTF9RgyakzSYX8txrow,True,0,24,1,0.729,0.475,8,-4.985,1,0.0364,0.378,0,0.12,0.371,62.52,212267,3
2018-12-29,25,Taki Taki,"DJ Snake Featuring Selena Gomez, Ozuna & Cardi B",39LmTF9RgyakzSYX8txrow,False,25,11,12,0.842,0.801,8,-4.167,0,0.228,0.157,4.82e-06,0.0642,0.617,95.881,212500,4
2018-12-29,26,MIA,Bad Bunny Featuring Drake,39LmTF9RgyakzSYX8txrow,False,26,5,10,0.817,0.539,6,-6.349,0,0.0621,0.0141,0.000496,0.099,0.158,97.062,210368,4
2018-12-29,27,Last Christmas,Wham!,39LmTF9RgyakzSYX8txrow,False,31,27,8,0.735,0.478,2,-12.472,1,0.0293,0.189,2.48e-06,0.355,0.947,107.682,262960,4
2018-12-29,28,Rudolph The Red-Nosed Reindeer,Gene Autry,39LmTF9RgyakzSYX8txrow,False,27,27,3,0.834,0.371,1,-11.99,1,0.0358,0.799,0,0.275,0.976,96.628,150267,4
2018-12-29,29,Trip,Ella Mai,39LmTF9RgyakzSYX8txrow,False,23,11,20,0.477,0.61,11,-5.628,0,0.144,0.225,0,0.107,0.358,79.882,213993,4
2018-12-29,30,Money,Cardi B,39LmTF9RgyakzSYX8txrow,False,29,13,9,0.95,0.59,8,-6.508,0,0.29,0.00534,0,0.11,0.219,130.003,183527,4
2018-12-29,31,Leave Me Alone,Flipp Dinero,39LmTF9RgyakzSYX8txrow,False,28,27,14,0.792,0.743,7,-2.806,1,0.0851,0.107,0,0.183,0.742,150.024,195637,4
2018-12-29,32,"Let It Snow, Let It Snow, Let It Snow",Dean Martin,39LmTF9RgyakzSYX8txrow,False,32,32,3,0.451,0.24,1,-14.014,1,0.0351,0.912,2.45e-06,0.175,0.701,134.009,117147,4
2018-12-29,33,Sleigh Ride,The Ronettes,39LmTF9RgyakzSYX8txrow,False,41,33,2,0.529,0.772,2,-7.013,1,0.0287,0.403,2.21e-06,0.316,0.853,91.751,181267,4
2018-12-29,34,Feliz Navidad,Jose Feliciano,39LmTF9RgyakzSYX8txrow,False,42,34,4,0.513,0.831,2,-9.004,1,0.0383,0.55,0,0.336,0.963,148.837,182067,4
2018-12-29,35,Here Comes Santa Claus (Right Down Santa Claus Lane),Gene Autry,39LmTF9RgyakzSYX8txrow,False,40,35,2,0.834,0.371,1,-11.99,1,0.0358,0.799,0,0.275,0.976,96.628,150267,4
2018-12-29,36,Speechless,Dan + Shay,39LmTF9RgyakzSYX8txrow,False,34,33,15,0.616,0.438,1,-5.968,1,0.0298,0.356,0,0.24,0.386,135.929,213387,4
2018-12-29,37,Love Lies,Khalid & Normani,39LmTF9RgyakzSYX8txrow,False,30,9,44,0.708,0.648,6,-5.626,1,0.0449,0.0956,0,0.134,0.338,143.955,201707,4
2018-12-29,38,Beautiful,Bazzi Featuring Camila Cabello,39LmTF9RgyakzSYX8txrow,False,36,30,20,0.638,0.717,2,-4.722,1,0.0337,0.346,0,0.105,0.249,100.027,180000,4
2018-12-29,39,Better,Khalid,39LmTF9RgyakzSYX8txrow,False,35,29,14,0.596,0.552,0,-10.278,0,0.097,0.0765,0.334,0.104,0.112,97.949,229320,4
2018-12-29,40,I Like It,"Cardi B, Bad Bunny & J Balvin",39LmTF9RgyakzSYX8txrow,False,38,1,37,0.816,0.726,5,-3.998,0,0.129,0.099,0,0.372,0.65,136.048,253390,4
2018-12-29,41,(There's No Place Like) Home For The Holidays,Perry Como,2pXpURmn6zC5ZYDMms6fwa,True,0,41,1,0.724,0.276,7,-12.25,1,0.0599,0.76,0,0.116,0.718,112.874,155933,4
2018-12-29,42,It's Beginning To Look A Lot Like Christmas,Perry Como And The Fontane Sisters With Mitchell Ayres And His Orchestra,2pXpURmn6zC5ZYDMms6fwa,True,0,42,1,0.724,0.276,7,-12.25,1,0.0599,0.76,0,0.116,0.718,112.874,155933,4
2018-12-29,43,Natural,Imagine Dragons,2pXpURmn6zC5ZYDMms6fwa,False,43,13,22,0.704,0.611,2,-6.112,1,0.0409,0.217,0,0.0812,0.22,100.0,189467,4
2018-12-29,44,Shallow,Lady Gaga & Bradley Cooper,2pXpURmn6zC5ZYDMms6fwa,False,39,5,12,0.572,0.385,7,-6.362,1,0.0308,0.371,0,0.231,0.323,95.799,215733,4
2018-12-29,45,Happy Xmas (War Is Over),John & Yoko/The Plastic Ono Band With The Harlem Community Choir,27RYrbL6S02LNVhDWVl38b,True,0,45,1,0.321,0.64,2,-10.023,1,0.0324,0.28,0,0.718,0.414,146.172,214333,3
2018-12-29,46,Calling My Spirit,Kodak Black,27RYrbL6S02LNVhDWVl38b,False,53,46,3,0.91,0.366,1,-9.954,1,0.0941,0.0996,0,0.261,0.74,119.985,152000,4
2018-12-29,47,Wonderful Christmastime,Paul McCartney,1SV1fxF65n9NhRHp3KlBuu,True,0,47,1,0.774,0.511,11,-8.914,1,0.0319,0.322,0,0.0672,0.771,94.736,227653,4
2018-12-29,48,White Christmas,Bing Crosby,4so0Wek9Ig1p6CRCHuINwW,False,0,12,14,0.317,0.158,9,-16.485,1,0.0381,0.673,0.353,0.338,0.247,130.503,177480,3
2018-12-29,49,Uproar,Lil Wayne,4so0Wek9Ig1p6CRCHuINwW,False,44,7,12,0.743,0.87,1,-2.188,1,0.212,0.0595,0,0.299,0.884,99.079,194184,4
2018-12-29,50,Christmas (Baby Please Come Home),Darlene Love,46pF1zFimM582ss1PrMy68,True,0,50,1,0.325,0.759,8,-7.146,1,0.053,0.395,0.000362,0.0773,0.36,126.627,166453,4
2018-12-29,51,She Got The Best Of Me,Luke Combs,46pF1zFimM582ss1PrMy68,False,47,34,19,0.533,0.907,11,-3.793,1,0.0406,0.0292,0,0.386,0.7,150.99,183160,4
2018-12-29,52,BAD!,XXXTENTACION,46pF1zFimM582ss1PrMy68,False,33,16,6,0.8,0.526,8,-5.153,1,0.0716,0.334,0.00174,0.0571,0.746,129.874,150475,4
2018-12-29,53,Dangerous,Meek Mill Featuring Jeremih & PnB Rock,46pF1zFimM582ss1PrMy68,False,49,31,18,0.734,0.493,0,-7.528,1,0.308,0.0467,0,0.0477,0.562,86.043,233750,4
2018-12-29,54,Drunk Me,Mitchell Tenpenny,46pF1zFimM582ss1PrMy68,False,54,53,19,0.499,0.797,2,-3.77,1,0.0554,0.199,0,0.0933,0.408,176.024,211768,4
2018-12-29,55,Best Shot,Jimmie Allen,46pF1zFimM582ss1PrMy68,False,52,46,14,0.629,0.464,4,-8.72,1,0.0334,0.75,0,0.0853,0.523,156.051,195053,4
2018-12-29,56,Nothing Breaks Like A Heart,Mark Ronson Featuring Miley Cyrus,46pF1zFimM582ss1PrMy68,False,80,56,3,0.699,0.887,7,-6.148,0,0.0406,0.00842,0.0106,0.0528,0.263,120.007,252000,4
2018-12-29,57,Close To Me,Ellie Goulding X Diplo Featuring Swae Lee,46pF1zFimM582ss1PrMy68,False,59,57,5,0.572,0.75,1,-5.042,0,0.0604,0.0946,0,0.378,0.475,144.081,182627,4
2018-12-29,58,MoshPit,Kodak Black Featuring Juice WRLD,4KX8vXbouybtUptEyYxtIk,True,0,58,1,0.769,0.627,7,-4.064,1,0.262,0.394,0,0.106,0.49,157.938,164038,4
2018-12-29,59,You Say,Lauren Daigle,4KX8vXbouybtUptEyYxtIk,False,58,44,23,0.494,0.632,5,-6.89,1,0.0342,0.682,0,0.0869,0.0797,147.873,274693,4
2018-12-29,60,Armed And Dangerous,Juice WRLD,4KX8vXbouybtUptEyYxtIk,False,67,44,6,0.736,0.67,10,-6.702,1,0.311,0.186,0,0.114,0.845,130.032,169999,4
2018-12-29,61,Talk To Me,Tory Lanez & Rich The Kid,4KX8vXbouybtUptEyYxtIk,False,74,61,8,0.698,0.66,0,-7.883,1,0.052,0.0226,0,0.0622,0.451,159.949,248521,4
2018-12-29,62,Arms Around You,XXXTENTACION x Lil Pump Featuring Maluma & Swae Lee,4KX8vXbouybtUptEyYxtIk,False,57,28,8,0.703,0.723,9,-5.45,0,0.0412,0.0302,2.06e-06,0.126,0.288,104.969,198903,4
2018-12-29,63,Be Alright,Dean Lewis,4KX8vXbouybtUptEyYxtIk,False,63,63,8,0.553,0.586,11,-6.319,1,0.0362,0.697,0,0.0813,0.443,126.684,196373,4
2018-12-29,64,Backin' It Up,Pardison Fontaine Featuring Cardi B,4KX8vXbouybtUptEyYxtIk,False,66,64,10,0.796,0.68,10,-4.853,0,0.353,0.0886,0,0.268,0.565,164.932,190466,4
2018-12-29,65,Burning Man,Dierks Bentley Featuring Brothers Osborne,4KX8vXbouybtUptEyYxtIk,False,73,65,9,0.609,0.807,5,-7.221,1,0.0972,0.00403,5.42e-06,0.0926,0.492,119.073,238493,4
2018-12-29,66,This Feeling,The Chainsmokers Featuring Kelsea Ballerini,4KX8vXbouybtUptEyYxtIk,False,71,66,10,0.575,0.571,1,-7.906,1,0.0439,0.0558,0,0.0912,0.449,105.049,197947,4
2018-12-29,67,Sixteen,Thomas Rhett,4KX8vXbouybtUptEyYxtIk,False,76,67,6,0.705,0.531,1,-7.031,1,0.0281,0.0135,2.11e-06,0.165,0.425,107.013,178333,4
2018-12-29,68,Cozy Little Christmas,Katy Perry,02FaKXXL7KUtRc7K0k54tL,True,0,68,1,0.774,0.608,7,-6.264,1,0.128,0.128,0,0.0895,0.56,137.494,182521,4
2018-12-29,69,Consequences,Camila Cabello,02FaKXXL7KUtRc7K0k54tL,False,72,69,7,0.455,0.292,0,-6.792,1,0.0563,0.889,0,0.106,0.43,84.339,178467,5
2018-12-29,70,Pure Cocaine,Lil Baby,02FaKXXL7KUtRc7K0k54tL,False,55,46,3,0.964,0.487,10,-6.071,0,0.421,0.00127,6.57e-06,0.115,0.107,127.05,154024,4
2018-12-29,71,Girl Like You,Jason Aldean,02FaKXXL7KUtRc7K0k54tL,False,77,71,4,0.543,0.88,3,-4.204,0,0.0365,0.035,0.000227,0.304,0.483,144.057,193067,4
2018-12-29,72,Good Girl,Dustin Lynch,02FaKXXL7KUtRc7K0k54tL,False,81,72,6,0.711,0.696,7,-5.05,1,0.0869,0.16,0,0.17,0.694,80.512,189533,4
2018-12-29,73,No Stylist,French Montana Featuring Drake,02FaKXXL7KUtRc7K0k54tL,False,85,47,13,0.765,0.704,5,-4.589,0,0.127,0.0215,0,0.227,0.498,147.055,192172,4
2018-12-29,74,Testimony,Kodak Black,6Gg25EZRbQd4IHiJz2KSY0,True,0,74,1,0.814,0.667,6,-4.785,0,0.36,0.0369,0,0.11,0.376,80.031,240000,4
2018-12-29,75,You,Jacquees,6Gg25EZRbQd4IHiJz2KSY0,False,83,75,4,0.735,0.453,8,-8.264,0,0.0602,0.413,0,0.104,0.335,115.002,217387,4
2018-12-29,76,KIKA,6ix9ine Featuring Tory Lanez,6Gg25EZRbQd4IHiJz2KSY0,False,60,44,4,0.745,0.715,1,-3.368,0,0.245,0.128,0,0.182,0.342,94.513,136032,4
2018-12-29,77,When The Party's Over,Billie Eilish,6Gg25EZRbQd4IHiJz2KSY0,False,69,52,9,0.367,0.111,4,-14.084,1,0.0972,0.978,3.97e-05,0.0897,0.198,82.642,196077,4
2018-12-29,78,Last Shot,Kip Moore,6Gg25EZRbQd4IHiJz2KSY0,False,87,78,5,0.487,0.859,4,-4.403,1,0.0488,0.00204,0,0.322,0.377,148.037,228480,4
2018-12-29,79,whoa (mind in awe),XXXTENTACION,6Gg25EZRbQd4IHiJz2KSY0,False,37,37,2,0.735,0.525,6,-2.939,0,0.0441,0.653,0.918,0.101,0.369,160.147,157777,4
2018-12-29,80,Ella Quiere Beber,Anuel AA & Romeo Santos,6Gg25EZRbQd4IHiJz2KSY0,False,93,79,7,0.75,0.665,8,-3.083,1,0.124,0.265,0,0.0515,0.697,95.239,219357,4
2018-12-29,81,Beautiful Crazy,Luke Combs,6Gg25EZRbQd4IHiJz2KSY0,False,97,58,6,0.551,0.402,11,-7.431,1,0.0262,0.676,0,0.0928,0.382,103.313,193200,4
2018-12-29,82,Fine China,Future & Juice WRLD,6Gg25EZRbQd4IHiJz2KSY0,False,89,26,9,0.656,0.542,7,-7.358,1,0.323,0.0484,0,0.126,0.551,166.111,141587,4
2018-12-29,84,This Is It,Scotty McCreery,1756lCPutsooqSmOiq4kIJ,False,96,84,2,0.579,0.511,8,-6.788,1,0.0293,0.254,0,0.099,0.594,78.003,230973,4
2018-12-29,85,Smile (Living My Best Life),Lil' Duval Featuring Snoop Dogg & Ball Greezy,1756lCPutsooqSmOiq4kIJ,False,88,56,17,0.874,0.727,8,-7.689,1,0.0777,0.09,5.83e-06,0.0759,0.427,98.97,214160,4
2018-12-29,86,Close Friends,Lil Baby,1756lCPutsooqSmOiq4kIJ,False,90,28,11,0.676,0.578,10,-4.669,0,0.375,0.0509,0,0.0796,0.698,158.896,203881,4
2018-12-29,87,Sweet But Psycho,Ava Max,7DnAm9FOTWE3cUvso43HhI,True,0,87,1,0.72,0.706,1,-4.719,1,0.0473,0.0684,0,0.166,0.62,133.002,187436,4
2018-12-29,88,Gnarly,Kodak Black Featuring Lil Pump,40Rpg3LkZwwzuHJ3GdjMma,True,0,88,1,0.764,0.784,10,-4.003,0,0.0833,0.469,0,0.123,0.51,144.981,186403,4
2018-12-29,89,Lovely,Billie Eilish & Khalid,40Rpg3LkZwwzuHJ3GdjMma,False,0,78,8,0.351,0.296,4,-10.109,0,0.0333,0.934,0,0.095,0.12,115.284,200186,4
2018-12-29,90,The Christmas Song,Lauren Daigle,3jRBwf09lbRAp2DSPlRx8p,True,0,90,1,0.402,0.239,3,-14.507,1,0.0329,0.934,0.00242,0.161,0.197,106.518,270935,4
2018-12-29,91,Envy Me,Calboy,7rvyVWja33WG9R97oeJAjx,True,0,91,1,0.74,0.488,1,-7.664,0,0.27,0.234,0,0.241,0.584,149.042,120133,4
2018-12-29,92,Yosemite,Travis Scott,7rvyVWja33WG9R97oeJAjx,False,100,25,10,0.785,0.554,0,-6.571,1,0.0409,0.283,3.4e-06,0.116,0.144,128.047,150043,4
2018-12-29,93,Electricity,Silk City x Dua Lipa,7rvyVWja33WG9R97oeJAjx,False,0,93,6,0.588,0.67,0,-6.439,1,0.0473,0.0104,3.33e-06,0.338,0.505,118.159,238173,4
2018-12-29,94,Good Form,Nicki Minaj Featuring Lil Wayne,7rvyVWja33WG9R97oeJAjx,False,94,60,3,0.88,0.775,7,-5.133,1,0.0953,0.113,0.00264,0.0943,0.284,96.503,199400,4
2018-12-29,95,Millionaire,Chris Stapleton,7rvyVWja33WG9R97oeJAjx,False,0,95,3,0.616,0.474,10,-9.608,1,0.0266,0.192,0.00762,0.0989,0.493,142.689,210133,4
2018-12-29,96,Look Back At It,A Boogie Wit da Hoodie,7rvyVWja33WG9R97oeJAjx,False,95,95,2,0.791,0.587,3,-5.075,0,0.0413,0.407,0,0.148,0.536,96.057,179449,4
2018-12-29,97,24/7,Meek Mill Featuring Ella Mai,7rvyVWja33WG9R97oeJAjx,False,86,54,3,0.657,0.711,0,-5.355,1,0.374,0.0135,0,0.221,0.368,86.957,221522,4
2018-12-29,98,Uptown Vibes,Meek Mill Featuring Fabolous & Anuel AA,7rvyVWja33WG9R97oeJAjx,False,79,39,3,0.655,0.835,1,-3.451,1,0.059,0.0459,0,0.409,0.165,91.035,190412,4
2018-12-29,99,Nuketown,Ski Mask The Slump God Featuring Juice WRLD,7rvyVWja33WG9R97oeJAjx,False,98,63,3,0.808,0.617,10,-9.32,0,0.442,0.113,0,0.734,0.632,149.962,166400,4
2018-12-29,100,MAMA,6ix9ine Featuring Nicki Minaj & Kanye West,7rvyVWja33WG9R97oeJAjx,False,75,43,4,0.761,0.672,1,-5.887,1,0.212,0.0893,9.77e-06,0.14,0.437,160.077,192405,3
