date,position,title,artist,spotify_id,is_new,last_pos,peak_pos,weeks,danceability,energy,key,loudness,mode,speechiness,acousticness,instrumentalness,liveness,valence,tempo,duration_ms,time_signature
1999-01-23,1,Have You Ever?,Brandy,7kSnTetIKAJZpKV2kEBHsv,False,1,1,8,0.698,0.533,2,-6.246,1,0.0437,0.542,0,0.333,0.275,134.001,273440,4
1999-01-23,2,Nobody's Supposed To Be Here,Deborah Cox,7kSnTetIKAJZpKV2kEBHsv,False,2,2,17,0.662,0.531,8,-5.3,1,0.0361,0.202,1.16e-05,0.595,0.399,119.957,262333,4
1999-01-23,3,...Baby One More Time,Britney Spears,7kSnTetIKAJZpKV2kEBHsv,False,4,3,10,0.759,0.699,0,-5.745,0,0.0307,0.202,0.000131,0.443,0.907,92.96,211067,4
1999-01-23,4,I'm Your Angel,R. Kelly & Celine Dion,7kSnTetIKAJZpKV2kEBHsv,False,3,1,8,0.62,0.504,0,-7.26,1,0.0301,0.669,0,0.11,0.266,112.681,332067,4
1999-01-23,5,Save Tonight,Eagle-Eye Cherry,7kSnTetIKAJZpKV2kEBHsv,False,8,5,8,0.547,0.693,0,-8.786,1,0.0353,9.24e-05,5.46e-05,0.113,0.583,119.567,239227,4
1999-01-23,6,Hands,Jewel,7kSnTetIKAJZpKV2kEBHsv,False,11,6,8,0.644,0.495,5,-10.175,0,0.0292,0.423,0.00128,0.082,0.321,127.221,235000,4
1999-01-23,7,Lullaby,Shawn Mullins,7kSnTetIKAJZpKV2kEBHsv,False,7,7,8,0.509,0.833,7,-5.337,1,0.0597,0.0398,0.00257,0.207,0.569,79.935,330667,4
1999-01-23,8,Lately,Divine,7kSnTetIKAJZpKV2kEBHsv,False,5,1,20,0.686,0.48,9,-9.592,1,0.0312,0.206,1.16e-06,0.156,0.494,121.039,269533,4
1999-01-23,9,Doo Wop (That Thing),Lauryn Hill,7kSnTetIKAJZpKV2kEBHsv,False,9,1,11,0.535,0.505,2,-8.926,0,0.245,0.0393,0,0.0923,0.495,99.935,320267,4
1999-01-23,10,Slide,Goo Goo Dolls,7kSnTetIKAJZpKV2kEBHsv,False,14,10,8,0.395,0.843,8,-4.476,1,0.0374,0.00483,0,0.0404,0.481,112.423,212067,4
1999-01-23,11,Trippin',Total Featuring Missy Elliott,7kSnTetIKAJZpKV2kEBHsv,False,10,7,12,0.753,0.831,11,-6.431,0,0.0958,0.173,1.23e-05,0.0927,0.505,124.151,267328,4
1999-01-23,12,Jumper,Third Eye Blind,7kSnTetIKAJZpKV2kEBHsv,False,15,12,8,0.599,0.543,0,-9.226,1,0.0302,0.0129,0.00193,0.291,0.624,91.105,272973,4
1999-01-23,13,Angel,Sarah McLachlan,7kSnTetIKAJZpKV2kEBHsv,False,18,13,8,0.532,0.0744,1,-16.092,1,0.0355,0.949,1.22e-05,0.106,0.125,117.131,270400,3
1999-01-23,14,Take Me There,BLACKstreet & Mya Featuring Mase & Blinky Blink,7kSnTetIKAJZpKV2kEBHsv,False,17,14,8,0.401,0.872,0,-4.91,1,0.117,0.215,0.00104,0.292,0.642,78.443,243000,3
1999-01-23,15,From This Moment On,Shania Twain,7kSnTetIKAJZpKV2kEBHsv,False,12,4,8,0.459,0.505,9,-5.487,1,0.0266,0.42,0,0.134,0.22,135.752,235107,4
1999-01-23,16,Love Like This,Faith Evans,7kSnTetIKAJZpKV2kEBHsv,False,13,7,11,0.767,0.551,0,-7.328,1,0.0616,0.00364,0,0.0451,0.796,100.904,275707,4
1999-01-23,17,Because Of You,98 Degrees,7kSnTetIKAJZpKV2kEBHsv,False,6,3,17,0.732,0.603,0,-7.624,1,0.0271,0.341,0,0.113,0.514,104.498,297893,4
1999-01-23,18,Miami,Will Smith,7kSnTetIKAJZpKV2kEBHsv,False,23,18,8,0.877,0.534,1,-6.178,1,0.15,0.0339,1.67e-05,0.0441,0.89,108.17,197560,4
1999-01-23,19,Can I Get A...,Jay-Z Featuring Amil (Of Major Coinz) & Ja,7kSnTetIKAJZpKV2kEBHsv,False,19,19,17,0.792,0.694,8,-8.496,0,0.33,0.0619,2.32e-05,0.25,0.804,177.094,309773,4
1999-01-23,20,Iris,Goo Goo Dolls,7kSnTetIKAJZpKV2kEBHsv,False,20,9,8,0.315,0.715,11,-8.072,0,0.0362,0.00125,7.97e-06,0.0942,0.497,155.925,289533,3
1999-01-23,21,These Are The Times,Dru Hill,7kSnTetIKAJZpKV2kEBHsv,False,26,21,8,0.718,0.473,9,-9.278,0,0.0267,0.106,0,0.0964,0.384,109.992,248400,4
1999-01-23,22,Angel Of Mine,Monica,7kSnTetIKAJZpKV2kEBHsv,False,31,22,8,0.592,0.562,10,-6.869,0,0.0239,0.00373,3.23e-05,0.223,0.208,90.16,250173,4
1999-01-23,23,(God Must Have Spent) A Little More Time On You,'N Sync,7kSnTetIKAJZpKV2kEBHsv,False,30,23,8,0.61,0.926,8,-4.843,0,0.0479,0.031,0.0012,0.0821,0.861,172.638,200400,4
1999-01-23,24,I Don't Want To Miss A Thing,Mark Chesnutt,7kSnTetIKAJZpKV2kEBHsv,False,24,19,6,0.496,0.47,10,-10.415,1,0.0333,0.0268,0,0.134,0.151,122.094,246227,4
1999-01-23,25,When You Believe,Whitney Houston & Mariah Carey,7kSnTetIKAJZpKV2kEBHsv,False,64,25,8,0.436,0.39,1,-9.62,0,0.0326,0.557,0,0.12,0.119,125.313,272893,4
1999-01-23,26,Ghetto Cowboy,Mo Thugs Family Featuring Bone Thugs-N-Harmony,7kSnTetIKAJZpKV2kEBHsv,False,21,15,10,0.693,0.637,0,-5.487,1,0.158,0.00096,0.00498,0.0908,0.204,170.26,324493,4
1999-01-23,27,This Kiss,Faith Hill,7kSnTetIKAJZpKV2kEBHsv,False,16,7,45,0.398,0.804,11,-5.559,1,0.0451,0.175,0,0.181,0.709,186.752,194307,4
1999-01-23,28,I'll Be,Edwin McCain,7kSnTetIKAJZpKV2kEBHsv,False,22,5,18,0.371,0.609,11,-5.524,1,0.0295,0.386,0,0.104,0.426,136.526,266533,3
1999-01-23,29,My Favorite Mistake,Sheryl Crow,7kSnTetIKAJZpKV2kEBHsv,False,25,20,8,0.613,0.754,4,-8.191,0,0.0318,0.00594,0.000318,0.33,0.576,104.651,245093,4
1999-01-23,30,Too Close,Next,7kSnTetIKAJZpKV2kEBHsv,False,27,1,50,0.847,0.402,7,-9.952,1,0.0641,0.0118,0,0.283,0.752,99.693,259440,4
1999-01-23,31,Inside Out,Eve 6,7kSnTetIKAJZpKV2kEBHsv,False,28,28,8,0.483,0.818,11,-7.666,1,0.0444,0.114,0,0.367,0.691,175.668,219467,4
1999-01-23,32,Changes,2Pac,7kSnTetIKAJZpKV2kEBHsv,False,43,32,8,0.865,0.665,7,-6.289,1,0.073,0.0453,0,0.224,0.331,111.113,268827,4
1999-01-23,33,Touch It,Monifah,7kSnTetIKAJZpKV2kEBHsv,False,32,9,25,0.863,0.476,8,-10.019,0,0.0932,0.0307,0.0515,0.0706,0.783,115.459,285827,4
1999-01-23,34,How Deep Is Your Love,Dru Hill Featuring Redman,7kSnTetIKAJZpKV2kEBHsv,False,29,3,16,0.729,0.434,3,-9.111,0,0.079,0.0473,1.23e-05,0.314,0.743,94.411,243360,4
1999-01-23,35,Believe,Cher,7kSnTetIKAJZpKV2kEBHsv,False,52,35,6,0.652,0.917,6,-6.72,1,0.0548,0.0082,0,0.0509,0.459,132.975,239027,4
1999-01-23,36,Wrong Again,Martina McBride,7kSnTetIKAJZpKV2kEBHsv,False,45,36,8,0.531,0.554,0,-5.231,1,0.0265,0.215,0,0.101,0.102,141.434,195400,4
1999-01-23,37,You Get What You Give,New Radicals,7kSnTetIKAJZpKV2kEBHsv,False,38,37,8,0.621,0.901,2,-5.396,1,0.0302,0.17,0,0.0875,0.744,113.967,300773,4
1999-01-23,38,Stand Beside Me,Jo Dee Messina,7kSnTetIKAJZpKV2kEBHsv,False,51,38,7,0.587,0.72,0,-7.746,1,0.0278,0.179,0,0.0878,0.33,99.916,224640,4
1999-01-23,39,Fly Away,Lenny Kravitz,7kSnTetIKAJZpKV2kEBHsv,False,41,39,8,0.587,0.872,7,-5.066,1,0.0484,0.018,0,0.622,0.735,159.925,221333,4
1999-01-23,40,When A Woman's Fed Up,R. Kelly,7kSnTetIKAJZpKV2kEBHsv,False,58,40,5,0.684,0.587,2,-6.271,0,0.0814,0.428,5.58e-06,0.0932,0.693,77.009,275293,4
1999-01-23,41,There You Have It,BlackHawk,7kSnTetIKAJZpKV2kEBHsv,False,44,41,8,0.711,0.667,4,-5.75,1,0.0258,0.218,0,0.354,0.777,113.655,192267,4
1999-01-23,42,Are You That Somebody?,Aaliyah,7kSnTetIKAJZpKV2kEBHsv,False,33,21,8,0.848,0.663,9,-7.078,0,0.159,0.124,0.0293,0.0737,0.833,137.953,265667,4
1999-01-23,43,Right On The Money,Alan Jackson,7kSnTetIKAJZpKV2kEBHsv,False,46,43,8,0.762,0.415,3,-11.262,1,0.0302,0.423,0,0.316,0.567,113.975,229827,4
1999-01-23,44,"Spirit Of A Boy, Wisdom Of A Man",Randy Travis,7kSnTetIKAJZpKV2kEBHsv,False,48,44,8,0.519,0.398,3,-10.968,1,0.0273,0.608,1.79e-05,0.11,0.247,71.932,230040,3
1999-01-23,45,For A Little While,Tim McGraw,7kSnTetIKAJZpKV2kEBHsv,False,56,45,8,0.554,0.815,7,-7.954,1,0.0256,0.133,0,0.0778,0.618,99.333,213893,4
1999-01-23,46,Every Morning,Sugar Ray,7kSnTetIKAJZpKV2kEBHsv,False,66,46,3,0.833,0.679,8,-4.496,1,0.0365,0.0834,0.00258,0.0769,0.975,109.916,219867,4
1999-01-23,47,One Week,Barenaked Ladies,7kSnTetIKAJZpKV2kEBHsv,False,36,1,17,0.702,0.898,9,-6.003,1,0.0373,0.00854,0.000154,0.0917,0.731,112.845,169760,4
1999-01-23,48,I Will Get There,Boyz II Men,7kSnTetIKAJZpKV2kEBHsv,False,76,48,2,0.551,0.284,1,-13.704,1,0.0287,0.805,0,0.113,0.527,109.831,260840,4
1999-01-23,49,For You I Will,Aaron Tippin,7kSnTetIKAJZpKV2kEBHsv,False,49,49,16,0.652,0.561,1,-7.271,1,0.0247,0.137,0.00309,0.12,0.385,107.747,211733,4
1999-01-23,50,You're Beginning To Get To Me,Clay Walker,7kSnTetIKAJZpKV2kEBHsv,False,47,39,8,0.536,0.582,4,-6.589,1,0.0397,0.184,0,0.109,0.491,83.238,161533,4
1999-01-23,51,It's All Been Done,Barenaked Ladies,7kSnTetIKAJZpKV2kEBHsv,False,57,51,5,0.521,0.919,2,-3.146,1,0.0475,0.000173,0.00218,0.301,0.746,131.726,206000,4
1999-01-23,52,Hard Knock Life (Ghetto Anthem),JAY-Z,7kSnTetIKAJZpKV2kEBHsv,False,39,32,12,0.884,0.679,10,-5.857,0,0.282,0.0957,0.00209,0.0289,0.591,76.993,238467,4
1999-01-23,53,Pretty Fly (For A White Guy),The Offspring,7kSnTetIKAJZpKV2kEBHsv,False,53,53,8,0.723,0.895,11,-3.707,0,0.102,0.088,0,0.0717,0.963,143.373,188667,4
1999-01-23,54,No Place That Far,Sara Evans,7kSnTetIKAJZpKV2kEBHsv,False,60,54,7,0.547,0.373,0,-7.336,1,0.0273,0.504,0,0.176,0.182,132.741,217400,4
1999-01-23,55,Ex-Factor,Lauryn Hill,7kSnTetIKAJZpKV2kEBHsv,False,82,55,3,0.593,0.619,3,-9.003,0,0.0976,0.118,0,0.484,0.668,80.02,326533,4
1999-01-23,56,Rosa Parks,OutKast,7kSnTetIKAJZpKV2kEBHsv,False,61,55,8,0.792,0.701,6,-7.198,0,0.283,0.105,0,0.761,0.251,103.89,324373,4
1999-01-23,57,Hold On To Me,John Michael Montgomery,7kSnTetIKAJZpKV2kEBHsv,False,65,57,8,0.488,0.425,10,-9.407,1,0.0262,0.333,0,0.104,0.233,165.06,251200,3
1999-01-23,58,Heartbreak Hotel,Whitney Houston Feat. Faith Evans & Kelly Price,7kSnTetIKAJZpKV2kEBHsv,False,77,58,5,0.724,0.535,3,-7.616,0,0.0588,0.0477,0,0.0314,0.664,133.816,281493,4
1999-01-23,59,Unbelievable,Diamond Rio,7kSnTetIKAJZpKV2kEBHsv,False,74,59,6,0.765,0.596,11,-7.586,1,0.0518,0.5,0,0.289,0.941,158.112,141533,3
1999-01-23,60,You're Easy On The Eyes,Terri Clark,7kSnTetIKAJZpKV2kEBHsv,False,55,40,8,0.724,0.793,0,-5.837,1,0.0271,0.127,0,0.0713,0.898,126.486,213160,4
1999-01-23,61,Back 2 Good,matchbox 20,7kSnTetIKAJZpKV2kEBHsv,False,71,61,5,0.559,0.504,7,-9.455,1,0.0246,0.106,0,0.13,0.479,89.051,340173,4
1999-01-23,62,Thank U,Alanis Morissette,7kSnTetIKAJZpKV2kEBHsv,False,42,17,8,0.672,0.616,0,-5.764,1,0.0258,0.379,2.73e-05,0.0887,0.566,92.094,258773,4
1999-01-23,63,Wrong Night,Reba,7kSnTetIKAJZpKV2kEBHsv,False,70,63,7,0.532,0.95,9,-4.123,1,0.106,0.103,0,0.315,0.898,156.815,171027,4
1999-01-23,64,What It's Like,Everlast,7kSnTetIKAJZpKV2kEBHsv,False,69,64,6,0.678,0.556,0,-7.423,1,0.0281,0.0904,0.0334,0.0866,0.405,85.158,303133,4
1999-01-23,65,Goodbye,Spice Girls,7kSnTetIKAJZpKV2kEBHsv,False,37,11,5,0.552,0.694,4,-4.489,1,0.026,0.0846,0,0.117,0.359,136.019,275427,4
1999-01-23,66,Hold Me,Brian McKnight Featuring Tone & Kobe Bryant,7kSnTetIKAJZpKV2kEBHsv,False,50,35,8,0.866,0.476,0,-8.121,1,0.0522,0.0414,0.000149,0.0523,0.631,96.932,229000,4
1999-01-23,67,Silly Ho,TLC,7kSnTetIKAJZpKV2kEBHsv,False,85,67,3,0.837,0.784,9,-3.874,1,0.0866,0.0387,0.471,0.32,0.836,145.578,255160,3
1999-01-23,68,Sweetest Thing,U2,7kSnTetIKAJZpKV2kEBHsv,False,63,63,8,0.524,0.641,0,-8.967,1,0.0497,0.0437,2.78e-05,0.159,0.482,141.65,184543,4
1999-01-23,69,Love Me,112 Featuring Mase,7kSnTetIKAJZpKV2kEBHsv,False,34,17,14,0.654,0.817,0,-5.898,1,0.153,0.124,1.18e-05,0.156,0.649,90.063,257333,4
1999-01-23,70,The Power Of Good-Bye,Madonna,7kSnTetIKAJZpKV2kEBHsv,False,54,11,15,0.534,0.561,5,-11.089,0,0.0409,0.0442,0.678,0.189,0.219,84.978,250560,4
1999-01-23,71,Fly (The Angel Song),The Wilkinsons,7kSnTetIKAJZpKV2kEBHsv,False,72,62,7,0.531,0.47,6,-8.004,1,0.0331,0.571,0,0.0688,0.246,170.395,222667,4
1999-01-23,72,Faded Pictures,Case & Joe,7kSnTetIKAJZpKV2kEBHsv,False,79,72,5,0.705,0.511,6,-7.422,0,0.202,0.125,1.72e-06,0.153,0.581,82.011,229773,4
1999-01-23,73,Pushin' Weight,Ice Cube Featuring Mr. Short Khop,7kSnTetIKAJZpKV2kEBHsv,False,59,26,13,0.826,0.836,10,-4.252,0,0.221,0.00398,0,0.108,0.556,91.788,274600,4
1999-01-23,74,Angel In Disguise,Brandy,7kSnTetIKAJZpKV2kEBHsv,False,83,74,8,0.625,0.643,1,-6.773,0,0.0307,0.0301,0.00233,0.347,0.593,140.135,288267,4
1999-01-23,75,You Were Mine,Dixie Chicks,2qdVHdkLxKntNjPh3Ssz7s,True,0,75,1,0.542,0.346,9,-6.598,1,0.0296,0.342,0,0.283,0.173,139.856,217807,4
1999-01-23,76,Busy Man,Billy Ray Cyrus,55bwRyNowFFB5Kp0Ojkvhx,True,0,76,1,0.6,0.568,7,-9.867,1,0.0388,0.106,0,0.238,0.475,163.887,197267,4
1999-01-23,77,Father Of Mine,Everclear,55bwRyNowFFB5Kp0Ojkvhx,False,75,75,8,0.568,0.94,1,-5.401,1,0.0411,0.000431,4.96e-05,0.0779,0.738,97.096,231400,4
1999-01-23,78,Never There,Cake,55bwRyNowFFB5Kp0Ojkvhx,False,78,78,8,0.761,0.735,9,-8.171,0,0.043,0.0426,0.0838,0.0917,0.592,125.815,164267,4
1999-01-23,79,"Luv Me, Luv Me",Shaggy Featuring Janet,55bwRyNowFFB5Kp0Ojkvhx,False,84,76,6,0.869,0.776,1,-6.918,0,0.225,0.175,1.08e-06,0.165,0.771,96.905,356840,4
1999-01-23,80,That Don't Impress Me Much,Shania Twain,4I7DV3MIgxJGlObiy9s6nx,True,0,80,1,0.743,0.873,10,-4.943,0,0.0507,0.14,0,0.142,0.965,125.005,238707,5
1999-01-23,81,Home Alone,R. Kelly Featuring Keith Murray,4I7DV3MIgxJGlObiy9s6nx,False,81,65,8,0.887,0.643,4,-2.578,0,0.214,0.0447,0,0.132,0.513,99.533,299560,4
1999-01-23,82,Let Me Let Go,Faith Hill,4I7DV3MIgxJGlObiy9s6nx,False,73,33,8,0.592,0.49,6,-8.053,1,0.0241,0.489,0,0.0967,0.29,91.775,264507,4
1999-01-23,83,Someone You Used To Know,Collin Raye,4I7DV3MIgxJGlObiy9s6nx,False,62,37,10,0.589,0.369,9,-11.477,1,0.0242,0.123,2.21e-06,0.114,0.295,98.997,225440,4
1999-01-23,84,Sweet Lady,Tyrese,1Dx8rIZaXzZPvUQRF2j9hB,True,0,84,1,0.588,0.522,9,-6.254,0,0.0383,0.233,0,0.24,0.584,66.024,290600,4
1999-01-23,85,Powerful Thing,Trisha Yearwood,726S7vART4JYDbwIZwvHEm,True,0,85,1,0.642,0.846,2,-3.842,1,0.0464,0.42,0,0.0402,0.944,147.938,176920,4
1999-01-23,86,It Must Be Love,Ty Herndon,726S7vART4JYDbwIZwvHEm,False,88,38,8,0.622,0.784,4,-4.576,1,0.0342,0.249,0,0.121,0.727,115.958,212307,4
1999-01-23,87,All The Places (I Will Kiss You),Aaron Hall,726S7vART4JYDbwIZwvHEm,False,68,26,15,0.722,0.423,0,-5.711,0,0.0566,0.0161,2.11e-06,0.0603,0.353,136.039,240133,4
1999-01-23,88,A Bitter End,Deryl Dodd,726S7vART4JYDbwIZwvHEm,False,96,88,4,0.595,0.418,9,-8.092,1,0.0308,0.568,1.27e-05,0.116,0.25,138.069,218980,4
1999-01-23,89,Somebody's Out There Watching,The Kinleys,1J2q9vOL8xL1MQXFazHB8y,True,0,89,1,0.606,0.805,7,-5.451,1,0.0318,0.125,0,0.351,0.44,81.488,215640,4
1999-01-23,90,Meanwhile,George Strait,58cy25QMhRxpDpYWaEsTRZ,True,0,90,1,0.518,0.459,7,-6.289,1,0.0283,0.0396,0.00116,0.145,0.165,124.126,210440,3
1999-01-23,91,Hot Spot,Foxy Brown,27vsyn5d9HPSkeLleEnL1x,True,0,91,1,0.895,0.768,10,-6.798,0,0.308,0.000687,4.58e-05,0.0413,0.622,92.943,230000,4
1999-01-23,92,Celebrity Skin,Hole,27vsyn5d9HPSkeLleEnL1x,False,91,85,8,0.438,0.905,9,-6.161,1,0.0419,9.44e-06,5.4e-05,0.363,0.723,134.163,162667,4
1999-01-23,93,Husbands And Wives,Brooks & Dunn,27vsyn5d9HPSkeLleEnL1x,False,86,36,8,0.507,0.388,5,-8.069,1,0.027,0.653,0.000216,0.162,0.12,105.601,190347,3
1999-01-23,94,Fire Escape,Fastball,27vsyn5d9HPSkeLleEnL1x,False,92,86,8,0.576,0.813,6,-5.69,1,0.0297,0.00354,0.143,0.0712,0.857,125.686,201133,4
1999-01-23,95,Big Big World,Emilia,27vsyn5d9HPSkeLleEnL1x,False,0,92,2,0.57,0.461,0,-10.249,1,0.0285,0.501,1.88e-05,0.202,0.336,87.987,205467,4
1999-01-23,96,Talk Show Shhh!,Shae Jones,27vsyn5d9HPSkeLleEnL1x,False,99,95,4,0.884,0.26,10,-7.458,0,0.0558,0.0244,0,0.0688,0.516,121.937,252819,4
1999-01-23,97,Wherever You Go,Voices Of Theory,27vsyn5d9HPSkeLleEnL1x,False,87,36,15,0.527,0.461,11,-7.57,1,0.0252,0.687,0,0.187,0.261,107.836,339760,4
1999-01-23,98,Come And Get With Me,Keith Sweat Featuring Snoop Dogg,27vsyn5d9HPSkeLleEnL1x,False,89,12,14,0.831,0.44,1,-7.273,1,0.203,0.172,0,0.115,0.628,92.688,293720,4
1999-01-23,99,My Little Secret,Xscape,27vsyn5d9HPSkeLleEnL1x,False,95,9,14,0.814,0.431,8,-9.125,1,0.0936,0.371,0,0.335,0.542,129.957,268040,4
1999-01-23,100,Just The Two Of Us,Will Smith,27vsyn5d9HPSkeLleEnL1x,False,94,20,11,0.805,0.638,1,-5.864,1,0.0806,0.142,0,0.322,0.644,94.52,315507,4
