date,position,title,artist,spotify_id,is_new,last_pos,peak_pos,weeks,danceability,energy,key,loudness,mode,speechiness,acousticness,instrumentalness,liveness,valence,tempo,duration_ms,time_signature
2013-06-22,1,Blurred Lines,Robin Thicke Featuring T.I. + Pharrell,5ZMFVgZSYvbq3SmgRwaGMa,False,6,1,8,0.853,0.599,7,-4.756,1,0.0411,0.00334,7.93e-06,0.0759,0.843,119.993,263827,4
2013-06-22,2,Can't Hold Us,Macklemore & Ryan Lewis Featuring Ray Dalton,5ZMFVgZSYvbq3SmgRwaGMa,False,1,1,18,0.641,0.922,2,-4.457,1,0.0786,0.0291,0,0.0862,0.847,146.078,258343,4
2013-06-22,3,Get Lucky,Daft Punk Featuring Pharrell Williams,5ZMFVgZSYvbq3SmgRwaGMa,False,3,3,8,0.794,0.811,6,-8.966,0,0.038,0.0426,1.07e-06,0.101,0.862,116.047,248413,4
2013-06-22,4,Mirrors,Justin Timberlake,5ZMFVgZSYvbq3SmgRwaGMa,False,2,2,17,0.574,0.512,5,-6.664,0,0.0503,0.234,0,0.0946,0.512,76.899,484147,4
2013-06-22,5,Cruise,Florida Georgia Line Featuring Nelly,5ZMFVgZSYvbq3SmgRwaGMa,False,5,5,36,0.457,0.948,10,-3.364,1,0.0354,0.0191,0,0.0536,0.878,148.0,208960,4
2013-06-22,6,Radioactive,Imagine Dragons,5ZMFVgZSYvbq3SmgRwaGMa,False,8,6,41,0.448,0.784,9,-3.686,1,0.0627,0.106,0.000108,0.668,0.236,136.245,186813,4
2013-06-22,7,Just Give Me A Reason,P!nk Featuring Nate Ruess,5ZMFVgZSYvbq3SmgRwaGMa,False,4,1,17,0.778,0.547,2,-7.273,1,0.0489,0.346,0.000302,0.132,0.441,95.002,242733,4
2013-06-22,8,Come & Get It,Selena Gomez,5ZMFVgZSYvbq3SmgRwaGMa,False,7,6,9,0.552,0.783,7,-4.138,0,0.0504,0.00887,0.00026,0.0954,0.575,79.984,231413,4
2013-06-22,9,The Way,Ariana Grande Featuring Mac Miller,5ZMFVgZSYvbq3SmgRwaGMa,False,12,9,11,0.645,0.877,5,-3.208,0,0.113,0.294,0,0.0759,0.861,82.324,227027,4
2013-06-22,10,I Love It,Icona Pop Featuring Charli XCX,5ZMFVgZSYvbq3SmgRwaGMa,False,9,7,19,0.711,0.906,8,-2.671,1,0.0284,0.00952,1.64e-05,0.153,0.824,125.916,157153,4
2013-06-22,11,We Can't Stop,Miley Cyrus,2y4lAQpi5VTNLu2ldeTdUH,True,0,11,1,0.613,0.622,1,-5.794,0,0.0334,0.00882,0,0.37,0.484,80.003,231240,4
2013-06-22,12,Stay,Rihanna Featuring Mikky Ekko,2y4lAQpi5VTNLu2ldeTdUH,False,10,3,18,0.621,0.31,9,-10.164,0,0.0283,0.945,6.12e-05,0.117,0.125,111.893,240707,4
2013-06-22,13,Boys 'round Here,Blake Shelton Featuring Pistol Annies & Friends,2y4lAQpi5VTNLu2ldeTdUH,False,13,13,11,0.611,0.688,2,-6.369,1,0.0529,0.251,2.35e-06,0.248,0.649,169.895,288760,4
2013-06-22,14,When I Was Your Man,Bruno Mars,2y4lAQpi5VTNLu2ldeTdUH,False,11,1,25,0.612,0.28,0,-8.648,1,0.0434,0.932,0,0.088,0.387,72.795,213827,4
2013-06-22,15,#Beautiful,Mariah Carey Featuring Miguel,2y4lAQpi5VTNLu2ldeTdUH,False,17,15,5,0.677,0.749,4,-5.405,1,0.0391,0.346,0,0.347,0.469,107.042,199867,4
2013-06-22,16,Treasure,Bruno Mars,2y4lAQpi5VTNLu2ldeTdUH,False,25,16,4,0.874,0.692,5,-5.28,0,0.0431,0.0412,7.24e-05,0.324,0.937,116.017,178560,4
2013-06-22,17,Thrift Shop,Macklemore & Ryan Lewis Featuring Wanz,2y4lAQpi5VTNLu2ldeTdUH,False,14,1,36,0.781,0.526,6,-6.986,0,0.293,0.0633,0,0.0457,0.665,94.993,235613,4
2013-06-22,18,Wagon Wheel,Darius Rucker,2y4lAQpi5VTNLu2ldeTdUH,False,19,15,18,0.537,0.66,9,-7.174,1,0.0296,0.455,0,0.135,0.574,148.096,298373,4
2013-06-22,19,My Songs Know What You Did In The Dark (Light Em Up),Fall Out Boy,2y4lAQpi5VTNLu2ldeTdUH,False,18,15,18,0.558,0.924,9,-4.341,0,0.064,0.0271,3.32e-06,0.537,0.567,151.99,186827,4
2013-06-22,20,Heart Attack,Demi Lovato,2y4lAQpi5VTNLu2ldeTdUH,False,15,10,15,0.504,0.785,8,-4.802,1,0.104,0.0738,0,0.239,0.502,173.968,210840,4
2013-06-22,21,Bad,Wale Featuring Tiara Thomas Or Rihanna,2y4lAQpi5VTNLu2ldeTdUH,False,32,21,17,0.807,0.702,6,-6.594,0,0.0748,0.307,0,0.111,0.447,114.038,238827,4
2013-06-22,22,Cups (Pitch Perfect's When I'm Gone),Anna Kendrick,2y4lAQpi5VTNLu2ldeTdUH,False,27,22,24,0.878,0.455,0,-8.845,1,0.077,0.0462,0.00484,0.0353,0.79,129.953,128013,4
2013-06-22,23,Power Trip,J. Cole Featuring Miguel,2y4lAQpi5VTNLu2ldeTdUH,False,20,20,17,0.667,0.608,1,-7.054,1,0.216,0.324,0.000198,0.426,0.475,99.992,241160,4
2013-06-22,24,Clarity,Zedd Featuring Foxes,2y4lAQpi5VTNLu2ldeTdUH,False,29,24,12,0.509,0.781,8,-3.48,1,0.072,0.0398,0,0.0749,0.176,128.0,271427,4
2013-06-22,25,Highway Don't Care,Tim McGraw With Taylor Swift,2y4lAQpi5VTNLu2ldeTdUH,False,22,22,15,0.477,0.791,2,-5.348,1,0.0396,0.0259,0,0.0841,0.505,157.83,279067,4
2013-06-22,26,22,Taylor Swift,2y4lAQpi5VTNLu2ldeTdUH,False,24,20,15,0.658,0.729,7,-6.561,1,0.0378,0.00215,0.0013,0.0752,0.668,104.007,230133,4
2013-06-22,27,Crash My Party,Luke Bryan,2y4lAQpi5VTNLu2ldeTdUH,False,31,18,9,0.526,0.816,7,-4.009,1,0.0421,0.0285,0,0.22,0.414,144.032,234760,4
2013-06-22,28,We Own It (Fast & Furious),2 Chainz & Wiz Khalifa,2y4lAQpi5VTNLu2ldeTdUH,False,16,16,3,0.554,0.899,8,-4.573,1,0.408,0.0521,0,0.0568,0.552,171.966,227893,4
2013-06-22,29,The Other Side,Jason Derulo,2y4lAQpi5VTNLu2ldeTdUH,False,30,29,8,0.561,0.836,9,-3.939,1,0.1,0.0525,0,0.136,0.517,127.923,226987,4
2013-06-22,30,Feel This Moment,Pitbull Featuring Christina Aguilera,2y4lAQpi5VTNLu2ldeTdUH,False,23,8,20,0.673,0.758,7,-3.632,1,0.158,0.039,0,0.341,0.542,135.956,229507,4
2013-06-22,31,Started From The Bottom,Drake,2y4lAQpi5VTNLu2ldeTdUH,False,26,6,18,0.793,0.524,8,-7.827,1,0.156,0.0319,0,0.156,0.579,86.325,174133,4
2013-06-22,32,Next To Me,Emeli Sande,2y4lAQpi5VTNLu2ldeTdUH,False,28,25,16,0.674,0.81,7,-5.117,0,0.0378,0.0923,4.74e-05,0.11,0.391,94.995,196867,4
2013-06-22,33,#thatPOWER,will.i.am Featuring Justin Bieber,2y4lAQpi5VTNLu2ldeTdUH,False,21,17,12,0.797,0.608,6,-6.096,0,0.0584,0.00112,7.66e-05,0.0748,0.402,127.999,279507,4
2013-06-22,34,Here's To Never Growing Up,Avril Lavigne,2y4lAQpi5VTNLu2ldeTdUH,False,34,30,9,0.482,0.873,0,-3.145,1,0.0853,0.0111,0,0.409,0.737,165.084,214320,4
2013-06-22,35,Love Somebody,Maroon 5,2y4lAQpi5VTNLu2ldeTdUH,False,37,35,3,0.675,0.792,1,-6.303,1,0.0368,0.145,0,0.12,0.395,120.016,229813,4
2013-06-22,36,I Want Crazy,Hunter Hayes,2y4lAQpi5VTNLu2ldeTdUH,False,48,36,9,0.562,0.878,8,-4.806,1,0.0387,0.0539,0,0.112,0.558,103.029,236865,4
2013-06-22,37,Wasting All These Tears,Cassadee Pope,25zXRQGuwYZdIp88fVZOPC,True,0,37,1,0.465,0.772,5,-3.932,0,0.0378,0.0959,1.04e-05,0.167,0.257,155.83,215640,4
2013-06-22,38,I Need Your Love,Calvin Harris Featuring Ellie Goulding,25zXRQGuwYZdIp88fVZOPC,False,42,38,8,0.695,0.869,8,-5.066,1,0.0483,0.41,0,0.237,0.58,124.989,234507,4
2013-06-22,39,Suit & Tie,Justin Timberlake Featuring JAY Z,25zXRQGuwYZdIp88fVZOPC,False,33,3,22,0.795,0.596,11,-3.799,0,0.219,0.103,0,0.164,0.357,101.985,326280,4
2013-06-22,40,Love Me,Lil Wayne Featuring Drake & Future,25zXRQGuwYZdIp88fVZOPC,False,35,9,21,0.674,0.608,8,-6.628,0,0.0334,0.0119,0,0.103,0.464,124.952,253440,4
2013-06-22,41,"Bitch, Don't Kill My Vibe",Kendrick Lamar,25zXRQGuwYZdIp88fVZOPC,False,40,32,16,0.587,0.698,1,-8.948,1,0.0943,0.0152,0,0.442,0.0985,133.954,310720,4
2013-06-22,42,I Knew You Were Trouble.,Taylor Swift,25zXRQGuwYZdIp88fVZOPC,False,43,2,34,0.622,0.469,3,-6.798,0,0.0363,0.00454,2.25e-06,0.0398,0.679,77.019,217973,4
2013-06-22,43,Rich As F**k,Lil Wayne Featuring 2 Chainz,25zXRQGuwYZdIp88fVZOPC,False,41,41,12,0.595,0.359,8,-13.488,1,0.453,0.289,0,0.15,0.886,131.969,229198,4
2013-06-22,44,Ho Hey,The Lumineers,25zXRQGuwYZdIp88fVZOPC,False,38,3,53,0.685,0.466,0,-9.074,1,0.0304,0.794,2.06e-06,0.0915,0.353,79.936,163133,4
2013-06-22,45,U.O.E.N.O.,Rocko Featuring Future & Rick Ross,25zXRQGuwYZdIp88fVZOPC,False,36,36,9,0.422,0.641,10,-4.947,0,0.323,0.422,0,0.317,0.654,187.027,260276,3
2013-06-22,46,Body Party,Ciara,25zXRQGuwYZdIp88fVZOPC,False,47,35,7,0.577,0.576,2,-6.299,1,0.0563,0.0143,0,0.602,0.12,133.973,234040,4
2013-06-22,47,Sail,AWOLNATION,25zXRQGuwYZdIp88fVZOPC,False,44,30,40,0.825,0.435,1,-9.582,1,0.0568,0.452,0.609,0.0953,0.243,119.038,259102,4
2013-06-22,48,Fine China,Chris Brown,25zXRQGuwYZdIp88fVZOPC,False,39,31,10,0.654,0.731,10,-4.767,0,0.0568,0.0419,0,0.122,0.59,104.002,213200,4
2013-06-22,49,Locked Out Of Heaven,Bruno Mars,25zXRQGuwYZdIp88fVZOPC,False,46,1,36,0.726,0.698,5,-4.165,1,0.0431,0.049,0,0.309,0.867,143.994,233478,4
2013-06-22,50,"Gone, Gone, Gone",Phillip Phillips,25zXRQGuwYZdIp88fVZOPC,False,52,50,14,0.664,0.642,6,-5.961,1,0.038,0.129,0,0.114,0.501,118.002,209693,4
2013-06-22,51,Same Love,Macklemore & Ryan Lewis Featuring Mary Lambert,25zXRQGuwYZdIp88fVZOPC,False,65,51,13,0.688,0.473,8,-9.059,1,0.167,0.716,4.46e-05,0.104,0.299,84.958,318525,4
2013-06-22,52,Anywhere With You,Jake Owen,25zXRQGuwYZdIp88fVZOPC,False,55,52,12,0.475,0.936,5,-2.545,1,0.0413,0.0418,0,0.0873,0.598,151.988,209587,4
2013-06-22,53,Get Your Shine On,Florida Georgia Line,25zXRQGuwYZdIp88fVZOPC,False,45,27,20,0.497,0.927,0,-4.52,1,0.0371,0.00286,1.26e-06,0.413,0.607,96.991,222013,4
2013-06-22,54,Lego House,Ed Sheeran,25zXRQGuwYZdIp88fVZOPC,False,53,42,11,0.592,0.637,11,-8.48,1,0.0992,0.562,0,0.13,0.565,159.701,185093,4
2013-06-22,55,DONE.,The Band Perry,25zXRQGuwYZdIp88fVZOPC,False,51,46,13,0.65,0.89,1,-2.995,1,0.0366,0.322,0,0.0543,0.757,100.053,205267,4
2013-06-22,56,Bugatti,Ace Hood Featuring Future & Rick Ross,25zXRQGuwYZdIp88fVZOPC,False,49,33,17,0.6,0.592,1,-4.947,1,0.0545,0.0191,0,0.0955,0.0663,130.205,269267,4
2013-06-22,57,No New Friends (SFTB Remix),"DJ Khaled Featuring Drake, Rick Ross & Lil Wayne",25zXRQGuwYZdIp88fVZOPC,False,61,54,7,0.703,0.681,2,-6.356,1,0.133,0.00589,0,0.449,0.245,124.928,308333,4
2013-06-22,58,Beat This Summer,Brad Paisley,25zXRQGuwYZdIp88fVZOPC,False,57,57,13,0.563,0.722,6,-5.252,1,0.0407,0.313,0,0.393,0.801,150.039,281453,4
2013-06-22,59,Runnin' Outta Moonlight,Randy Houser,25zXRQGuwYZdIp88fVZOPC,False,62,59,5,0.526,0.801,2,-3.717,1,0.0393,0.0354,3.17e-06,0.0637,0.769,172.024,193773,4
2013-06-22,60,Mama's Broken Heart,Miranda Lambert,25zXRQGuwYZdIp88fVZOPC,False,58,20,20,0.768,0.809,4,-4.204,0,0.0616,0.278,0,0.139,0.748,111.989,177773,4
2013-06-22,61,Crazy Kids,Ke$ha Featuring will.i.am Or Juicy J,25zXRQGuwYZdIp88fVZOPC,False,59,59,2,0.742,0.706,0,-4.6,0,0.0433,0.0141,0.00568,0.133,0.478,128.03,230747,4
2013-06-22,62,See You Again,Carrie Underwood,25zXRQGuwYZdIp88fVZOPC,False,76,62,6,0.514,0.742,8,-2.525,1,0.0258,0.27,1.7e-06,0.085,0.47,101.0,246453,4
2013-06-22,63,Harlem Shake,Baauer,25zXRQGuwYZdIp88fVZOPC,False,54,1,17,0.452,0.794,0,-5.151,1,0.0483,0.0111,0.00182,0.416,0.282,137.825,196664,4
2013-06-22,64,Young And Beautiful,Lana Del Rey,25zXRQGuwYZdIp88fVZOPC,False,50,22,7,0.324,0.416,11,-8.92,0,0.0368,0.262,3.69e-05,0.11,0.151,113.986,236053,4
2013-06-22,65,Safe And Sound,Capital Cities,25zXRQGuwYZdIp88fVZOPC,False,74,65,6,0.655,0.819,0,-4.852,1,0.0316,0.000176,0.00374,0.104,0.766,117.956,192790,5
2013-06-22,66,Hey Pretty Girl,Kip Moore,25zXRQGuwYZdIp88fVZOPC,False,67,66,12,0.291,0.4,2,-10.615,1,0.0306,0.145,1.86e-05,0.259,0.0935,83.112,215920,1
2013-06-22,67,Like Jesus Does,Eric Church,25zXRQGuwYZdIp88fVZOPC,False,63,59,16,0.576,0.355,1,-8.388,1,0.033,0.439,4.55e-05,0.13,0.299,137.232,198733,4
2013-06-22,68,Tapout,"Rich Gang Featuring Lil Wayne, Birdman, Future, Mack Maine, Nicki Minaj",25zXRQGuwYZdIp88fVZOPC,False,72,68,5,0.762,0.577,8,-5.229,1,0.175,0.0309,0,0.108,0.287,142.055,284587,4
2013-06-22,69,We Still In This B****,B.o.B Featuring T.I. & Juicy J,25zXRQGuwYZdIp88fVZOPC,False,66,66,17,0.693,0.733,1,-5.126,1,0.139,0.013,0,0.0924,0.497,140.01,247987,4
2013-06-22,70,Slow Down,Selena Gomez,2OsEJFTfzfjG4oC92cuP2c,True,0,70,1,0.722,0.821,1,-3.856,0,0.165,0.073,0,0.631,0.721,127.944,210293,4
2013-06-22,71,Beat It,Sean Kingston Featuring Chris Brown & Wiz Khalifa,2OsEJFTfzfjG4oC92cuP2c,False,69,69,7,0.477,0.637,1,-5.386,1,0.109,0.00487,0,0.284,0.555,198.12,253453,4
2013-06-22,72,Alive,Krewella,2OsEJFTfzfjG4oC92cuP2c,False,60,32,17,0.663,0.822,9,-2.909,1,0.0557,0.00413,0.00318,0.234,0.567,128.002,290760,4
2013-06-22,73,Gentleman,PSY,2OsEJFTfzfjG4oC92cuP2c,False,56,5,9,0.861,0.742,3,-3.292,0,0.148,0.0035,0,0.0643,0.655,126.01,194960,4
2013-06-22,74,Demons,Imagine Dragons,2OsEJFTfzfjG4oC92cuP2c,False,73,64,12,0.505,0.71,3,-3.015,1,0.0321,0.19,0.00025,0.329,0.428,89.938,175200,4
2013-06-22,75,Downtown,Lady Antebellum,2OsEJFTfzfjG4oC92cuP2c,False,68,29,18,0.532,0.825,9,-5.287,1,0.0468,0.18,0,0.296,0.96,169.961,195867,4
2013-06-22,76,Don't Ya,Brett Eldredge,2OsEJFTfzfjG4oC92cuP2c,False,83,76,3,0.537,0.693,9,-5.256,1,0.0847,0.0566,0,0.146,0.581,176.004,181210,4
2013-06-22,77,People Like Us,Kelly Clarkson,2OsEJFTfzfjG4oC92cuP2c,False,77,77,4,0.6,0.787,6,-5.163,1,0.0366,0.043,0,0.358,0.608,127.977,258907,4
2013-06-22,78,High School,Nicki Minaj Featuring Lil Wayne,2OsEJFTfzfjG4oC92cuP2c,False,70,64,10,0.531,0.683,1,-4.093,0,0.333,0.135,0.00265,0.22,0.212,84.817,218747,4
2013-06-22,79,Little Bit Of Everything,Keith Urban,2OsEJFTfzfjG4oC92cuP2c,False,91,79,3,0.619,0.882,8,-5.99,1,0.0912,0.239,0,0.033,0.897,159.98,205707,4
2013-06-22,80,Jump Right In,Zac Brown Band,2OsEJFTfzfjG4oC92cuP2c,False,78,78,7,0.697,0.82,1,-5.108,1,0.0575,0.0888,0,0.143,0.655,104.022,180813,4
2013-06-22,81,All Over The Road,Easton Corbin,2OsEJFTfzfjG4oC92cuP2c,False,81,81,5,0.491,0.841,5,-3.579,1,0.0421,0.0471,0,0.0886,0.721,199.851,163067,4
2013-06-22,82,Live It Up,Jennifer Lopez Featuring Pitbull,2OsEJFTfzfjG4oC92cuP2c,False,71,60,5,0.692,0.728,6,-5.13,1,0.171,0.0131,0,0.329,0.642,127.995,243787,4
2013-06-22,83,More Than Miles,Brantley Gilbert,2OsEJFTfzfjG4oC92cuP2c,False,82,79,15,0.47,0.778,5,-5.992,1,0.037,0.0295,0.000225,0.354,0.448,152.005,252867,4
2013-06-22,84,Wild For The Night,A$AP Rocky Featuring Skrillex,2OsEJFTfzfjG4oC92cuP2c,False,84,80,13,0.757,0.848,2,-4.234,1,0.335,0.0481,0,0.121,0.686,139.995,212640,4
2013-06-22,85,I Knew You Were Trouble,Michelle Chamuel,0GrAOvAXTH1EHMHV4ZSjgV,True,0,85,1,0.598,0.586,1,-4.945,1,0.0463,0.0418,0,0.0918,0.715,77.055,206307,4
2013-06-22,86,How Many Drinks?,Miguel,0GrAOvAXTH1EHMHV4ZSjgV,False,86,82,8,0.379,0.608,0,-7.011,0,0.134,0.00311,0.000614,0.248,0.241,81.822,272987,4
2013-06-22,87,Redneck Crazy,Tyler Farr,0GrAOvAXTH1EHMHV4ZSjgV,False,95,87,2,0.487,0.667,7,-4.216,0,0.0309,0.153,0,0.161,0.463,145.854,216040,4
2013-06-22,88,Play Hard,David Guetta Featuring Ne-Yo & Akon,0GrAOvAXTH1EHMHV4ZSjgV,False,64,64,3,0.691,0.921,8,-1.702,0,0.0535,0.174,0,0.331,0.802,130.072,201000,4
2013-06-22,89,Point At You,Justin Moore,0GrAOvAXTH1EHMHV4ZSjgV,False,97,89,2,0.626,0.805,7,-5.81,1,0.0449,0.0126,0,0.156,0.882,116.03,180720,4
2013-06-22,90,Hey Girl,Billy Currington,0GrAOvAXTH1EHMHV4ZSjgV,False,93,75,3,0.548,0.673,1,-5.29,1,0.0268,0.0158,0,0.0794,0.652,81.947,200533,4
2013-06-22,91,Everything Has Changed,Taylor Swift Featuring Ed Sheeran,0GrAOvAXTH1EHMHV4ZSjgV,False,0,67,2,0.624,0.458,6,-6.755,1,0.0287,0.36,3.89e-06,0.303,0.436,80.017,243933,4
2013-06-22,92,Levitate,Hadouken!,0GrAOvAXTH1EHMHV4ZSjgV,False,87,69,15,0.548,0.832,4,-3.72,0,0.0655,0.00628,0,0.261,0.192,133.031,285267,4
2013-06-22,93,Loveeeeeee Song,Rihanna Featuring Future,0GrAOvAXTH1EHMHV4ZSjgV,False,90,55,19,0.71,0.598,5,-7.598,0,0.0319,0.508,0,0.0971,0.501,119.981,256320,4
2013-06-22,94,Love And War,Tamar Braxton,0GrAOvAXTH1EHMHV4ZSjgV,False,88,57,20,0.27,0.58,8,-5.717,0,0.039,0.469,0,0.343,0.242,179.919,241920,3
2013-06-22,95,Pirate Flag,Kenny Chesney,0GrAOvAXTH1EHMHV4ZSjgV,False,85,46,18,0.559,0.795,7,-6.255,1,0.052,0.0787,4.83e-06,0.102,0.553,160.039,225427,4
2013-06-22,96,Ready,Fabolous Featuring Chris Brown,0GrAOvAXTH1EHMHV4ZSjgV,False,100,93,7,0.585,0.62,7,-8.429,0,0.193,0.37,0,0.123,0.301,150.006,239947,4
2013-06-22,97,Molly,"Tyga Featuring Cedric Gervais, Wiz Khalifa & Mally Mall",0GrAOvAXTH1EHMHV4ZSjgV,False,94,66,12,0.831,0.783,5,-6.719,1,0.0527,0.079,1.27e-06,0.35,0.771,140.046,218440,4
2013-06-22,98,Sweater Weather,The Neighbourhood,2QjOHCTQ1Jl3zawyYOpxh6,True,0,98,1,0.612,0.807,10,-2.81,1,0.0336,0.0495,0.0177,0.101,0.398,124.053,240400,4
2013-06-22,99,Can't Shake You,Gloriana,2QjOHCTQ1Jl3zawyYOpxh6,False,98,83,4,0.651,0.696,9,-6.611,1,0.0331,0.247,0,0.114,0.441,112.988,266973,4
2013-06-22,100,Work,A$AP Ferg,2QjOHCTQ1Jl3zawyYOpxh6,False,0,100,2,0.841,0.733,1,-5.077,1,0.142,0.0246,0,0.174,0.284,130.009,283693,4
