date,position,title,artist,spotify_id,is_new,last_pos,peak_pos,weeks,danceability,energy,key,loudness,mode,speechiness,acousticness,instrumentalness,liveness,valence,tempo,duration_ms,time_signature
2019-02-23,1,7 Rings,Ariana Grande,5NfJGBAL9mgFPRQxKJmiX2,False,1,1,4,0.778,0.317,1,-10.732,0,0.334,0.592,0,0.0881,0.327,140.048,178627,4
2019-02-23,2,"Break Up With Your Girlfriend, I'm Bored",Ariana Grande,4kV4N9D1iKVxx1KLvtTpjS,True,0,2,1,0.726,0.554,5,-5.29,0,0.0917,0.0421,0,0.106,0.335,169.999,190440,4
2019-02-23,3,"Thank U, Next",Ariana Grande,4kV4N9D1iKVxx1KLvtTpjS,False,7,1,15,0.717,0.653,1,-5.634,1,0.0658,0.229,0,0.101,0.412,106.966,207320,4
2019-02-23,4,Without Me,Halsey,4kV4N9D1iKVxx1KLvtTpjS,False,3,1,19,0.752,0.488,6,-7.05,1,0.0705,0.297,9.11e-06,0.0936,0.533,136.041,201661,4
2019-02-23,5,Sunflower (Spider-Man: Into The Spider-Verse),Post Malone & Swae Lee,4kV4N9D1iKVxx1KLvtTpjS,False,4,1,17,0.76,0.479,2,-5.574,1,0.0466,0.556,0,0.0703,0.913,89.911,158040,4
2019-02-23,6,Happier,Marshmello & Bastille,4kV4N9D1iKVxx1KLvtTpjS,False,2,2,26,0.687,0.792,5,-2.749,1,0.0452,0.191,0,0.167,0.671,100.015,214290,4
2019-02-23,7,Sicko Mode,Travis Scott,4kV4N9D1iKVxx1KLvtTpjS,False,5,1,28,0.834,0.73,8,-3.714,1,0.222,0.00513,0,0.124,0.446,155.008,312820,4
2019-02-23,8,High Hopes,Panic! At The Disco,4kV4N9D1iKVxx1KLvtTpjS,False,6,4,28,0.579,0.904,5,-2.729,1,0.0618,0.193,0,0.064,0.681,82.014,190947,4
2019-02-23,9,Wow.,Post Malone,4kV4N9D1iKVxx1KLvtTpjS,False,9,8,8,0.829,0.539,11,-7.359,0,0.208,0.136,1.78e-06,0.103,0.388,99.96,149547,4
2019-02-23,10,Eastside,"benny blanco, Halsey & Khalid",4kV4N9D1iKVxx1KLvtTpjS,False,11,9,31,0.56,0.68,6,-7.648,0,0.321,0.555,0,0.116,0.319,89.391,173800,4
2019-02-23,11,Middle Child,J. Cole,4kV4N9D1iKVxx1KLvtTpjS,False,8,4,4,0.837,0.364,8,-11.713,1,0.276,0.149,0,0.271,0.463,123.984,213594,4
2019-02-23,12,Girls Like You,Maroon 5 Featuring Cardi B,4kV4N9D1iKVxx1KLvtTpjS,False,10,1,38,0.609,0.529,0,-6.859,1,0.106,0.545,0,0.127,0.474,60.349,235680,4
2019-02-23,13,Going Bad,Meek Mill Featuring Drake,4kV4N9D1iKVxx1KLvtTpjS,False,15,6,11,0.889,0.496,4,-6.365,0,0.0905,0.259,0,0.252,0.544,86.003,180522,4
2019-02-23,14,Needy,Ariana Grande,1TEL6MlSSVLSdhOSddidlJ,True,0,14,1,0.647,0.309,7,-7.948,0,0.0366,0.78,7.41e-06,0.202,0.195,87.045,171573,4
2019-02-23,15,A Lot,21 Savage,1TEL6MlSSVLSdhOSddidlJ,False,12,12,8,0.837,0.636,1,-7.643,1,0.086,0.0395,0.00125,0.342,0.274,145.972,288624,4
2019-02-23,16,Drip Too Hard,Lil Baby & Gunna,1TEL6MlSSVLSdhOSddidlJ,False,13,4,22,0.897,0.662,1,-6.903,0,0.292,0.0852,0,0.534,0.389,112.511,145543,4
2019-02-23,17,NASA,Ariana Grande,4uTvPEr01pjTbZgl7jcKBD,True,0,17,1,0.747,0.458,6,-6.891,1,0.303,0.451,0,0.252,0.47,75.029,182000,4
2019-02-23,18,Shallow,Lady Gaga & Bradley Cooper,4uTvPEr01pjTbZgl7jcKBD,False,24,5,20,0.572,0.385,7,-6.362,1,0.0308,0.371,0,0.231,0.323,95.799,215733,4
2019-02-23,19,Money,Cardi B,4uTvPEr01pjTbZgl7jcKBD,False,16,13,17,0.95,0.59,8,-6.508,0,0.29,0.00534,0,0.11,0.219,130.003,183527,4
2019-02-23,20,Thotiana,Blueface,4uTvPEr01pjTbZgl7jcKBD,False,20,20,5,0.906,0.382,10,-12.89,0,0.269,0.18,0,0.113,0.391,104.025,129264,4
2019-02-23,21,Imagine,Ariana Grande,4uTvPEr01pjTbZgl7jcKBD,False,0,21,6,0.729,0.475,8,-4.985,1,0.0364,0.378,0,0.12,0.371,62.52,212267,3
2019-02-23,22,Bloodline,Ariana Grande,2hloaUoRonYssMuqLCBLTX,True,0,22,1,0.758,0.665,2,-5.188,0,0.0774,0.0815,0.000157,0.216,0.643,151.976,216893,4
2019-02-23,23,Better,Khalid,2hloaUoRonYssMuqLCBLTX,False,18,18,22,0.596,0.552,0,-10.278,0,0.097,0.0765,0.334,0.104,0.112,97.949,229320,4
2019-02-23,24,ZEZE,Kodak Black Featuring Travis Scott & Offset,2hloaUoRonYssMuqLCBLTX,False,17,2,18,0.861,0.603,8,-5.788,0,0.176,0.0521,0,0.0924,0.504,98.043,228760,4
2019-02-23,25,Ghostin,Ariana Grande,2vdBo4ALPYbHRUPKgtE5iC,True,0,25,1,0.287,0.364,9,-8.295,1,0.0306,0.418,1.8e-05,0.185,0.11,103.777,271467,4
2019-02-23,26,Fake Smile,Ariana Grande,3wFLWP0FcIqHK1wb1CPthQ,True,0,26,1,0.45,0.619,9,-7.412,1,0.372,0.329,0,0.319,0.427,83.3,208880,4
2019-02-23,27,Bad Idea,Ariana Grande,5Il6Oe7lr5XM7A0cWbVQtr,True,0,27,1,0.847,0.579,1,-5.314,1,0.0719,0.0268,0.0545,0.102,0.569,137.998,267107,4
2019-02-23,28,MIA,Bad Bunny Featuring Drake,5Il6Oe7lr5XM7A0cWbVQtr,False,19,5,18,0.817,0.539,6,-6.349,0,0.0621,0.0141,0.000496,0.099,0.158,97.062,210368,4
2019-02-23,29,Better Now,Post Malone,5Il6Oe7lr5XM7A0cWbVQtr,False,21,3,42,0.68,0.578,10,-5.804,1,0.04,0.331,0,0.135,0.341,145.038,231267,4
2019-02-23,30,Dancing With A Stranger,Sam Smith & Normani,5Il6Oe7lr5XM7A0cWbVQtr,False,26,26,5,0.741,0.52,8,-7.513,1,0.0656,0.45,1.97e-06,0.222,0.347,102.998,171030,4
2019-02-23,31,Tequila,Dan + Shay,5Il6Oe7lr5XM7A0cWbVQtr,False,31,21,41,0.489,0.581,11,-5.731,1,0.0281,0.0312,0,0.132,0.494,86.016,196747,4
2019-02-23,32,Bury A Friend,Billie Eilish,5Il6Oe7lr5XM7A0cWbVQtr,False,14,14,3,0.905,0.389,8,-14.505,1,0.332,0.74,0.162,0.106,0.196,120.046,193143,4
2019-02-23,33,Leave Me Alone,Flipp Dinero,5Il6Oe7lr5XM7A0cWbVQtr,False,25,20,22,0.792,0.743,7,-2.806,1,0.0851,0.107,0,0.183,0.742,150.024,195637,4
2019-02-23,34,Youngblood,5 Seconds Of Summer,5Il6Oe7lr5XM7A0cWbVQtr,False,23,7,37,0.596,0.854,7,-5.114,0,0.463,0.0169,0,0.124,0.152,120.274,203418,4
2019-02-23,35,Wake Up In The Sky,Gucci Mane X Bruno Mars X Kodak Black,5Il6Oe7lr5XM7A0cWbVQtr,False,22,11,22,0.8,0.578,4,-5.144,0,0.0485,0.00381,0,0.359,0.367,143.01,204665,4
2019-02-23,36,Beautiful Crazy,Luke Combs,5Il6Oe7lr5XM7A0cWbVQtr,False,36,36,14,0.551,0.402,11,-7.431,1,0.0262,0.676,0,0.0928,0.382,103.313,193200,4
2019-02-23,37,Sweet But Psycho,Ava Max,5Il6Oe7lr5XM7A0cWbVQtr,False,30,30,9,0.72,0.706,1,-4.719,1,0.0473,0.0684,0,0.166,0.62,133.002,187436,4
2019-02-23,38,In My Head,Ariana Grande,4T652DlATVHe0jdLKaN3Bw,True,0,38,1,0.662,0.6,0,-6.402,1,0.0703,0.173,0.000137,0.109,0.331,134.979,222947,4
2019-02-23,39,Taki Taki,"DJ Snake Featuring Selena Gomez, Ozuna & Cardi B",4T652DlATVHe0jdLKaN3Bw,False,29,11,20,0.842,0.801,8,-4.167,0,0.228,0.157,4.82e-06,0.0642,0.617,95.881,212500,4
2019-02-23,40,You Say,Lauren Daigle,4T652DlATVHe0jdLKaN3Bw,False,37,34,31,0.494,0.632,5,-6.89,1,0.0342,0.682,0,0.0869,0.0797,147.873,274693,4
2019-02-23,41,Mo Bamba,Sheck Wes,4T652DlATVHe0jdLKaN3Bw,False,27,6,25,0.729,0.625,4,-5.266,1,0.0315,0.194,0.00986,0.248,0.261,146.034,183907,4
2019-02-23,42,Close To Me,Ellie Goulding X Diplo Featuring Swae Lee,4T652DlATVHe0jdLKaN3Bw,False,33,28,13,0.572,0.75,1,-5.042,0,0.0604,0.0946,0,0.378,0.475,144.081,182627,4
2019-02-23,43,Lucid Dreams,Juice WRLD,4T652DlATVHe0jdLKaN3Bw,False,34,2,40,0.511,0.566,6,-7.23,0,0.2,0.349,0,0.34,0.218,83.903,239836,4
2019-02-23,44,Talk,Khalid,6TqXcAFInzjp0bODyvrWEq,True,0,44,1,0.901,0.4,0,-8.575,1,0.126,0.051,0,0.0599,0.346,135.984,197573,4
2019-02-23,45,I Like It,"Cardi B, Bad Bunny & J Balvin",6TqXcAFInzjp0bODyvrWEq,False,39,1,45,0.816,0.726,5,-3.998,0,0.129,0.099,0,0.372,0.65,136.048,253390,4
2019-02-23,46,Be Alright,Dean Lewis,6TqXcAFInzjp0bODyvrWEq,False,43,40,16,0.553,0.586,11,-6.319,1,0.0362,0.697,0,0.0813,0.443,126.684,196373,4
2019-02-23,47,Look Back At It,A Boogie Wit da Hoodie,6TqXcAFInzjp0bODyvrWEq,False,32,32,10,0.791,0.587,3,-5.075,0,0.0413,0.407,0,0.148,0.536,96.057,179449,4
2019-02-23,48,Make Up,Ariana Grande,27356GVuMPFWiJSZCragoM,True,0,48,1,0.671,0.714,7,-5.373,1,0.21,0.0844,1.48e-06,0.0568,0.477,105.137,140693,3
2019-02-23,49,Baby Shark,Pinkfong,27356GVuMPFWiJSZCragoM,False,40,32,7,0.829,0.886,8,-1.746,1,0.112,0.259,0,0.0559,0.777,115.056,80927,4
2019-02-23,50,Envy Me,Calboy,27356GVuMPFWiJSZCragoM,False,45,41,9,0.74,0.488,1,-7.664,0,0.27,0.234,0,0.241,0.584,149.042,120133,4
2019-02-23,51,Swervin,A Boogie Wit da Hoodie Featuring 6ix9ine,27356GVuMPFWiJSZCragoM,False,46,38,8,0.581,0.662,9,-5.239,1,0.303,0.0153,0,0.111,0.434,93.023,189487,4
2019-02-23,52,This Is It,Scotty McCreery,27356GVuMPFWiJSZCragoM,False,42,42,10,0.579,0.511,8,-6.788,1,0.0293,0.254,0,0.099,0.594,78.003,230973,4
2019-02-23,53,Backin' It Up,Pardison Fontaine Featuring Cardi B,27356GVuMPFWiJSZCragoM,False,48,40,18,0.796,0.68,10,-4.853,0,0.353,0.0886,0,0.268,0.565,164.932,190466,4
2019-02-23,54,Twerk,City Girls Featuring Cardi B,27356GVuMPFWiJSZCragoM,False,50,29,6,0.788,0.842,4,-4.006,0,0.142,0.121,0.00112,0.166,0.481,190.077,166476,4
2019-02-23,55,Girl Like You,Jason Aldean,27356GVuMPFWiJSZCragoM,False,51,46,12,0.543,0.88,3,-4.204,0,0.0365,0.035,0.000227,0.304,0.483,144.057,193067,4
2019-02-23,56,Who Do You Love,The Chainsmokers Featuring 5 Seconds Of Summer,2fVHrSxsQbJUuj9MW9zG1e,True,0,56,1,0.51,0.846,3,-4.595,1,0.0461,0.0101,0,0.208,0.475,139.927,226733,4
2019-02-23,57,This Feeling,The Chainsmokers Featuring Kelsea Ballerini,2fVHrSxsQbJUuj9MW9zG1e,False,52,50,18,0.575,0.571,1,-7.906,1,0.0439,0.0558,0,0.0912,0.449,105.049,197947,4
2019-02-23,58,Lost In The Fire,Gesaffelstein & The Weeknd,2fVHrSxsQbJUuj9MW9zG1e,False,49,27,5,0.658,0.671,2,-12.21,1,0.0363,0.0933,0.000927,0.115,0.166,100.966,202093,4
2019-02-23,59,Murder On My Mind,YNW Melly,2fVHrSxsQbJUuj9MW9zG1e,False,73,59,4,0.759,0.73,0,-7.985,0,0.0516,0.145,3.06e-06,0.11,0.74,115.007,268434,4
2019-02-23,60,Nothing Breaks Like A Heart,Mark Ronson Featuring Miley Cyrus,2fVHrSxsQbJUuj9MW9zG1e,False,53,43,11,0.699,0.887,7,-6.148,0,0.0406,0.00842,0.0106,0.0528,0.263,120.007,252000,4
2019-02-23,61,Pure Water,Mustard & Migos,2fVHrSxsQbJUuj9MW9zG1e,False,64,61,3,0.682,0.559,0,-5.545,1,0.127,0.174,0,0.344,0.137,202.015,192471,4
2019-02-23,62,Take It From Me,Jordan Davis,2fVHrSxsQbJUuj9MW9zG1e,False,58,58,7,0.592,0.891,10,-3.144,1,0.0512,0.0267,0,0.352,0.674,99.983,174255,4
2019-02-23,63,Undecided,Chris Brown,2fVHrSxsQbJUuj9MW9zG1e,False,54,35,6,0.407,0.612,5,-4.387,0,0.13,0.288,0,0.198,0.488,96.943,185000,4
2019-02-23,64,What Makes You Country,Luke Bryan,2fVHrSxsQbJUuj9MW9zG1e,False,63,63,7,0.515,0.948,0,-1.721,1,0.0438,0.0106,0,0.134,0.752,159.983,235266,4
2019-02-23,65,Armed And Dangerous,Juice WRLD,2fVHrSxsQbJUuj9MW9zG1e,False,62,44,14,0.736,0.67,10,-6.702,1,0.311,0.186,0,0.114,0.845,130.032,169999,4
2019-02-23,66,Millionaire,Chris Stapleton,2fVHrSxsQbJUuj9MW9zG1e,False,69,66,10,0.616,0.474,10,-9.608,1,0.0266,0.192,0.00762,0.0989,0.493,142.689,210133,4
2019-02-23,67,Pure Cocaine,Lil Baby,2fVHrSxsQbJUuj9MW9zG1e,False,57,46,10,0.964,0.487,10,-6.071,0,0.421,0.00127,6.57e-06,0.115,0.107,127.05,154024,4
2019-02-23,68,Close Friends,Lil Baby,2fVHrSxsQbJUuj9MW9zG1e,False,99,28,16,0.676,0.578,10,-4.669,0,0.375,0.0509,0,0.0796,0.698,158.896,203881,4
2019-02-23,69,Sixteen,Thomas Rhett,2fVHrSxsQbJUuj9MW9zG1e,False,55,42,14,0.705,0.531,1,-7.031,1,0.0281,0.0135,2.11e-06,0.165,0.425,107.013,178333,4
2019-02-23,70,Love Someone,Lukas Graham,2fVHrSxsQbJUuj9MW9zG1e,False,72,70,7,0.55,0.415,9,-6.557,0,0.052,0.161,0,0.108,0.274,172.065,205463,4
2019-02-23,71,Calling My Spirit,Kodak Black,2fVHrSxsQbJUuj9MW9zG1e,False,67,46,11,0.91,0.366,1,-9.954,1,0.0941,0.0996,0,0.261,0.74,119.985,152000,4
2019-02-23,72,Put A Date On It,Yo Gotti Featuring Lil Baby,2fVHrSxsQbJUuj9MW9zG1e,False,59,59,3,0.835,0.659,4,-5.696,1,0.31,0.0123,0,0.372,0.579,129.93,195257,4
2019-02-23,73,Uproar,Lil Wayne,2fVHrSxsQbJUuj9MW9zG1e,False,65,7,20,0.743,0.87,1,-2.188,1,0.212,0.0595,0,0.299,0.884,99.079,194184,4
2019-02-23,74,Ella Quiere Beber,Anuel AA & Romeo Santos,2fVHrSxsQbJUuj9MW9zG1e,False,68,61,15,0.75,0.665,8,-3.083,1,0.124,0.265,0,0.0515,0.697,95.239,219357,4
2019-02-23,75,Lovely,Billie Eilish & Khalid,2fVHrSxsQbJUuj9MW9zG1e,False,66,64,16,0.351,0.296,4,-10.109,0,0.0333,0.934,0,0.095,0.12,115.284,200186,4
2019-02-23,76,Burning Man,Dierks Bentley Featuring Brothers Osborne,2fVHrSxsQbJUuj9MW9zG1e,False,60,45,17,0.609,0.807,5,-7.221,1,0.0972,0.00403,5.42e-06,0.0926,0.492,119.073,238493,4
2019-02-23,77,You,Jacquees,2fVHrSxsQbJUuj9MW9zG1e,False,70,58,12,0.735,0.453,8,-8.264,0,0.0602,0.413,0,0.104,0.335,115.002,217387,4
2019-02-23,78,When The Party's Over,Billie Eilish,2fVHrSxsQbJUuj9MW9zG1e,False,61,52,17,0.367,0.111,4,-14.084,1,0.0972,0.978,3.97e-05,0.0897,0.198,82.642,196077,4
2019-02-23,79,Down To The Honkytonk,Jake Owen,2fVHrSxsQbJUuj9MW9zG1e,False,74,74,7,0.634,0.808,3,-4.12,1,0.0517,0.192,0,0.0898,0.937,82.016,186867,4
2019-02-23,80,Secreto,Anuel AA & Karol G,2fVHrSxsQbJUuj9MW9zG1e,False,0,68,3,0.807,0.803,11,-4.156,1,0.126,0.6,0.0085,0.136,0.706,91.982,258800,4
2019-02-23,81,Shot Clock,Ella Mai,2fVHrSxsQbJUuj9MW9zG1e,False,82,81,3,0.512,0.512,4,-6.008,0,0.285,0.654,0,0.148,0.434,95.11,201609,1
2019-02-23,82,Body,Loud Luxury Featuring Brando,2fVHrSxsQbJUuj9MW9zG1e,False,81,80,7,0.752,0.764,1,-4.399,1,0.038,0.0476,9.44e-05,0.0543,0.582,121.958,163216,4
2019-02-23,83,Good Girl,Dustin Lynch,2fVHrSxsQbJUuj9MW9zG1e,False,71,44,14,0.711,0.696,7,-5.05,1,0.0869,0.16,0,0.17,0.694,80.512,189533,4
2019-02-23,84,Make It Sweet,Old Dominion,2fVHrSxsQbJUuj9MW9zG1e,False,87,84,7,0.424,0.837,7,-4.453,1,0.0472,0.0373,0,0.0665,0.554,180.175,187000,4
2019-02-23,85,Burn Out,Midland,2fVHrSxsQbJUuj9MW9zG1e,False,93,85,6,0.671,0.724,7,-5.61,1,0.0244,0.292,0,0.231,0.801,99.976,188613,4
2019-02-23,86,Ruin My Life,Zara Larsson,2fVHrSxsQbJUuj9MW9zG1e,False,78,76,7,0.665,0.699,11,-5.265,1,0.0578,0.423,0,0.0969,0.585,124.896,190932,4
2019-02-23,87,Love Wins,Carrie Underwood,2fVHrSxsQbJUuj9MW9zG1e,False,84,83,7,0.523,0.865,7,-4.697,1,0.0989,0.0112,0,0.153,0.325,135.115,228640,4
2019-02-23,88,Arms Around You,XXXTENTACION x Lil Pump Featuring Maluma & Swae Lee,2fVHrSxsQbJUuj9MW9zG1e,False,79,28,16,0.703,0.723,9,-5.45,0,0.0412,0.0302,2.06e-06,0.126,0.288,104.969,198903,4
2019-02-23,89,Nights Like This,Kehlani Featuring Ty Dolla $ign,2fVHrSxsQbJUuj9MW9zG1e,False,76,69,5,0.61,0.725,8,-5.131,1,0.15,0.367,0,0.154,0.291,146.163,201788,4
2019-02-23,90,Yosemite,Travis Scott,2fVHrSxsQbJUuj9MW9zG1e,False,77,25,17,0.785,0.554,0,-6.571,1,0.0409,0.283,3.4e-06,0.116,0.144,128.047,150043,4
2019-02-23,91,Miss Me More,Kelsea Ballerini,2fVHrSxsQbJUuj9MW9zG1e,False,95,91,2,0.643,0.72,2,-7.146,1,0.0527,0.014,0,0.0834,0.491,96.028,192840,4
2019-02-23,92,Here Tonight,Brett Young,2fVHrSxsQbJUuj9MW9zG1e,False,89,88,6,0.517,0.776,11,-5.271,1,0.0362,0.0144,0,0.113,0.448,96.002,216533,4
2019-02-23,93,Mixed Personalities,YNW Melly Featuring Kanye West,2fVHrSxsQbJUuj9MW9zG1e,False,86,71,4,0.661,0.44,2,-9.104,1,0.0803,0.457,0,0.128,0.352,149.937,230400,4
2019-02-23,94,Let Me Down Slowly,Alec Benjamin + Alessia Cara,2fVHrSxsQbJUuj9MW9zG1e,False,94,79,4,0.652,0.557,1,-5.714,0,0.0318,0.74,0,0.124,0.483,150.073,169354,4
2019-02-23,95,Con Calma,Daddy Yankee & Katy Perry Featuring Snow,2fVHrSxsQbJUuj9MW9zG1e,False,0,90,2,0.737,0.86,8,-2.652,0,0.0593,0.11,1.94e-06,0.0574,0.656,93.989,193227,4
2019-02-23,96,Talk To Me,Tory Lanez & Rich The Kid,2fVHrSxsQbJUuj9MW9zG1e,False,83,43,16,0.698,0.66,0,-7.883,1,0.052,0.0226,0,0.0622,0.451,159.949,248521,4
2019-02-23,97,Splashin,Rich The Kid,2fVHrSxsQbJUuj9MW9zG1e,False,90,90,4,0.942,0.382,10,-8.099,1,0.564,0.00192,0,0.092,0.379,100.017,177864,4
2019-02-23,98,Rainbow,Kacey Musgraves,79qxwHypONUt3AFq0WPpT9,True,0,98,1,0.581,0.197,3,-7.697,1,0.0329,0.88,0,0.107,0.349,130.367,214293,4
2019-02-23,99,Startender,A Boogie Wit da Hoodie Featuring Offset & Tyga,79qxwHypONUt3AFq0WPpT9,False,85,59,8,0.736,0.622,6,-4.653,0,0.133,0.0235,0,0.151,0.506,191.971,192779,4
2019-02-23,100,On My Way To You,Cody Johnson,79qxwHypONUt3AFq0WPpT9,False,100,91,3,0.443,0.538,1,-5.477,1,0.0309,0.327,4.61e-05,0.0866,0.245,157.97,213307,4
