date,position,title,artist,spotify_id,is_new,last_pos,peak_pos,weeks,danceability,energy,key,loudness,mode,speechiness,acousticness,instrumentalness,liveness,valence,tempo,duration_ms,time_signature
2000-09-16,1,Music,Madonna,6M33HiUHLC3R3gfXYNGMAy,False,2,1,6,0.736,0.802,7,-8.527,1,0.0663,0.00149,0.0876,0.14,0.871,119.854,225973,4
2000-09-16,2,Doesn't Really Matter,Janet,6M33HiUHLC3R3gfXYNGMAy,False,1,1,14,0.771,0.796,5,-3.081,0,0.076,0.0993,0.00278,0.0981,0.801,99.316,265027,4
2000-09-16,3,"Jumpin', Jumpin'",Destiny's Child,6M33HiUHLC3R3gfXYNGMAy,False,3,3,19,0.771,0.685,1,-4.639,1,0.0567,0.00543,0.00157,0.0537,0.683,88.997,230200,4
2000-09-16,4,Bent,matchbox twenty,6M33HiUHLC3R3gfXYNGMAy,False,5,1,21,0.518,0.83,6,-6.814,0,0.0386,0.0404,3.85e-06,0.375,0.527,95.468,256133,4
2000-09-16,5,Incomplete,Sisqo,6M33HiUHLC3R3gfXYNGMAy,False,4,1,13,0.746,0.443,1,-7.693,0,0.0771,0.282,0,0.14,0.272,119.311,274227,4
2000-09-16,6,Kryptonite,3 Doors Down,6M33HiUHLC3R3gfXYNGMAy,False,6,6,24,0.545,0.865,11,-5.708,0,0.0286,0.00664,1.1e-05,0.168,0.543,99.009,233933,4
2000-09-16,7,(Hot S**t) Country Grammar,Nelly,6M33HiUHLC3R3gfXYNGMAy,False,10,7,21,0.85,0.7,7,-6.49,1,0.0478,0.0616,1.8e-06,0.244,0.722,101.875,291782,4
2000-09-16,8,No More,Ruff Endz,6M33HiUHLC3R3gfXYNGMAy,False,8,5,12,0.839,0.641,10,-5.669,0,0.0858,0.0324,4.56e-06,0.0602,0.927,97.004,242560,4
2000-09-16,9,I Wanna Know,Joe,6M33HiUHLC3R3gfXYNGMAy,False,9,4,38,0.725,0.487,8,-5.959,0,0.0368,0.26,1.09e-05,0.431,0.599,136.086,296693,4
2000-09-16,10,Wifey,Next,6M33HiUHLC3R3gfXYNGMAy,False,7,7,17,0.831,0.713,7,-6.967,0,0.104,0.0678,0,0.0659,0.683,99.584,243467,4
2000-09-16,11,Come On Over Baby (All I Want Is You),Christina Aguilera,6M33HiUHLC3R3gfXYNGMAy,False,18,11,7,0.829,0.915,8,-3.205,1,0.106,0.226,1.25e-05,0.246,0.779,118.903,203333,4
2000-09-16,12,Absolutely (Story Of A Girl),Nine Days,6M33HiUHLC3R3gfXYNGMAy,False,11,6,20,0.481,0.94,7,-5.204,1,0.066,0.000891,0,0.0939,0.66,96.493,189333,4
2000-09-16,13,I Need You,LeAnn Rimes,6M33HiUHLC3R3gfXYNGMAy,False,12,11,17,0.478,0.736,7,-7.124,1,0.0367,0.02,9.58e-05,0.118,0.564,144.705,229827,4
2000-09-16,14,He Wasn't Man Enough,Toni Braxton,6M33HiUHLC3R3gfXYNGMAy,False,16,2,27,0.739,0.947,11,-1.915,0,0.0412,0.00947,2.99e-05,0.326,0.763,88.009,261933,4
2000-09-16,15,It's Gonna Be Me,'N Sync,6M33HiUHLC3R3gfXYNGMAy,False,13,1,20,0.636,0.873,0,-4.672,0,0.071,0.0407,1.27e-06,0.0372,0.908,165.071,192427,4
2000-09-16,16,Try Again,Aaliyah,6M33HiUHLC3R3gfXYNGMAy,False,14,1,27,0.852,0.333,0,-8.559,1,0.117,0.173,0.0545,0.0374,0.928,95.484,254750,4
2000-09-16,17,Higher,Creed,6M33HiUHLC3R3gfXYNGMAy,False,17,7,46,0.459,0.83,2,-6.254,1,0.0364,5.15e-05,0.00014,0.206,0.431,155.827,316733,4
2000-09-16,18,Back Here,BBMak,6M33HiUHLC3R3gfXYNGMAy,False,15,13,21,0.624,0.945,7,-3.109,1,0.0343,0.0698,4.57e-06,0.0867,0.914,104.77,218200,4
2000-09-16,19,With Arms Wide Open,Creed,6M33HiUHLC3R3gfXYNGMAy,False,29,19,19,0.41,0.539,0,-8.412,1,0.0302,0.00425,0.00089,0.117,0.141,138.852,274800,4
2000-09-16,20,Bounce With Me,Lil Bow Wow Featuring Xscape,6M33HiUHLC3R3gfXYNGMAy,False,24,20,5,0.852,0.75,8,-5.153,1,0.168,0.434,0,0.265,0.934,72.016,175893,4
2000-09-16,21,Most Girls,P!nk,6M33HiUHLC3R3gfXYNGMAy,False,27,21,6,0.742,0.732,2,-6.046,0,0.0311,0.0424,0.00444,0.101,0.695,97.923,298960,4
2000-09-16,22,Faded,SoulDecision Featuring Thrust,6M33HiUHLC3R3gfXYNGMAy,False,22,22,11,0.859,0.585,6,-9.779,0,0.0986,0.153,0,0.0597,0.908,107.998,209123,4
2000-09-16,23,Let's Get Married,Jagged Edge,6M33HiUHLC3R3gfXYNGMAy,False,21,11,20,0.852,0.694,1,-6.765,1,0.0653,0.0121,0,0.126,0.789,109.906,249040,4
2000-09-16,24,Desert Rose,Sting Featuring Cheb Mami,6M33HiUHLC3R3gfXYNGMAy,False,19,17,19,0.577,0.654,0,-7.9,0,0.0321,0.0143,0,0.114,0.13,111.993,285893,4
2000-09-16,25,Shake Ya Ass,Mystikal,6M33HiUHLC3R3gfXYNGMAy,False,34,25,6,0.914,0.607,7,-5.658,1,0.32,0.0626,0,0.0515,0.666,98.054,256973,4
2000-09-16,26,Give Me Just One Night (Una Noche),98 Degrees,6M33HiUHLC3R3gfXYNGMAy,False,26,26,5,0.543,0.79,0,-6.145,1,0.0491,0.0513,3.55e-06,0.0981,0.655,123.631,205160,4
2000-09-16,27,Everything You Want,Vertical Horizon,6M33HiUHLC3R3gfXYNGMAy,False,20,1,35,0.637,0.759,3,-6.389,0,0.0305,0.0504,0,0.0642,0.741,93.898,257067,4
2000-09-16,28,Wonderful,Everclear,6M33HiUHLC3R3gfXYNGMAy,False,25,22,11,0.514,0.817,7,-6.489,1,0.05,0.0118,8.25e-06,0.346,0.734,186.765,280813,4
2000-09-16,29,Lucky,Britney Spears,6M33HiUHLC3R3gfXYNGMAy,False,23,23,6,0.765,0.791,8,-5.707,1,0.0317,0.262,0.000154,0.0669,0.966,95.026,206227,4
2000-09-16,30,That's The Way,Jo Dee Messina,6M33HiUHLC3R3gfXYNGMAy,False,28,25,13,0.488,0.923,2,-3.697,1,0.103,0.129,0,0.158,0.818,183.891,202253,4
2000-09-16,31,Breathe,Faith Hill,6M33HiUHLC3R3gfXYNGMAy,False,31,2,46,0.529,0.496,7,-9.007,1,0.029,0.173,0,0.251,0.278,136.859,250547,4
2000-09-16,32,Purest Of Pain (A Puro Dolor),Son By Four,6M33HiUHLC3R3gfXYNGMAy,False,30,26,24,0.565,0.547,0,-7.722,1,0.0347,0.579,0,0.194,0.252,75.018,209320,4
2000-09-16,33,You Sang To Me,Marc Anthony,6M33HiUHLC3R3gfXYNGMAy,False,35,2,30,0.578,0.894,10,-5.42,1,0.0296,0.0103,2.66e-06,0.216,0.741,165.98,347107,4
2000-09-16,34,Just Be A Man About It,Toni Braxton,6M33HiUHLC3R3gfXYNGMAy,False,32,32,8,0.753,0.45,9,-6.909,1,0.0924,0.274,2e-06,0.321,0.56,109.405,288933,4
2000-09-16,35,Aaron's Party (Come Get It),Aaron Carter,6M33HiUHLC3R3gfXYNGMAy,False,57,35,4,0.944,0.886,1,-4.121,1,0.135,0.0462,0,0.0429,0.912,117.03,204733,4
2000-09-16,36,Don't Think I'm Not,Kandi,6M33HiUHLC3R3gfXYNGMAy,False,42,36,7,0.859,0.622,11,-8.196,1,0.0445,0.0661,0,0.0394,0.433,134.007,243533,4
2000-09-16,37,What About Now,Lonestar,6M33HiUHLC3R3gfXYNGMAy,False,36,30,15,0.739,0.688,4,-5.581,1,0.0349,0.498,0,0.17,0.769,126.998,211253,4
2000-09-16,38,I Think I'm In Love With You,Jessica Simpson,6M33HiUHLC3R3gfXYNGMAy,False,38,21,12,0.715,0.815,9,-5.867,1,0.0576,0.0689,0,0.233,0.804,106.001,197693,4
2000-09-16,39,There You Go,P!nk,6M33HiUHLC3R3gfXYNGMAy,False,39,7,29,0.822,0.847,10,-6.729,0,0.0916,0.0862,0,0.0452,0.667,107.906,202800,4
2000-09-16,40,It Must Be Love,Alan Jackson,6M33HiUHLC3R3gfXYNGMAy,False,37,37,13,0.816,0.669,6,-7.925,1,0.0295,0.284,0,0.0563,0.967,112.132,171813,4
2000-09-16,41,You're A God,Vertical Horizon,6M33HiUHLC3R3gfXYNGMAy,False,43,41,4,0.65,0.851,5,-6.519,0,0.0303,0.00117,3.39e-05,0.0937,0.294,96.651,218760,4
2000-09-16,42,Case Of The Ex (Whatcha Gonna Do),Mya,6M33HiUHLC3R3gfXYNGMAy,False,47,42,5,0.774,0.684,1,-4.721,0,0.0408,0.0687,9.34e-05,0.0765,0.354,98.001,236827,4
2000-09-16,43,I Will...But,SHeDAISY,6M33HiUHLC3R3gfXYNGMAy,False,45,43,10,0.675,0.837,2,-5.105,1,0.0354,0.103,0,0.123,0.888,112.53,219973,4
2000-09-16,44,One Voice,Billy Gilman,6M33HiUHLC3R3gfXYNGMAy,False,40,38,14,0.442,0.447,0,-8.838,1,0.0252,0.101,0,0.0962,0.16,149.652,249840,4
2000-09-16,45,It's My Life,Bon Jovi,6M33HiUHLC3R3gfXYNGMAy,False,48,45,6,0.551,0.913,0,-4.063,0,0.0466,0.0263,1.35e-05,0.347,0.544,119.992,224493,4
2000-09-16,46,Callin' Me,Lil' Zane Featuring 112,6M33HiUHLC3R3gfXYNGMAy,False,33,21,8,0.782,0.675,8,-5.096,0,0.0706,0.00814,0,0.0978,0.663,106.956,257307,4
2000-09-16,47,The Next Episode,Dr. Dre Featuring Snoop Dogg,6M33HiUHLC3R3gfXYNGMAy,False,46,23,17,0.922,0.909,10,-2.429,0,0.27,0.0281,0,0.0856,0.309,95.295,161507,4
2000-09-16,48,Bag Lady,Erykah Badu,6M33HiUHLC3R3gfXYNGMAy,False,41,41,5,0.724,0.416,5,-8.964,0,0.0841,0.365,0,0.0969,0.578,151.181,348893,4
2000-09-16,49,The Light,Common,6M33HiUHLC3R3gfXYNGMAy,False,44,44,7,0.934,0.649,7,-6.465,1,0.266,0.114,1.71e-06,0.0807,0.685,97.026,243587,4
2000-09-16,50,Dance With Me,Debelah Morgan,6M33HiUHLC3R3gfXYNGMAy,False,54,50,8,0.85,0.674,7,-7.981,0,0.0373,0.309,0.000645,0.0356,0.74,115.005,220107,4
2000-09-16,51,Your Everything,Keith Urban,6M33HiUHLC3R3gfXYNGMAy,False,53,51,10,0.549,0.54,9,-5.76,1,0.027,0.0399,0,0.0688,0.361,139.714,239360,4
2000-09-16,52,Liar,Profyle,18jS43nfrzTvN68Q9tkjDh,True,0,52,1,0.694,0.617,10,-3.559,0,0.049,0.226,0,0.247,0.305,114.064,297893,4
2000-09-16,53,Kiss This,Aaron Tippin,18jS43nfrzTvN68Q9tkjDh,False,66,53,4,0.765,0.706,6,-5.477,0,0.026,0.047,4.25e-06,0.36,0.669,116.02,173760,4
2000-09-16,54,Who Let The Dogs Out,Baha Men,18jS43nfrzTvN68Q9tkjDh,False,58,54,9,0.596,0.954,0,-4.745,1,0.0657,0.00038,0.0171,0.227,0.628,128.913,150581,4
2000-09-16,55,What You Want,DMX Featuring Sisqo,18jS43nfrzTvN68Q9tkjDh,False,52,52,12,0.644,0.841,1,-5.794,1,0.324,0.0631,0,0.325,0.752,166.999,248653,4
2000-09-16,56,Go On,George Strait,18jS43nfrzTvN68Q9tkjDh,False,63,56,4,0.705,0.555,8,-8.488,1,0.0238,0.449,0.0149,0.254,0.487,104.501,201760,4
2000-09-16,57,It's Always Somethin',Joe Diffie,18jS43nfrzTvN68Q9tkjDh,False,60,57,6,0.61,0.83,9,-4.772,1,0.0343,0.0452,0.000211,0.163,0.566,90.024,178533,4
2000-09-16,58,What'Chu Like,Da Brat Featuring Tyrese,18jS43nfrzTvN68Q9tkjDh,False,49,26,16,0.879,0.681,10,-8.951,0,0.24,0.017,0,0.0669,0.817,99.974,221160,4
2000-09-16,59,Country Comes To Town,Toby Keith,18jS43nfrzTvN68Q9tkjDh,False,62,59,7,0.697,0.928,9,-4.173,1,0.0423,0.102,0,0.066,0.722,123.785,218000,4
2000-09-16,60,Let's Make Love,Faith Hill With Tim McGraw,18jS43nfrzTvN68Q9tkjDh,False,67,60,6,0.566,0.306,5,-12.699,1,0.0284,0.082,0.942,0.132,0.0745,146.713,251690,4
2000-09-16,61,Last Resort,Papa Roach,18jS43nfrzTvN68Q9tkjDh,False,61,61,8,0.589,0.89,4,-3.719,0,0.0603,0.000481,0.00082,0.201,0.692,90.598,199907,4
2000-09-16,62,You'll Always Be Loved By Me,Brooks & Dunn,18jS43nfrzTvN68Q9tkjDh,False,55,55,15,0.672,0.658,2,-6.563,1,0.0258,0.2,2.49e-05,0.294,0.569,103.12,181840,4
2000-09-16,63,Best Of Intentions,Travis Tritt,18jS43nfrzTvN68Q9tkjDh,False,70,63,5,0.659,0.468,8,-7.439,1,0.0232,0.363,0,0.0964,0.37,99.066,257400,4
2000-09-16,64,I Hope You Dance,Lee Ann Womack,18jS43nfrzTvN68Q9tkjDh,False,56,32,19,0.385,0.443,7,-9.627,0,0.0295,0.0632,0,0.0898,0.275,151.278,294533,4
2000-09-16,65,The Way I Am,Eminem,18jS43nfrzTvN68Q9tkjDh,False,59,59,4,0.785,0.871,4,-2.692,0,0.265,0.144,0,0.309,0.315,87.248,290427,4
2000-09-16,66,I Wanna Be With You,Mandy Moore,18jS43nfrzTvN68Q9tkjDh,False,65,24,14,0.515,0.908,8,-4.632,1,0.0368,0.0158,1.88e-05,0.412,0.637,150.031,252600,4
2000-09-16,67,The Little Girl,John Michael Montgomery,18jS43nfrzTvN68Q9tkjDh,False,81,67,2,0.658,0.434,1,-8.527,1,0.025,0.354,1.75e-05,0.112,0.218,83.921,232640,4
2000-09-16,68,Treat Her Like A Lady,Joe,18jS43nfrzTvN68Q9tkjDh,False,64,63,7,0.75,0.463,5,-6.99,0,0.0415,0.0581,0,0.0889,0.568,126.072,257773,4
2000-09-16,69,Open My Heart,Yolanda Adams,18jS43nfrzTvN68Q9tkjDh,False,74,69,4,0.414,0.402,10,-8.911,0,0.0427,0.7,0,0.363,0.171,105.368,340040,4
2000-09-16,70,Deep Inside Of You,Third Eye Blind,18jS43nfrzTvN68Q9tkjDh,False,73,70,3,0.502,0.591,7,-4.522,1,0.0242,0.00585,1.9e-05,0.0725,0.169,81.782,250533,4
2000-09-16,71,Can't Fight The Moonlight,LeAnn Rimes,18jS43nfrzTvN68Q9tkjDh,False,82,71,2,0.628,0.834,6,-6.341,0,0.0497,0.403,0,0.051,0.626,97.865,215507,4
2000-09-16,72,Gotta Tell You,Samantha Mumba,18jS43nfrzTvN68Q9tkjDh,False,85,72,2,0.729,0.752,0,-4.478,0,0.028,0.229,0,0.19,0.792,110.007,201067,4
2000-09-16,73,Whatever,Ideal Featuring Lil' Mo,18jS43nfrzTvN68Q9tkjDh,False,68,47,15,0.824,0.708,10,-6.037,0,0.0712,0.00223,0,0.0902,0.767,101.854,228159,4
2000-09-16,74,Feels Like Love,Vince Gill,18jS43nfrzTvN68Q9tkjDh,False,76,74,3,0.55,0.832,10,-7.773,1,0.0296,0.133,3.96e-05,0.189,0.627,99.917,255773,4
2000-09-16,75,There You Are,Martina McBride,18jS43nfrzTvN68Q9tkjDh,False,79,75,2,0.343,0.434,7,-7.072,1,0.0298,0.648,0,0.126,0.14,144.479,204627,4
2000-09-16,76,Pinch Me,Barenaked Ladies,18jS43nfrzTvN68Q9tkjDh,False,77,76,2,0.68,0.857,7,-4.132,1,0.0373,0.0151,2.88e-05,0.056,0.794,95.349,285160,4
2000-09-16,77,Prayin' For Daylight,Rascal Flatts,18jS43nfrzTvN68Q9tkjDh,False,72,38,20,0.64,0.781,7,-3.155,1,0.0398,0.578,0,0.272,0.646,91.02,215600,4
2000-09-16,78,Change Your Mind,Sister Hazel,18jS43nfrzTvN68Q9tkjDh,False,78,59,10,0.428,0.785,0,-4.853,1,0.0569,0.0104,0,0.102,0.68,182.352,259667,4
2000-09-16,79,Taking You Home,Don Henley,18jS43nfrzTvN68Q9tkjDh,False,71,58,13,0.569,0.498,4,-6.63,0,0.0269,0.341,2.35e-05,0.134,0.0891,72.344,331667,4
2000-09-16,80,I Will Love Again,Lara Fabian,18jS43nfrzTvN68Q9tkjDh,False,80,32,15,0.643,0.757,9,-8.031,0,0.0347,0.0435,1.35e-06,0.0883,0.471,126.975,223040,4
2000-09-16,81,Could I Have This Kiss Forever,Whitney Houston & Enrique Iglesias,18jS43nfrzTvN68Q9tkjDh,False,69,52,14,0.505,0.876,10,-6.107,0,0.0772,0.00375,6.06e-06,0.138,0.443,93.841,235107,4
2000-09-16,82,My Baby You,Marc Anthony,124qDsjeZZkujOuer8gG45,True,0,82,1,0.443,0.596,0,-5.366,0,0.0294,0.688,0,0.167,0.186,115.597,236960,4
2000-09-16,83,Hey Papi,Jay-Z Featuring Memphis Bleek & Amil,124qDsjeZZkujOuer8gG45,False,83,83,6,0.784,0.872,1,-5.321,0,0.316,0.0408,0.000632,0.137,0.908,158.063,268693,4
2000-09-16,84,Californication,Red Hot Chili Peppers,124qDsjeZZkujOuer8gG45,False,75,72,8,0.592,0.767,9,-2.788,0,0.027,0.0021,0.00165,0.127,0.328,96.483,329733,4
2000-09-16,85,Between Me And You,Ja Rule Featuring Christina Milian,4xwRtK6tfMp4yZwcDvY0gT,True,0,85,1,0.818,0.883,0,-4.547,1,0.0695,0.0202,0.000767,0.243,0.405,93.67,250173,4
2000-09-16,86,Dance Tonight,Lucy Pearl,4xwRtK6tfMp4yZwcDvY0gT,False,84,36,18,0.787,0.425,10,-5.692,0,0.0641,0.00637,0.00169,0.196,0.711,99.225,221280,4
2000-09-16,87,Bad Boyz,Shyne Featuring Barrington Levy,4xwRtK6tfMp4yZwcDvY0gT,False,94,87,2,0.788,0.594,6,-4.864,0,0.336,0.0249,1.65e-05,0.0534,0.691,83.84,228907,4
2000-09-16,88,Don't Call Me Baby,Madison Avenue,4xwRtK6tfMp4yZwcDvY0gT,False,92,88,11,0.808,0.982,3,-6.588,0,0.0311,0.0585,0.00689,0.35,0.961,124.999,228140,4
2000-09-16,89,I Disappear,Metallica,4xwRtK6tfMp4yZwcDvY0gT,False,95,76,19,0.534,0.929,1,-3.609,1,0.047,0.000206,5.58e-05,0.036,0.447,122.733,266240,4
2000-09-16,90,Can't Go For That,Tamia,3GjMBL5j6glH2C2Ihceq0b,True,0,90,1,0.668,0.699,11,-7.036,0,0.0716,0.242,6.25e-05,0.06,0.448,106.039,226333,4
2000-09-16,91,Sour Girl,Stone Temple Pilots,3GjMBL5j6glH2C2Ihceq0b,False,93,78,11,0.394,0.663,0,-6.619,1,0.0295,0.0769,0.00644,0.239,0.737,207.575,256253,4
2000-09-16,92,The Hardest Part Of Breaking Up (Is Getting Back Your Stuff),2Gether,3GjMBL5j6glH2C2Ihceq0b,False,87,87,3,0.83,0.948,9,-3.973,0,0.0455,0.106,2.29e-06,0.105,0.931,111.993,197627,4
2000-09-16,93,Pull Over,Trina,3GjMBL5j6glH2C2Ihceq0b,False,97,93,2,0.955,0.768,1,-5.54,0,0.181,0.0134,0,0.308,0.741,125.04,194293,4
2000-09-16,94,I'll Be,Reba McEntire,3GjMBL5j6glH2C2Ihceq0b,False,91,51,19,0.586,0.423,0,-9.951,1,0.0267,0.643,0,0.129,0.268,122.625,268867,4
2000-09-16,95,Ta Da,Lil' Mo,3GjMBL5j6glH2C2Ihceq0b,False,100,95,6,0.838,0.599,6,-5.398,1,0.157,0.187,0,0.407,0.424,119.955,262255,4
2000-09-16,96,Baby U Are,Gerald Levert,3GjMBL5j6glH2C2Ihceq0b,False,96,89,5,0.657,0.537,6,-7.825,0,0.199,0.0196,5.55e-06,0.102,0.636,172.212,317067,4
2000-09-16,97,No Matter What They Say,Lil' Kim,3GjMBL5j6glH2C2Ihceq0b,False,90,60,10,0.744,0.775,1,-7.697,1,0.325,0.0267,0,0.137,0.649,106.093,251200,4
2000-09-16,98,That's The Kind Of Mood I'm In,Patty Loveless,71JdxVBpSlqJFKh929iDVn,True,0,98,1,0.698,0.628,11,-6.359,1,0.0336,0.182,0,0.0736,0.669,126.394,212200,4
2000-09-16,99,When You Need My Love,Darryl Worley,71JdxVBpSlqJFKh929iDVn,False,86,75,15,0.587,0.641,4,-5.843,1,0.0224,0.0843,0,0.31,0.412,86.008,219800,4
2000-09-16,100,Simple Kind Of Life,No Doubt,71JdxVBpSlqJFKh929iDVn,False,88,38,12,0.576,0.849,0,-5.199,1,0.0355,0.0678,0,0.278,0.482,119.999,256933,4
