date,position,title,artist,spotify_id,is_new,last_pos,peak_pos,weeks,danceability,energy,key,loudness,mode,speechiness,acousticness,instrumentalness,liveness,valence,tempo,duration_ms,time_signature
2020-02-29,1,The Box,Roddy Ricch,0rxwifmdF1T1sT1iZfqR4u,False,1,1,11,0.896,0.586,10,-6.687,0,0.0559,0.104,0,0.79,0.642,116.971,196653,4
2020-02-29,2,Life Is Good,Future Featuring Drake,0rxwifmdF1T1sT1iZfqR4u,False,2,2,6,0.676,0.609,2,-5.831,0,0.481,0.0706,0,0.152,0.508,142.037,237735,4
2020-02-29,3,Circles,Post Malone,0rxwifmdF1T1sT1iZfqR4u,False,3,1,25,0.695,0.762,0,-3.497,1,0.0395,0.192,0.00244,0.0863,0.553,120.042,215280,4
2020-02-29,4,Dance Monkey,Tones And I,0rxwifmdF1T1sT1iZfqR4u,False,5,4,20,0.824,0.588,6,-6.4,0,0.0924,0.692,0.000104,0.149,0.513,98.027,209438,4
2020-02-29,5,Don't Start Now,Dua Lipa,0rxwifmdF1T1sT1iZfqR4u,False,6,5,16,0.794,0.793,11,-4.521,0,0.0842,0.0125,0,0.0952,0.677,123.941,183290,4
2020-02-29,6,Roxanne,Arizona Zervas,0rxwifmdF1T1sT1iZfqR4u,False,7,4,16,0.621,0.601,6,-5.616,0,0.148,0.0522,0,0.46,0.457,116.735,163636,5
2020-02-29,7,Memories,Maroon 5,0rxwifmdF1T1sT1iZfqR4u,False,4,2,22,0.764,0.32,11,-7.209,1,0.0546,0.837,0,0.0822,0.575,91.019,189486,4
2020-02-29,8,Someone You Loved,Lewis Capaldi,0rxwifmdF1T1sT1iZfqR4u,False,8,1,41,0.501,0.405,1,-5.679,1,0.0319,0.751,0,0.105,0.446,109.891,182161,4
2020-02-29,9,Intentions,Justin Bieber Featuring Quavo,0rxwifmdF1T1sT1iZfqR4u,False,11,9,2,0.813,0.554,9,-6.631,1,0.0544,0.315,0,0.105,0.86,148.011,212869,4
2020-02-29,10,Blinding Lights,The Weeknd,0rxwifmdF1T1sT1iZfqR4u,False,12,10,12,0.514,0.73,1,-5.934,1,0.0598,0.00146,9.54e-05,0.0897,0.334,171.005,200040,4
2020-02-29,11,Yummy,Justin Bieber,0rxwifmdF1T1sT1iZfqR4u,False,19,2,7,0.653,0.578,2,-5.709,0,0.0513,0.292,0,0.105,0.554,145.883,209177,4
2020-02-29,12,Everything I Wanted,Billie Eilish,0rxwifmdF1T1sT1iZfqR4u,False,10,8,15,0.704,0.225,6,-14.454,0,0.0994,0.902,0.657,0.106,0.243,120.006,245426,4
2020-02-29,13,"10,000 Hours",Dan + Shay & Justin Bieber,0rxwifmdF1T1sT1iZfqR4u,False,9,4,20,0.654,0.63,10,-4.644,1,0.0259,0.153,0,0.111,0.43,89.991,167693,4
2020-02-29,14,Heartless,The Weeknd,0rxwifmdF1T1sT1iZfqR4u,False,17,1,13,0.538,0.751,10,-5.487,0,0.128,0.0194,1.42e-06,0.145,0.244,169.985,198267,4
2020-02-29,15,Hot Girl Bummer,blackbear,0rxwifmdF1T1sT1iZfqR4u,False,16,15,23,0.782,0.559,6,-7.106,0,0.0767,0.125,0,0.385,0.685,129.992,188344,1
2020-02-29,16,No Time To Die,Billie Eilish,73SpzrcaHk0RQPFP73vqVR,True,0,16,1,0.38,0.219,4,-13.273,0,0.0358,0.917,0.0104,0.0827,0.0517,73.537,242265,4
2020-02-29,17,Ballin',Mustard & Roddy Ricch,73SpzrcaHk0RQPFP73vqVR,False,14,11,31,0.809,0.545,7,-6.678,1,0.0735,0.392,0,0.151,0.244,97.008,180435,4
2020-02-29,18,BOP,DaBaby,73SpzrcaHk0RQPFP73vqVR,False,15,11,21,0.769,0.787,11,-3.909,1,0.367,0.189,0,0.129,0.836,126.77,159715,4
2020-02-29,19,The Bones,Maren Morris,73SpzrcaHk0RQPFP73vqVR,False,18,18,22,0.612,0.57,11,-6.642,0,0.0347,0.278,0,0.0963,0.334,77.002,197293,4
2020-02-29,20,Adore You,Harry Styles,73SpzrcaHk0RQPFP73vqVR,False,22,20,11,0.676,0.771,8,-3.675,1,0.0483,0.0237,7e-06,0.102,0.569,99.048,207133,4
2020-02-29,21,Lose You To Love Me,Selena Gomez,73SpzrcaHk0RQPFP73vqVR,False,13,1,18,0.488,0.343,4,-8.985,1,0.0436,0.556,0,0.21,0.0978,102.819,206459,4
2020-02-29,22,Good As Hell,Lizzo,73SpzrcaHk0RQPFP73vqVR,False,20,3,26,0.682,0.919,0,-3.18,0,0.0875,0.256,0,0.442,0.535,95.982,159736,4
2020-02-29,23,Numbers,"A Boogie Wit da Hoodie Featuring Roddy Ricch, Gunna & London On Da Track",733c1CWmIGymoQXdp7Us88,True,0,23,1,0.819,0.654,11,-6.665,0,0.136,0.517,0,0.0996,0.455,133.503,188563,4
2020-02-29,24,Forever,Justin Bieber Featuring Post Malone & Clever,2ZlCGeK30BLRNSPC832pNZ,True,0,24,1,0.825,0.483,8,-5.746,0,0.08,0.538,1.48e-05,0.204,0.892,139.98,219933,4
2020-02-29,25,My Oh My,Camila Cabello Featuring DaBaby,2ZlCGeK30BLRNSPC832pNZ,False,26,25,11,0.724,0.491,8,-6.024,1,0.0296,0.018,1.29e-05,0.0887,0.383,105.046,170746,4
2020-02-29,26,High Fashion,Roddy Ricch Featuring Mustard,2ZlCGeK30BLRNSPC832pNZ,False,21,20,8,0.831,0.499,11,-8.442,0,0.114,0.269,0,0.3,0.511,97.956,220487,4
2020-02-29,27,Falling,Trevor Daniel,2ZlCGeK30BLRNSPC832pNZ,False,25,25,14,0.785,0.431,10,-8.756,0,0.0364,0.123,0,0.0887,0.236,127.085,159382,4
2020-02-29,28,Woah,Lil Baby,2ZlCGeK30BLRNSPC832pNZ,False,24,16,15,0.884,0.617,11,-5.598,1,0.233,0.0153,0,0.19,0.402,142.952,183011,4
2020-02-29,29,You Should Be Sad,Halsey,2ZlCGeK30BLRNSPC832pNZ,False,31,26,6,0.591,0.585,2,-6.35,1,0.0277,0.143,0,0.109,0.324,110.94,205473,4
2020-02-29,30,Bad Guy,Billie Eilish,2ZlCGeK30BLRNSPC832pNZ,False,29,1,47,0.701,0.425,7,-10.965,1,0.375,0.328,0.13,0.1,0.562,135.128,194088,4
2020-02-29,31,No Guidance,Chris Brown Featuring Drake,2ZlCGeK30BLRNSPC832pNZ,False,27,5,37,0.696,0.454,1,-6.756,0,0.153,0.123,0,0.155,0.136,92.928,260640,4
2020-02-29,32,Senorita,Shawn Mendes & Camila Cabello,2ZlCGeK30BLRNSPC832pNZ,False,33,1,35,0.759,0.54,9,-6.039,0,0.0287,0.037,0,0.0945,0.75,116.947,190960,4
2020-02-29,33,What A Man Gotta Do,Jonas Brothers,2ZlCGeK30BLRNSPC832pNZ,False,32,16,5,0.852,0.698,9,-7.206,1,0.0629,0.00839,1.03e-06,0.0773,0.324,113.039,180645,4
2020-02-29,34,Kinfolks,Sam Hunt,2ZlCGeK30BLRNSPC832pNZ,False,34,34,19,0.569,0.807,0,-4.584,1,0.0464,0.0876,0,0.164,0.883,76.011,181933,4
2020-02-29,35,HIGHEST IN THE ROOM,Travis Scott,2ZlCGeK30BLRNSPC832pNZ,False,30,1,20,0.598,0.427,7,-8.764,0,0.0317,0.0546,5.83e-06,0.21,0.0605,76.469,175721,4
2020-02-29,36,Godzilla,Eminem Featuring Juice WRLD,2ZlCGeK30BLRNSPC832pNZ,False,28,3,5,0.808,0.745,10,-5.26,0,0.342,0.145,0,0.292,0.829,165.995,210800,4
2020-02-29,37,Trampoline,SHAED,2ZlCGeK30BLRNSPC832pNZ,False,35,13,38,0.689,0.412,7,-7.523,0,0.0301,0.488,0.00016,0.0659,0.537,126.754,184060,4
2020-02-29,38,One Man Band,Old Dominion,2ZlCGeK30BLRNSPC832pNZ,False,38,20,26,0.706,0.358,6,-8.331,1,0.0347,0.677,0,0.107,0.478,75.991,186240,4
2020-02-29,39,I Don't Care,Ed Sheeran & Justin Bieber,2ZlCGeK30BLRNSPC832pNZ,False,40,2,38,0.798,0.675,6,-5.041,1,0.0442,0.0912,0,0.0894,0.842,101.956,219947,4
2020-02-29,40,RITMO (Bad Boys For Life),Black Eyed Peas X J Balvin,2ZlCGeK30BLRNSPC832pNZ,False,36,36,13,0.721,0.716,10,-7.037,0,0.0657,0.0334,0.00084,0.237,0.667,104.994,221714,4
2020-02-29,41,Sucker,Jonas Brothers,2ZlCGeK30BLRNSPC832pNZ,False,37,1,46,0.842,0.734,1,-5.065,0,0.0588,0.0427,0,0.106,0.952,137.958,181027,4
2020-02-29,42,Only Human,Jonas Brothers,2ZlCGeK30BLRNSPC832pNZ,False,39,18,35,0.795,0.496,0,-5.883,1,0.0722,0.108,0,0.0645,0.874,94.01,183000,4
2020-02-29,43,Homesick,Kane Brown,2ZlCGeK30BLRNSPC832pNZ,False,45,43,14,0.701,0.5,8,-8.82,1,0.0303,0.46,0,0.234,0.409,97.028,205400,4
2020-02-29,44,I Hope,Gabby Barrett Featuring Charlie Puth,2ZlCGeK30BLRNSPC832pNZ,False,48,44,8,0.466,0.536,6,-6.227,1,0.0429,0.0951,0,0.114,0.377,75.998,210773,4
2020-02-29,45,Truth Hurts,Lizzo,2ZlCGeK30BLRNSPC832pNZ,False,41,1,42,0.715,0.624,4,-3.046,0,0.114,0.11,0,0.123,0.412,158.087,173325,4
2020-02-29,46,To Die For,Sam Smith,2ZTYlnhhV1UAReg7wIGolx,True,0,46,1,0.483,0.361,0,-7.889,1,0.0738,0.832,4.66e-06,0.098,0.307,171.649,193795,4
2020-02-29,47,Tusa,Karol G & Nicki Minaj,2ZTYlnhhV1UAReg7wIGolx,False,42,42,12,0.803,0.715,2,-3.28,1,0.298,0.295,0.000134,0.0574,0.574,101.085,200960,4
2020-02-29,48,g n f (Give No Fxk),"Migos, Young Thug & Travis Scott",6ZelF5APDN5r6XnFqcnvWR,True,0,48,1,0.904,0.627,1,-5.608,1,0.222,0.0303,5.68e-06,0.0923,0.236,145.976,224243,4
2020-02-29,49,Dior,Pop Smoke,79s5XnCN4TJKTVMSmOx8Ep,True,0,49,1,0.548,0.805,7,-5.732,1,0.351,0.212,0.000389,0.408,0.648,142.094,216387,4
2020-02-29,50,Sum 2 Prove,Lil Baby,79s5XnCN4TJKTVMSmOx8Ep,False,49,16,6,0.823,0.552,4,-7.57,0,0.324,0.0174,0,0.122,0.418,124.038,205760,4
2020-02-29,51,Say So,Doja Cat Featuring Nicki Minaj,79s5XnCN4TJKTVMSmOx8Ep,False,58,51,7,0.787,0.673,11,-4.577,0,0.158,0.256,3.57e-06,0.0904,0.786,110.962,237893,4
2020-02-29,52,Juicy,Doja Cat & Tyga,79s5XnCN4TJKTVMSmOx8Ep,False,43,41,17,0.786,0.652,0,-2.607,1,0.0669,0.102,0,0.0697,0.483,170.031,203093,4
2020-02-29,53,Make Me Want To,Jimmie Allen,79s5XnCN4TJKTVMSmOx8Ep,False,53,53,8,0.519,0.872,2,-3.212,1,0.0616,0.0793,0,0.111,0.74,179.965,172280,4
2020-02-29,54,Blueberry Faygo,Lil Mosey,79s5XnCN4TJKTVMSmOx8Ep,False,62,54,2,0.774,0.554,0,-7.909,1,0.0383,0.207,0,0.132,0.349,99.034,162547,4
2020-02-29,55,Slide,H.E.R. Featuring YG,79s5XnCN4TJKTVMSmOx8Ep,False,56,54,9,0.827,0.469,10,-9.141,0,0.341,0.0807,8.12e-06,0.207,0.196,97.028,238321,4
2020-02-29,56,Suicidal,YNW Melly & Juice WRLD,79s5XnCN4TJKTVMSmOx8Ep,False,44,34,13,0.655,0.441,9,-5.245,0,0.0629,0.474,0,0.099,0.273,139.957,225857,4
2020-02-29,57,BEST ON EARTH,Russ & BIA,79s5XnCN4TJKTVMSmOx8Ep,False,54,52,11,0.846,0.748,5,-3.512,0,0.078,0.188,0,0.093,0.597,90.006,160720,4
2020-02-29,58,Me And My Guitar,A Boogie Wit da Hoodie,6cZH4rX1KTt1aJ3Ql6Ynja,True,0,58,1,0.644,0.587,7,-6.736,0,0.353,0.473,0,0.0759,0.68,173.972,161765,4
2020-02-29,59,South Of The Border,Ed Sheeran Featuring Camila Cabello & Cardi B,6cZH4rX1KTt1aJ3Ql6Ynja,False,50,49,11,0.857,0.621,9,-6.376,0,0.0825,0.148,0,0.0865,0.668,97.989,204467,4
2020-02-29,60,Go Stupid,Polo G Featuring NLE Choppa & Stunna 4 Vegas,4PklAHGXT5ityno3IA8SKd,True,0,60,1,0.92,0.833,1,-3.18,1,0.253,0.0277,0,0.0596,0.645,141.034,165726,4
2020-02-29,61,Heart On Ice,Rod Wave,4PklAHGXT5ityno3IA8SKd,False,55,54,15,0.733,0.389,10,-8.468,0,0.0738,0.0513,0,0.141,0.244,157.878,159670,3
2020-02-29,62,Bandit,Juice WRLD & YoungBoy Never Broke Again,4PklAHGXT5ityno3IA8SKd,False,51,10,20,0.474,0.631,5,-5.884,0,0.343,0.0687,0,0.132,0.425,180.051,189323,4
2020-02-29,63,Nobody But You,Blake Shelton Duet With Gwen Stefani,4PklAHGXT5ityno3IA8SKd,False,60,43,6,0.463,0.653,0,-5.515,1,0.0273,0.111,0.000136,0.172,0.233,143.912,194867,4
2020-02-29,64,What She Wants Tonight,Luke Bryan,4PklAHGXT5ityno3IA8SKd,False,64,64,9,0.484,0.903,8,-3.9,0,0.0882,0.0649,0,0.151,0.716,169.948,186988,4
2020-02-29,65,I Hope You're Happy Now,Carly Pearce & Lee Brice,4PklAHGXT5ityno3IA8SKd,False,77,65,7,0.591,0.815,10,-4.725,1,0.0366,0.168,8.68e-06,0.142,0.306,118.024,198689,4
2020-02-29,66,Might Not Give Up,A Boogie Wit da Hoodie Featuring Young Thug,4l2rsMfr20dj6nf6i6F3Y8,True,0,66,1,0.687,0.592,2,-6.378,1,0.224,0.203,0,0.279,0.246,178.83,225266,4
2020-02-29,67,I Wish Grandpas Never Died,Riley Green,4l2rsMfr20dj6nf6i6F3Y8,False,66,66,8,0.445,0.492,6,-5.717,1,0.0294,0.036,0,0.122,0.24,148.013,250413,4
2020-02-29,68,Out West,JACKBOYS Featuring Young Thug,4l2rsMfr20dj6nf6i6F3Y8,False,59,38,8,0.802,0.591,8,-4.895,1,0.225,0.0104,0,0.196,0.309,139.864,157712,4
2020-02-29,69,We Back,Jason Aldean,4l2rsMfr20dj6nf6i6F3Y8,False,69,69,12,0.433,0.928,4,-5.117,0,0.0512,0.0135,2.01e-06,0.32,0.552,155.938,197160,4
2020-02-29,70,More Hearts Than Mine,Ingrid Andress,4l2rsMfr20dj6nf6i6F3Y8,False,67,67,8,0.375,0.428,0,-7.387,1,0.029,0.109,0,0.105,0.361,78.516,214787,4
2020-02-29,71,Chasin' You,Morgan Wallen,4l2rsMfr20dj6nf6i6F3Y8,False,81,71,4,0.631,0.591,7,-5.785,1,0.0277,0.657,0,0.11,0.489,97.074,205453,4
2020-02-29,72,Slow Dance In A Parking Lot,Jordan Davis,4l2rsMfr20dj6nf6i6F3Y8,False,76,72,7,0.523,0.837,7,-4.494,1,0.0335,0.301,0,0.172,0.523,82.006,193929,4
2020-02-29,73,Thug Love,A Boogie Wit da Hoodie,4MzhmCOgPB7xb87f1CXjlA,True,0,73,1,0.54,0.643,5,-4.707,0,0.288,0.428,0,0.174,0.328,178.125,181744,4
2020-02-29,74,Homemade,Jake Owen,4MzhmCOgPB7xb87f1CXjlA,False,75,74,4,0.51,0.838,6,-2.702,1,0.0469,0.396,0,0.195,0.574,145.922,192653,4
2020-02-29,75,TOES,DaBaby Featuring Lil Baby & Moneybagg Yo,4MzhmCOgPB7xb87f1CXjlA,False,63,28,12,0.816,0.582,8,-4.141,1,0.341,0.0794,5.84e-06,0.0916,0.542,160.004,136366,4
2020-02-29,76,Before You Go,Lewis Capaldi,4MzhmCOgPB7xb87f1CXjlA,False,71,71,4,0.459,0.575,3,-4.858,1,0.0573,0.604,0,0.0885,0.183,111.881,215107,4
2020-02-29,77,After Hours,The Weeknd,2xUuzDqjpXP0kwqZ5wGpVv,True,0,77,1,0.653,0.574,5,-6.104,0,0.0316,0.0772,0.00661,0.122,0.139,108.977,361025,4
2020-02-29,78,Know Your Worth,Khalid x Disclosure,2xUuzDqjpXP0kwqZ5wGpVv,False,57,57,2,0.79,0.694,9,-7.726,0,0.0708,0.145,0.00252,0.281,0.508,103.007,181436,4
2020-02-29,79,Ignorantes,Bad Bunny & Sech,3wYRLYuO1M88d8woWUIxct,True,0,79,1,0.85,0.536,1,-5.161,1,0.0599,0.267,3.89e-05,0.0996,0.505,96.029,210607,4
2020-02-29,80,Stain,A Boogie Wit da Hoodie Featuring DaBaby,0dIz1I7IwX5ardG47AHxCZ,True,0,80,1,0.816,0.754,8,-3.911,1,0.389,0.0117,0,0.129,0.604,159.073,175128,4
2020-02-29,81,Yikes,Nicki Minaj,0dIz1I7IwX5ardG47AHxCZ,False,23,23,2,0.911,0.637,8,-8.381,1,0.447,0.0409,3.68e-05,0.238,0.66,149.996,156882,4
2020-02-29,82,Make No Sense,YoungBoy Never Broke Again,0dIz1I7IwX5ardG47AHxCZ,False,79,57,15,0.876,0.733,10,-4.478,0,0.333,0.0208,0,0.0999,0.962,154.904,148630,4
2020-02-29,83,Heartless,Diplo Presents Thomas Wesley Featuring Morgan Wallen,0dIz1I7IwX5ardG47AHxCZ,False,73,73,7,0.765,0.556,11,-6.417,1,0.0512,0.275,0,0.0824,0.274,111.033,169227,4
2020-02-29,84,Whats Poppin,"Jack Harlow Featuring DaBaby, Tory Lanez & Lil Wayne",0dIz1I7IwX5ardG47AHxCZ,False,96,84,2,0.904,0.723,11,-5.224,0,0.26,0.0631,0,0.185,0.835,145.013,227478,4
2020-02-29,85,Ridin' Roads,Dustin Lynch,0dIz1I7IwX5ardG47AHxCZ,False,78,47,16,0.547,0.817,9,-4.255,1,0.0448,0.0986,0,0.136,0.592,142.118,205427,4
2020-02-29,86,Come Around Me,Justin Bieber,2o9LAypwGH4ctV0i9boo6d,True,0,86,1,0.648,0.681,2,-8.389,0,0.0378,0.263,0.00783,0.0971,0.767,157.941,200773,4
2020-02-29,87,Catch,Brett Young,2o9LAypwGH4ctV0i9boo6d,False,92,87,4,0.566,0.765,2,-6.337,1,0.0439,0.0248,0,0.0783,0.604,156.036,196440,4
2020-02-29,88,B.I.T.C.H.,Megan Thee Stallion,2o9LAypwGH4ctV0i9boo6d,False,72,31,4,0.742,0.731,11,-4.362,0,0.306,0.0851,0,0.131,0.547,174.019,183143,4
2020-02-29,89,homecoming queen?,Kelsea Ballerini,2o9LAypwGH4ctV0i9boo6d,False,86,76,11,0.462,0.512,9,-5.443,1,0.0334,0.478,0,0.0993,0.29,114.014,167796,4
2020-02-29,90,Rare,Selena Gomez,2o9LAypwGH4ctV0i9boo6d,False,87,30,6,0.838,0.541,5,-6.746,1,0.0708,0.207,7.97e-05,0.103,0.637,114.996,220590,4
2020-02-29,91,King Of My City,A Boogie Wit da Hoodie,2o9LAypwGH4ctV0i9boo6d,False,99,69,3,0.48,0.679,4,-6.776,0,0.264,0.452,0,0.152,0.29,81.186,148676,5
2020-02-29,93,SUGAR,BrockHampton,,False,82,66,7,0.453,0.538,1,-8.212,1,0.0638,0.449,0,0.19,0.516,122.973,204533,4
2020-02-29,94,Come Thru,Summer Walker & Usher,,False,89,42,10,0.679,0.728,5,-3.092,0,0.154,0.159,0,0.107,0.46,152.001,181013,4
2020-02-29,95,Cinderella Story,A Boogie Wit da Hoodie,18AIesWCXvIbXu8RqQw1E1,True,0,95,1,0.639,0.571,4,-7.332,1,0.511,0.272,0,0.144,0.569,88.047,185455,4
2020-02-29,96,Vete,Bad Bunny,18AIesWCXvIbXu8RqQw1E1,False,91,33,12,0.886,0.672,1,-4.394,1,0.188,0.0363,8.78e-06,0.101,0.526,91.976,192024,4
2020-02-29,97,Into The Unknown,Idina Menzel & AURORA,18AIesWCXvIbXu8RqQw1E1,False,93,46,10,0.323,0.405,10,-8.533,0,0.0413,0.849,0.000544,0.138,0.274,145.104,194848,5
2020-02-29,98,Habitual,Justin Bieber,40qyPyljksBEqlNw5sW37T,True,0,98,1,0.764,0.443,4,-6.625,1,0.0439,0.52,1.96e-05,0.0749,0.63,138.999,168200,4
2020-02-29,99,P*$$y Fairy (OTW),Jhene Aiko,40qyPyljksBEqlNw5sW37T,False,70,55,5,0.572,0.519,2,-7.092,0,0.212,0.536,0,0.102,0.35,128.331,181860,4
2020-02-29,100,All Around Me,Justin Bieber,5Py8zRKGkZvgHniVVtvNCN,True,0,100,1,0.566,0.438,0,-7.564,0,0.0367,0.809,0,0.212,0.692,117.127,136907,4
