date,position,title,artist,spotify_id,is_new,last_pos,peak_pos,weeks,danceability,energy,key,loudness,mode,speechiness,acousticness,instrumentalness,liveness,valence,tempo,duration_ms,time_signature
2009-02-28,1,Right Round,Flo Rida,7zqM7Wm2xJLZ50qAnTLoHD,False,58,1,3,0.72,0.672,7,-6.852,1,0.0551,0.009,0,0.232,0.705,124.986,204640,4
2009-02-28,2,Dead And Gone,T.I. Featuring Justin Timberlake,7zqM7Wm2xJLZ50qAnTLoHD,False,9,2,11,0.713,0.746,0,-4.99,1,0.259,0.0402,0,0.601,0.47,135.021,299747,4
2009-02-28,3,Crack A Bottle,"Eminem, Dr. Dre & 50 Cent",7zqM7Wm2xJLZ50qAnTLoHD,False,1,1,5,0.516,0.874,9,-2.571,1,0.186,0.0864,0,0.173,0.391,169.561,297520,3
2009-02-28,4,Heartless,Kanye West,7zqM7Wm2xJLZ50qAnTLoHD,False,2,2,15,0.79,0.647,10,-5.983,0,0.136,0.0515,0,0.248,0.654,87.999,211000,4
2009-02-28,5,Just Dance,Lady Gaga Featuring Colby O'Donis,7zqM7Wm2xJLZ50qAnTLoHD,False,3,1,28,0.813,0.74,1,-4.668,0,0.0327,0.0318,1.43e-05,0.166,0.699,118.976,244055,4
2009-02-28,6,Gives You Hell,The All-American Rejects,7zqM7Wm2xJLZ50qAnTLoHD,False,6,6,14,0.718,0.691,4,-6.44,1,0.0387,0.0159,0,0.0627,0.552,100.008,213107,4
2009-02-28,7,Love Story,Taylor Swift,7zqM7Wm2xJLZ50qAnTLoHD,False,7,4,23,0.626,0.79,2,-4.302,1,0.0311,0.135,3.97e-06,0.0989,0.416,119.082,235767,4
2009-02-28,8,My Life Would Suck Without You,Kelly Clarkson,7zqM7Wm2xJLZ50qAnTLoHD,False,4,1,5,0.526,0.882,9,-4.006,1,0.0509,0.0014,0,0.144,0.424,144.982,211493,4
2009-02-28,9,Single Ladies (Put A Ring On It),Beyonce,7zqM7Wm2xJLZ50qAnTLoHD,False,5,1,18,0.426,0.584,1,-5.293,1,0.296,0.0383,0,0.188,0.272,193.437,193213,4
2009-02-28,10,Poker Face,Lady Gaga,7zqM7Wm2xJLZ50qAnTLoHD,False,12,10,9,0.851,0.806,4,-4.62,1,0.0787,0.118,1.64e-06,0.121,0.787,118.999,237200,4
2009-02-28,11,You Found Me,The Fray,7zqM7Wm2xJLZ50qAnTLoHD,False,8,7,13,0.338,0.803,8,-5.412,0,0.0413,0.0187,0,0.136,0.4,151.994,241853,4
2009-02-28,12,Circus,Britney Spears,7zqM7Wm2xJLZ50qAnTLoHD,False,11,3,11,0.791,0.733,6,-5.215,0,0.052,0.147,0.000381,0.0713,0.761,114.98,192360,4
2009-02-28,13,Viva La Vida,Coldplay,7zqM7Wm2xJLZ50qAnTLoHD,False,24,1,41,0.486,0.617,5,-7.115,0,0.0287,0.0954,3.23e-06,0.109,0.417,138.015,242373,4
2009-02-28,14,Mad,Ne-Yo,7zqM7Wm2xJLZ50qAnTLoHD,False,14,14,11,0.727,0.649,0,-5.356,1,0.0338,0.661,0,0.111,0.669,129.992,254533,4
2009-02-28,15,I'm Yours,Jason Mraz,7zqM7Wm2xJLZ50qAnTLoHD,False,10,6,44,0.686,0.457,11,-8.322,1,0.0468,0.595,0,0.105,0.718,150.953,242187,4
2009-02-28,16,Live Your Life,T.I. Featuring Rihanna,7zqM7Wm2xJLZ50qAnTLoHD,False,13,1,21,0.375,0.862,11,-3.363,0,0.255,0.071,0,0.211,0.478,159.841,338853,4
2009-02-28,17,Kiss Me Thru The Phone,Soulja Boy Tell 'em Featuring Sammie,7zqM7Wm2xJLZ50qAnTLoHD,False,22,17,8,0.758,0.712,7,-3.781,1,0.112,0.0185,0,0.0677,0.795,149.998,193387,4
2009-02-28,18,Sober,P!nk,7zqM7Wm2xJLZ50qAnTLoHD,False,17,16,12,0.612,0.797,6,-4.896,1,0.0315,0.0626,0,0.187,0.373,90.95,251533,4
2009-02-28,19,Let It Rock,Kevin Rudolf Featuring Lil Wayne,7zqM7Wm2xJLZ50qAnTLoHD,False,18,5,25,0.607,0.783,7,-4.41,1,0.0397,0.000683,0,0.0678,0.434,113.172,231173,4
2009-02-28,20,Hot N Cold,Katy Perry,7zqM7Wm2xJLZ50qAnTLoHD,False,19,3,29,0.706,0.841,7,-3.956,1,0.0418,7.95e-05,0,0.0688,0.861,132.032,220227,4
2009-02-28,21,Chasing Pavements,Adele,7zqM7Wm2xJLZ50qAnTLoHD,False,64,21,6,0.616,0.47,5,-6.092,0,0.0253,0.291,0,0.111,0.325,80.03,210507,4
2009-02-28,22,I Hate This Part,The Pussycat Dolls,7zqM7Wm2xJLZ50qAnTLoHD,False,16,11,12,0.757,0.607,5,-4.335,1,0.0309,0.0723,0,0.305,0.454,111.579,218960,4
2009-02-28,23,Turnin Me On,Keri Hilson Featuring Lil Wayne,7zqM7Wm2xJLZ50qAnTLoHD,False,23,23,9,0.675,0.602,1,-4.688,1,0.0596,0.0034,1.28e-05,0.199,0.092,159.994,247800,4
2009-02-28,24,Diva,Beyonce,7zqM7Wm2xJLZ50qAnTLoHD,False,20,20,9,0.875,0.551,6,-6.744,0,0.317,0.0488,0.00728,0.0537,0.861,146.092,200613,4
2009-02-28,25,Beautiful,Akon Featuring Colby O'Donis & Kardinal Offishall,7zqM7Wm2xJLZ50qAnTLoHD,False,21,19,11,0.743,0.948,0,-4.445,0,0.0893,0.122,0,0.112,0.614,130.024,312987,4
2009-02-28,26,Blame It,Jamie Foxx Featuring T-Pain,7zqM7Wm2xJLZ50qAnTLoHD,False,26,26,5,0.673,0.614,7,-5.426,1,0.103,0.0782,0,0.139,0.362,176.052,289747,4
2009-02-28,27,Untouched,The Veronicas,7zqM7Wm2xJLZ50qAnTLoHD,False,28,17,12,0.557,0.783,6,-4.893,0,0.234,0.0171,0.0172,0.151,0.442,177.008,255360,4
2009-02-28,28,Womanizer,Britney Spears,7zqM7Wm2xJLZ50qAnTLoHD,False,25,1,20,0.724,0.695,11,-5.226,1,0.0622,0.073,0,0.0889,0.235,139.0,224400,4
2009-02-28,29,Thinking Of You,Katy Perry,7zqM7Wm2xJLZ50qAnTLoHD,False,29,29,5,0.431,0.803,4,-4.459,1,0.0364,0.00167,0,0.331,0.309,147.048,246410,4
2009-02-28,30,Gotta Be Somebody,Nickelback,7zqM7Wm2xJLZ50qAnTLoHD,False,27,10,20,0.536,0.89,0,-5.222,1,0.0601,0.000354,0.00165,0.133,0.205,115.998,252653,4
2009-02-28,31,Whatever You Like,T.I.,7zqM7Wm2xJLZ50qAnTLoHD,False,30,1,28,0.68,0.687,9,-6.162,0,0.0709,0.0161,0,0.261,0.467,150.053,249533,4
2009-02-28,32,So What,P!nk,7zqM7Wm2xJLZ50qAnTLoHD,False,31,1,26,0.534,0.87,11,-3.078,0,0.0425,0.000329,0,0.241,0.462,126.019,215160,4
2009-02-28,33,Disturbia,Rihanna,7zqM7Wm2xJLZ50qAnTLoHD,False,38,1,35,0.707,0.813,11,-4.515,0,0.0571,0.0863,0,0.168,0.722,124.921,238627,4
2009-02-28,34,White Horse,Taylor Swift,7zqM7Wm2xJLZ50qAnTLoHD,False,39,13,14,0.578,0.34,0,-8.027,1,0.0264,0.305,0,0.104,0.223,92.702,234427,4
2009-02-28,35,Green Light,John Legend Featuring Andre 3000,7zqM7Wm2xJLZ50qAnTLoHD,False,37,24,24,0.622,0.882,9,-5.59,0,0.119,0.0912,0,0.216,0.762,77.506,284187,4
2009-02-28,36,Rockin' That Thang,The-Dream,7zqM7Wm2xJLZ50qAnTLoHD,False,40,36,8,0.674,0.616,8,-4.757,1,0.0432,0.118,0,0.289,0.63,77.968,221933,4
2009-02-28,37,Feel That Fire,Dierks Bentley,7zqM7Wm2xJLZ50qAnTLoHD,False,32,32,19,0.412,0.833,1,-3.865,1,0.0352,0.371,1.28e-05,0.208,0.669,179.846,201507,4
2009-02-28,38,Love Lockdown,Kanye West,7zqM7Wm2xJLZ50qAnTLoHD,False,33,3,22,0.76,0.524,1,-7.67,0,0.0323,0.0542,0.5,0.112,0.112,119.603,270307,4
2009-02-28,39,Miss Independent,Ne-Yo,7zqM7Wm2xJLZ50qAnTLoHD,False,35,7,26,0.673,0.683,1,-5.693,1,0.115,0.522,0,0.235,0.713,171.86,232000,4
2009-02-28,40,Lost!,Coldplay With Jay-Z,7zqM7Wm2xJLZ50qAnTLoHD,False,0,40,4,0.257,0.805,7,-7.025,1,0.0559,0.0081,0.494,0.357,0.39,175.251,256909,4
2009-02-28,41,God Love Her,Toby Keith,7zqM7Wm2xJLZ50qAnTLoHD,False,41,41,13,0.551,0.919,10,-3.895,1,0.0529,0.133,8.36e-05,0.0637,0.432,125.025,216627,4
2009-02-28,42,Right Now (Na Na Na),Akon,7zqM7Wm2xJLZ50qAnTLoHD,False,34,8,21,0.826,0.853,8,-4.219,0,0.172,0.289,0,0.35,0.567,137.996,244680,4
2009-02-28,43,Pop Champagne,Jim Jones & Ron Browz Featuring Juelz Santana,7zqM7Wm2xJLZ50qAnTLoHD,False,36,22,18,0.61,0.431,0,-6.73,1,0.294,0.03,0,0.099,0.463,136.878,215973,3
2009-02-28,44,Prom Queen,Lil Wayne Featuring Shanell AKA SNL,7zqM7Wm2xJLZ50qAnTLoHD,False,15,15,3,0.514,0.876,7,-4.828,1,0.0625,3.52e-05,2.56e-05,0.17,0.365,144.035,217400,4
2009-02-28,45,Chicken Fried,Zac Brown Band,7zqM7Wm2xJLZ50qAnTLoHD,False,42,20,22,0.566,0.713,6,-4.25,1,0.0417,0.645,0,0.114,0.807,169.864,238147,4
2009-02-28,46,Sweet Thing,Keith Urban,7zqM7Wm2xJLZ50qAnTLoHD,False,46,43,14,0.621,0.888,8,-6.199,1,0.0443,0.19,1.7e-05,0.151,0.651,102.986,228187,4
2009-02-28,47,Light On,David Cook,7zqM7Wm2xJLZ50qAnTLoHD,False,43,17,19,0.446,0.834,9,-4.014,0,0.0341,0.0794,0,0.114,0.363,132.034,228827,4
2009-02-28,48,Down The Road,Kenny Chesney With Mac McAnally,7zqM7Wm2xJLZ50qAnTLoHD,False,50,48,11,0.414,0.584,5,-9.245,1,0.0285,0.801,6.05e-06,0.617,0.579,162.887,189293,4
2009-02-28,49,Halo,Beyonce,7zqM7Wm2xJLZ50qAnTLoHD,False,44,44,4,0.508,0.72,11,-5.908,0,0.0628,0.272,0,0.0563,0.472,79.983,261640,4
2009-02-28,50,Lucky,Jason Mraz & Colbie Caillat,7zqM7Wm2xJLZ50qAnTLoHD,False,48,48,6,0.623,0.417,0,-8.699,1,0.0354,0.296,0,0.135,0.721,130.032,191360,4
2009-02-28,51,"1, 2, 3, 4",Plain White T's,7zqM7Wm2xJLZ50qAnTLoHD,False,52,51,4,0.458,0.55,2,-7.092,1,0.0262,0.566,1.39e-05,0.108,0.56,90.56,198360,4
2009-02-28,52,Cowgirls Don't Cry,Brooks & Dunn Featuring Reba McEntire,7zqM7Wm2xJLZ50qAnTLoHD,False,51,49,14,0.655,0.668,9,-5.251,1,0.0302,0.0626,2.78e-06,0.179,0.619,114.881,219813,4
2009-02-28,53,I Get It In,50 Cent,2GGXna7FXpFGhFfeuCijZ0,True,0,53,1,0.688,0.772,1,-8.165,1,0.223,0.0832,1.2e-05,0.304,0.572,94.947,200107,4
2009-02-28,54,Day 'N' Nite,Kid Cudi,2GGXna7FXpFGhFfeuCijZ0,False,53,53,5,0.871,0.44,11,-6.25,0,0.0761,0.499,4.15e-06,0.114,0.799,137.996,221267,4
2009-02-28,55,I Love College,Asher Roth,1akgiRM3mN2nxu2AX6ACCW,True,0,55,1,0.713,0.826,8,-4.075,1,0.243,0.0897,0,0.421,0.664,86.444,241933,4
2009-02-28,56,Second Chance,Shinedown,1akgiRM3mN2nxu2AX6ACCW,False,55,55,12,0.46,0.796,0,-4.501,0,0.0333,0.00107,0,0.106,0.182,100.011,222067,4
2009-02-28,57,How Do You Sleep?,Jesse McCartney Featuring Ludacris,1akgiRM3mN2nxu2AX6ACCW,False,94,57,2,0.747,0.878,8,-3.533,1,0.0282,0.343,0,0.0872,0.557,106.004,208333,4
2009-02-28,58,If I Were A Boy,Beyonce,1akgiRM3mN2nxu2AX6ACCW,False,54,3,19,0.632,0.518,6,-6.126,1,0.0313,0.107,0,0.354,0.427,90.007,249147,4
2009-02-28,59,Beep,Bobby V Featuring Yung Joc,1akgiRM3mN2nxu2AX6ACCW,False,74,59,7,0.696,0.573,0,-8.531,1,0.0919,0.104,0,0.135,0.368,79.013,250973,4
2009-02-28,60,She Wouldn't Be Gone,Blake Shelton,1akgiRM3mN2nxu2AX6ACCW,False,45,43,17,0.51,0.683,0,-4.338,1,0.0302,0.166,0,0.0795,0.211,159.918,215613,4
2009-02-28,61,She Got Her Own,Ne-Yo Featuring Jamie Foxx & Fabolous,1akgiRM3mN2nxu2AX6ACCW,False,56,56,10,0.65,0.659,11,-9.477,1,0.619,0.356,1.62e-06,0.229,0.352,80.618,202222,4
2009-02-28,62,It Won't Be Like This For Long,Darius Rucker,1akgiRM3mN2nxu2AX6ACCW,False,62,62,7,0.584,0.524,4,-6.001,1,0.0287,0.335,0,0.11,0.389,143.863,219000,4
2009-02-28,64,I'm So Paid,Akon Featuring Lil Wayne & Young Jeezy,,False,57,31,18,0.471,0.865,6,-4.179,1,0.325,0.118,0,0.0994,0.516,92.037,263640,4
2009-02-28,65,Fifteen,Taylor Swift,,False,0,65,2,0.556,0.651,7,-4.396,1,0.0266,0.067,0,0.145,0.203,95.485,294333,4
2009-02-28,66,Sex On Fire,Kings Of Leon,,False,68,56,17,0.542,0.905,9,-5.653,1,0.054,0.00172,0.0104,0.136,0.374,153.398,203347,4
2009-02-28,67,I Will Be,Leona Lewis,,False,66,66,3,0.47,0.602,7,-4.167,1,0.0284,0.143,0,0.156,0.185,74.993,238840,4
2009-02-28,68,F*ck You,Lily Allen,1dukvf5b39mFygaP8hvN02,True,0,68,1,0.819,0.496,4,-13.975,1,0.0652,0.0283,0.675,0.107,0.451,130.024,184059,4
2009-02-28,69,She's Country,Jason Aldean,1dukvf5b39mFygaP8hvN02,False,73,69,5,0.553,0.872,1,-2.832,0,0.0782,0.198,0,0.0659,0.638,172.138,220573,4
2009-02-28,70,Human,The Killers,1dukvf5b39mFygaP8hvN02,False,60,32,20,0.557,0.8,10,-8.477,1,0.0601,0.00132,0.0012,0.0906,0.582,135.47,245373,4
2009-02-28,71,Move (If You 'W'anna),Mims,1dukvf5b39mFygaP8hvN02,False,69,69,4,0.728,0.605,8,-7.953,1,0.334,0.0197,2.46e-05,0.0668,0.743,80.545,190667,4
2009-02-28,72,River Of Love,George Strait,1dukvf5b39mFygaP8hvN02,False,75,71,10,0.474,0.814,7,-6.875,1,0.0419,0.604,0.0145,0.15,0.91,79.216,195147,4
2009-02-28,73,Just Like Me,Jamie Foxx Featuring T.I.,1dukvf5b39mFygaP8hvN02,False,63,49,10,0.755,0.713,11,-4.753,0,0.15,0.151,0,0.269,0.741,151.047,206093,5
2009-02-28,74,Rehab,Rihanna,1dukvf5b39mFygaP8hvN02,False,59,18,15,0.583,0.792,1,-5.894,1,0.0533,0.00321,4.92e-05,0.315,0.397,80.055,294720,4
2009-02-28,75,Ain't I,Yung L.A. Featuring Young Dro & T.I.,1dukvf5b39mFygaP8hvN02,False,81,75,3,0.665,0.826,11,-3.126,1,0.116,0.141,0,0.0926,0.541,77.504,252093,4
2009-02-28,76,My President,Young Jeezy Featuring Nas,1dukvf5b39mFygaP8hvN02,False,61,53,5,0.564,0.773,6,-6.568,0,0.115,0.0526,0,0.328,0.588,151.975,329813,4
2009-02-28,77,Stanky Legg,GS Boyz,1dukvf5b39mFygaP8hvN02,False,86,77,2,0.761,0.704,11,-5.975,0,0.059,0.00435,0,0.272,0.738,154.007,233320,4
2009-02-28,78,That's Not My Name,The Ting Tings,1dukvf5b39mFygaP8hvN02,False,72,64,6,0.755,0.901,9,-3.152,1,0.0893,0.0451,0.0373,0.363,0.959,145.042,310573,4
2009-02-28,79,Don't,Billy Currington,1dukvf5b39mFygaP8hvN02,False,65,52,17,0.571,0.826,1,-4.475,1,0.0362,0.0446,0,0.343,0.713,90.966,189000,4
2009-02-28,80,Freeze,T-Pain Featuring Chris Brown,1dukvf5b39mFygaP8hvN02,False,83,38,6,0.734,0.626,0,-6.808,1,0.0714,0.0152,0,0.214,0.458,119.997,216933,4
2009-02-28,81,Lost,Gorilla Zoe,1dukvf5b39mFygaP8hvN02,False,82,81,6,0.722,0.564,0,-7.476,0,0.0668,0.0162,0.176,0.351,0.553,136.039,287187,4
2009-02-28,82,Country Boy,Alan Jackson,1dukvf5b39mFygaP8hvN02,False,71,49,16,0.73,0.684,9,-10.803,1,0.0351,0.259,1.53e-06,0.111,0.564,139.037,246080,4
2009-02-28,83,Angels On The Moon,Thriving Ivory,1dukvf5b39mFygaP8hvN02,False,77,75,5,0.441,0.8,10,-3.268,1,0.0365,0.267,0,0.101,0.204,151.011,252800,4
2009-02-28,84,Don't Trust Me,3OH!3,1dukvf5b39mFygaP8hvN02,False,80,56,10,0.757,0.629,7,-5.582,0,0.125,0.018,0,0.339,0.711,129.942,194613,4
2009-02-28,85,Chopped 'N' Skrewed,T-Pain Featuring Ludacris,1dukvf5b39mFygaP8hvN02,False,67,27,18,0.558,0.604,7,-7.892,0,0.0529,0.0181,0,0.503,0.323,120.159,261227,4
2009-02-28,86,I'm On A Boat,The Lonely Island Featuring T-Pain,3IQSYqnKsCTMLWn2xE3HFT,True,0,86,1,0.623,0.871,0,-2.403,1,0.239,0.0465,0,0.111,0.653,150.079,156267,4
2009-02-28,87,Don't Think I Can't Love You,Jake Owen,3IQSYqnKsCTMLWn2xE3HFT,False,93,87,3,0.435,0.558,10,-5.423,1,0.0342,0.26,0,0.245,0.203,115.742,185107,3
2009-02-28,88,You Complete Me,Keyshia Cole,3IQSYqnKsCTMLWn2xE3HFT,False,97,88,2,0.681,0.666,2,-4.984,0,0.0491,0.578,0,0.26,0.732,111.401,230920,4
2009-02-28,89,Trading Places,Usher,3IQSYqnKsCTMLWn2xE3HFT,False,78,45,16,0.696,0.643,0,-5.218,1,0.0447,0.000153,1.03e-05,0.156,0.332,146.005,268240,4
2009-02-28,90,Last Call,Lee Ann Womack,3IQSYqnKsCTMLWn2xE3HFT,False,89,89,5,0.335,0.584,6,-7.089,1,0.0341,0.794,0.000195,0.0869,0.332,78.51,195467,4
2009-02-28,91,The Fear,Lily Allen,7bW6MqAdTclmHVHAOkIyPS,True,0,91,1,0.661,0.847,10,-6.948,1,0.0404,0.419,8.82e-05,0.107,0.522,134.002,207120,4
2009-02-28,92,I Told You So,Carrie Underwood Featuring Randy Travis,3ZK8icmaq8PMW686smPDVL,True,0,92,1,0.423,0.522,8,-3.849,1,0.029,0.643,0,0.122,0.236,147.745,257893,4
2009-02-28,93,More Like Her,Miranda Lambert,3ZK8icmaq8PMW686smPDVL,False,90,90,5,0.556,0.393,11,-6.589,1,0.025,0.238,0,0.0979,0.213,132.746,208867,4
2009-02-28,94,Use Somebody,Kings Of Leon,3ZK8icmaq8PMW686smPDVL,False,100,86,3,0.276,0.715,0,-5.356,1,0.0432,0.00552,0.000417,0.201,0.173,137.028,230760,4
2009-02-28,95,La La Land,Demi Lovato,3ZK8icmaq8PMW686smPDVL,False,88,52,8,0.467,0.919,6,-2.255,0,0.069,0.0149,0,0.0193,0.706,169.987,196467,4
2009-02-28,96,"Lions, Tigers & Bears",Jazmine Sullivan,3ZK8icmaq8PMW686smPDVL,False,99,96,2,0.576,0.515,6,-6.178,1,0.0295,0.0788,0,0.118,0.407,95.406,251200,3
2009-02-28,97,Nothin' To Die For,Tim McGraw,3lRSz6HujrSy9b3LXg2Kq9,True,0,97,1,0.481,0.786,10,-5.654,1,0.0288,0.0538,0,0.0759,0.389,153.105,253640,4
2009-02-28,98,IfULeave,Musiq Soulchild Featuring Mary J. Blige,3lRSz6HujrSy9b3LXg2Kq9,False,87,71,12,0.467,0.752,11,-3.244,1,0.232,0.208,0,0.164,0.728,122.775,252440,4
2009-02-28,99,Lollipop,Framing Hanley,3lRSz6HujrSy9b3LXg2Kq9,False,96,82,7,0.348,0.893,0,-4.589,1,0.0662,0.000484,6.36e-05,0.281,0.392,148.043,187907,4
2009-02-28,100,Put It On Ya,Plies Featuring Chris J,3lRSz6HujrSy9b3LXg2Kq9,False,84,31,13,0.759,0.583,1,-8.503,1,0.0864,0.00286,0,0.0445,0.904,76.023,257413,4
