date,position,title,artist,spotify_id,is_new,last_pos,peak_pos,weeks,danceability,energy,key,loudness,mode,speechiness,acousticness,instrumentalness,liveness,valence,tempo,duration_ms,time_signature
1991-08-10,1,(Everything I Do) I Do It For You,Bryan Adams,,False,1,1,7,0.508,0.834,2,-6.205,1,0.0386,0.0183,0,0.0732,0.774,139.131,216053,4
1991-08-10,2,P.A.S.S.I.O.N.,Rhythm Syndicate,,False,2,2,11,0.737,0.753,2,-8.416,0,0.0399,0.0135,0.0562,0.0738,0.562,110.89,217993,4
1991-08-10,3,Every Heartbeat,Amy Grant,,False,5,3,9,0.648,0.89,2,-3.834,1,0.0429,0.288,0,0.119,0.808,126.956,213733,4
1991-08-10,4,Summertime,D.J. Jazzy Jeff & The Fresh Prince,,False,4,4,9,0.677,0.54,7,-14.439,1,0.0627,0.0455,1.84e-06,0.845,0.469,95.116,270973,4
1991-08-10,5,It Ain't Over 'til It's Over,Lenny Kravitz,,False,6,5,10,0.679,0.568,6,-10.74,1,0.0423,0.422,0.00928,0.322,0.93,159.69,242640,4
1991-08-10,6,Temptation,Corina,,False,8,6,13,0.609,0.771,7,-10.663,1,0.0428,0.000274,0.05,0.038,0.565,118.352,241533,4
1991-08-10,7,Fading Like A Flower (Every Time You Leave),Roxette,,False,9,7,9,0.609,0.668,0,-5.738,1,0.026,0.195,0,0.219,0.319,105.419,230680,4
1991-08-10,8,I'll Be There,The Escape Club,,False,10,8,12,0.57,0.385,1,-12.027,0,0.0251,0.383,0.0012,0.0924,0.188,99.86,347867,4
1991-08-10,9,"Right Here, Right Now",Jesus Jones,,False,3,2,18,0.657,0.608,2,-13.565,1,0.0287,0.0088,3.45e-06,0.103,0.723,106.862,189293,4
1991-08-10,10,Wind Of Change,Scorpions,,False,11,10,11,0.452,0.524,0,-10.108,1,0.0351,0.315,0,0.103,0.246,151.505,312360,4
1991-08-10,11,3 A.M. Eternal,The KLF,,False,16,11,8,0.732,0.577,0,-11.716,1,0.0506,0.000826,0.925,0.363,0.332,120.013,200073,4
1991-08-10,12,I Can't Wait Another Minute,Hi-Five,,False,15,12,8,0.625,0.644,8,-8.801,1,0.0287,0.357,0,0.102,0.638,147.435,301640,4
1991-08-10,13,Unbelievable,EMF,,False,7,1,18,0.637,0.849,1,-6.855,1,0.0362,0.000341,0.0386,0.141,0.936,104.074,209813,4
1991-08-10,14,Motownphilly,Boyz II Men,,False,19,14,9,0.754,0.857,2,-9.699,1,0.0605,0.0143,2.14e-05,0.278,0.785,114.144,235227,4
1991-08-10,15,The Promise Of A New Day,Paula Abdul,,False,23,15,4,0.754,0.82,1,-8.622,1,0.062,0.0911,1.62e-06,0.0805,0.896,119.835,272893,4
1991-08-10,16,Crazy,Seal,,False,18,16,8,0.643,0.699,4,-11.102,0,0.039,0.436,0.109,0.166,0.89,102.877,269427,4
1991-08-10,17,Love And Understanding,Cher,,False,17,17,9,0.668,0.75,0,-9.717,1,0.0267,0.0332,3.5e-06,0.0383,0.646,116.07,282040,4
1991-08-10,18,Unforgettable,Natalie Cole,,False,25,18,5,0.307,0.289,5,-13.369,1,0.0281,0.851,0.000126,0.0798,0.145,85.948,210907,4
1991-08-10,20,Too Many Walls,Cathy Dennis,,False,27,20,6,0.729,0.578,10,-11.04,1,0.0267,0.377,2.44e-05,0.0886,0.649,97.146,264680,4
1991-08-10,21,"Time, Love And Tenderness",Michael Bolton,,False,32,21,5,0.51,0.808,6,-8.649,0,0.0475,0.0281,0,0.295,0.738,170.037,330307,4
1991-08-10,22,Rush Rush,Paula Abdul,,False,13,1,14,0.706,0.44,4,-11.577,1,0.0493,0.763,0,0.0958,0.395,90.012,292933,4
1991-08-10,23,Now That We Found Love,Heavy D & The Boyz,,False,26,23,7,0.744,0.697,8,-14.753,1,0.0631,0.039,0,0.171,0.683,119.955,258200,4
1991-08-10,24,The Dream Is Still Alive,Wilson Phillips,,False,12,12,11,0.582,0.676,5,-7.496,1,0.0265,0.303,0,0.234,0.496,108.291,248800,4
1991-08-10,25,The Motown Song,Rod Stewart,,False,30,25,6,0.654,0.837,9,-6.121,1,0.0455,0.155,0,0.113,0.778,116.0,238013,4
1991-08-10,26,Piece Of My Heart,Tara Kemp,,False,14,7,14,0.536,0.823,1,-10.696,1,0.0687,0.111,0.000432,0.0543,0.916,200.128,289740,4
1991-08-10,27,Hard To Handle,The Black Crowes,,False,28,27,8,0.599,0.79,4,-3.58,1,0.043,0.00257,0.00181,0.312,0.961,103.783,188067,4
1991-08-10,28,I Adore Mi Amor,Color Me Badd,,False,41,28,3,0.683,0.476,3,-9.995,0,0.027,0.243,0,0.0787,0.725,91.99,289200,4
1991-08-10,29,You Could Be Mine,Guns N' Roses,,False,31,29,5,0.35,0.985,10,-5.676,0,0.122,0.00876,0.551,0.36,0.323,151.007,343640,4
1991-08-10,30,Only Time Will Tell,Nelson,,False,34,30,8,0.455,0.417,0,-16.817,0,0.0303,0.316,1.44e-06,0.0608,0.464,142.25,233718,4
1991-08-10,31,Place In This World,Michael W. Smith,,False,20,6,15,0.446,0.559,4,-8.319,1,0.0285,0.388,1.78e-05,0.153,0.372,145.419,240173,4
1991-08-10,32,Love Of A Lifetime,Firehouse,,False,36,32,7,0.472,0.48,1,-11.893,1,0.0308,0.000204,0.00275,0.0914,0.126,123.023,286573,4
1991-08-10,33,"I Wanna Sex You Up (From ""New Jack City"")",Color Me Badd,,False,21,2,19,0.551,0.591,6,-8.404,0,0.12,0.00549,6.55e-06,0.0416,0.474,201.81,236947,4
1991-08-10,34,Just Like You,Robbie Nevil,,False,38,34,6,0.697,0.716,2,-11.987,1,0.0408,0.113,0,0.345,0.847,98.243,246600,4
1991-08-10,35,Good Vibrations,Marky Mark & The Funky Bunch Featuring Loleatta Holloway,,False,44,35,4,0.711,0.951,1,-8.406,1,0.0537,0.00189,0.366,0.0229,0.903,121.656,269307,4
1991-08-10,36,My Name Is Not Susan,Whitney Houston,,False,46,36,3,0.787,0.899,7,-7.896,1,0.0562,0.178,0,0.358,0.536,101.098,279840,4
1991-08-10,37,Learning To Fly,Tom Petty And The Heartbreakers,,False,40,37,7,0.651,0.766,0,-9.935,1,0.0299,0.206,0.00103,0.362,0.949,116.74,242107,4
1991-08-10,38,Do You Want Me,Salt-N-Pepa,,False,35,21,21,0.899,0.451,11,-14.009,0,0.0511,0.0756,3.22e-05,0.044,0.973,121.575,232267,4
1991-08-10,39,Shiny Happy People,R.E.M.,,False,51,39,3,0.452,0.909,9,-3.977,1,0.0366,0.0313,0.0603,0.23,0.805,124.623,225787,4
1991-08-10,40,Pop Goes The Weasel,3rd Bass,,False,47,40,5,0.663,0.599,2,-13.299,1,0.378,0.0145,0,0.15,0.259,200.312,235627,4
1991-08-10,41,Let The Beat Hit 'Em,Lisa Lisa And Cult Jam,,False,37,37,8,0.792,0.731,1,-9.659,1,0.0502,0.00263,0.0126,0.303,0.838,113.007,278267,4
1991-08-10,42,Love On A Rooftop,Desmond Child,,False,42,42,8,0.613,0.754,3,-8.128,1,0.031,0.179,1.59e-06,0.211,0.662,107.967,318227,4
1991-08-10,43,"Nights Like This (From ""The Five Heartbeats"")",After 7,,False,29,24,12,0.707,0.644,8,-7.017,1,0.0287,0.174,0,0.069,0.576,97.127,242000,4
1991-08-10,44,It Hit Me Like A Hammer,Huey Lewis & The News,,False,50,44,4,0.607,0.742,8,-11.151,1,0.0316,0.0772,0,0.126,0.736,145.3,241893,3
1991-08-10,45,Here I Am (Come And Take Me),UB40,,False,33,7,21,0.802,0.621,5,-7.932,0,0.0377,0.0975,0.0256,0.0627,0.81,95.906,242093,4
1991-08-10,46,More Than Words,Extreme,,False,39,1,21,0.626,0.134,6,-14.898,1,0.0298,0.467,0,0.113,0.239,91.893,334107,4
1991-08-10,47,Something To Talk About,Bonnie Raitt,,False,59,47,4,0.795,0.64,1,-13.478,1,0.0294,0.0631,2.13e-06,0.0692,0.954,102.633,227573,4
1991-08-10,49,Everybody Plays The Fool,Aaron Neville,,False,58,49,4,0.789,0.352,10,-14.022,1,0.143,0.224,0.00147,0.0536,0.431,87.894,266107,4
1991-08-10,50,Got A Love For You,Jomanda,,False,57,50,6,0.708,0.604,6,-13.591,0,0.0437,4.18e-05,0.639,0.0489,0.632,119.9,454960,4
1991-08-10,51,Elevate My Mind,Stereo MC's,,False,49,39,11,0.845,0.591,9,-14.87,1,0.0627,0.137,0.65,0.129,0.765,115.139,196827,4
1991-08-10,52,The Sound Of Your Voice,38 Special,,False,62,52,5,0.616,0.786,4,-9.973,1,0.0281,0.0148,0,0.224,0.79,136.043,299600,4
1991-08-10,53,Can't Forget You,Gloria Estefan,,False,43,43,10,0.565,0.426,2,-10.705,1,0.0343,0.339,0,0.365,0.28,142.179,254173,4
1991-08-10,54,Can You Stop The Rain,Peabo Bryson,,False,52,52,8,0.684,0.359,3,-12.867,0,0.0368,0.353,0,0.233,0.144,119.942,334933,4
1991-08-10,55,With You,Tony Terry,,False,60,55,7,0.619,0.492,8,-9.532,1,0.0328,0.455,0,0.106,0.553,131.888,305827,4
1991-08-10,56,I'll Never Let You Go,Steelheart,,False,48,23,22,0.341,0.651,1,-9.829,1,0.0423,0.0119,0.148,0.0875,0.31,143.934,306560,4
1991-08-10,57,Power Of Love/Love Power,Luther Vandross,,False,45,4,16,0.602,0.911,0,-6.615,1,0.0387,0.0174,3.47e-05,0.0735,0.851,92.357,402413,4
1991-08-10,58,Do Anything,Natural Selection,5nNwxsg6vS3pKcLNcAvRWP,True,0,58,1,0.654,0.749,11,-9.221,0,0.0537,0.0746,0,0.114,0.663,93.847,237373,4
1991-08-10,59,My Fallen Angel,Coro,5nNwxsg6vS3pKcLNcAvRWP,False,66,59,5,0.76,0.733,10,-9.312,0,0.0675,0.00621,0.0105,0.0401,0.797,124.058,340773,4
1991-08-10,60,Hole Hearted,Extreme,5nNwxsg6vS3pKcLNcAvRWP,False,75,60,2,0.4,0.747,6,-9.438,1,0.045,0.163,0,0.0774,0.674,203.396,219289,4
1991-08-10,61,There She Goes,The La's,5nNwxsg6vS3pKcLNcAvRWP,False,68,61,4,0.536,0.854,7,-6.907,1,0.0298,0.0129,0.743,0.156,0.905,122.733,162160,4
1991-08-10,62,Walking In Memphis,Marc Cohn,5nNwxsg6vS3pKcLNcAvRWP,False,53,13,20,0.567,0.512,0,-8.831,1,0.0357,0.545,0,0.296,0.334,130.271,252613,4
1991-08-10,63,Losing My Religion,R.E.M.,5nNwxsg6vS3pKcLNcAvRWP,False,56,4,19,0.666,0.855,9,-5.051,0,0.0295,0.179,1.2e-06,0.0987,0.803,125.639,268427,4
1991-08-10,64,How Can I Ease The Pain,Lisa Fischer,5nNwxsg6vS3pKcLNcAvRWP,False,55,11,18,0.634,0.577,4,-7.579,0,0.0303,0.143,1.78e-05,0.183,0.4,116.212,319880,4
1991-08-10,65,Latin Active,Lighter Shade Of Brown Featuring Teardrop & Shiro,5nNwxsg6vS3pKcLNcAvRWP,False,69,65,4,0.938,0.628,4,-7.587,0,0.158,0.0364,0,0.33,0.758,119.996,211733,4
1991-08-10,67,A Better Love,Londonbeat,,False,61,18,14,0.616,0.6,9,-14.772,1,0.0331,0.0944,0.000121,0.336,0.792,95.743,240400,4
1991-08-10,68,That's The Way Love Goes,Young M.C.,,False,87,68,2,0.849,0.694,6,-14.43,0,0.0642,0.0232,0.00252,0.0524,0.932,118.309,229307,4
1991-08-10,69,Gypsy Woman (She's Homeless),Crystal Waters,,False,54,8,15,0.484,0.641,5,-12.612,1,0.0377,0.000779,0.278,0.0738,0.181,119.981,451827,4
1991-08-10,70,Don't Want To Be A Fool,Luther Vandross,,False,92,70,2,0.632,0.576,7,-8.345,1,0.0234,0.482,0,0.151,0.323,95.321,275133,4
1991-08-10,71,Playground,Another Bad Creation,,False,63,10,16,0.788,0.774,6,-11.399,1,0.111,0.101,0,0.94,0.784,110.491,249836,4
1991-08-10,72,Running Back To You,Vanessa Williams,28zaRfdizHTtqqUXJWZjtb,True,0,72,1,0.723,0.865,5,-10.517,1,0.0451,0.0358,0.51,0.335,0.875,115.303,280000,4
1991-08-10,73,The One And Only,Chesney Hawkes,28zaRfdizHTtqqUXJWZjtb,False,79,73,2,0.681,0.697,4,-11.063,1,0.0327,0.357,0,0.388,0.775,119.956,223667,4
1991-08-10,74,Never Gonna Let You Down,Surface,28zaRfdizHTtqqUXJWZjtb,False,64,17,16,0.56,0.363,3,-11.9,1,0.0307,0.55,0,0.205,0.186,124.45,227227,4
1991-08-10,75,Kissing You,Keith Washington,28zaRfdizHTtqqUXJWZjtb,False,67,40,12,0.494,0.495,7,-8.855,1,0.0312,0.184,0,0.127,0.233,126.515,260013,4
1991-08-10,76,I Don't Wanna See You,Michael Morales,28zaRfdizHTtqqUXJWZjtb,False,73,73,3,0.675,0.731,7,-9.782,1,0.0283,0.0259,0,0.05,0.724,124.865,247800,4
1991-08-10,77,Love. . .Thy Will Be Done,Martika,61n0HIKhgIXOGusfWBIyEI,True,0,77,1,0.663,0.34,2,-10.995,1,0.0286,0.4,0.00363,0.163,0.269,91.38,302773,4
1991-08-10,78,Hey Stoopid,Alice Cooper,61n0HIKhgIXOGusfWBIyEI,False,78,78,3,0.47,0.939,7,-7.782,0,0.0599,0.00511,0.00102,0.51,0.3,129.896,273933,4
1991-08-10,79,You Can't Play With My Yo-Yo,Yo-Yo Featuring Ice Cube,61n0HIKhgIXOGusfWBIyEI,False,65,36,12,0.739,0.758,9,-6.128,0,0.217,0.0999,0,0.0781,0.765,96.717,304667,4
1991-08-10,80,Turn It Up,Oaktown's 3.5.7,61n0HIKhgIXOGusfWBIyEI,False,82,80,2,0.78,0.852,11,-5.617,0,0.0505,0.00115,0.000313,0.314,0.875,126.989,223733,4
1991-08-10,81,My Body Says Yes,Titiyo,61n0HIKhgIXOGusfWBIyEI,False,70,42,10,0.751,0.558,7,-14.87,1,0.0486,0.00581,3.77e-05,0.3,0.88,113.365,249867,4
1991-08-10,82,Just Want To Hold You,Jasmine Guy,61n0HIKhgIXOGusfWBIyEI,False,91,82,2,0.611,0.368,8,-13.701,1,0.0362,0.3,4.05e-05,0.0567,0.451,161.986,251867,4
1991-08-10,83,Get Serious,Cut 'N' Move,61n0HIKhgIXOGusfWBIyEI,False,90,83,2,0.81,0.695,5,-12.172,1,0.0755,0.00137,0.0142,0.0914,0.603,108.948,229107,4
1991-08-10,85,Chorus,Erasure,6gGie940lliTLLt85tZPp7,True,0,85,1,0.613,0.655,5,-12.989,1,0.0302,0.209,0.000754,0.171,0.69,129.906,266267,4
1991-08-10,87,Louder Than Love,TKA,37fXlIwxO9bfLdmbU67MwS,True,0,87,1,0.686,0.652,6,-10.505,0,0.0387,0.0941,0.109,0.1,0.523,122.063,318893,4
1991-08-10,88,Dirty Love,Thunder,37fXlIwxO9bfLdmbU67MwS,False,77,55,11,0.459,0.935,6,-10.083,0,0.0423,0.00853,0.000176,0.171,0.778,119.111,315587,4
1991-08-10,89,Silver Thunderbird,Marc Cohn,2Jd4KhCwRbEqsrRC57cTe3,True,0,89,1,0.475,0.267,7,-15.35,1,0.034,0.721,0,0.0815,0.56,138.942,278720,4
1991-08-10,90,Your Love,Keith Sweat,2Jd4KhCwRbEqsrRC57cTe3,False,80,71,9,0.688,0.864,7,-9.855,1,0.0564,0.00662,0.000106,0.0375,0.778,100.35,351667,4
1991-08-10,92,"Just Ask Me To (From ""Boyz N The Hood"")",Tevin Campbell,0gzjfF1qKORte5h0kKHQfB,True,0,92,1,0.738,0.816,1,-6.74,1,0.0528,0.0579,3.91e-06,0.0862,0.682,109.899,248040,4
1991-08-10,94,Love Desire,Sandee,,False,83,49,11,0.837,0.549,2,-12.576,1,0.0502,0.0819,0.0501,0.115,0.707,106.996,332493,4
1991-08-10,95,I Don't Wanna Cry,Mariah Carey,,False,74,1,19,0.641,0.504,7,-12.486,1,0.031,0.197,9.62e-05,0.288,0.275,130.786,288827,4
1991-08-10,96,Surrender,Trixter,,False,84,72,10,0.577,0.385,3,-14.092,1,0.0372,0.0267,3.04e-05,0.27,0.203,125.917,350960,4
1991-08-10,97,Don't Treat Me Bad,Firehouse,,False,88,19,23,0.616,0.807,8,-11.4,1,0.0348,0.000303,2.37e-05,0.193,0.637,111.054,235360,4
1991-08-10,98,Love Is A Wonderful Thing,Michael Bolton,,False,85,4,17,0.727,0.824,2,-8.915,1,0.0394,0.00812,1.58e-06,0.0922,0.935,125.104,282933,4
1991-08-10,100,Break Up To Make Up,Cynthia,,False,81,70,8,0.4,0.28,4,-13.412,1,0.0343,0.522,0,0.193,0.149,121.488,237093,4
