date,position,title,artist,spotify_id,is_new,last_pos,peak_pos,weeks,danceability,energy,key,loudness,mode,speechiness,acousticness,instrumentalness,liveness,valence,tempo,duration_ms,time_signature
1996-01-13,1,One Sweet Day,Mariah Carey & Boyz II Men,,False,1,1,7,0.568,0.495,1,-8.964,1,0.0299,0.353,0,0.0839,0.303,128.234,281067,4
1996-01-13,2,"Exhale (Shoop Shoop) (From ""Waiting To Exhale"")",Whitney Houston,,False,2,1,8,0.661,0.394,1,-9.032,1,0.0318,0.401,0,0.119,0.107,137.954,204333,4
1996-01-13,3,Hey Lover,LL Cool J,,False,3,3,9,0.707,0.427,5,-12.216,0,0.0698,0.339,0,0.105,0.541,88.08,284693,4
1996-01-13,4,"Gangsta's Paradise (From ""Dangerous Minds"")",Coolio Featuring L.V.,,False,4,1,22,0.647,0.514,8,-10.05,1,0.0593,0.0655,0,0.398,0.387,79.974,240693,4
1996-01-13,5,Diggin' On You,TLC,,False,5,5,9,0.719,0.631,6,-7.411,1,0.0451,0.0235,0.702,0.0686,0.456,80.127,254560,4
1996-01-13,6,Breakfast At Tiffany's,Deep Blue Something,,False,7,6,22,0.622,0.829,2,-5.548,1,0.029,0.11,0,0.0954,0.539,110.367,257373,4
1996-01-13,7,Fantasy,Mariah Carey,,False,8,1,16,0.669,0.727,7,-7.588,1,0.0353,0.139,0,0.123,0.807,102.322,243493,4
1996-01-13,9,Name,Goo Goo Dolls,,False,10,8,14,0.464,0.701,9,-5.943,1,0.0341,0.0691,0.00182,0.0766,0.407,73.97,270000,4
1996-01-13,10,Missing,Everything But The Girl,,False,11,10,23,0.677,0.484,9,-10.506,0,0.0324,0.077,4.75e-05,0.135,0.697,123.534,247200,4
1996-01-13,11,You'll See,Madonna,,False,12,6,6,0.601,0.545,4,-9.972,0,0.0311,0.479,0.000224,0.0975,0.234,89.79,281067,4
1996-01-13,12,One Of Us,Joan Osborne,,False,13,12,6,0.316,0.499,9,-7.899,1,0.0298,0.0108,1.81e-05,0.126,0.403,174.782,320467,4
1996-01-13,13,Runaway,Janet Jackson,,False,16,3,18,0.787,0.86,1,-4.974,1,0.0344,0.364,0.041,0.0612,0.862,109.154,214933,4
1996-01-13,14,You Remind Me Of Something,R. Kelly,,False,15,4,9,0.631,0.536,6,-7.194,1,0.0586,0.591,0,0.108,0.829,59.999,249920,4
1996-01-13,15,Free As A Bird,The Beatles,,False,6,6,3,0.474,0.503,9,-9.074,1,0.0279,0.0438,0.016,0.153,0.457,72.323,265293,4
1996-01-13,17,Beautiful Life,Ace Of Base,,False,17,15,10,0.749,0.988,0,-5.266,0,0.0387,0.202,0.00631,0.17,0.749,135.015,221187,4
1996-01-13,18,Tell Me,Groove Theory,,False,18,5,21,0.8,0.361,6,-10.849,0,0.0635,0.0355,3.75e-06,0.0668,0.887,93.059,236067,4
1996-01-13,19,Tonite's Tha Night,Kris Kross,,False,19,19,6,0.743,0.523,5,-5.456,0,0.103,0.0231,0.0309,0.0701,0.789,90.974,199293,4
1996-01-13,20,Anything,3T,,False,20,20,15,0.686,0.454,10,-10.928,0,0.0328,0.43,0.00021,0.286,0.645,131.977,321000,4
1996-01-13,21,Soon As I Get Home,Faith Evans,,False,21,21,6,0.652,0.498,11,-6.2,1,0.0413,0.519,0,0.149,0.336,120.141,324280,4
1996-01-13,22,Back For Good,Take That,,False,23,7,23,0.6,0.504,5,-9.761,1,0.0292,0.308,0,0.137,0.547,78.961,242267,4
1996-01-13,23,Only Wanna Be With You,Hootie & The Blowfish,,False,28,6,24,0.49,0.873,6,-5.861,1,0.0355,0.107,5.19e-06,0.118,0.513,103.272,229587,4
1996-01-13,24,Too Hot,Coolio,,False,24,24,6,0.845,0.407,7,-14.983,1,0.203,0.089,0.00985,0.222,0.576,102.598,218933,4
1996-01-13,25,Be My Lover,La Bouche,,False,26,25,10,0.669,0.941,1,-5.765,0,0.0313,0.00129,4.3e-06,0.886,0.841,134.809,240267,4
1996-01-13,26,As I Lay Me Down,Sophie B. Hawkins,,False,25,6,33,0.519,0.737,10,-8.7,1,0.0437,0.645,1.77e-06,0.271,0.668,82.999,248893,4
1996-01-13,27,Time,Hootie & The Blowfish,,False,27,27,10,0.387,0.875,2,-5.741,1,0.0385,0.0373,0,0.152,0.238,105.1,296840,4
1996-01-13,28,Bullet With Butterfly Wings,The Smashing Pumpkins,,False,22,22,10,0.404,0.72,10,-9.18,0,0.0623,5.59e-05,0.836,0.0466,0.475,121.864,258467,4
1996-01-13,29,Kiss From A Rose,Seal,,False,30,1,30,0.584,0.533,10,-7.11,0,0.0305,0.684,0,0.306,0.224,131.745,288427,3
1996-01-13,30,Set U Free,Planet Soul,,False,33,29,13,0.636,0.645,6,-11.64,1,0.0873,0.101,1.64e-05,0.0686,0.711,128.43,258933,4
1996-01-13,31,Love U 4 Life,Jodeci,,False,31,31,11,0.606,0.648,0,-7.802,1,0.0466,0.349,0,0.639,0.646,59.041,290067,4
1996-01-13,32,"Sittin' Up In My Room (From ""Waiting To Exhale"")",Brandy,,False,34,32,3,0.791,0.61,8,-5.408,0,0.0264,0.288,0.00123,0.0457,0.907,93.277,291067,4
1996-01-13,33,Carnival,Natalie Merchant,,False,35,10,24,0.601,0.48,6,-11.41,0,0.0732,0.2,0.0955,0.0297,0.802,188.214,361107,4
1996-01-13,34,Roll To Me,Del Amitri,,False,36,10,28,0.567,0.821,6,-5.894,1,0.0371,0.418,0,0.108,0.895,150.106,132307,4
1996-01-13,35,Dreaming Of You,Selena,,False,32,22,12,0.553,0.458,8,-10.796,1,0.0381,0.325,9.71e-05,0.0583,0.247,165.807,314867,4
1996-01-13,36,Who Can I Run To,Xscape,,False,29,8,14,0.71,0.545,4,-9.599,1,0.0588,0.483,0,0.0644,0.632,140.233,216333,4
1996-01-13,37,No One Else,Total,,False,37,37,5,0.782,0.515,6,-8.215,0,0.3,0.185,1.34e-05,0.0577,0.791,182.19,260467,4
1996-01-13,38,Nobody Knows,The Tony Rich Project,,False,47,38,5,0.64,0.433,5,-9.432,1,0.0374,0.509,4.9e-06,0.103,0.25,176.086,306933,4
1996-01-13,39,The World I Know,Collective Soul,,False,40,39,9,0.514,0.704,2,-4.724,1,0.0261,0.0515,0.00219,0.228,0.386,76.975,255467,4
1996-01-13,40,"Natural One (From ""Kids"")",Folk Implosion,,False,42,40,6,0.677,0.463,4,-10.743,1,0.0304,0.53,7.17e-06,0.0988,0.481,110.908,179006,4
1996-01-13,41,Wonder,Natalie Merchant,,False,41,41,6,0.719,0.739,1,-5.577,1,0.0419,0.346,0.0102,0.0581,0.603,115.142,266008,4
1996-01-13,42,Run-Around,Blues Traveler,,False,43,8,43,0.629,0.867,7,-7.307,1,0.0603,0.0865,0,0.126,0.876,151.695,279800,4
1996-01-13,43,Hook,Blues Traveler,,False,39,39,15,0.562,0.742,9,-6.355,1,0.0346,0.0369,1.47e-06,0.102,0.793,165.6,289200,4
1996-01-13,44,Blessed,Elton John,,False,38,34,11,0.601,0.412,5,-11.963,1,0.0361,0.147,0.00585,0.263,0.464,204.064,300733,4
1996-01-13,45,Just Tah Let U Know,Eazy-E,,False,45,45,4,0.736,0.741,8,-3.857,0,0.292,0.0645,0,0.137,0.579,92.65,248867,4
1996-01-13,46,I Remember,Boyz II Men,,False,46,46,7,0.537,0.184,9,-15.886,1,0.0381,0.792,0,0.126,0.217,77.817,169840,4
1996-01-13,47,I'd Lie For You (And That's The Truth),Meat Loaf,,False,44,13,13,0.409,0.626,2,-8.032,1,0.0363,0.556,0,0.415,0.305,170.949,400358,4
1996-01-13,48,December,Collective Soul,,False,49,20,36,0.684,0.645,0,-5.707,1,0.0272,0.589,0.00432,0.18,0.366,121.995,285000,4
1996-01-13,49,Waterfalls,TLC,,False,48,1,32,0.77,0.505,1,-7.345,1,0.0828,0.311,7.4e-05,0.0777,0.757,171.798,279507,4
1996-01-13,50,Get Together,Big Mountain,,False,50,50,5,0.68,0.914,0,-7.392,1,0.0418,0.0529,0.00493,0.226,0.879,97.055,303133,4
1996-01-13,51,Let's Play House,Tha Dogg Pound Featuring Michel'le,,False,63,51,2,0.822,0.702,10,-4.759,0,0.0755,0.0919,0.00559,0.191,0.804,91.37,204440,4
1996-01-13,53,Cruisin',D'Angelo,,False,53,53,11,0.407,0.525,11,-12.725,0,0.166,0.381,0.000452,0.0816,0.329,74.34,384667,4
1996-01-13,54,Cell Therapy,Goodie Mob,,False,51,39,14,0.849,0.476,0,-10.479,1,0.445,0.0966,0,0.105,0.48,83.21,277133,4
1996-01-13,55,Ridin' Low,L.A.D.,,False,59,55,9,0.699,0.722,5,-6.532,1,0.0735,0.158,0.000452,0.0523,0.673,197.562,252360,4
1996-01-13,56,I'll Be There For You/This House Is Not A Home,The Rembrandts,,False,62,17,16,0.258,0.919,9,-6.927,1,0.0809,0.065,0,0.279,0.636,93.62,187293,4
1996-01-13,57,Danger,Blahzay Blahzay,,False,54,46,15,0.723,0.739,0,-7.943,1,0.401,0.403,0,0.365,0.805,177.886,225267,4
1996-01-13,58,Comedown,Bush,,False,60,30,20,0.46,0.81,11,-5.008,0,0.0557,6.54e-05,0.000189,0.123,0.38,139.671,326667,4
1996-01-13,59,You Are Not Alone,Michael Jackson,,False,56,1,20,0.651,0.402,11,-9.303,1,0.028,0.639,7.73e-05,0.0765,0.258,119.873,345600,4
1996-01-13,60,Pretty Girl,Jon B,,False,57,25,20,0.696,0.521,0,-9.32,1,0.0339,0.398,0,0.339,0.646,93.056,258107,4
1996-01-13,61,Brokenhearted,Brandy,,False,61,9,19,0.533,0.516,6,-7.178,1,0.0311,0.488,0,0.0985,0.42,74.921,286493,4
1996-01-13,62,East 1999,Bone Thugs-N-Harmony,,False,64,62,6,0.878,0.607,11,-9.032,0,0.149,0.0748,0,0.659,0.735,129.472,261773,4
1996-01-13,63,Do You Sleep?,Lisa Loeb & Nine Stories,,False,65,18,17,0.643,0.671,1,-7.158,0,0.0296,0.0383,4.65e-05,0.0496,0.26,90.396,233493,4
1996-01-13,64,When Love & Hate Collide,Def Leppard,,False,67,59,7,0.485,0.53,4,-9.611,1,0.0279,0.0272,0,0.151,0.28,67.97,259160,4
1996-01-13,65,Where Ever You Are,Terry Ellis,,False,58,52,11,0.732,0.499,5,-6.794,1,0.0346,0.52,8.62e-06,0.0842,0.428,134.027,298080,4
1996-01-13,66,Come With Me,Shai,,False,68,43,18,0.57,0.32,2,-8.965,1,0.0323,0.644,0,0.244,0.321,183.524,279960,3
1996-01-13,67,"I Miss You (Come Back Home) (From ""New York Undercover"")",Monifah,,False,70,66,12,0.639,0.495,5,-10.783,0,0.356,0.0738,0,0.0682,0.833,175.982,233867,4
1996-01-13,68,I Will Remember You (Live),Sarah McLachlan,,False,66,66,10,0.606,0.353,9,-11.484,1,0.0315,0.763,0.000578,0.0778,0.179,140.057,291400,4
1996-01-13,69,Throw Your Hands Up,L.V.,,False,72,65,9,0.849,0.727,9,-4.572,0,0.0534,0.148,2.17e-05,0.0453,0.7,100.927,230227,4
1996-01-13,70,"Visions Of A Sunset (From ""Mr. Holland's Opus"")",Shawn Stockman,6lQREztig1UKUHeyQhw7As,True,0,70,1,0.229,0.418,0,-9.066,1,0.0291,0.697,0,0.256,0.219,84.645,271600,4
1996-01-13,71,Macarena (Bayside Boys Mix),Los Del Rio,6lQREztig1UKUHeyQhw7As,False,69,45,20,0.927,0.721,8,-12.561,1,0.0908,0.422,4.36e-05,0.0422,0.965,103.018,249382,4
1996-01-13,72,Hooked On You,Silk,6lQREztig1UKUHeyQhw7As,False,73,54,11,0.598,0.56,6,-7.401,1,0.0278,0.0429,1.2e-05,0.12,0.775,179.529,289933,4
1996-01-13,73,Just A Girl,No Doubt,6lQREztig1UKUHeyQhw7As,False,78,73,5,0.638,0.906,2,-4.824,1,0.0504,0.0662,6.88e-05,0.142,0.767,107.991,209200,4
1996-01-13,74,(If You're Not In It For Love) I'm Outta Here!/The Woman In Me,Shania Twain,6lQREztig1UKUHeyQhw7As,False,74,74,11,0.598,0.839,4,-4.605,1,0.111,0.106,0,0.372,0.783,105.084,156276,4
1996-01-13,75,Hurricane,The Click,6lQREztig1UKUHeyQhw7As,False,75,63,10,0.824,0.48,0,-6.745,0,0.144,0.178,0,0.167,0.724,88.029,261080,4
1996-01-13,76,Sexual Healing,Max-A-Million,6lQREztig1UKUHeyQhw7As,False,71,60,11,0.775,0.745,8,-7.167,1,0.0563,0.0268,0,0.27,0.691,99.008,243613,4
1996-01-13,77,It Matters To Me,Faith Hill,6lQREztig1UKUHeyQhw7As,False,77,77,4,0.613,0.355,6,-8.218,1,0.0247,0.567,0,0.0909,0.129,135.622,197667,4
1996-01-13,79,Ain't Nuthin' But A She Thing,Salt-N-Pepa,,False,80,38,13,0.835,0.553,6,-8.607,1,0.0784,0.0314,0.000253,0.331,0.314,97.698,271308,4
1996-01-13,80,Runnin',The Pharcyde,,False,79,55,13,0.754,0.785,10,-8.178,0,0.18,0.0287,0.00144,0.319,0.821,94.123,296267,4
1996-01-13,81,Throw Your Set In The Air,Cypress Hill,,False,85,45,14,0.776,0.731,9,-12.264,1,0.43,0.0945,0.000274,0.318,0.485,92.394,245800,4
1996-01-13,82,Rosealia,Better Than Ezra,,False,83,71,8,0.392,0.676,7,-11.914,1,0.0327,0.00567,0.000111,0.155,0.548,120.926,278973,4
1996-01-13,83,Magic Carpet Ride,The Mighty Dub Katz,,False,82,58,14,0.916,0.824,6,-6.947,0,0.0652,0.0153,0.926,0.0844,0.886,128.698,189147,4
1996-01-13,84,Where Do U Want Me To Put It,Solo,,False,86,84,2,0.782,0.759,8,-5.87,1,0.0447,0.261,0,0.102,0.779,87.01,243667,4
1996-01-13,85,Fu-Gee-La,Fugees,,False,87,85,3,0.681,0.505,1,-11.709,1,0.138,0.137,0,0.234,0.399,89.953,260067,4
1996-01-13,87,Can't Be Really Gone,Tim McGraw,,False,94,87,2,0.561,0.473,5,-9.972,1,0.0263,0.646,3.44e-06,0.298,0.444,106.994,201133,4
1996-01-13,88,Boom Boom Boom,The Outhere Brothers,,False,81,65,16,0.723,0.857,7,-9.989,1,0.241,0.0523,2.66e-05,0.149,0.642,129.87,201893,4
1996-01-13,89,Automatic Lover (Call For Love),Real McCoy,,False,92,52,13,0.688,0.98,5,-4.862,0,0.034,0.0693,0.462,0.16,0.538,132.992,227933,4
1996-01-13,90,We've Got It Goin' On,Backstreet Boys,,False,91,69,12,0.758,0.875,3,-4.518,0,0.0363,0.0851,0,0.227,0.91,112.966,219467,4
1996-01-13,91,Sentimental,Deborah Cox,,False,90,27,19,0.773,0.79,5,-8.057,1,0.0782,0.193,0,0.0356,0.712,88.977,270333,4
1996-01-13,92,Solitude,Edwin McCain,,False,89,72,15,0.601,0.494,9,-10.304,1,0.0422,0.63,7.47e-06,0.132,0.308,79.976,270747,4
1996-01-13,93,"The Riddler (From ""Batman Forever"")",Method Man,,False,96,56,10,0.798,0.668,10,-4.824,1,0.091,0.0571,0.00987,0.204,0.438,168.039,213733,4
1996-01-13,94,A Mover La Colita,Artie The 1 Man Party,,False,88,65,16,0.846,0.73,11,-7.868,0,0.0521,0.0012,0.711,0.0592,0.733,130.05,184613,4
1996-01-13,95,Fast Life,Kool G Rap,,False,84,74,7,0.837,0.774,6,-8.707,1,0.266,0.0273,0,0.365,0.668,91.174,293627,4
1996-01-13,96,East Side Rendezvous,Frost,,False,99,73,11,0.798,0.561,4,-8.625,0,0.147,0.412,0,0.0446,0.785,83.971,273400,4
1996-01-13,97,Sometimes I Miss You So Much (Dedicated To The Christ Consciousness),P.M. Dawn,,False,95,95,4,0.711,0.6,1,-9.842,1,0.0334,0.101,7.68e-05,0.167,0.773,89.409,282533,4
1996-01-13,99,Celebration/Take Your Chance,Fun Factory,0GIRKdArNATu5WA0CnXLOH,True,0,99,1,0.61,0.957,11,-8.205,0,0.0402,0.228,0.002,0.248,0.873,140.257,240400,4
1996-01-13,100,Cold World,Genius/GZA Featuring Inspektah Deck,0GIRKdArNATu5WA0CnXLOH,False,100,97,3,0.773,0.794,2,-5.486,1,0.215,0.0976,2.89e-05,0.384,0.541,90.848,331000,4
