date,position,title,artist,spotify_id,is_new,last_pos,peak_pos,weeks,danceability,energy,key,loudness,mode,speechiness,acousticness,instrumentalness,liveness,valence,tempo,duration_ms,time_signature
2009-01-17,1,Just Dance,Lady Gaga Featuring Colby O'Donis,1UXBbmjIrxjckrbv5EfSVT,False,2,1,22,0.813,0.74,1,-4.668,0,0.0327,0.0318,1.43e-05,0.166,0.699,118.976,244055,4
2009-01-17,2,Single Ladies (Put A Ring On It),Beyonce,1UXBbmjIrxjckrbv5EfSVT,False,1,1,12,0.426,0.584,1,-5.293,1,0.296,0.0383,0,0.188,0.272,193.437,193213,4
2009-01-17,3,Live Your Life,T.I. Featuring Rihanna,1UXBbmjIrxjckrbv5EfSVT,False,3,1,15,0.375,0.862,11,-3.363,0,0.255,0.071,0,0.211,0.478,159.841,338853,4
2009-01-17,4,Love Story,Taylor Swift,1UXBbmjIrxjckrbv5EfSVT,False,5,4,17,0.626,0.79,2,-4.302,1,0.0311,0.135,3.97e-06,0.0989,0.416,119.082,235767,4
2009-01-17,5,Heartless,Kanye West,1UXBbmjIrxjckrbv5EfSVT,False,4,4,9,0.79,0.647,10,-5.983,0,0.136,0.0515,0,0.248,0.654,87.999,211000,4
2009-01-17,6,Hot N Cold,Katy Perry,1UXBbmjIrxjckrbv5EfSVT,False,6,3,23,0.706,0.841,7,-3.956,1,0.0418,7.95e-05,0,0.0688,0.861,132.032,220227,4
2009-01-17,7,I'm Yours,Jason Mraz,1UXBbmjIrxjckrbv5EfSVT,False,12,6,38,0.686,0.457,11,-8.322,1,0.0468,0.595,0,0.105,0.718,150.953,242187,4
2009-01-17,8,Womanizer,Britney Spears,1UXBbmjIrxjckrbv5EfSVT,False,7,1,14,0.724,0.695,11,-5.226,1,0.0622,0.073,0,0.0889,0.235,139.0,224400,4
2009-01-17,9,Let It Rock,Kevin Rudolf Featuring Lil Wayne,1UXBbmjIrxjckrbv5EfSVT,False,15,5,19,0.607,0.783,7,-4.41,1,0.0397,0.000683,0,0.0678,0.434,113.172,231173,4
2009-01-17,10,Love Lockdown,Kanye West,1UXBbmjIrxjckrbv5EfSVT,False,8,3,16,0.76,0.524,1,-7.67,0,0.0323,0.0542,0.5,0.112,0.112,119.603,270307,4
2009-01-17,11,Whatever You Like,T.I.,1UXBbmjIrxjckrbv5EfSVT,False,9,1,22,0.68,0.687,9,-6.162,0,0.0709,0.0161,0,0.261,0.467,150.053,249533,4
2009-01-17,12,Circus,Britney Spears,1UXBbmjIrxjckrbv5EfSVT,False,11,3,5,0.791,0.733,6,-5.215,0,0.052,0.147,0.000381,0.0713,0.761,114.98,192360,4
2009-01-17,13,If I Were A Boy,Beyonce,1UXBbmjIrxjckrbv5EfSVT,False,10,3,13,0.632,0.518,6,-6.126,1,0.0313,0.107,0,0.354,0.427,90.007,249147,4
2009-01-17,14,So What,P!nk,1UXBbmjIrxjckrbv5EfSVT,False,14,1,20,0.534,0.87,11,-3.078,0,0.0425,0.000329,0,0.241,0.462,126.019,215160,4
2009-01-17,15,Right Now (Na Na Na),Akon,1UXBbmjIrxjckrbv5EfSVT,False,13,8,15,0.826,0.853,8,-4.219,0,0.172,0.289,0,0.35,0.567,137.996,244680,4
2009-01-17,16,Miss Independent,Ne-Yo,1UXBbmjIrxjckrbv5EfSVT,False,17,7,20,0.673,0.683,1,-5.693,1,0.115,0.522,0,0.235,0.713,171.86,232000,4
2009-01-17,17,Gotta Be Somebody,Nickelback,1UXBbmjIrxjckrbv5EfSVT,False,16,10,14,0.536,0.89,0,-5.222,1,0.0601,0.000354,0.00165,0.133,0.205,115.998,252653,4
2009-01-17,18,Gives You Hell,The All-American Rejects,1UXBbmjIrxjckrbv5EfSVT,False,18,18,8,0.718,0.691,4,-6.44,1,0.0387,0.0159,0,0.0627,0.552,100.008,213107,4
2009-01-17,19,I Hate This Part,The Pussycat Dolls,1UXBbmjIrxjckrbv5EfSVT,False,21,19,6,0.757,0.607,5,-4.335,1,0.0309,0.0723,0,0.305,0.454,111.579,218960,4
2009-01-17,20,Disturbia,Rihanna,1UXBbmjIrxjckrbv5EfSVT,False,19,1,29,0.707,0.813,11,-4.515,0,0.0571,0.0863,0,0.168,0.722,124.921,238627,4
2009-01-17,21,Viva La Vida,Coldplay,1UXBbmjIrxjckrbv5EfSVT,False,28,1,35,0.486,0.617,5,-7.115,0,0.0287,0.0954,3.23e-06,0.109,0.417,138.015,242373,4
2009-01-17,22,Chicken Fried,Zac Brown Band,1UXBbmjIrxjckrbv5EfSVT,False,22,20,16,0.566,0.713,6,-4.25,1,0.0417,0.645,0,0.114,0.807,169.864,238147,4
2009-01-17,23,Rehab,Rihanna,1UXBbmjIrxjckrbv5EfSVT,False,20,18,9,0.583,0.792,1,-5.894,1,0.0533,0.00321,4.92e-05,0.315,0.397,80.055,294720,4
2009-01-17,24,You Found Me,The Fray,1UXBbmjIrxjckrbv5EfSVT,False,26,15,7,0.338,0.803,8,-5.412,0,0.0413,0.0187,0,0.136,0.4,151.994,241853,4
2009-01-17,25,Addicted,Saving Abel,1UXBbmjIrxjckrbv5EfSVT,False,24,20,30,0.512,0.864,7,-4.146,1,0.0338,0.000821,0,0.0982,0.527,138.018,222827,4
2009-01-17,26,Untouched,The Veronicas,1UXBbmjIrxjckrbv5EfSVT,False,29,26,6,0.557,0.783,6,-4.893,0,0.234,0.0171,0.0172,0.151,0.442,177.008,255360,4
2009-01-17,27,Pop Champagne,Jim Jones & Ron Browz Featuring Juelz Santana,1UXBbmjIrxjckrbv5EfSVT,False,31,22,12,0.61,0.431,0,-6.73,1,0.294,0.03,0,0.099,0.463,136.878,215973,3
2009-01-17,28,Mrs. Officer,Lil Wayne Featuring Bobby Valentino & Kidd Kidd,1UXBbmjIrxjckrbv5EfSVT,False,23,16,20,0.92,0.553,6,-5.068,1,0.191,0.236,0,0.0767,0.947,112.022,286907,5
2009-01-17,29,Green Light,John Legend Featuring Andre 3000,1UXBbmjIrxjckrbv5EfSVT,False,38,24,18,0.622,0.882,9,-5.59,0,0.119,0.0912,0,0.216,0.762,77.506,284187,4
2009-01-17,31,Can't Believe It,T-Pain Featuring Lil Wayne,,False,25,7,23,0.648,0.516,10,-8.869,0,0.049,0.00179,0,0.0772,0.0756,89.828,273827,4
2009-01-17,32,Sober,P!nk,,False,35,32,6,0.612,0.797,6,-4.896,1,0.0315,0.0626,0,0.187,0.373,90.95,251533,4
2009-01-17,33,Chopped 'N' Skrewed,T-Pain Featuring Ludacris,,False,32,27,12,0.558,0.604,7,-7.892,0,0.0529,0.0181,0,0.503,0.323,120.159,261227,4
2009-01-17,34,Better In Time,Leona Lewis,,False,39,11,26,0.584,0.7,6,-4.251,1,0.0506,0.512,2.43e-05,0.13,0.549,163.953,234173,4
2009-01-17,35,Crush,David Archuleta,,False,27,2,21,0.57,0.664,0,-4.718,0,0.0322,0.00836,1.2e-05,0.0719,0.487,162.084,213520,4
2009-01-17,36,I'm So Paid,Akon Featuring Lil Wayne & Young Jeezy,,False,34,31,12,0.471,0.865,6,-4.179,1,0.325,0.118,0,0.0994,0.516,92.037,263640,4
2009-01-17,37,Light On,David Cook,,False,40,17,13,0.446,0.834,9,-4.014,0,0.0341,0.0794,0,0.114,0.363,132.034,228827,4
2009-01-17,38,White Horse,Taylor Swift,,False,41,13,8,0.578,0.34,0,-8.027,1,0.0264,0.305,0,0.104,0.223,92.702,234427,4
2009-01-17,39,I Don't Care,Fall Out Boy,,False,37,21,17,0.55,0.938,11,-3.556,0,0.0522,0.00171,2.18e-05,0.555,0.433,133.99,214493,4
2009-01-17,40,Shattered (Turn The Car Around),O.A.R.,,False,44,36,22,0.571,0.784,11,-6.396,1,0.0352,0.0175,0,0.19,0.462,105.973,255493,4
2009-01-17,41,Decode,Paramore,,False,33,33,9,0.277,0.949,10,-4.072,0,0.0919,0.00155,0.000112,0.765,0.232,164.102,264205,4
2009-01-17,42,Fall For You,Secondhand Serenade,,False,36,21,30,0.387,0.442,0,-7.086,1,0.0352,0.19,0,0.0788,0.382,169.481,185600,4
2009-01-17,43,Closer,Ne-Yo,,False,45,7,38,0.711,0.753,4,-6.461,0,0.0766,0.028,2.96e-05,0.152,0.588,126.051,234360,4
2009-01-17,44,Human,The Killers,,False,48,32,14,0.557,0.8,10,-8.477,1,0.0601,0.00132,0.0012,0.0906,0.582,135.47,245373,4
2009-01-17,45,Put It On Ya,Plies Featuring Chris J,,False,43,31,7,0.759,0.583,1,-8.503,1,0.0864,0.00286,0,0.0445,0.904,76.023,257413,4
2009-01-17,46,Love Remains The Same,Gavin Rossdale,,False,50,27,31,0.406,0.632,4,-5.115,1,0.0344,0.236,0,0.18,0.109,149.258,249440,4
2009-01-17,47,About You Now,Miranda Cosgrove,,False,51,47,2,0.489,0.868,6,-3.8,1,0.13,0.00558,0,0.602,0.658,164.98,190560,4
2009-01-17,48,Keeps Gettin' Better,Christina Aguilera,,False,46,7,14,0.645,0.697,5,-4.733,0,0.0285,0.0739,0.000842,0.575,0.25,130.001,181947,4
2009-01-17,49,Mad,Ne-Yo,,False,61,49,5,0.727,0.649,0,-5.356,1,0.0338,0.661,0,0.111,0.669,129.992,254533,4
2009-01-17,50,Swagga Like Us,Jay-Z & T.I. Featuring Kanye West & Lil Wayne,,False,47,5,17,0.579,0.809,4,-5.031,1,0.206,0.00154,0,0.564,0.258,88.99,329680,4
2009-01-17,51,Seventeen Forever,Metro Station,,False,42,42,4,0.569,0.793,0,-5.041,0,0.0329,0.00172,0.00054,0.136,0.687,139.979,174133,4
2009-01-17,52,Roll With Me,Montgomery Gentry,,False,58,33,17,0.552,0.648,2,-6.71,1,0.0273,0.0533,0.00015,0.144,0.407,142.159,233933,4
2009-01-17,53,Cowgirls Don't Cry,Brooks & Dunn Featuring Reba McEntire,,False,52,52,8,0.655,0.668,9,-5.251,1,0.0302,0.0626,2.78e-06,0.179,0.619,114.881,219813,4
2009-01-17,54,In Color,Jamey Johnson,,False,55,52,14,0.544,0.404,3,-8.751,1,0.0354,0.391,3.98e-06,0.157,0.251,129.518,290680,4
2009-01-17,55,Feel That Fire,Dierks Bentley,,False,75,54,13,0.412,0.833,1,-3.865,1,0.0352,0.371,1.28e-05,0.208,0.669,179.846,201507,4
2009-01-17,56,La La Land,Demi Lovato,,False,83,56,2,0.467,0.919,6,-2.255,0,0.069,0.0149,0,0.0193,0.706,169.987,196467,4
2009-01-17,57,Already Gone,Sugarland,,False,69,41,15,0.48,0.596,1,-5.844,1,0.03,0.214,1.06e-05,0.151,0.332,154.769,275867,3
2009-01-17,58,She Wouldn't Be Gone,Blake Shelton,,False,66,54,11,0.51,0.683,0,-4.338,1,0.0302,0.166,0,0.0795,0.211,159.918,215613,4
2009-01-17,59,Country Boy,Alan Jackson,,False,70,57,10,0.73,0.684,9,-10.803,1,0.0351,0.259,1.53e-06,0.111,0.564,139.037,246080,4
2009-01-17,60,Dead And Gone,T.I. Featuring Justin Timberlake,,False,67,60,5,0.713,0.746,0,-4.99,1,0.259,0.0402,0,0.601,0.47,135.021,299747,4
2009-01-17,61,Beautiful,Akon Featuring Colby O'Donis & Kardinal Offishall,,False,54,19,5,0.743,0.948,0,-4.445,0,0.0893,0.122,0,0.112,0.614,130.024,312987,4
2009-01-17,62,Start A Band,Brad Paisley Duet With Keith Urban,,False,76,55,12,0.719,0.629,5,-11.132,1,0.0297,0.00919,0,0.13,0.766,123.006,214709,4
2009-01-17,63,God Love Her,Toby Keith,,False,74,63,7,0.551,0.919,10,-3.895,1,0.0529,0.133,8.36e-05,0.0637,0.432,125.025,216627,4
2009-01-17,64,Trading Places,Usher,,False,68,45,10,0.696,0.643,0,-5.218,1,0.0447,0.000153,1.03e-05,0.156,0.332,146.005,268240,4
2009-01-17,65,"You're Gonna Go Far, Kid",The Offspring,,False,63,63,13,0.55,0.917,0,-3.159,1,0.0638,0.00428,0,0.197,0.601,126.115,177827,4
2009-01-17,66,Lovebug,Jonas Brothers,,False,49,49,14,0.597,0.499,4,-6.216,1,0.0581,0.126,0,0.214,0.521,79.071,220693,4
2009-01-17,67,Come On Get Higher,Matt Nathanson,,False,59,59,19,0.672,0.623,9,-5.699,1,0.0297,0.241,0,0.0848,0.617,92.018,215173,4
2009-01-17,68,Second Chance,Shinedown,,False,60,60,6,0.46,0.796,0,-4.501,0,0.0333,0.00107,0,0.106,0.182,100.011,222067,4
2009-01-17,69,Just Like Me,Jamie Foxx Featuring T.I.,,False,57,49,4,0.755,0.713,11,-4.753,0,0.15,0.151,0,0.269,0.741,151.047,206093,5
2009-01-17,70,Krazy,Pitbull Featuring Lil Jon,,False,64,30,15,0.871,0.883,11,-5.075,0,0.105,0.0155,0,0.14,0.581,125.037,231507,4
2009-01-17,71,Lookin' For A Good Time,Lady Antebellum,,False,80,67,13,0.665,0.936,7,-2.97,1,0.0544,0.0146,0,0.125,0.848,122.003,187320,4
2009-01-17,72,Don't,Billy Currington,,False,90,63,11,0.571,0.826,1,-4.475,1,0.0362,0.0446,0,0.343,0.713,90.966,189000,4
2009-01-17,73,Here,Rascal Flatts,,False,87,50,14,0.458,0.585,2,-5.574,1,0.0342,0.324,0,0.231,0.196,145.977,245373,4
2009-01-17,74,All Summer Long,The Rock Heroes,,False,53,29,13,0.606,0.885,7,-4.377,1,0.0336,0.00825,0,0.0634,0.855,102.992,296347,4
2009-01-17,75,Sex On Fire,Kings Of Leon,,False,73,56,11,0.542,0.905,9,-5.653,1,0.054,0.00172,0.0104,0.136,0.374,153.398,203347,4
2009-01-17,76,Bust Your Windows,Jazmine Sullivan,,False,77,31,13,0.683,0.664,5,-4.233,0,0.0332,0.538,0,0.0671,0.866,106.991,266307,4
2009-01-17,77,Don't Trust Me,3OH!3,,False,56,56,4,0.757,0.629,7,-5.582,0,0.125,0.018,0,0.339,0.711,129.942,194613,4
2009-01-17,78,Diva,Beyonce,,False,82,78,3,0.875,0.551,6,-6.744,0,0.317,0.0488,0.00728,0.0537,0.861,146.092,200613,4
2009-01-17,79,Kiss Me Thru The Phone,Soulja Boy Tell 'em Featuring Sammie,,False,71,71,2,0.758,0.712,7,-3.781,1,0.112,0.0185,0,0.0677,0.795,149.998,193387,4
2009-01-17,80,Sweet Thing,Keith Urban,,False,93,43,8,0.621,0.888,8,-6.199,1,0.0443,0.19,1.7e-05,0.151,0.651,102.986,228187,4
2009-01-17,81,Right Here (Departed),Brandy,,False,65,34,17,0.568,0.682,8,-5.781,1,0.0439,0.256,0,0.231,0.366,92.99,217947,4
2009-01-17,82,Down The Road,Kenny Chesney With Mac McAnally,,False,98,78,5,0.414,0.584,5,-9.245,1,0.0285,0.801,6.05e-06,0.617,0.579,162.887,189293,4
2009-01-17,83,Poker Face,Lady Gaga,,False,81,81,3,0.851,0.806,4,-4.62,1,0.0787,0.118,1.64e-06,0.121,0.787,118.999,237200,4
2009-01-17,84,Universal Mind Control,Common Featuring Pharrell,,False,62,62,5,0.868,0.92,4,-4.17,0,0.055,0.39,0.00682,0.155,0.694,119.994,213613,4
2009-01-17,85,Turnin Me On,Keri Hilson Featuring Lil Wayne,,False,100,85,3,0.675,0.602,1,-4.688,1,0.0596,0.0034,1.28e-05,0.199,0.092,159.994,247800,4
2009-01-17,86,Playa Cardz Right,Keyshia Cole Featuring 2Pac,,False,88,63,8,0.626,0.59,0,-5.547,0,0.0366,0.0392,0,0.254,0.192,86.078,291240,4
2009-01-17,87,I Don't Care,Apocalyptica Featuring Adam Gontier,,False,78,78,12,0.274,0.792,2,-4.388,0,0.0413,0.00833,0,0.131,0.092,179.067,237347,4
2009-01-17,88,Broken,Lifehouse,,False,95,87,11,0.534,0.708,11,-5.732,1,0.0402,0.089,0,0.192,0.488,130.639,286480,4
2009-01-17,89,Bad Girlfriend,Theory Of A Deadman,,False,89,75,14,0.504,0.957,0,-2.657,1,0.0529,0.00298,0,0.187,0.676,135.013,205627,4
2009-01-17,90,She Got Her Own,Ne-Yo Featuring Jamie Foxx & Fabolous,,False,97,73,4,0.65,0.659,11,-9.477,1,0.619,0.356,1.62e-06,0.229,0.352,80.618,202222,4
2009-01-17,91,Fly On The Wall,Miley Cyrus,,False,84,84,2,0.559,0.961,7,-4.162,0,0.0544,0.165,0,0.152,0.697,143.974,151800,4
2009-01-17,92,IfULeave,Musiq Soulchild Featuring Mary J. Blige,,False,0,71,6,0.467,0.752,11,-3.244,1,0.232,0.208,0,0.164,0.728,122.775,252440,4
2009-01-17,93,Without You,Hinder,,False,85,85,7,0.415,0.816,3,-3.831,1,0.0333,0.0299,2.09e-05,0.129,0.264,136.017,232267,4
2009-01-17,94,Everybody Wants To Go To Heaven,Kenny Chesney With The Wailers,,False,0,41,20,0.705,0.693,11,-7.153,1,0.155,0.374,1.21e-05,0.65,0.555,137.741,252987,4
2009-01-17,95,Rockin' That Thang,The-Dream,,False,0,95,2,0.674,0.616,8,-4.757,1,0.0432,0.118,0,0.289,0.63,77.968,221933,4
2009-01-17,96,That's Not My Name,The Ting Tings,,False,0,88,2,0.755,0.901,9,-3.152,1,0.0893,0.0451,0.0373,0.363,0.959,145.042,310573,4
2009-01-17,97,Arab Money,Busta Rhymes Featuring Ron Browz,,False,96,86,5,0.735,0.75,7,-5.056,1,0.34,0.241,0,0.151,0.583,93.225,165213,4
2009-01-17,98,T-Shirt,Shontelle,,False,79,36,17,0.679,0.657,6,-6.222,1,0.0423,0.0219,0,0.295,0.363,86.984,234760,4
2009-01-17,99,If Today Was Your Last Day,Nickelback,,False,91,35,4,0.485,0.911,3,-5.749,1,0.0355,8.67e-05,0,0.092,0.568,89.956,249067,4
2009-01-17,100,River Of Love,George Strait,,False,0,87,4,0.474,0.814,7,-6.875,1,0.0419,0.604,0.0145,0.15,0.91,79.216,195147,4
