date,position,title,artist,spotify_id,is_new,last_pos,peak_pos,weeks,danceability,energy,key,loudness,mode,speechiness,acousticness,instrumentalness,liveness,valence,tempo,duration_ms,time_signature
2002-03-09,1,Ain't It Funny,Jennifer Lopez Featuring Ja Rule,,False,3,1,11,0.781,0.746,8,-2.686,1,0.17,0.364,0,0.098,0.786,89.43,229800,4
2002-03-09,2,Always On Time,Ja Rule Featuring Ashanti,,False,1,1,17,0.839,0.706,5,-6.104,0,0.199,0.208,0,0.242,0.839,96.673,245133,4
2002-03-09,3,How You Remind Me,Nickelback,,False,2,1,27,0.446,0.764,10,-5.042,1,0.033,0.00135,0,0.099,0.543,172.094,223840,4
2002-03-09,4,In The End,Linkin Park,,False,4,4,19,0.556,0.864,3,-5.87,0,0.0584,0.00958,0,0.209,0.4,105.143,216880,4
2002-03-09,5,Hey Baby,No Doubt Featuring Bounty Killer,,False,5,5,14,0.705,0.872,11,-3.557,0,0.126,0.0618,0,0.227,0.75,93.628,207040,4
2002-03-09,6,Wherever You Will Go,The Calling,,False,7,6,18,0.558,0.719,2,-5.113,1,0.0267,0.0367,0,0.115,0.371,112.027,208600,4
2002-03-09,7,U Got It Bad,Usher,,False,6,1,25,0.816,0.5,1,-4.551,1,0.03,0.0227,1.53e-06,0.0733,0.649,124.037,247840,4
2002-03-09,8,What About Us?,Brandy,,False,9,8,7,0.524,0.732,10,-1.595,0,0.355,0.257,0,0.439,0.736,185.932,250067,4
2002-03-09,9,My Sacrifice,Creed,,False,8,4,20,0.32,0.88,2,-6.035,1,0.0504,0.000101,4.31e-06,0.076,0.257,146.349,294600,4
2002-03-09,10,Blurry,Puddle Of Mudd,,False,13,10,12,0.431,0.938,3,-4.507,0,0.0542,0.00805,0,0.138,0.523,157.462,304000,4
2002-03-09,11,Can't Fight The Moonlight,LeAnn Rimes,,False,11,11,34,0.628,0.834,6,-6.341,0,0.0497,0.403,0,0.051,0.626,97.865,215507,4
2002-03-09,12,Can't Get You Out Of My Head,Kylie Minogue,,False,12,12,7,0.766,0.563,9,-7.516,0,0.0339,0.0263,0.683,0.115,0.964,126.007,230640,4
2002-03-09,13,7 Days,Craig David,,False,10,10,14,0.659,0.812,4,-7.499,0,0.0487,0.23,0,0.0951,0.888,83.013,235133,4
2002-03-09,14,"Lights, Camera, Action!",Mr. Cheeks,,False,16,14,22,0.792,0.93,1,-6.32,1,0.0693,0.115,0,0.292,0.812,105.505,261027,4
2002-03-09,15,What's Luv?,Fat Joe Featuring Ashanti,,False,23,15,4,0.835,0.707,8,-5.074,1,0.0598,0.0219,2.19e-05,0.108,0.919,93.955,267093,4
2002-03-09,16,Oops (Oh My),Tweet,,False,18,16,5,0.66,0.536,10,-8.786,0,0.29,0.233,0.00669,0.111,0.775,159.963,237800,4
2002-03-09,17,"Whenever, Wherever",Shakira,,False,15,6,20,0.793,0.832,1,-4.862,0,0.0406,0.236,1.12e-05,0.202,0.872,107.661,196160,4
2002-03-09,18,Girlfriend,'N Sync Featuring Nelly,,False,22,18,5,0.748,0.811,0,-5.213,0,0.0907,0.0866,1.45e-05,0.0282,0.862,93.963,253600,4
2002-03-09,19,The Whole World,OutKast Featuring Killer Mike,,False,19,19,12,0.814,0.852,2,-6.176,1,0.401,0.0958,1.32e-06,0.0288,0.717,184.682,295347,3
2002-03-09,20,Get The Party Started,P!nk,,False,14,4,20,0.802,0.904,11,-3.267,0,0.0459,0.00108,0,0.173,0.961,128.931,192533,4
2002-03-09,21,No More Drama,Mary J. Blige,,False,17,15,13,0.653,0.837,6,-6.818,0,0.124,0.534,7.12e-05,0.0784,0.64,97.914,326240,4
2002-03-09,22,I Love You,Faith Evans,,False,30,22,7,0.489,0.757,11,-4.062,0,0.0926,0.00981,0,0.234,0.567,168.004,267160,4
2002-03-09,23,Family Affair,Mary J. Blige,,False,21,1,33,0.911,0.551,8,-3.75,0,0.0449,0.132,4.12e-05,0.0863,0.969,92.887,265867,4
2002-03-09,24,Roll Out (My Business),Ludacris,,False,24,17,18,0.921,0.668,7,-8.73,1,0.235,0.0949,0,0.592,0.892,131.059,296587,4
2002-03-09,25,U Don't Have To Call,Usher,,False,31,25,5,0.793,0.568,1,-4.958,1,0.0459,0.0478,3.57e-05,0.0304,0.806,100.005,269400,4
2002-03-09,26,Hands Clean,Alanis Morissette,,False,27,26,6,0.513,0.82,7,-5.428,1,0.0299,0.00192,2.83e-06,0.504,0.52,99.952,269400,4
2002-03-09,27,Nothing In This World,KeKe Wyatt Featuring Avant,,False,28,27,10,0.7,0.63,6,-3.344,1,0.0444,0.195,0,0.034,0.399,131.95,251067,4
2002-03-09,28,Escape,Enrique Iglesias,,False,47,28,3,0.777,0.852,11,-5.329,1,0.0295,0.0299,0.000498,0.145,0.877,125.994,208040,4
2002-03-09,29,Foolish,Ashanti,,False,51,29,4,0.665,0.695,0,-5.763,1,0.0532,0.347,0,0.106,0.707,90.119,227387,4
2002-03-09,30,A Woman's Worth,Alicia Keys,,False,20,7,20,0.667,0.41,4,-8.323,0,0.138,0.331,0,0.064,0.493,75.069,303333,4
2002-03-09,31,Don't You Forget It,Glenn Lewis,,False,35,31,15,0.708,0.513,6,-7.748,0,0.0888,0.118,0,0.114,0.31,89.0,248773,4
2002-03-09,32,Hero,Enrique Iglesias,,False,25,3,24,0.581,0.651,7,-5.617,1,0.0392,0.143,1.05e-05,0.107,0.146,151.959,264600,4
2002-03-09,33,The Cowboy In Me,Tim McGraw,,False,36,33,9,0.488,0.569,2,-7.323,1,0.0294,0.076,1.06e-06,0.0796,0.153,71.92,244507,4
2002-03-09,34,Superman (It's Not Easy),Five For Fighting,,False,33,14,28,0.382,0.416,0,-9.303,1,0.0302,0.0733,0,0.0719,0.125,102.089,221693,4
2002-03-09,35,Butterflies,Michael Jackson,,False,29,14,17,0.708,0.655,8,-2.69,1,0.0883,0.0583,2.1e-06,0.11,0.545,89.99,279160,4
2002-03-09,36,Bring On The Rain,Jo Dee Messina With Tim McGraw,,False,37,36,14,0.555,0.372,5,-9.437,1,0.0274,0.31,5.07e-06,0.115,0.0891,136.885,236994,4
2002-03-09,37,More Than A Woman,Aaliyah,,False,41,37,6,0.482,0.872,4,-5.259,1,0.231,0.00515,1.83e-05,0.409,0.665,173.994,225270,4
2002-03-09,38,Caramel,City High Featuring Eve,,False,26,18,22,0.801,0.66,5,-8.267,0,0.286,0.175,9.5e-06,0.0748,0.295,93.036,212293,4
2002-03-09,39,Welcome To Atlanta,Jermaine Dupri & Ludacris,,False,39,39,11,0.751,0.786,3,-7.441,0,0.383,0.0126,0,0.107,0.679,95.989,200840,4
2002-03-09,40,Standing Still,Jewel,,False,32,25,17,0.615,0.68,2,-6.616,1,0.0338,0.152,7.18e-06,0.0797,0.34,123.9,270333,4
2002-03-09,41,The Long Goodbye,Brooks & Dunn,,False,42,40,12,0.5,0.619,8,-5.939,1,0.0297,0.263,1.42e-05,0.107,0.569,145.367,229987,4
2002-03-09,42,Blessed,Martina McBride,,False,50,42,9,0.587,0.629,7,-7.439,1,0.0424,0.183,0,0.0686,0.425,114.993,276600,4
2002-03-09,43,Young'n (Holla Back),Fabolous,,False,48,33,15,0.933,0.728,7,-5.902,1,0.148,0.326,8.55e-06,0.0717,0.898,108.994,206400,4
2002-03-09,44,Good Morning Beautiful,Steve Holy,,False,34,29,15,0.565,0.5,7,-8.822,1,0.031,0.452,0,0.137,0.242,70.984,210933,4
2002-03-09,45,Drops Of Jupiter (Tell Me),Train,,False,46,5,52,0.468,0.64,0,-5.862,1,0.0275,0.154,0,0.154,0.499,79.297,259933,4
2002-03-09,46,Wrapped Around,Brad Paisley,,False,38,35,17,0.616,0.758,9,-8.43,1,0.0434,0.093,0,0.132,0.447,141.495,202933,3
2002-03-09,47,Youth Of The Nation,P.O.D.,,False,53,47,5,0.563,0.86,8,-7.533,1,0.0621,0.00834,0.0106,0.39,0.517,97.867,256240,4
2002-03-09,48,Break Ya Neck,Busta Rhymes,,False,49,26,18,0.82,0.809,4,-6.759,0,0.251,0.443,0.00175,0.0613,0.737,83.011,231240,4
2002-03-09,49,Wasting My Time,Default,,False,52,49,10,0.449,0.776,2,-5.594,1,0.0322,0.00171,0,0.0698,0.198,148.11,269307,4
2002-03-09,50,Uh Huh,B2K,,False,45,38,10,0.855,0.681,2,-4.955,1,0.0688,0.0881,3.7e-06,0.0592,0.908,99.699,223293,4
2002-03-09,51,All You Wanted,Michelle Branch,,False,56,51,3,0.499,0.72,8,-9.101,1,0.0286,0.00466,0.00303,0.122,0.652,96.103,217680,4
2002-03-09,52,Young,Kenny Chesney,,False,55,52,5,0.684,0.84,9,-5.753,1,0.0433,0.0278,0,0.329,0.682,125.801,235733,4
2002-03-09,53,We Thuggin',Fat Joe Featuring R. Kelly,,False,44,15,20,0.896,0.649,8,-3.792,1,0.208,0.177,0,0.0759,0.822,99.107,213533,4
2002-03-09,54,"I Breathe In, I Breathe Out",Chris Cagle,,False,59,54,5,0.316,0.514,7,-7.048,1,0.0271,0.178,0,0.194,0.242,185.882,243947,4
2002-03-09,55,Some Days You Gotta Dance,Dixie Chicks,,False,57,55,8,0.626,0.903,4,-8.072,1,0.0694,0.307,0.0007,0.0383,0.909,170.229,147933,4
2002-03-09,56,My List,Toby Keith,,False,65,56,4,0.629,0.737,1,-4.309,0,0.0323,0.332,0,0.147,0.341,87.068,199813,4
2002-03-09,57,I'm Movin' On,Rascal Flatts,,False,61,57,6,0.489,0.308,0,-5.488,1,0.0297,0.879,0,0.0959,0.29,128.855,242867,3
2002-03-09,58,Rapture (Tastes So Sweet),iio,,False,79,58,4,0.541,0.931,10,-9.687,0,0.0552,0.326,0.129,0.325,0.148,128.584,189701,4
2002-03-09,59,Anything,Jaheim Featuring Next,,False,67,59,3,0.731,0.377,5,-7.907,1,0.0425,0.0516,0,0.137,0.452,105.743,287027,4
2002-03-09,60,Don't Let Me Get Me,P!nk,1BfRdnfPYrni7zj4ANodBX,True,0,60,1,0.621,0.849,3,-4.754,1,0.0771,0.00234,0,0.0621,0.62,98.523,210693,4
2002-03-09,61,A New Day Has Come,Celine Dion,1BfRdnfPYrni7zj4ANodBX,False,73,61,2,0.691,0.64,8,-5.087,1,0.0384,0.0247,5.24e-06,0.2,0.452,101.991,210227,4
2002-03-09,62,Hey Luv (Anything),Mobb Deep Featuring 112,1BfRdnfPYrni7zj4ANodBX,False,62,58,7,0.833,0.68,7,-5.408,1,0.227,0.157,0,0.189,0.641,98.996,242093,4
2002-03-09,63,A Thousand Miles,Vanessa Carlton,1BfRdnfPYrni7zj4ANodBX,False,80,63,2,0.56,0.825,11,-3.862,1,0.0379,0.323,0,0.161,0.268,94.931,237493,4
2002-03-09,64,Wrong Impression,Natalie Imbruglia,1BfRdnfPYrni7zj4ANodBX,False,64,64,2,0.48,0.753,6,-5.632,1,0.027,0.0102,0,0.18,0.263,100.181,256000,4
2002-03-09,65,Take Away,"Missy ""Misdemeanor"" Elliott Featuring Ginuwine & Tweet",1BfRdnfPYrni7zj4ANodBX,False,54,45,13,0.824,0.318,9,-10.7,1,0.0637,0.133,0.0625,0.0517,0.523,125.79,276221,4
2002-03-09,66,Bouncin' Back (Bumpin' Me Against The Wall),Mystikal,1BfRdnfPYrni7zj4ANodBX,False,58,37,13,0.883,0.896,0,-3.695,1,0.208,0.268,1.04e-06,0.0564,0.748,93.928,259547,4
2002-03-09,67,Roc The Mic,Beanie Sigel & Freeway,1BfRdnfPYrni7zj4ANodBX,False,71,67,3,0.869,0.555,11,-8.626,0,0.393,0.0883,0,0.0492,0.922,95.177,263187,4
2002-03-09,68,The World's Greatest,R. Kelly,1BfRdnfPYrni7zj4ANodBX,False,43,34,11,0.661,0.604,11,-6.436,0,0.0358,0.248,0,0.0469,0.721,95.971,277600,4
2002-03-09,69,Where Were You (When The World Stopped Turning),Alan Jackson,1BfRdnfPYrni7zj4ANodBX,False,60,28,16,0.623,0.387,0,-9.537,1,0.0316,0.549,0,0.0764,0.189,115.362,305093,4
2002-03-09,70,What If She's An Angel,Tommy Shane Steiner,1BfRdnfPYrni7zj4ANodBX,False,70,70,3,0.535,0.528,8,-7.453,1,0.0258,0.308,1.11e-06,0.0912,0.41,146.169,215533,4
2002-03-09,71,Pass The Courvoisier Part II,Busta Rhymes Featuring P. Diddy & Pharrell,1BfRdnfPYrni7zj4ANodBX,False,85,71,2,0.697,0.793,6,-4.699,0,0.323,0.0844,0,0.0619,0.56,89.767,238600,4
2002-03-09,72,That's When I Love You,Phil Vassar,1BfRdnfPYrni7zj4ANodBX,False,74,72,3,0.552,0.831,10,-4.819,1,0.0402,0.236,0,0.0907,0.604,111.061,208880,4
2002-03-09,73,Saturday (Oooh! Ooooh!),Ludacris Featuring Sleepy Brown,1BfRdnfPYrni7zj4ANodBX,False,78,73,4,0.588,0.809,11,-6.327,0,0.412,0.0235,0,0.324,0.696,103.0,230533,4
2002-03-09,74,For You,Staind,1BfRdnfPYrni7zj4ANodBX,False,75,74,2,0.318,0.958,10,-2.683,1,0.442,0.0603,4.68e-06,0.0981,0.3,163.089,206200,4
2002-03-09,75,Run,George Strait,1BfRdnfPYrni7zj4ANodBX,False,69,34,20,0.544,0.57,2,-10.192,1,0.0326,0.462,0.00183,0.213,0.295,75.59,245427,4
2002-03-09,76,Hush Lil' Lady,Corey Featuring Lil' Romeo,1BfRdnfPYrni7zj4ANodBX,False,63,63,7,0.79,0.672,0,-6.887,1,0.0482,0.0356,1.42e-05,0.148,0.619,137.48,224600,4
2002-03-09,77,Crawling In The Dark,Hoobastank,1BfRdnfPYrni7zj4ANodBX,False,77,77,2,0.57,0.915,6,-4.802,0,0.105,0.000273,8.48e-05,0.178,0.676,93.54,175227,4
2002-03-09,78,In Another World,Joe Diffie,1BfRdnfPYrni7zj4ANodBX,False,66,66,8,0.47,0.63,7,-7.194,0,0.0266,0.057,0,0.257,0.357,78.0,226533,4
2002-03-09,79,Insatiable,Darren Hayes,1BfRdnfPYrni7zj4ANodBX,False,81,79,2,0.67,0.847,0,-5.449,0,0.0545,0.0974,0,0.0842,0.852,143.872,310227,4
2002-03-09,80,Any Other Night,Sharissa,1BfRdnfPYrni7zj4ANodBX,False,91,80,5,0.732,0.517,4,-7.901,0,0.0846,0.134,1.47e-06,0.104,0.595,76.991,227416,4
2002-03-09,81,Just Let Me Be In Love,Tracy Byrd,1BfRdnfPYrni7zj4ANodBX,False,76,64,9,0.581,0.8,0,-7.397,0,0.0344,0.117,3.32e-05,0.045,0.415,96.1,226213,4
2002-03-09,82,Alive,P.O.D.,1BfRdnfPYrni7zj4ANodBX,False,83,41,19,0.421,0.95,10,-3.985,1,0.0768,1.21e-05,0.000214,0.314,0.553,80.912,205027,4
2002-03-09,83,Never,Amanda Perez,1BfRdnfPYrni7zj4ANodBX,False,89,83,4,0.561,0.524,5,-5.459,0,0.0301,0.112,0,0.296,0.265,96.01,253507,4
2002-03-09,84,Brotha,Angie Stone,1BfRdnfPYrni7zj4ANodBX,False,87,52,18,0.801,0.434,7,-9.174,0,0.376,0.538,0,0.0729,0.661,132.254,268133,4
2002-03-09,85,Round And Round,Jonell & Method Man,1BfRdnfPYrni7zj4ANodBX,False,82,62,13,0.679,0.732,5,-4.393,0,0.238,0.306,0,0.0946,0.904,90.634,230640,4
2002-03-09,86,Jigga,JAY-Z,1BfRdnfPYrni7zj4ANodBX,False,84,66,7,0.579,0.96,1,-3.152,0,0.245,0.102,0,0.0674,0.566,133.63,211173,4
2002-03-09,87,Got Ur Self A...,Nas,1BfRdnfPYrni7zj4ANodBX,False,93,87,13,0.699,0.869,11,-4.263,0,0.238,0.0118,0,0.0982,0.616,93.612,228627,4
2002-03-09,88,That's Just Jessie,Kevin Denney,1BfRdnfPYrni7zj4ANodBX,False,92,88,6,0.492,0.685,5,-6.046,1,0.035,0.141,0,0.389,0.376,172.115,232267,4
2002-03-09,89,I Miss You,DMX Featuring Faith Evans,1BfRdnfPYrni7zj4ANodBX,False,86,86,6,0.725,0.708,6,-5.21,1,0.219,0.152,0,0.0887,0.585,90.596,280867,4
2002-03-09,90,Chop Suey,System Of A Down,1BfRdnfPYrni7zj4ANodBX,False,90,76,10,0.419,0.934,7,-3.908,0,0.12,0.000278,0.0015,0.132,0.286,127.288,210240,4
2002-03-09,91,Wrapped Up In You,Garth Brooks,1BfRdnfPYrni7zj4ANodBX,False,95,46,20,0.673,0.575,0,-8.171,1,0.0375,0.384,0.000141,0.0762,0.532,105.293,267297,4
2002-03-09,92,Defy You,The Offspring,1BfRdnfPYrni7zj4ANodBX,False,94,77,10,0.491,0.841,11,-3.651,0,0.0387,0.000609,2.4e-06,0.131,0.669,92.296,228240,4
2002-03-09,93,It's Goin' Down,X-Ecutioners,7qFEFcjmSAtODGtLYqraCq,True,0,93,1,0.685,0.89,8,-3.943,0,0.253,0.00183,0.0107,0.0473,0.878,104.919,248267,4
2002-03-09,94,Riding With Private Malone,David Ball,7qFEFcjmSAtODGtLYqraCq,False,98,36,20,0.648,0.527,4,-8.862,1,0.0515,0.405,0,0.0978,0.515,93.93,275053,4
2002-03-09,95,Video,India.Arie,7qFEFcjmSAtODGtLYqraCq,False,0,47,18,0.652,0.604,9,-8.766,0,0.227,0.111,1.01e-05,0.0409,0.675,170.003,249960,4
2002-03-09,96,Part II,Method Man & Redman,7qFEFcjmSAtODGtLYqraCq,False,97,72,12,0.775,0.837,10,-4.965,0,0.39,0.0383,0,0.315,0.807,95.86,244600,4
2002-03-09,97,Awnaw,Nappy Roots,37RC87Ce8jeeKmnpYNExhP,True,0,97,1,0.721,0.678,7,-3.703,1,0.258,0.00521,0,0.153,0.712,160.023,241373,4
2002-03-09,100,Let's Stay Home Tonight,Joe,,False,100,68,12,0.691,0.742,0,-4.49,0,0.0602,0.145,3.14e-05,0.0944,0.722,90.102,206667,4
