date,position,title,artist,spotify_id,is_new,last_pos,peak_pos,weeks,danceability,energy,key,loudness,mode,speechiness,acousticness,instrumentalness,liveness,valence,tempo,duration_ms,time_signature
1991-02-23,1,All The Man That I Need,Whitney Houston,0rgdUmMZzwmZyZI2fCEhsv,False,2,1,10,0.496,0.571,5,-9.958,0,0.0335,0.43,0,0.0332,0.25,150.944,251427,4
1991-02-23,2,Gonna Make You Sweat (Everybody Dance Now),C+C Music Factory,0rgdUmMZzwmZyZI2fCEhsv,False,1,1,15,0.557,0.798,6,-7.405,1,0.0935,0.000851,0.675,0.183,0.794,112.187,244093,4
1991-02-23,3,One More Try,Timmy T.,0rgdUmMZzwmZyZI2fCEhsv,False,3,3,10,0.641,0.573,9,-9.198,1,0.0485,0.191,0,0.317,0.5,149.826,209427,5
1991-02-23,4,Someday,Mariah Carey,0rgdUmMZzwmZyZI2fCEhsv,False,5,4,6,0.684,0.818,1,-8.686,0,0.0405,0.207,2.19e-06,0.0251,0.937,109.864,246107,4
1991-02-23,5,Where Does My Heart Beat Now,Celine Dion,0rgdUmMZzwmZyZI2fCEhsv,False,6,5,12,0.528,0.62,10,-10.419,1,0.0285,0.648,1.63e-06,0.0801,0.595,74.051,272867,4
1991-02-23,6,The First Time,Surface,0rgdUmMZzwmZyZI2fCEhsv,False,4,1,17,0.639,0.375,10,-11.148,1,0.0277,0.264,0.000546,0.0872,0.116,126.421,255427,4
1991-02-23,7,Wicked Game,Chris Isaak,0rgdUmMZzwmZyZI2fCEhsv,False,11,7,13,0.667,0.548,9,-7.802,1,0.0262,0.744,0.0122,0.0946,0.29,112.549,286880,4
1991-02-23,8,I'll Give All My Love To You,Keith Sweat,0rgdUmMZzwmZyZI2fCEhsv,False,7,7,13,0.62,0.514,8,-7.948,1,0.0417,0.431,0,0.148,0.453,140.062,269027,4
1991-02-23,9,Disappear,INXS,0rgdUmMZzwmZyZI2fCEhsv,False,8,8,14,0.645,0.88,9,-3.403,1,0.0329,0.0242,2.04e-06,0.0978,0.834,125.418,250076,4
1991-02-23,10,I Saw Red,Warrant,0rgdUmMZzwmZyZI2fCEhsv,False,12,10,13,0.495,0.677,4,-6.139,0,0.0271,0.269,0,0.381,0.437,84.879,226920,4
1991-02-23,11,Show Me The Way,Styx,0rgdUmMZzwmZyZI2fCEhsv,False,17,11,12,0.245,0.433,6,-9.537,1,0.0365,0.215,7.76e-06,0.092,0.165,157.416,277173,3
1991-02-23,12,Around The Way Girl,LL Cool J,0rgdUmMZzwmZyZI2fCEhsv,False,15,12,13,0.62,0.445,1,-17.154,0,0.382,0.00273,0.0145,0.333,0.587,202.134,248493,4
1991-02-23,13,All This Time,Sting,0rgdUmMZzwmZyZI2fCEhsv,False,18,13,6,0.637,0.463,2,-13.122,1,0.0337,0.0852,0.000132,0.0483,0.451,127.084,294333,4
1991-02-23,14,Love Makes Things Happen,Pebbles,0rgdUmMZzwmZyZI2fCEhsv,False,13,13,13,0.664,0.497,8,-11.975,0,0.0344,0.302,0,0.0631,0.645,149.996,311133,4
1991-02-23,15,This House,Tracie Spencer,0rgdUmMZzwmZyZI2fCEhsv,False,22,15,10,0.74,0.738,6,-9.849,0,0.0399,0.0303,0.00406,0.0324,0.971,112.589,306533,4
1991-02-23,16,Get Here,Oleta Adams,0rgdUmMZzwmZyZI2fCEhsv,False,25,16,11,0.28,0.211,10,-16.333,1,0.0357,0.771,0,0.125,0.223,74.106,276733,3
1991-02-23,17,Coming Out Of The Dark,Gloria Estefan,0rgdUmMZzwmZyZI2fCEhsv,False,26,17,5,0.643,0.43,4,-11.694,1,0.0447,0.65,0,0.417,0.475,131.846,242627,4
1991-02-23,18,Play That Funky Music,Vanilla Ice,0rgdUmMZzwmZyZI2fCEhsv,False,9,4,12,0.851,0.514,4,-15.279,0,0.165,0.000928,3.58e-06,0.381,0.573,100.425,285800,4
1991-02-23,19,If You Needed Somebody,Bad Company,0rgdUmMZzwmZyZI2fCEhsv,False,21,19,16,0.496,0.514,7,-13.394,1,0.0274,0.0044,0.000106,0.0429,0.388,168.324,261000,4
1991-02-23,20,Love Will Never Do (Without You),Janet Jackson,0rgdUmMZzwmZyZI2fCEhsv,False,10,1,15,0.739,0.951,1,-8.863,1,0.0496,0.139,0.0062,0.462,0.551,103.17,350000,4
1991-02-23,21,Iesha,Another Bad Creation,0rgdUmMZzwmZyZI2fCEhsv,False,27,21,7,0.751,0.761,8,-8.151,1,0.147,0.0145,2.96e-06,0.0305,0.661,111.819,260400,4
1991-02-23,22,Waiting For Love,Alias,0rgdUmMZzwmZyZI2fCEhsv,False,30,22,6,0.615,0.537,7,-10.728,1,0.0282,0.278,0,0.164,0.494,111.581,278173,4
1991-02-23,23,Deeper Shade Of Soul,Urban Dance Squad,0rgdUmMZzwmZyZI2fCEhsv,False,28,23,11,0.76,0.767,7,-6.155,1,0.0313,0.11,0.000718,0.0314,0.821,113.425,272907,4
1991-02-23,24,Signs,Tesla,0rgdUmMZzwmZyZI2fCEhsv,False,31,24,8,0.333,0.74,7,-10.479,1,0.0459,0.161,0,0.982,0.481,162.042,194933,4
1991-02-23,25,Hold You Tight,Tara Kemp,0rgdUmMZzwmZyZI2fCEhsv,False,32,25,6,0.739,0.675,1,-9.194,1,0.0444,0.0545,0.0112,0.0632,0.643,100.054,284345,4
1991-02-23,26,Sensitivity,Ralph Tresvant,0rgdUmMZzwmZyZI2fCEhsv,False,14,4,17,0.683,0.661,1,-12.823,1,0.0459,0.137,0.557,0.0772,0.707,96.956,281333,4
1991-02-23,27,Round And Round,Tevin Campbell,0rgdUmMZzwmZyZI2fCEhsv,False,33,27,12,0.79,0.591,7,-8.805,1,0.0935,0.00335,0.00733,0.0338,0.725,107.197,293053,4
1991-02-23,28,After The Rain,Nelson,0rgdUmMZzwmZyZI2fCEhsv,False,16,6,17,0.461,0.867,3,-5.879,1,0.0684,0.0109,0.000164,0.33,0.611,125.441,245862,4
1991-02-23,29,High Enough,Damn Yankees,0rgdUmMZzwmZyZI2fCEhsv,False,20,3,23,0.273,0.537,2,-9.612,1,0.0306,0.0241,0,0.0922,0.232,81.814,287320,4
1991-02-23,30,Moneytalks,AC/DC,0rgdUmMZzwmZyZI2fCEhsv,False,23,23,12,0.649,0.903,7,-3.677,1,0.0318,0.000841,0.000351,0.122,0.412,121.841,225947,4
1991-02-23,31,Waiting For That Day,George Michael,0rgdUmMZzwmZyZI2fCEhsv,False,35,31,6,0.612,0.777,0,-10.903,1,0.0403,0.217,0.000454,0.104,0.557,172.412,289997,4
1991-02-23,32,I've Been Thinking About You,Londonbeat,0rgdUmMZzwmZyZI2fCEhsv,False,38,32,3,0.63,0.595,11,-14.986,0,0.038,0.0434,0.0363,0.0902,0.878,113.561,317933,4
1991-02-23,33,Heat Of The Moment,After 7,0rgdUmMZzwmZyZI2fCEhsv,False,19,19,26,0.693,0.733,9,-11.365,0,0.0467,0.0571,1.05e-06,0.205,0.899,100.191,267067,4
1991-02-23,34,I'll Do 4 U,Father M.C.,0rgdUmMZzwmZyZI2fCEhsv,False,36,34,7,0.832,0.666,1,-4.92,0,0.0633,0.143,0,0.072,0.81,109.536,223890,4
1991-02-23,35,It Never Rains (In Southern California),Tony Toni Tone,0rgdUmMZzwmZyZI2fCEhsv,False,34,34,10,0.742,0.359,10,-14.098,1,0.0423,0.245,1.25e-06,0.0797,0.85,79.862,304240,4
1991-02-23,36,You're In Love,Wilson Phillips,0rgdUmMZzwmZyZI2fCEhsv,False,44,36,3,0.688,0.679,1,-11.05,0,0.0259,0.319,0.000301,0.29,0.536,101.872,291867,4
1991-02-23,37,I'll Be By Your Side,Stevie B,0rgdUmMZzwmZyZI2fCEhsv,False,45,37,4,0.628,0.42,5,-12.032,0,0.0376,0.427,0,0.158,0.277,122.282,300307,4
1991-02-23,38,Just Another Dream,Cathy Dennis,0rgdUmMZzwmZyZI2fCEhsv,False,24,9,18,0.666,0.696,0,-13.459,0,0.0367,0.03,0.114,0.0659,0.844,118.791,235613,4
1991-02-23,39,I'm Not In Love,Will To Power,0rgdUmMZzwmZyZI2fCEhsv,False,29,7,15,0.553,0.611,4,-8.199,1,0.0279,0.00462,0.0567,0.104,0.335,75.02,223840,4
1991-02-23,40,From A Distance,Bette Midler,0rgdUmMZzwmZyZI2fCEhsv,False,37,2,21,0.536,0.242,7,-11.716,1,0.0277,0.674,0,0.331,0.331,137.989,276346,4
1991-02-23,41,Rico Suave,Gerardo,0rgdUmMZzwmZyZI2fCEhsv,False,59,41,4,0.798,0.817,11,-11.337,0,0.121,0.00596,6.29e-05,0.0548,0.446,105.931,291667,4
1991-02-23,43,Sadeness Part 1,Enigma,,False,65,43,3,0.607,0.478,7,-13.677,1,0.0354,0.0866,0.106,0.0983,0.51,95.721,260400,4
1991-02-23,44,Don't Hold Back Your Love,Daryl Hall John Oates,,False,41,41,8,0.639,0.484,7,-10.992,1,0.0274,0.36,2.14e-06,0.166,0.248,113.1,313893,4
1991-02-23,45,My Side Of The Bed,Susanna Hoffs,,False,52,45,4,0.585,0.667,2,-7.23,1,0.0317,0.301,1.02e-05,0.0486,0.574,113.096,208360,4
1991-02-23,46,Something In My Heart,Michel'le,,False,50,46,7,0.698,0.434,8,-12.892,0,0.0272,0.166,0.000566,0.0658,0.386,130.295,353000,4
1991-02-23,47,Chasin' The Wind,Chicago,,False,51,47,5,0.423,0.641,7,-5.831,1,0.0301,0.105,0.0111,0.372,0.385,80.318,259040,4
1991-02-23,48,Mother's Pride,George Michael,,False,53,48,4,0.362,0.159,11,-17.144,1,0.0292,0.97,4e-05,0.119,0.115,158.536,239174,4
1991-02-23,49,Mercy Mercy Me (The Ecology)/I Want You,Robert Palmer,,False,77,49,2,0.584,0.949,1,-7.673,0,0.0465,0.197,0.00163,0.0738,0.854,99.061,357347,4
1991-02-23,50,Spend My Life,Slaughter,,False,39,39,10,0.504,0.983,0,-3.071,1,0.0793,0.019,0,0.339,0.534,115.178,200640,4
1991-02-23,51,Power Of Love,Deee-Lite,,False,47,47,8,0.66,0.669,9,-14.895,0,0.0418,0.0214,0.0117,0.27,0.798,120.989,281760,4
1991-02-23,52,Ride The Wind,Poison,,False,61,52,4,0.551,0.969,6,-2.41,1,0.0373,0.0727,7.55e-05,0.0991,0.431,136.507,231400,4
1991-02-23,53,"Just The Way It Is, Baby",The Rembrandts,,False,68,53,3,0.793,0.612,3,-8.711,1,0.0295,0.329,2.72e-06,0.0764,0.822,110.738,243893,4
1991-02-23,55,This Is Ponderous,2nu,,False,48,46,10,0.848,0.48,9,-17.561,1,0.112,0.389,0.0327,0.259,0.607,114.316,217453,4
1991-02-23,56,I Don't Know Anybody Else,Black Box,,False,42,23,12,0.706,0.88,0,-7.063,1,0.0576,0.0787,0.00795,0.0501,0.947,120.126,273059,4
1991-02-23,57,Together Forever,Lisette Melendez,,False,69,57,4,0.682,0.963,11,-4.046,1,0.057,0.0186,0.0719,0.344,0.71,118.937,345800,4
1991-02-23,58,Easy Come Easy Go,Winger,,False,75,58,3,0.687,0.68,1,-10.835,1,0.0299,0.0128,1.73e-05,0.0702,0.825,118.03,245240,4
1991-02-23,59,Cry For Help,Rick Astley,,False,86,59,2,0.564,0.628,0,-6.933,1,0.0221,0.522,0,0.0891,0.462,89.977,245640,4
1991-02-23,60,Miles Away,Winger,,False,54,12,20,0.363,0.528,5,-10.08,1,0.0305,0.0661,0,0.334,0.317,182.21,252867,4
1991-02-23,61,Here Comes The Hammer,M.C. Hammer,,False,60,54,8,0.896,0.715,7,-12.978,1,0.0917,0.000355,0.34,0.0433,0.72,124.107,272200,4
1991-02-23,62,Night And Day,Bette Midler,,False,67,62,5,0.578,0.505,4,-13.012,1,0.0253,0.181,7e-05,0.63,0.316,133.902,330360,4
1991-02-23,64,Candy,Iggy Pop With Kate Pierson,,False,43,28,14,0.644,0.475,7,-10.343,1,0.0302,0.0435,1.36e-06,0.146,0.308,144.235,247246,4
1991-02-23,65,Because I Love You (The Postman Song),Stevie B,,False,49,1,21,0.506,0.321,1,-11.796,1,0.0289,0.74,1.21e-06,0.125,0.0724,128.391,300107,4
1991-02-23,66,Funk Boutique,The Cover Girls,,False,83,66,3,0.63,0.864,6,-10.163,0,0.0397,0.00749,0.35,0.0754,0.712,115.804,403000,4
1991-02-23,67,Secret,Heart,,False,74,67,4,0.78,0.436,7,-14.56,1,0.0658,0.839,0.0134,0.0877,0.374,101.188,229373,4
1991-02-23,68,Justify My Love,Madonna,,False,40,1,15,0.705,0.821,1,-7.085,1,0.128,0.00244,0.684,0.0572,0.456,99.642,294267,4
1991-02-23,69,Love Takes Time,Mariah Carey,,False,58,1,24,0.403,0.338,8,-12.371,0,0.0322,0.727,0,0.0849,0.233,126.23,229227,4
1991-02-23,70,The Shoop Shoop Song (It's In His Kiss),Cher,,False,64,33,14,0.63,0.799,0,-4.833,1,0.0286,0.136,0,0.213,0.815,117.043,166680,4
1991-02-23,72,The Way You Do The Things You Do,UB40,,False,55,6,24,0.865,0.414,5,-13.256,0,0.168,0.225,0.00159,0.0425,0.937,80.852,182467,4
1991-02-23,73,When Will I See You Smile Again?,Bell Biv DeVoe,,False,63,63,6,0.727,0.436,6,-11.862,0,0.0281,0.0492,0.00338,0.0686,0.381,124.021,307133,4
1991-02-23,74,Unchained Melody,The Righteous Brothers,,False,82,19,21,0.339,0.208,0,-16.725,1,0.0308,0.396,0.000519,0.18,0.288,98.54,218013,3
1991-02-23,75,Baby Baby,Amy Grant,3IDsegNBHC4pjGCOMTQYlU,True,0,75,1,0.702,0.901,1,-4.45,1,0.0264,0.426,0.00153,0.0368,0.919,97.862,236973,4
1991-02-23,76,Shelter Me,Cinderella,3IDsegNBHC4pjGCOMTQYlU,False,56,36,12,0.612,0.878,7,-7.65,1,0.0297,0.0362,0.0742,0.0825,0.92,125.956,287827,4
1991-02-23,78,For You,The Outfield,,False,70,21,17,0.623,0.675,10,-9.196,1,0.0309,0.226,8.37e-05,0.156,0.633,118.9,267280,4
1991-02-23,79,Give It Up,ZZ Top,,False,88,79,3,0.664,0.665,10,-9.881,1,0.0282,0.00812,0.000114,0.149,0.53,123.95,209427,4
1991-02-23,80,Another Sleepless Night,Shawn Christopher,,False,93,80,2,0.745,0.868,4,-13.042,0,0.048,0.105,0.0644,0.0637,0.693,121.959,325000,4
1991-02-23,81,Let's Chill,Guy,12soRJf1RZRsCd0QUnJUYL,True,0,81,1,0.604,0.417,10,-12.598,0,0.0385,0.0681,0,0.0425,0.558,74.57,323827,4
1991-02-23,82,Who Said I Would,Phil Collins,12soRJf1RZRsCd0QUnJUYL,False,73,73,4,0.688,0.9,5,-5.534,1,0.049,0.164,0.00988,0.291,0.491,131.031,241787,4
1991-02-23,83,Call It Poison,The Escape Club,3lxGEScEFa9EndItaMZW2O,True,0,83,1,0.63,0.727,10,-7.256,0,0.0412,0.00237,0.000364,0.29,0.559,110.747,294427,4
1991-02-23,85,Stone Cold Gentleman,Ralph Tresvant,2lZtKMrV9IVZL5pbItZzlM,True,0,85,1,0.728,0.708,9,-10.443,1,0.0547,0.196,0,0.102,0.405,105.55,369429,4
1991-02-23,86,Wiggle It,2 In A Room,2lZtKMrV9IVZL5pbItZzlM,False,78,15,21,0.781,0.838,2,-13.943,1,0.0494,0.0718,5.42e-06,0.0381,0.849,122.819,244133,4
1991-02-23,87,New York Minute,Don Henley,2lZtKMrV9IVZL5pbItZzlM,False,80,48,16,0.551,0.289,8,-12.214,0,0.0262,0.334,0,0.0379,0.117,132.133,395400,4
1991-02-23,88,Impulsive,Wilson Phillips,2lZtKMrV9IVZL5pbItZzlM,False,66,4,20,0.657,0.76,4,-8.613,1,0.0298,0.171,0.00551,0.224,0.71,107.872,274267,4
1991-02-23,89,All True Man,Alexander O'Neal,6nhCjIwKCpZCol6O4ciUTu,True,0,89,1,0.761,0.702,7,-8.523,1,0.0389,0.108,3.13e-05,0.0935,0.85,104.773,304427,4
1991-02-23,90,I Like The Way (The Kissing Game),Hi-Five,0flZtKtmkZMNqFF7V7Yfmu,True,0,90,1,0.724,0.692,1,-5.109,1,0.0333,0.0595,0.0108,0.0316,0.732,104.086,350267,4
1991-02-23,91,What's It Gonna Be,Jellybean Featuring Niki Haris,0flZtKtmkZMNqFF7V7Yfmu,False,90,90,3,0.781,0.836,4,-10.976,0,0.0808,0.00464,0.00394,0.0393,0.674,120.007,342120,4
1991-02-23,92,I'm Your Baby Tonight,Whitney Houston,0flZtKtmkZMNqFF7V7Yfmu,False,79,1,19,0.665,0.899,6,-7.75,1,0.0877,0.303,2.21e-06,0.445,0.873,165.16,299427,3
1991-02-23,93,How Can You Expect To Be Taken Seriously?,Pet Shop Boys,0flZtKtmkZMNqFF7V7Yfmu,False,99,93,2,0.568,0.897,0,-6.202,0,0.0398,0.00578,0.00201,0.384,0.839,94.641,236200,4
1991-02-23,94,I Love You,Vanilla Ice,1BRRxHOemfHiZ9UljcYrBs,True,0,94,1,0.633,0.518,11,-13.152,0,0.0656,0.0929,1.52e-05,0.102,0.568,156.966,306200,4
1991-02-23,95,Something To Believe In,Poison,1BRRxHOemfHiZ9UljcYrBs,False,81,4,21,0.52,0.711,3,-5.009,1,0.0386,0.266,1.09e-05,0.148,0.226,133.947,328360,4
1991-02-23,96,Melt In Your Mouth,Candyman,1BRRxHOemfHiZ9UljcYrBs,False,71,69,11,0.908,0.539,7,-8.688,1,0.244,0.0321,1.42e-06,0.0495,0.487,98.127,276080,4
1991-02-23,97,Still Got The Blues,Gary Moore,1BRRxHOemfHiZ9UljcYrBs,False,97,97,2,0.189,0.39,9,-14.497,0,0.0353,0.257,0.000152,0.122,0.32,169.563,370867,3
1991-02-23,98,House Full Of Reasons,Jude Cole,1BRRxHOemfHiZ9UljcYrBs,False,94,69,13,0.613,0.563,9,-9.325,1,0.0306,0.102,0,0.129,0.508,114.848,235733,4
1991-02-23,99,Jealousy,The Adventures Of Stevie V,1BRRxHOemfHiZ9UljcYrBs,False,95,94,6,0.85,0.742,4,-7.747,0,0.0733,0.0338,5.13e-06,0.0743,0.686,118.808,215403,4
1991-02-23,100,Tom's Diner,DNA Featuring Suzanne Vega,1BRRxHOemfHiZ9UljcYrBs,False,76,5,21,0.86,0.439,6,-12.264,0,0.0495,0.0204,0.0147,0.0465,0.725,99.144,228307,4
