date,position,title,artist,spotify_id,is_new,last_pos,peak_pos,weeks,danceability,energy,key,loudness,mode,speechiness,acousticness,instrumentalness,liveness,valence,tempo,duration_ms,time_signature
2004-01-31,1,Hey Ya!,OutKast,,False,1,1,16,0.727,0.974,4,-2.261,0,0.0664,0.103,0.000532,0.174,0.965,79.526,235213,4
2004-01-31,2,The Way You Move,OutKast Featuring Sleepy Brown,,False,2,2,19,0.871,0.597,5,-4.932,0,0.0464,0.126,0.000113,0.0638,0.635,125.999,234000,4
2004-01-31,3,You Don't Know My Name,Alicia Keys,,False,4,3,12,0.263,0.663,9,-8.264,1,0.19,0.589,0.00451,0.342,0.25,167.271,366733,4
2004-01-31,4,Slow Jamz,Twista Featuring Kanye West & Jamie Foxx,,False,5,4,9,0.559,0.733,2,-5.659,0,0.171,0.314,0,0.284,0.611,145.115,316053,4
2004-01-31,5,Milkshake,Kelis,,False,3,3,18,0.891,0.77,1,-6.124,1,0.0439,0.00862,0.0315,0.155,0.819,112.997,182627,4
2004-01-31,6,"Me, Myself And I",Beyonce,,False,8,6,12,0.75,0.458,1,-9.092,1,0.0803,0.226,3.25e-05,0.137,0.536,83.61,301133,4
2004-01-31,7,Yeah!,Usher Featuring Lil Jon & Ludacris,,False,14,7,4,0.894,0.791,2,-4.699,1,0.112,0.0183,0,0.0388,0.583,105.018,250373,4
2004-01-31,8,Someday,Nickelback,,False,12,8,24,0.455,0.858,11,-5.659,0,0.0391,0.000616,0.000247,0.226,0.597,163.118,207467,4
2004-01-31,9,Suga Suga,Baby Bash Featuring Frankie J,,False,9,7,24,0.662,0.748,5,-3.041,0,0.268,0.688,8.43e-06,0.0841,0.535,82.331,239027,4
2004-01-31,10,It's My Life,No Doubt,,False,11,10,14,0.606,0.75,8,-4.535,0,0.0306,0.00264,0.000788,0.321,0.771,126.316,225867,4
2004-01-31,11,Here Without You,3 Doors Down,,False,10,5,23,0.557,0.533,10,-6.817,0,0.0252,0.0492,0,0.205,0.233,143.994,238733,4
2004-01-31,12,Stand Up,Ludacris Featuring Shawnna,,False,6,1,22,0.751,0.84,6,-4.855,1,0.349,0.367,0,0.0916,0.801,99.057,213760,4
2004-01-31,13,Walked Outta Heaven,Jagged Edge,,False,7,6,22,0.67,0.616,10,-6.123,1,0.225,0.573,0,0.0535,0.523,120.129,270880,4
2004-01-31,14,Numb,Linkin Park,,False,16,14,13,0.496,0.863,9,-4.153,1,0.0381,0.0046,0,0.639,0.243,110.018,185587,4
2004-01-31,15,Read Your Mind,Avant,,False,13,13,18,0.755,0.381,8,-6.696,0,0.0711,0.291,5.13e-06,0.0974,0.695,73.108,263507,4
2004-01-31,16,Salt Shaker,Ying Yang Twins Featuring Lil Jon & The East Side Boyz,,False,24,16,12,0.884,0.697,11,-6.022,1,0.128,0.0509,0,0.094,0.322,101.965,252440,4
2004-01-31,17,The First Cut Is The Deepest,Sheryl Crow,,False,19,17,15,0.509,0.7,2,-5.372,1,0.033,0.0374,0,0.106,0.671,160.003,227400,4
2004-01-31,18,White Flag,Dido,,False,18,18,20,0.509,0.538,5,-6.835,1,0.0379,0.306,5.03e-06,0.091,0.284,170.111,240600,4
2004-01-31,19,Through The Wire,Kanye West,,False,26,19,10,0.571,0.739,7,-6.11,1,0.247,0.00865,5.21e-06,0.158,0.66,83.089,221227,4
2004-01-31,20,Sorry 2004,Ruben Studdard,,False,35,20,5,0.721,0.472,9,-7.574,1,0.0619,0.076,0,0.332,0.462,129.964,261867,4
2004-01-31,21,Get Low,Lil Jon & The East Side Boyz Featuring Ying Yang Twins,,False,15,2,40,0.521,0.625,1,-7.47,1,0.067,0.0301,0,0.121,0.136,101.019,334067,4
2004-01-31,22,Baby Boy,Beyonce Featuring Sean Paul,,False,17,1,25,0.655,0.488,1,-9.17,1,0.22,0.0825,1.16e-06,0.221,0.791,91.025,244827,4
2004-01-31,23,Step In The Name Of Love,R. Kelly,,False,22,9,24,0.775,0.53,1,-6.564,0,0.119,0.2,0,0.231,0.775,94.985,432147,4
2004-01-31,24,Hotel,Cassidy Featuring R. Kelly,,False,42,24,7,0.68,0.659,0,-6.855,1,0.211,0.118,0,0.107,0.411,91.259,247040,4
2004-01-31,25,Gigolo,Nick Cannon Featuring R. Kelly,,False,27,24,12,0.896,0.552,4,-6.11,0,0.102,0.273,0,0.0662,0.657,93.001,237840,4
2004-01-31,26,F**k It (I Don't Want You Back),Eamon,,False,36,26,9,0.814,0.611,0,-6.154,0,0.0491,0.0781,0.000134,0.0406,0.533,68.493,225667,4
2004-01-31,27,Why Don't You & I,Santana Featuring Alex Band Or Chad Kroeger,,False,25,8,28,0.495,0.894,10,-4.89,1,0.102,0.136,0,0.106,0.777,168.062,274360,4
2004-01-31,28,Damn!,YoungBloodZ Featuring Lil Jon,,False,20,4,26,0.772,0.724,6,-5.799,0,0.307,0.0149,0,0.355,0.518,84.038,298600,4
2004-01-31,29,Splash Waterfalls,Ludacris,,False,46,29,5,0.734,0.846,11,-6.102,1,0.409,0.101,0,0.233,0.702,145.894,290760,4
2004-01-31,30,Remember When,Alan Jackson,,False,30,30,8,0.558,0.314,2,-10.623,1,0.0295,0.709,0.000319,0.193,0.267,125.59,271280,4
2004-01-31,31,There Goes My Life,Kenny Chesney,,False,31,29,13,0.577,0.483,4,-8.141,1,0.0324,0.0337,6.22e-06,0.3,0.218,135.77,302667,4
2004-01-31,32,With You,Jessica Simpson,,False,38,32,6,0.553,0.756,0,-4.583,1,0.108,0.0923,0,0.215,0.605,94.487,191827,4
2004-01-31,33,Holidae In,Chingy Featuring Ludacris & Snoop Dogg,,False,21,3,20,0.81,0.791,7,-5.909,1,0.181,0.0893,0,0.0838,0.948,153.067,314400,4
2004-01-31,34,Perfect,Simple Plan,,False,29,24,14,0.494,0.672,3,-4.877,1,0.0405,0.0273,0,0.105,0.557,156.208,277027,4
2004-01-31,35,Change Clothes,JAY-Z,,False,23,10,12,0.895,0.628,10,-3.79,1,0.0473,0.0412,0,0.059,0.34,104.009,258427,4
2004-01-31,36,Gangsta Nation,Westside Connection Featuring Nate Dogg,,False,40,36,9,0.843,0.7,9,-3.249,0,0.26,0.127,0,0.876,0.675,95.05,293053,4
2004-01-31,37,American Soldier,Toby Keith,,False,44,37,6,0.565,0.541,9,-8.426,1,0.0376,0.193,3.45e-06,0.0582,0.226,82.006,263333,4
2004-01-31,38,Unwell,matchbox twenty,,False,34,5,46,0.442,0.793,9,-5.152,1,0.0347,0.0456,0,0.328,0.437,80.985,237267,4
2004-01-31,39,You Can't Take The Honky Tonk Out Of The Girl,Brooks & Dunn,,False,39,39,13,0.574,0.949,5,-2.799,1,0.0383,0.00881,3.82e-05,0.277,0.755,114.271,208933,4
2004-01-31,40,Headstrong,Trapt,,False,32,16,41,0.492,0.896,4,-5.819,0,0.117,0.000172,2.78e-06,0.189,0.534,184.981,285570,4
2004-01-31,41,Wat Da Hook Gon Be,Murphy Lee Featuring Jermaine Dupri,,False,37,17,17,0.927,0.596,10,-7.058,0,0.301,0.0979,0,0.283,0.914,94.997,224667,4
2004-01-31,42,So Far Away,Staind,,False,33,24,27,0.407,0.896,6,-2.935,1,0.063,0.012,0,0.196,0.156,138.697,243573,3
2004-01-31,43,The Voice Within,Christina Aguilera,,False,41,33,10,0.484,0.439,2,-5.995,1,0.0336,0.556,0,0.251,0.157,69.945,304013,4
2004-01-31,44,Runnin (Dying To Live),Tupac Featuring The Notorious B.I.G.,,False,28,19,16,0.545,0.796,10,-2.762,0,0.406,0.0467,0.000287,0.165,0.629,166.122,231987,4
2004-01-31,45,Tipsy,J-Kwon,,False,76,45,3,0.925,0.744,0,-5.79,1,0.367,0.0644,0,0.0888,0.656,93.02,243227,4
2004-01-31,46,I Wanna Do It All,Terri Clark,,False,49,46,8,0.626,0.886,4,-4.787,1,0.034,0.0668,0,0.118,0.782,132.905,173333,4
2004-01-31,47,Bright Lights,matchbox twenty,,False,45,23,19,0.319,0.732,4,-4.475,1,0.0436,0.0134,0,0.658,0.2,80.195,234427,4
2004-01-31,48,My Immortal,Evanescence,,False,61,48,4,0.19,0.265,9,-9.206,1,0.0356,0.863,0,0.134,0.101,79.012,262533,4
2004-01-31,49,Watch The Wind Blow By,Tim McGraw,,False,50,49,8,0.517,0.608,10,-7.206,1,0.0265,0.0924,0,0.0707,0.506,62.65,276400,5
2004-01-31,50,Dirt Off Your Shoulder,JAY-Z,,False,68,50,2,0.78,0.657,1,-7.149,1,0.317,0.0321,2.56e-06,0.339,0.648,163.969,245173,4
2004-01-31,51,Fallen,Sarah McLachlan,,False,47,41,15,0.503,0.492,2,-7.607,0,0.0357,0.61,2.4e-05,0.0853,0.352,74.967,227000,4
2004-01-31,52,Little Moments,Brad Paisley,,False,53,52,7,0.558,0.551,9,-6.333,1,0.0263,0.245,4.19e-06,0.231,0.347,78.374,221067,4
2004-01-31,53,Toxic,Britney Spears,6I9VzXrHxO9rA9A5euc8Ak,True,0,53,1,0.774,0.838,5,-3.914,0,0.114,0.0249,0.025,0.242,0.924,143.04,198800,4
2004-01-31,54,One Call Away,Chingy Featuring J. Weav,0UNTBB02C1aB55Fu4H63qd,True,0,54,1,0.765,0.821,4,-5.926,0,0.183,0.0918,0,0.217,0.962,162.519,276800,4
2004-01-31,55,More & More,Joe,0UNTBB02C1aB55Fu4H63qd,False,54,48,11,0.7,0.508,5,-7.32,0,0.0577,0.189,0,0.0938,0.464,139.974,223693,4
2004-01-31,56,In My Daughter's Eyes,Martina McBride,0UNTBB02C1aB55Fu4H63qd,False,58,56,3,0.357,0.302,8,-7.191,1,0.0362,0.869,0,0.157,0.376,122.622,193800,4
2004-01-31,57,Why Can't I?,Liz Phair,0UNTBB02C1aB55Fu4H63qd,False,52,32,20,0.487,0.759,11,-4.849,1,0.0405,0.0273,0,0.165,0.227,80.958,208360,4
2004-01-31,58,She's Not Just A Pretty Face,Shania Twain,0UNTBB02C1aB55Fu4H63qd,False,56,56,9,0.565,0.878,9,-4.388,1,0.0385,0.0431,0,0.365,0.451,98.985,229027,4
2004-01-31,59,Not Today,Mary J. Blige Featuring Eve,0UNTBB02C1aB55Fu4H63qd,False,51,41,8,0.907,0.628,10,-2.551,0,0.0796,0.448,1.32e-06,0.0423,0.902,94.027,253867,4
2004-01-31,60,Stunt 101,G Unit,0UNTBB02C1aB55Fu4H63qd,False,43,13,14,0.675,0.779,6,-1.439,0,0.402,0.161,0,0.0656,0.553,95.739,232227,4
2004-01-31,61,In My Life,Juvenile Featuring Mannie Fresh,0UNTBB02C1aB55Fu4H63qd,False,66,61,5,0.76,0.67,1,-4.891,1,0.126,0.0132,5.94e-05,0.113,0.145,177.927,344987,4
2004-01-31,62,Drinkin' Bone,Tracy Byrd,0UNTBB02C1aB55Fu4H63qd,False,60,60,10,0.77,0.833,5,-4.536,1,0.028,0.0793,0,0.0819,0.964,109.928,131867,4
2004-01-31,63,Invisible,Clay Aiken,0UNTBB02C1aB55Fu4H63qd,False,48,37,11,0.565,0.777,2,-5.516,0,0.037,0.152,0,0.35,0.593,110.092,243867,4
2004-01-31,64,Megalomaniac,Incubus,0UNTBB02C1aB55Fu4H63qd,False,67,64,5,0.532,0.943,7,-4.549,0,0.0512,0.0056,0.000587,0.317,0.371,140.042,294800,4
2004-01-31,65,Are You Gonna Be My Girl,Jet,0UNTBB02C1aB55Fu4H63qd,False,65,65,7,0.613,0.953,2,-3.435,1,0.0855,0.00148,0.000582,0.152,0.537,105.046,213800,4
2004-01-31,66,Honesty (Write Me A List),Rodney Atkins,0UNTBB02C1aB55Fu4H63qd,False,57,57,18,0.576,0.496,6,-6.716,1,0.0264,0.0355,0,0.162,0.236,77.006,255387,4
2004-01-31,67,(I Hate) Everything About You,Three Days Grace,0UNTBB02C1aB55Fu4H63qd,False,64,55,10,0.553,0.853,8,-3.668,1,0.0339,0.000684,0,0.126,0.506,122.023,231400,4
2004-01-31,68,Hit That,The Offspring,0UNTBB02C1aB55Fu4H63qd,False,69,64,7,0.704,0.809,4,-3.045,1,0.0321,0.0233,0,0.0596,0.962,131.952,169413,4
2004-01-31,69,Rubber Band Man,T.I.,0UNTBB02C1aB55Fu4H63qd,False,72,69,4,0.601,0.768,8,-5.712,1,0.386,0.141,0,0.482,0.634,152.45,347507,4
2004-01-31,70,I Love You This Much,Jimmy Wayne,0UNTBB02C1aB55Fu4H63qd,False,74,70,2,0.364,0.45,2,-4.905,1,0.0288,0.382,0,0.122,0.198,73.279,247373,4
2004-01-31,71,My Baby,Bow Wow Featuring Jagged Edge,0UNTBB02C1aB55Fu4H63qd,False,55,42,9,0.623,0.58,5,-9.464,0,0.439,0.172,0,0.563,0.51,85.9,303107,4
2004-01-31,72,Perfect,Sara Evans,0UNTBB02C1aB55Fu4H63qd,False,71,71,2,0.39,0.879,4,-4.352,1,0.0813,0.0403,7.03e-06,0.376,0.616,206.072,241840,4
2004-01-31,73,Hot Mama,Trace Adkins,0UNTBB02C1aB55Fu4H63qd,False,73,73,2,0.559,0.84,7,-3.997,1,0.0321,0.0101,0.0017,0.333,0.77,105.943,200600,4
2004-01-31,74,I'm Still In Love With You,Sean Paul Featuring Sasha,0UNTBB02C1aB55Fu4H63qd,False,81,74,5,0.765,0.666,7,-5.384,1,0.172,0.102,0,0.116,0.756,87.002,273360,4
2004-01-31,75,I Am The Highway,Audioslave,0UNTBB02C1aB55Fu4H63qd,False,78,71,4,0.341,0.662,9,-5.023,0,0.0335,0.105,0,0.113,0.2,174.875,334907,4
2004-01-31,76,No Better Love,Young Gunz Featuring Rell,0K7XjmTNFwQ2qwHn4MjlDx,True,0,76,1,0.674,0.897,8,-3.053,1,0.259,0.181,0,0.195,0.525,91.194,235907,4
2004-01-31,77,Badaboom,B2K Featuring Fabolous,0K7XjmTNFwQ2qwHn4MjlDx,False,59,59,7,0.812,0.626,4,-5.025,0,0.149,0.0238,0.000699,0.149,0.811,96.006,221067,4
2004-01-31,78,I Wish,Jo Dee Messina,0K7XjmTNFwQ2qwHn4MjlDx,False,75,75,2,0.389,0.515,7,-6.224,1,0.03,0.388,0,0.0802,0.164,70.136,213547,4
2004-01-31,79,Breathe,Michelle Branch,0K7XjmTNFwQ2qwHn4MjlDx,False,63,36,13,0.644,0.753,6,-4.296,1,0.0391,0.0279,0.00227,0.108,0.209,117.148,211773,4
2004-01-31,80,Freek-A-Leek,Petey Pablo,0K7XjmTNFwQ2qwHn4MjlDx,False,85,80,5,0.756,0.691,2,-3.718,1,0.178,0.0744,0,0.364,0.632,104.999,235187,4
2004-01-31,81,Forthenight,Musiq,0K7XjmTNFwQ2qwHn4MjlDx,False,70,53,13,0.698,0.678,3,-7.127,0,0.234,0.253,0,0.191,0.785,101.052,229467,4
2004-01-31,82,(There's Gotta Be) More To Life,Stacie Orrico,0K7XjmTNFwQ2qwHn4MjlDx,False,62,30,20,0.58,0.922,1,-3.785,1,0.0957,0.0917,0,0.189,0.649,89.841,200387,4
2004-01-31,83,Long Black Train,Josh Turner,0K7XjmTNFwQ2qwHn4MjlDx,False,89,83,7,0.537,0.699,10,-6.615,1,0.0399,0.237,2.27e-05,0.114,0.814,84.905,250627,4
2004-01-31,84,Away From Me,Puddle Of Mudd,0K7XjmTNFwQ2qwHn4MjlDx,False,79,72,11,0.388,0.943,8,-2.927,1,0.104,0.000306,0,0.168,0.162,154.721,238467,4
2004-01-31,85,Neva Eva,Trillville,0K7XjmTNFwQ2qwHn4MjlDx,False,90,85,7,0.777,0.81,7,-4.968,1,0.0462,0.0192,0,0.0861,0.787,78.021,276320,4
2004-01-31,86,Fallen,Mya,0K7XjmTNFwQ2qwHn4MjlDx,False,77,51,10,0.669,0.61,1,-8.217,1,0.0457,0.119,2.75e-05,0.53,0.428,94.439,214600,4
2004-01-31,87,Hell Yeah,Montgomery Gentry,0K7XjmTNFwQ2qwHn4MjlDx,False,80,45,14,0.372,0.872,0,-6.651,1,0.056,0.0185,0,0.368,0.65,173.525,289560,4
2004-01-31,88,Still Frame,Trapt,0K7XjmTNFwQ2qwHn4MjlDx,False,87,69,12,0.445,0.932,4,-4.739,1,0.316,0.000866,0,0.108,0.51,113.945,271093,4
2004-01-31,89,Cowboys Like Us,George Strait,0K7XjmTNFwQ2qwHn4MjlDx,False,82,38,18,0.477,0.553,0,-6.094,1,0.0302,0.213,1.31e-06,0.201,0.299,128.416,219160,3
2004-01-31,90,Shake That Monkey,Too Short Featuring Lil Jon & The East Side Boyz,0K7XjmTNFwQ2qwHn4MjlDx,False,84,84,11,0.937,0.695,0,-6.932,1,0.134,0.000577,3.19e-05,0.295,0.457,99.997,278707,4
2004-01-31,91,Pop That Booty,"Marques Houston Featuring Jermaine ""JD"" Dupri",0K7XjmTNFwQ2qwHn4MjlDx,False,83,76,8,0.839,0.625,9,-5.699,1,0.15,0.0752,0,0.26,0.731,95.511,246267,4
2004-01-31,92,You,Ryan Duarte,0K7XjmTNFwQ2qwHn4MjlDx,False,97,92,4,0.805,0.773,3,-5.734,0,0.0278,0.12,0,0.0594,0.969,130.03,208427,4
2004-01-31,93,Gangsta Girl,Big Tymers Featuring R. Kelly,0K7XjmTNFwQ2qwHn4MjlDx,False,88,85,6,0.839,0.612,8,-8.777,1,0.179,0.484,0,0.0839,0.891,152.0,258947,4
2004-01-31,94,Chicks Dig It,Chris Cagle,0K7XjmTNFwQ2qwHn4MjlDx,False,86,53,14,0.596,0.921,7,-4.987,1,0.0504,0.0221,0,0.303,0.703,104.024,210560,4
2004-01-31,95,Love You More,Ginuwine,0K7XjmTNFwQ2qwHn4MjlDx,False,93,78,14,0.661,0.422,8,-6.918,0,0.0282,0.0887,2.39e-06,0.164,0.428,117.007,241373,4
2004-01-31,97,Stacy's Mom,Fountains Of Wayne,,False,92,21,17,0.774,0.75,11,-4.927,0,0.0412,0.00207,1.78e-05,0.0808,0.927,118.015,197987,4
2004-01-31,98,Some Girls (Dance With Women),JC Chasez Featuring Dirt McGirt,1mJkU57DxmxPrjd3l91HDD,True,0,98,1,0.872,0.838,6,-6.687,1,0.26,0.055,0,0.0596,0.932,98.011,272093,4
2004-01-31,99,I Can Only Imagine,MercyMe,1mJkU57DxmxPrjd3l91HDD,False,98,71,13,0.407,0.612,4,-5.359,1,0.0496,0.0909,0,0.0914,0.133,159.527,248253,4
2004-01-31,100,Alone,Lasgo,1mJkU57DxmxPrjd3l91HDD,False,94,91,6,0.72,0.917,8,-4.717,1,0.0476,0.0821,0.00154,0.296,0.548,140.025,241040,4
