date,position,title,artist,spotify_id,is_new,last_pos,peak_pos,weeks,danceability,energy,key,loudness,mode,speechiness,acousticness,instrumentalness,liveness,valence,tempo,duration_ms,time_signature
1996-04-27,1,"Because You Loved Me (From ""Up Close & Personal"")",Celine Dion,,False,1,1,8,0.615,0.467,1,-9.883,1,0.0327,0.314,0,0.099,0.177,119.919,273667,4
1996-04-27,2,Always Be My Baby,Mariah Carey,,False,2,2,4,0.65,0.531,4,-8.335,1,0.0364,0.457,0,0.249,0.487,78.946,258133,4
1996-04-27,3,Nobody Knows,The Tony Rich Project,,False,3,2,20,0.64,0.433,5,-9.432,1,0.0374,0.509,4.9e-06,0.103,0.25,176.086,306933,4
1996-04-27,4,Ironic,Alanis Morissette,,False,4,4,7,0.408,0.582,11,-8.305,1,0.0508,0.218,0,0.159,0.365,114.926,230000,5
1996-04-27,5,"1, 2, 3, 4 (Sumpin' New)",Coolio,,False,6,5,8,0.91,0.681,1,-9.639,0,0.153,0.288,0.00477,0.372,0.7,115.186,214307,4
1996-04-27,6,Down Low (Nobody Has To Know),R. Kelly Featuring Ronald Isley,,False,5,4,9,0.603,0.417,10,-9.408,0,0.0273,0.282,0.000183,0.0651,0.172,107.72,288507,4
1996-04-27,7,You're The One,SWV,,False,9,7,2,0.79,0.608,6,-7.151,1,0.0363,0.522,0.00491,0.193,0.958,94.166,282600,4
1996-04-27,9,"Count On Me (From ""Waiting To Exhale"")",Whitney Houston & CeCe Winans,,False,10,9,6,0.526,0.507,4,-6.647,0,0.029,0.388,0,0.115,0.14,113.653,266787,4
1996-04-27,10,"Sittin' Up In My Room (From ""Waiting To Exhale"")",Brandy,,False,7,2,18,0.791,0.61,8,-5.408,0,0.0264,0.288,0.00123,0.0457,0.907,93.277,291067,4
1996-04-27,12,Doin It,LL Cool J,,False,12,9,8,0.801,0.55,10,-11.044,0,0.209,0.365,0.0234,0.117,0.609,94.994,293933,4
1996-04-27,13,Missing,Everything But The Girl,,False,16,2,38,0.677,0.484,9,-10.506,0,0.0324,0.077,4.75e-05,0.135,0.697,123.534,247200,4
1996-04-27,14,"All The Things (Your Man Won't Do) (From ""Don't Be A Menace..."")",Joe,,False,14,11,12,0.573,0.679,3,-6.774,0,0.0423,0.247,0,0.321,0.648,66.215,380533,4
1996-04-27,15,Lady,D'Angelo,,False,15,10,9,0.815,0.364,8,-11.834,0,0.089,0.14,0.0255,0.121,0.723,84.898,346267,4
1996-04-27,16,"Not Gon' Cry (From ""Waiting To Exhale"")",Mary J. Blige,,False,11,2,14,0.758,0.424,2,-8.935,0,0.0468,0.664,0,0.095,0.455,110.087,294267,4
1996-04-27,17,1979,The Smashing Pumpkins,,False,18,12,12,0.767,0.787,3,-9.897,1,0.0331,0.0163,0.583,0.0513,0.964,126.879,266200,4
1996-04-27,18,One Sweet Day,Mariah Carey & Boyz II Men,,False,17,1,22,0.568,0.495,1,-8.964,1,0.0299,0.353,0,0.0839,0.303,128.234,281067,4
1996-04-27,19,"Closer To Free (From ""Party Of Five"")",BoDeans,,False,21,19,8,0.497,0.943,7,-4.792,1,0.0412,0.000627,0.000698,0.731,0.702,98.155,188600,4
1996-04-27,20,Who Do U Love,Deborah Cox,,False,19,19,13,0.69,0.888,6,-5.781,0,0.186,0.163,2.25e-05,0.659,0.686,87.918,262933,4
1996-04-27,21,Be My Lover,La Bouche,,False,20,6,25,0.669,0.941,1,-5.765,0,0.0313,0.00129,4.3e-06,0.886,0.841,134.809,240267,4
1996-04-27,22,Give Me One Reason,Tracy Chapman,,False,33,22,4,0.608,0.419,11,-10.016,1,0.0331,0.602,7.58e-06,0.108,0.602,100.22,268333,4
1996-04-27,23,Wonder,Natalie Merchant,,False,22,21,21,0.719,0.739,1,-5.577,1,0.0419,0.346,0.0102,0.0581,0.603,115.142,266008,4
1996-04-27,24,5 O'Clock,Nonchalant,,False,29,24,9,0.731,0.76,10,-8.321,0,0.116,0.111,1.85e-06,0.0987,0.799,86.108,302640,4
1996-04-27,25,Just A Girl,No Doubt,,False,30,25,20,0.638,0.906,2,-4.824,1,0.0504,0.0662,6.88e-05,0.142,0.767,107.991,209200,4
1996-04-27,26,"Insensitive (From ""Bed Of Roses"")",Jann Arden,,False,35,26,12,0.512,0.429,2,-9.931,1,0.0256,0.154,8.81e-05,0.101,0.332,178.669,255893,4
1996-04-27,27,The World I Know,Collective Soul,,False,25,19,24,0.514,0.704,2,-4.724,1,0.0261,0.0515,0.00219,0.228,0.386,76.975,255467,4
1996-04-27,28,Old Man & Me (When I Get To Heaven),Hootie & The Blowfish,6gjpBCqMvSuLp0uo6Zx447,True,0,28,1,0.405,0.804,4,-5.685,1,0.0334,0.034,0,0.118,0.685,99.629,267587,4
1996-04-27,29,Name,Goo Goo Dolls,6gjpBCqMvSuLp0uo6Zx447,False,27,5,29,0.464,0.701,9,-5.943,1,0.0341,0.0691,0.00182,0.0766,0.407,73.97,270000,4
1996-04-27,30,Anything,3T,6gjpBCqMvSuLp0uo6Zx447,False,23,15,30,0.686,0.454,10,-10.928,0,0.0328,0.43,0.00021,0.286,0.645,131.977,321000,4
1996-04-27,31,I Want To Come Over,Melissa Etheridge,6gjpBCqMvSuLp0uo6Zx447,False,26,22,11,0.537,0.488,9,-9.874,1,0.0316,0.0631,0.00295,0.108,0.538,113.796,324667,4
1996-04-27,32,In The Meantime,Spacehog,6gjpBCqMvSuLp0uo6Zx447,False,34,32,4,0.269,0.895,9,-6.382,1,0.118,0.083,0.00266,0.153,0.16,168.479,299507,4
1996-04-27,33,Sweet Dreams,La Bouche,6gjpBCqMvSuLp0uo6Zx447,False,44,33,5,0.656,0.956,11,-5.647,0,0.0536,0.0784,0.0247,0.0923,0.831,133.713,204587,4
1996-04-27,34,Renee,Lost Boyz,6gjpBCqMvSuLp0uo6Zx447,False,36,34,6,0.783,0.457,4,-9.747,0,0.18,0.0442,0,0.121,0.539,91.996,293867,4
1996-04-27,35,"Keep On, Keepin' On (From ""Sunset Park"")",MC Lyte Featuring Xscape,6gjpBCqMvSuLp0uo6Zx447,False,48,35,7,0.875,0.63,1,-6.015,0,0.114,0.24,0.00011,0.0742,0.733,91.043,271440,4
1996-04-27,36,I Will Survive,Chantay Savage,6gjpBCqMvSuLp0uo6Zx447,False,24,24,11,0.624,0.405,3,-10.084,0,0.0403,0.501,9.5e-05,0.228,0.209,84.153,372400,4
1996-04-27,37,One Of Us,Joan Osborne,6gjpBCqMvSuLp0uo6Zx447,False,28,4,21,0.316,0.499,9,-7.899,1,0.0298,0.0108,1.81e-05,0.126,0.403,174.782,320467,4
1996-04-27,38,"A Thin Line Between Love & Hate (From ""A Thin Line..."")",H-Town,6gjpBCqMvSuLp0uo6Zx447,False,49,38,11,0.549,0.446,0,-7.807,1,0.258,0.536,0,0.0442,0.511,122.431,300000,4
1996-04-27,39,Hook,Blues Traveler,6gjpBCqMvSuLp0uo6Zx447,False,39,23,30,0.562,0.742,9,-6.355,1,0.0346,0.0369,1.47e-06,0.102,0.793,165.6,289200,4
1996-04-27,40,Wonderwall,Oasis,6gjpBCqMvSuLp0uo6Zx447,False,32,8,14,0.41,0.854,2,-5.609,1,0.0366,0.00236,0,0.133,0.456,174.584,258907,4
1996-04-27,41,Don't Cry,Seal,6gjpBCqMvSuLp0uo6Zx447,False,40,33,11,0.282,0.421,2,-8.112,1,0.0306,0.726,9.09e-05,0.33,0.153,92.546,377907,3
1996-04-27,42,Feels So Good (Show Me Your Love),Lina Santiago,6gjpBCqMvSuLp0uo6Zx447,False,45,35,14,0.772,0.902,6,-4.376,0,0.0566,0.0703,0.0102,0.0536,0.748,126.958,307438,4
1996-04-27,43,Lucky Love,Ace Of Base,6gjpBCqMvSuLp0uo6Zx447,False,37,30,10,0.769,0.662,5,-7.238,1,0.0319,0.129,0.00102,0.0814,0.863,104.104,175747,4
1996-04-27,44,Time,Hootie & The Blowfish,6gjpBCqMvSuLp0uo6Zx447,False,43,14,25,0.387,0.875,2,-5.741,1,0.0385,0.0373,0,0.152,0.238,105.1,296840,4
1996-04-27,45,"Gangsta's Paradise (From ""Dangerous Minds"")",Coolio Featuring L.V.,6gjpBCqMvSuLp0uo6Zx447,False,38,1,37,0.647,0.514,8,-10.05,1,0.0593,0.0655,0,0.398,0.387,79.974,240693,4
1996-04-27,46,Peaches,The Presidents Of The United States Of America,6gjpBCqMvSuLp0uo6Zx447,False,31,29,8,0.417,0.849,1,-4.199,0,0.0481,0.0146,0.000387,0.0673,0.594,94.267,171693,4
1996-04-27,47,Get Money,Junior M.A.F.I.A. Featuring The Notorious B.I.G.,6gjpBCqMvSuLp0uo6Zx447,False,47,30,12,0.727,0.83,2,-5.835,1,0.286,0.478,0,0.251,0.894,91.174,274938,4
1996-04-27,49,Don't Wanna Lose You,Lionel Richie,,False,51,49,3,0.481,0.523,0,-6.518,1,0.029,0.566,2.72e-05,0.105,0.227,103.643,302333,3
1996-04-27,50,Chains,Tina Arena,,False,52,50,2,0.684,0.464,0,-9.37,0,0.0298,0.267,0.00103,0.0994,0.55,92.132,262133,4
1996-04-27,51,"Machinehead (From ""Fear"")",Bush,,False,57,51,3,0.143,0.919,9,-4.438,1,0.11,2.57e-05,0.00427,0.134,0.201,172.668,256333,3
1996-04-27,52,Fu-Gee-La,Fugees,,False,42,29,18,0.681,0.505,1,-11.709,1,0.138,0.137,0,0.234,0.399,89.953,260067,4
1996-04-27,53,Amish Paradise,"""Weird Al"" Yankovic",,False,53,53,5,0.728,0.448,8,-10.54,1,0.172,0.103,0,0.267,0.483,80.902,202920,4
1996-04-27,54,Cumbersome,Seven Mary Three,,False,55,39,15,0.543,0.79,11,-5.932,1,0.0358,0.00811,0,0.238,0.339,80.923,236973,4
1996-04-27,55,No One Else,Total,,False,50,22,20,0.782,0.515,6,-8.215,0,0.3,0.185,1.34e-05,0.0577,0.791,182.19,260467,4
1996-04-27,56,Glycerine,Bush,,False,56,28,14,0.437,0.337,5,-11.439,1,0.0326,0.0371,0.000946,0.0981,0.0784,114.239,266493,4
1996-04-27,58,Only Happy When It Rains,Garbage,,False,58,58,8,0.511,0.827,1,-4.55,0,0.0323,3.77e-05,0.00103,0.208,0.486,121.459,236533,4
1996-04-27,59,Release Me,Angelina,,False,59,59,6,0.869,0.732,8,-5.405,1,0.0559,0.0162,5.74e-05,0.0627,0.944,130.064,237267,4
1996-04-27,60,Reach,Gloria Estefan,,False,66,60,2,0.451,0.832,5,-5.371,0,0.0429,0.314,0,0.0722,0.435,156.104,230133,4
1996-04-27,61,Only Love (The Ballad Of Sleeping Beauty),Sophie B. Hawkins,,False,62,49,9,0.656,0.733,9,-6.87,1,0.031,0.425,0,0.0712,0.437,104.999,302693,4
1996-04-27,62,One For The Money,Horace Brown,,False,64,62,5,0.759,0.536,3,-8.537,1,0.0429,0.0455,0,0.0313,0.842,90.073,265467,4
1996-04-27,64,Soul Food,Goodie Mob,,False,80,64,5,0.927,0.495,4,-8.778,0,0.304,0.0689,8.62e-05,0.0826,0.618,96.372,236467,4
1996-04-27,65,Can't Get You Off My Mind,Lenny Kravitz,,False,69,65,6,0.567,0.52,7,-10.247,1,0.0283,0.0147,3.91e-06,0.25,0.393,124.708,274000,4
1996-04-27,66,C'mon N' Ride It (The Train),Quad City DJ's,,False,71,66,7,0.843,0.959,6,-4.933,0,0.0914,0.0913,0,0.408,0.923,135.988,451440,4
1996-04-27,67,Shadowboxin',Genius/GZA Featuring Method Man,,False,67,67,4,0.704,0.642,1,-10.11,1,0.39,0.00704,1.43e-06,0.161,0.72,92.09,209973,4
1996-04-27,68,Slow Jams,Quincy Jones Feat. Babyface & Tamia With Portrai,,False,72,68,2,0.616,0.553,7,-9.269,0,0.0642,0.551,5.34e-06,0.112,0.488,138.145,450600,4
1996-04-27,70,Real Love,The Beatles,,False,60,11,6,0.375,0.694,8,-7.334,1,0.031,0.0458,0.019,0.257,0.405,175.726,234053,4
1996-04-27,71,Your Loving Arms,Billie Ray Martin,,False,88,71,12,0.559,0.878,9,-9.865,0,0.0367,0.0105,0.00403,0.0947,0.851,131.604,396067,4
1996-04-27,72,Jesus To A Child,George Michael,,False,68,7,10,0.534,0.415,1,-11.781,0,0.0278,0.314,0.000365,0.0847,0.188,173.561,411147,4
1996-04-27,73,Counting Blue Cars,Dishwalla,,False,83,73,4,0.454,0.79,11,-4.361,0,0.0285,0.00604,3.09e-05,0.225,0.362,100.225,291907,4
1996-04-27,74,"Can't Be Wasting My Time (From ""Don't Be A Menace..."")",Mona Lisa Featuring Lost Boyz,,False,65,65,11,0.542,0.645,0,-8.206,1,0.133,0.218,0,0.134,0.594,174.415,275067,4
1996-04-27,75,Esa Nena Linda,Artie The 1 Man Party,,False,75,75,6,0.715,0.956,8,-6.795,0,0.059,0.00436,0.831,0.0326,0.844,129.999,192000,4
1996-04-27,76,Tres Delinquentes,Delinquent Habits,1dstLlsgEFPsaiccsUz2SP,True,0,76,1,0.826,0.698,11,-4.004,1,0.151,0.0177,0.00761,0.314,0.604,100.108,255693,4
1996-04-27,77,Ever Since You Went Away,Art N' Soul,1dstLlsgEFPsaiccsUz2SP,False,73,73,7,0.693,0.498,3,-9.714,0,0.0346,0.265,0.000139,0.246,0.719,138.04,249661,4
1996-04-27,78,Feel The Music,Planet Soul Featuring Brenda Dee,2Yoo0VmPYEloBjMqzXvPRu,True,0,78,1,0.554,0.684,7,-10.061,1,0.0816,0.019,0.0166,0.0635,0.554,132.063,352427,4
1996-04-27,79,Have I Never,A Few Good Men,2Yoo0VmPYEloBjMqzXvPRu,False,76,76,6,0.717,0.377,4,-8.68,1,0.0288,0.282,0,0.138,0.161,120.036,336533,4
1996-04-27,80,"Scarred (From ""Eddie"")",Luke,0NXA8wKGM6eRgLzpJXanGL,True,0,80,1,0.846,0.922,7,-5.185,1,0.242,0.0272,0,0.76,0.908,146.726,206054,4
1996-04-27,81,Take A Look,J'Son,0NXA8wKGM6eRgLzpJXanGL,False,74,74,10,0.443,0.937,6,-3.817,0,0.0724,0.000303,0.00649,0.124,0.572,178.147,249733,4
1996-04-27,82,Live And Die For Hip Hop,Kris Kross,4UCNGmp2jX1YhokWQk5Ak4,True,0,82,1,0.755,0.536,5,-9.643,0,0.181,0.0133,0,0.0794,0.658,87.087,223867,4
1996-04-27,84,Ain't No Playa,Rappin' 4-Tay,,False,99,73,9,0.741,0.763,7,-6.514,1,0.11,0.0106,0,0.201,0.449,84.992,302360,4
1996-04-27,85,Give Me...A Reason,Buffy,,False,90,78,7,0.691,0.731,0,-9.675,1,0.0371,0.0079,1.11e-05,0.108,0.83,123.044,304160,4
1996-04-27,87,Love Don't Live Here Anymore,Madonna,,False,91,87,2,0.49,0.354,7,-14.953,0,0.0434,0.329,3.31e-05,0.333,0.424,138.651,288267,4
1996-04-27,88,Where Do U Want Me To Put It,Solo,,False,79,50,17,0.782,0.759,8,-5.87,1,0.0447,0.261,0,0.102,0.779,87.01,243667,4
1996-04-27,89,Stayin' Alive,N-Trance,,False,84,62,15,0.805,0.863,6,-7.853,0,0.0771,0.0515,0.000427,0.98,0.826,106.787,245907,4
1996-04-27,90,Mr. Ice Cream Man,Master P,6utJPGnUAGkW7qRaYpoasi,True,0,90,1,0.806,0.666,0,-5.755,1,0.117,0.026,0,0.72,0.571,131.939,307933,4
1996-04-27,91,High And Dry,Radiohead,6utJPGnUAGkW7qRaYpoasi,False,92,78,7,0.419,0.383,4,-11.782,1,0.0256,0.0724,0.0176,0.0896,0.35,87.568,257480,4
1996-04-27,93,Keep Tryin',Groove Theory,,False,89,64,12,0.634,0.598,2,-10.415,1,0.0962,0.0997,0.00035,0.298,0.729,83.082,260440,4
1996-04-27,95,"Guilty (From ""Seven"")",Gravity Kills,,False,98,91,3,0.646,0.905,9,-9.456,0,0.0414,5.12e-05,0.856,0.279,0.579,129.084,242027,4
1996-04-27,96,My Maria,Brooks & Dunn,09qzRI951OVkXGCc33gzcT,True,0,96,1,0.673,0.842,3,-4.627,1,0.0366,0.06,0.000257,0.178,0.898,125.57,208107,4
1996-04-27,98,La Familia,Frost,,False,94,77,9,0.834,0.697,4,-7.063,1,0.19,0.0364,0.000407,0.122,0.618,101.398,243774,4
1996-04-27,100,Drop,The Pharcyde,,False,93,93,3,0.853,0.754,10,-7.158,0,0.259,0.335,6.21e-06,0.252,0.69,95.081,334467,4
