date,position,title,artist,spotify_id,is_new,last_pos,peak_pos,weeks,danceability,energy,key,loudness,mode,speechiness,acousticness,instrumentalness,liveness,valence,tempo,duration_ms,time_signature
1995-02-25,1,Take A Bow,Madonna,1FlDtQBj95pnFbS9kCTZEI,False,2,1,11,0.549,0.408,8,-7.698,1,0.024,0.341,0,0.0764,0.319,80.133,320467,4
1995-02-25,2,Creep,TLC,1FlDtQBj95pnFbS9kCTZEI,False,1,1,16,0.811,0.458,5,-9.688,0,0.0402,0.0193,1.41e-06,0.0526,0.797,92.94,268533,4
1995-02-25,3,On Bended Knee,Boyz II Men,1FlDtQBj95pnFbS9kCTZEI,False,3,1,15,0.631,0.516,8,-8.225,1,0.0353,0.413,0,0.115,0.18,116.654,329800,4
1995-02-25,4,Another Night,Real McCoy,1FlDtQBj95pnFbS9kCTZEI,False,4,3,27,0.813,0.882,7,-7.575,1,0.0402,0.0908,0.00457,0.147,0.874,125.983,236933,4
1995-02-25,5,Baby,Brandy,1FlDtQBj95pnFbS9kCTZEI,False,5,5,4,0.832,0.732,5,-5.075,0,0.0595,0.0116,1.49e-06,0.0628,0.801,91.037,261000,4
1995-02-25,6,Candy Rain,Soul For Real,1FlDtQBj95pnFbS9kCTZEI,False,7,6,8,0.59,0.699,11,-7.529,0,0.079,0.00389,4.69e-05,0.0577,0.63,188.268,276067,4
1995-02-25,7,You Gotta Be,Des'ree,1FlDtQBj95pnFbS9kCTZEI,False,6,6,26,0.627,0.669,0,-9.985,1,0.0412,0.211,2.72e-06,0.111,0.498,94.029,245200,4
1995-02-25,8,If You Love Me,Brownstone,1FlDtQBj95pnFbS9kCTZEI,False,11,8,12,0.687,0.583,7,-10.224,1,0.064,0.224,0,0.106,0.21,95.137,303903,4
1995-02-25,9,Sukiyaki,4PM,1FlDtQBj95pnFbS9kCTZEI,False,9,8,24,0.363,0.388,11,-8.608,0,0.034,0.749,0,0.363,0.348,76.099,162093,4
1995-02-25,10,Hold My Hand,Hootie & The Blowfish,1FlDtQBj95pnFbS9kCTZEI,False,10,10,21,0.22,0.769,11,-5.125,1,0.054,0.208,0,0.0985,0.495,170.773,258333,4
1995-02-25,11,Always,Bon Jovi,1FlDtQBj95pnFbS9kCTZEI,False,8,4,22,0.383,0.659,4,-5.558,1,0.0312,0.117,0,0.0778,0.327,140.795,353027,4
1995-02-25,12,Strong Enough,Sheryl Crow,1FlDtQBj95pnFbS9kCTZEI,False,16,12,9,0.58,0.265,2,-15.267,1,0.0317,0.796,0.00019,0.11,0.583,154.595,189827,3
1995-02-25,14,You Don't Know How It Feels,Tom Petty,,False,15,13,13,0.765,0.502,9,-7.393,1,0.0321,0.119,0.0011,0.171,0.836,144.204,289440,4
1995-02-25,15,Before I Let You Go,BLACKstreet,,False,12,7,19,0.67,0.468,1,-6.725,0,0.0328,0.325,0,0.0516,0.486,140.069,299800,4
1995-02-25,16,The Rhythm Of The Night,Corona,,False,13,11,16,0.688,0.782,5,-12.291,0,0.034,0.000235,0.666,0.0955,0.77,127.822,264307,4
1995-02-25,17,I'm The Only One,Melissa Etheridge,,False,14,8,30,0.614,0.476,0,-9.648,1,0.0321,0.0448,0,0.0608,0.644,84.938,295000,4
1995-02-25,18,If You Think You're Lonely Now,K-Ci Hailey,,False,52,18,2,0.475,0.475,2,-13.562,1,0.0375,0.376,0,0.245,0.524,144.731,233733,5
1995-02-25,19,I Know,Dionne Farris,,False,27,19,5,0.589,0.962,7,-6.815,1,0.181,0.0502,0.00225,0.242,0.503,103.396,227827,4
1995-02-25,20,Every Day Of The Week,Jade,,False,21,20,14,0.757,0.68,1,-8.857,1,0.0338,0.0039,0,0.0742,0.83,97.381,315600,4
1995-02-25,21,Constantly,Immature,,False,19,16,14,0.71,0.519,8,-9.933,1,0.0363,0.165,0.00198,0.0854,0.577,117.837,343333,4
1995-02-25,23,The Sweetest Days,Vanessa Williams,,False,20,18,16,0.482,0.301,10,-10.341,1,0.0273,0.722,0.0012,0.166,0.0692,139.853,211293,4
1995-02-25,24,"Here Comes The Hotstepper (From ""Ready To Wear"")",Ini Kamoze,,False,18,1,24,0.888,0.462,7,-8.615,1,0.205,0.0159,0.000218,0.301,0.435,100.352,250427,4
1995-02-25,26,In The House Of Stone And Light,Martin Page,,False,29,26,11,0.623,0.797,11,-10.826,1,0.0509,0.296,8.34e-05,0.613,0.802,89.274,300800,4
1995-02-25,27,I Miss You,N2U,,False,22,22,13,0.401,0.285,11,-11.322,1,0.0315,0.747,0,0.134,0.171,179.628,256424,4
1995-02-25,28,I Wanna Be Down,Brandy,,False,24,6,22,0.703,0.469,11,-6.515,0,0.0415,0.177,0,0.726,0.661,86.038,291667,4
1995-02-25,29,Bang And Blame,R.E.M.,,False,23,19,6,0.694,0.584,7,-9.855,1,0.0404,0.141,0.545,0.112,0.444,120.949,330933,4
1995-02-25,30,I'll Make Love To You,Boyz II Men,,False,26,1,29,0.567,0.501,2,-8.038,1,0.0241,0.0995,0,0.0986,0.2,142.589,236773,3
1995-02-25,31,Everlasting Love,Gloria Estefan,,False,39,31,5,0.709,0.813,7,-7.056,1,0.0393,0.157,0,0.114,0.854,128.875,241533,4
1995-02-25,32,Freak Like Me,Adina Howard,,False,44,32,3,0.655,0.837,11,-6.04,0,0.0723,0.0262,5.85e-06,0.0454,0.66,91.014,253613,4
1995-02-25,33,Mental Picture,Jon Secada,,False,32,29,14,0.576,0.713,7,-7.808,1,0.0273,0.125,0,0.0687,0.498,86.999,261600,4
1995-02-25,34,Short Dick Man,20 Fingers Featuring Gillette,,False,31,14,25,0.894,0.764,4,-10.028,0,0.0604,0.00154,0.0349,0.0323,0.796,127.038,290933,4
1995-02-25,36,Tootsee Roll,69 Boyz,,False,30,8,34,0.869,0.725,9,-12.507,0,0.256,0.0453,0,0.203,0.699,132.989,261360,4
1995-02-25,37,House Of Love,Amy Grant With Vince Gill,,False,37,37,14,0.546,0.572,1,-11.062,1,0.0265,0.0951,0.000582,0.0627,0.509,161.967,291013,4
1995-02-25,38,100% Pure Love,Crystal Waters,,False,34,11,40,0.811,0.725,8,-7.203,1,0.0491,0.0843,0.0059,0.0567,0.698,120.242,278627,4
1995-02-25,39,All I Wanna Do,Sheryl Crow,,False,35,2,30,0.82,0.528,9,-11.179,1,0.0321,0.111,0.0186,0.257,0.931,120.091,272107,4
1995-02-25,40,I'll Stand By You,Pretenders,,False,33,16,29,0.438,0.606,7,-6.549,1,0.0305,0.3,4.49e-06,0.0754,0.266,133.822,240760,4
1995-02-25,41,Mishale,Andru Donalds,,False,41,38,12,0.604,0.786,10,-5.643,0,0.0741,0.0187,1.04e-05,0.0704,0.795,176.043,241467,4
1995-02-25,42,Secret,Madonna,,False,40,3,21,0.813,0.655,1,-7.884,1,0.0262,0.101,6.65e-05,0.146,0.46,99.982,304933,4
1995-02-25,43,Get Down,Craig Mack,,False,45,43,9,0.709,0.782,7,-3.438,1,0.227,0.262,1.64e-05,0.0721,0.644,94.168,224920,4
1995-02-25,44,Get Ready For This,2 Unlimited,,False,46,44,24,0.797,0.863,11,-7.015,0,0.0559,0.0332,2.22e-05,0.0941,0.769,124.891,224827,4
1995-02-25,45,"Turn The Beat Around (From ""The Specialist"")",Gloria Estefan,,False,38,13,23,0.735,0.804,6,-6.476,0,0.0347,0.0145,0,0.0716,0.539,130.018,233200,4
1995-02-25,46,Hold On,Jamie Walters,,False,54,46,5,0.571,0.553,0,-8.584,1,0.0279,0.0319,0,0.109,0.209,126.215,264560,4
1995-02-25,47,"New Age Girl (From ""Dumb And Dumber"")",Deadeye Dick,,False,48,27,27,0.66,0.797,9,-5.287,1,0.0817,0.56,1.61e-05,0.076,0.808,138.982,204365,4
1995-02-25,48,Foe Tha Love Of $,Bone Thugs-N-Harmony Featuring Eazy-E,1muLq1kBLWIT3pmNC2xl0g,True,0,48,1,0.772,0.695,7,-8.013,1,0.0735,0.00295,0,0.427,0.643,137.868,272440,1
1995-02-25,49,Practice What You Preach,Barry White,1muLq1kBLWIT3pmNC2xl0g,False,47,18,21,0.841,0.412,7,-10.336,1,0.0445,0.0919,0,0.0908,0.661,93.65,239307,3
1995-02-25,50,Wild Night,John Mellencamp With Me'Shell Ndegeocello,1muLq1kBLWIT3pmNC2xl0g,False,43,3,40,0.598,0.728,7,-8.208,1,0.0699,0.427,0.000424,0.0606,0.888,146.04,203566,4
1995-02-25,51,"You Got It (From ""Boys On The Side"")",Bonnie Raitt,1muLq1kBLWIT3pmNC2xl0g,False,74,51,2,0.601,0.683,2,-5.53,0,0.0339,0.495,3.99e-05,0.263,0.752,124.533,216467,4
1995-02-25,52,Whutcha Want?,Nine,1muLq1kBLWIT3pmNC2xl0g,False,50,50,10,0.674,0.767,2,-7.303,1,0.0609,0.104,1.09e-06,0.0893,0.837,97.075,272160,4
1995-02-25,53,Sour Times (Nobody Loves Me),Portishead,1muLq1kBLWIT3pmNC2xl0g,False,55,53,3,0.698,0.633,8,-6.68,0,0.0406,0.0508,0.272,0.264,0.55,94.085,252267,4
1995-02-25,54,Foolin' Around,Changing Faces,1muLq1kBLWIT3pmNC2xl0g,False,53,38,15,0.591,0.574,5,-8.276,0,0.0269,0.228,1.43e-05,0.0794,0.229,131.495,268160,4
1995-02-25,55,She Don't Use Jelly,The Flaming Lips,1muLq1kBLWIT3pmNC2xl0g,False,61,55,11,0.33,0.556,7,-11.494,1,0.0796,0.207,4.39e-05,0.315,0.506,173.828,222279,4
1995-02-25,56,Mad Izm,Channel Live,1muLq1kBLWIT3pmNC2xl0g,False,60,56,4,0.901,0.655,11,-10.085,0,0.273,0.00743,0.00629,0.173,0.807,96.005,255533,4
1995-02-25,57,She's A River,Simple Minds,1muLq1kBLWIT3pmNC2xl0g,False,67,57,2,0.37,0.854,2,-7.018,1,0.0812,0.00147,5.74e-06,0.0586,0.181,184.068,332560,4
1995-02-25,58,Tour,Capleton,1muLq1kBLWIT3pmNC2xl0g,False,63,57,4,0.848,0.896,1,-3.871,0,0.323,0.223,0,0.229,0.758,129.147,212547,5
1995-02-25,59,Dream About You/Funky Melody,Stevie B,1muLq1kBLWIT3pmNC2xl0g,False,71,59,3,0.805,0.451,4,-17.401,0,0.111,0.000532,0.695,0.103,0.465,128.005,369333,4
1995-02-25,60,Kitty Kitty,69 Boyz,1muLq1kBLWIT3pmNC2xl0g,False,51,51,12,0.777,0.901,11,-10.789,0,0.168,0.00106,0,0.428,0.577,133.011,248133,4
1995-02-25,61,Bring The Pain,Method Man,1muLq1kBLWIT3pmNC2xl0g,False,56,45,16,0.835,0.456,6,-10.195,0,0.266,0.38,0.00359,0.16,0.224,101.889,189760,4
1995-02-25,62,Promise Me,Lil Suzy,1muLq1kBLWIT3pmNC2xl0g,False,66,62,10,0.727,0.657,5,-9.577,0,0.0359,0.000203,0.00114,0.0984,0.309,126.011,137040,4
1995-02-25,63,Be Happy,Mary J. Blige,1muLq1kBLWIT3pmNC2xl0g,False,57,29,17,0.682,0.739,10,-8.504,1,0.0763,0.129,0,0.252,0.685,92.894,349560,4
1995-02-25,64,"Whiney, Whiney (From ""Dumb And Dumber"")",Willi One Blood,1muLq1kBLWIT3pmNC2xl0g,False,62,62,6,0.868,0.816,0,-5.342,1,0.078,0.0476,0,0.093,0.943,125.111,216907,4
1995-02-25,65,Brooklyn Zoo,Ol' Dirty Bastard,2FWmKZ3kNbVsKGhuNHsltW,True,0,65,1,0.704,0.701,2,-8.031,1,0.46,0.549,0,0.664,0.618,92.032,217507,4
1995-02-25,66,Shook Ones Part II,Mobb Deep,4nASzyRbzL5qZQuOPjQfsj,True,0,66,1,0.637,0.878,6,-5.506,1,0.369,0.0762,0,0.118,0.652,94.921,256333,4
1995-02-25,67,I Never Seen A Man Cry (aka I Seen A Man Die),Scarface,4nASzyRbzL5qZQuOPjQfsj,False,59,37,15,0.751,0.405,4,-11.766,0,0.125,0.0343,0.00124,0.488,0.507,81.044,261250,4
1995-02-25,68,I Believe,Blessid Union Of Souls,4nASzyRbzL5qZQuOPjQfsj,False,85,68,2,0.491,0.458,11,-8.159,1,0.027,0.653,0,0.164,0.238,141.724,267493,4
1995-02-25,69,Bad Reputation,Freedy Johnston,4nASzyRbzL5qZQuOPjQfsj,False,58,54,10,0.608,0.677,4,-9.951,0,0.0246,0.0058,0.000537,0.266,0.787,114.046,248560,4
1995-02-25,70,(She's Got) Skillz,All-4-One,4nASzyRbzL5qZQuOPjQfsj,False,64,64,8,0.532,0.407,6,-9.658,0,0.0233,0.235,0,0.117,0.23,83.207,259853,4
1995-02-25,71,Always And Forever,Luther Vandross,4nASzyRbzL5qZQuOPjQfsj,False,65,58,12,0.429,0.413,4,-9.566,1,0.032,0.669,7.9e-06,0.288,0.155,149.312,292733,3
1995-02-25,72,Woman To Woman,Jewell,4nASzyRbzL5qZQuOPjQfsj,False,73,72,5,0.682,0.197,0,-21.782,0,0.924,0.555,0,0.154,0.379,98.935,189916,4
1995-02-25,73,Thank You,Boyz II Men,2ESAoDR0NAUMzm81TEBuJE,True,0,73,1,0.678,0.711,1,-8.949,1,0.0759,0.0165,0,0.0184,0.91,95.101,275200,4
1995-02-25,74,I Apologize,Anita Baker,2ESAoDR0NAUMzm81TEBuJE,False,78,74,9,0.581,0.509,11,-10.9,1,0.0528,0.488,0,0.0703,0.363,77.255,256200,4
1995-02-25,75,Age Ain't Nothing But A Number,Aaliyah,2ESAoDR0NAUMzm81TEBuJE,False,79,75,7,0.589,0.532,6,-8.572,0,0.0271,0.155,0.0903,0.323,0.434,84.012,253960,4
1995-02-25,76,I Live My Life For You,Firehouse,4vHp893kV7HksfB5FN1Nk5,True,0,76,1,0.519,0.517,1,-7.531,1,0.0286,0.0537,0,0.0928,0.344,141.808,261827,4
1995-02-25,77,Nika,Vicious,4vHp893kV7HksfB5FN1Nk5,False,72,69,7,0.708,0.837,10,-6.761,0,0.21,0.0406,0.000307,0.118,0.739,89.994,258760,4
1995-02-25,78,Dreamer,Livin' Joy,4vHp893kV7HksfB5FN1Nk5,False,75,72,5,0.74,0.762,5,-7.166,0,0.0418,0.0131,0,0.283,0.832,127.372,223535,4
1995-02-25,80,Living In Danger,Ace Of Base,,False,80,20,19,0.669,0.931,11,-7.161,0,0.0488,0.000573,0.56,0.106,0.829,102.079,223227,4
1995-02-25,81,Take You There,Pete Rock & C.L. Smooth,,False,76,76,4,0.746,0.516,7,-10.643,1,0.246,0.0371,0.000736,0.228,0.565,94.955,284533,4
1995-02-25,82,Breakdown,Fu-Schnickens,,False,82,67,19,0.75,0.719,9,-8.469,1,0.211,0.256,0,0.341,0.694,97.82,250560,4
1995-02-25,83,Rodeo,95 South,,False,83,83,3,0.884,0.823,7,-7.225,1,0.0483,0.012,0.0358,0.251,0.657,132.039,212733,4
1995-02-25,84,Can I Stay With You,Karyn White,,False,81,81,2,0.674,0.465,5,-8.565,1,0.0258,0.441,0,0.098,0.317,129.896,338667,4
1995-02-25,85,"Shame (From ""A Low Down Dirty Shame"")",Zhane,,False,70,28,14,0.778,0.784,11,-4.092,0,0.0384,0.126,0.0049,0.168,0.893,107.22,254973,4
1995-02-25,86,Pimp Of The Year,Dru Down,,False,69,65,10,0.931,0.513,2,-4.655,1,0.263,0.108,0.000435,0.272,0.3,101.064,254093,4
1995-02-25,87,Cocktales,Too $hort,,False,77,69,6,0.838,0.542,1,-6.884,0,0.0951,0.115,0.0075,0.374,0.239,87.094,366160,4
1995-02-25,88,Think Of You,Usher,,False,94,88,2,0.71,0.431,0,-8.333,1,0.0388,0.0553,4.23e-05,0.0537,0.553,93.105,229333,4
1995-02-25,89,Move It Like This,K7,,False,89,89,3,0.788,0.642,7,-9.467,1,0.0392,0.0398,0.000243,0.0529,0.9,106.041,325000,4
1995-02-25,90,Fat Boy,Max-A-Million,,False,84,84,4,0.832,0.953,5,-6.351,0,0.0367,0.0105,0.00607,0.0293,0.981,126.947,214000,4
1995-02-25,91,(I Could Only) Whisper Your Name,"Harry Connick, Jr.",,False,91,67,19,0.543,0.284,5,-13.205,1,0.051,0.683,0,0.101,0.409,125.558,158227,4
1995-02-25,93,This Is How We Do It,Montell Jordan,6uQKuonTU8VKBz5SHZuQXD,True,0,93,1,0.799,0.623,0,-9.374,1,0.0812,0.0141,0,0.43,0.773,103.649,238800,4
1995-02-25,94,Can't Wait,Redman,0gr7MtWpDjyWK3E0xCbJCX,True,0,94,1,0.801,0.592,1,-9.868,1,0.438,0.0522,0.00289,0.0625,0.512,93.54,252613,4
1995-02-25,95,Supa Star,Group Home,0gr7MtWpDjyWK3E0xCbJCX,False,92,85,4,0.708,0.776,4,-7.378,0,0.278,0.0195,2.05e-06,0.216,0.379,91.283,321627,4
1995-02-25,96,How Did I Get By Without You?,John Waite,0gr7MtWpDjyWK3E0xCbJCX,False,93,93,2,0.574,0.586,7,-9.007,1,0.0246,0.101,9.44e-06,0.0524,0.511,88.42,244667,4
1995-02-25,97,Doll Parts,Hole,0gr7MtWpDjyWK3E0xCbJCX,False,90,58,12,0.245,0.542,7,-7.159,1,0.0324,0.147,4.05e-06,0.102,0.365,204.824,211960,4
1995-02-25,98,That's Just What You Are,Aimee Mann,0gr7MtWpDjyWK3E0xCbJCX,False,95,93,6,0.646,0.752,10,-8.357,1,0.0304,0.0338,0.00039,0.0344,0.914,92.639,265400,4
1995-02-25,99,Do You See,Warren G,0gr7MtWpDjyWK3E0xCbJCX,False,87,42,13,0.769,0.624,1,-10.559,0,0.197,0.173,1.02e-06,0.378,0.569,95.232,239067,4
1995-02-25,100,When We Dance,Sting,0gr7MtWpDjyWK3E0xCbJCX,False,86,38,18,0.65,0.323,11,-10.954,1,0.0258,0.709,0.0768,0.0829,0.318,84.02,256707,4
