date,position,title,artist,spotify_id,is_new,last_pos,peak_pos,weeks,danceability,energy,key,loudness,mode,speechiness,acousticness,instrumentalness,liveness,valence,tempo,duration_ms,time_signature
1995-09-16,1,"Gangsta's Paradise (From ""Dangerous Minds"")",Coolio Featuring L.V.,3tcnMlMoipbsAv52IXWWsV,False,1,1,5,0.647,0.514,8,-10.05,1,0.0593,0.0655,0,0.398,0.387,79.974,240693,4
1995-09-16,2,You Are Not Alone,Michael Jackson,3tcnMlMoipbsAv52IXWWsV,False,2,1,3,0.651,0.402,11,-9.303,1,0.028,0.639,7.73e-05,0.0765,0.258,119.873,345600,4
1995-09-16,3,Kiss From A Rose,Seal,3tcnMlMoipbsAv52IXWWsV,False,3,1,13,0.584,0.533,10,-7.11,0,0.0305,0.684,0,0.306,0.224,131.745,288427,3
1995-09-16,4,Waterfalls,TLC,3tcnMlMoipbsAv52IXWWsV,False,4,1,15,0.77,0.505,1,-7.345,1,0.0828,0.311,7.4e-05,0.0777,0.757,171.798,279507,4
1995-09-16,6,Runaway,Janet Jackson,6ayyzu6smOchwXO1vxwfn6,True,0,6,1,0.787,0.86,1,-4.974,1,0.0344,0.364,0.041,0.0612,0.862,109.154,214933,4
1995-09-16,7,I Can Love You Like That,All-4-One,6ayyzu6smOchwXO1vxwfn6,False,6,5,14,0.635,0.712,8,-4.998,1,0.0283,0.0811,0,0.322,0.423,91.024,257960,4
1995-09-16,8,Only Wanna Be With You,Hootie & The Blowfish,6ayyzu6smOchwXO1vxwfn6,False,8,8,7,0.49,0.873,6,-5.861,1,0.0355,0.107,5.19e-06,0.118,0.513,103.272,229587,4
1995-09-16,9,I Got 5 On It,Luniz,6ayyzu6smOchwXO1vxwfn6,False,10,9,15,0.6,0.706,10,-7.899,0,0.361,0.209,0,0.125,0.58,173.926,253533,4
1995-09-16,10,"Colors Of The Wind (From ""Pocahontas"")",Vanessa Williams,6ayyzu6smOchwXO1vxwfn6,False,7,4,13,0.55,0.241,10,-18.092,1,0.0482,0.395,2.37e-05,0.104,0.135,83.964,257867,4
1995-09-16,11,He's Mine,MoKenStef,6ayyzu6smOchwXO1vxwfn6,False,11,7,14,0.616,0.535,11,-8.789,1,0.0379,0.0814,0.0924,0.121,0.391,64.979,253040,4
1995-09-16,12,Run-Around,Blues Traveler,6ayyzu6smOchwXO1vxwfn6,False,9,8,26,0.629,0.867,7,-7.307,1,0.0603,0.0865,0,0.126,0.876,151.695,279800,4
1995-09-16,13,As I Lay Me Down,Sophie B. Hawkins,6ayyzu6smOchwXO1vxwfn6,False,18,13,16,0.519,0.737,10,-8.7,1,0.0437,0.645,1.77e-06,0.271,0.668,82.999,248893,4
1995-09-16,14,1st Of Tha Month,Bone Thugs-N-Harmony,6ayyzu6smOchwXO1vxwfn6,False,14,14,4,0.729,0.581,5,-8.235,0,0.18,0.0777,3.81e-06,0.696,0.508,74.038,314680,4
1995-09-16,15,Don't Take It Personal (Just One Of Dem Days),Monica,6ayyzu6smOchwXO1vxwfn6,False,12,2,21,0.731,0.355,8,-12.741,1,0.0603,0.00864,5.14e-05,0.0579,0.529,175.72,258467,4
1995-09-16,16,I Wish,Skee-Lo,6ayyzu6smOchwXO1vxwfn6,False,13,13,21,0.669,0.809,7,-7.146,1,0.147,0.00137,0,0.38,0.572,97.885,249293,4
1995-09-16,17,One More Chance/Stay With Me,The Notorious B.I.G.,6ayyzu6smOchwXO1vxwfn6,False,16,2,13,0.725,0.68,0,-6.037,1,0.224,0.149,0,0.127,0.695,90.964,268707,4
1995-09-16,19,Player's Anthem,Junior M.A.F.I.A.,,False,15,13,9,0.788,0.626,0,-8.582,1,0.354,0.262,0,0.0791,0.74,87.96,322227,4
1995-09-16,20,Roll To Me,Del Amitri,,False,23,20,11,0.567,0.821,6,-5.894,1,0.0371,0.418,0,0.108,0.895,150.106,132307,4
1995-09-16,21,Water Runs Dry,Boyz II Men,,False,19,2,21,0.589,0.368,0,-12.979,1,0.0264,0.475,0,0.108,0.523,89.626,201400,4
1995-09-16,22,Brokenhearted,Brandy,,False,37,22,2,0.533,0.516,6,-7.178,1,0.0311,0.488,0,0.0985,0.42,74.921,286493,4
1995-09-16,23,Carnival,Natalie Merchant,,False,26,23,7,0.601,0.48,6,-11.41,0,0.0732,0.2,0.0955,0.0297,0.802,188.214,361107,4
1995-09-16,24,Back For Good,Take That,,False,30,24,6,0.6,0.504,5,-9.761,1,0.0292,0.308,0,0.137,0.547,78.961,242267,4
1995-09-16,25,"I Like It, I Love It",Tim McGraw,,False,33,25,4,0.643,0.961,0,-5.298,1,0.0315,0.0196,0,0.948,0.96,124.027,205707,4
1995-09-16,26,Someone To Love,Jon B. Featuring Babyface,,False,20,10,21,0.665,0.452,6,-8.486,0,0.0257,0.14,8.03e-06,0.125,0.304,136.12,272360,4
1995-09-16,27,December,Collective Soul,,False,21,20,19,0.684,0.645,0,-5.707,1,0.0272,0.589,0.00432,0.18,0.366,121.995,285000,4
1995-09-16,28,"Shy Guy (From ""Bad Boys"")",Diana King,,False,24,13,25,0.714,0.825,11,-5.447,0,0.0751,0.0128,0.000569,0.049,0.751,94.074,258560,4
1995-09-16,29,Every Little Thing I Do,Soul For Real,,False,28,17,20,0.713,0.378,7,-9.04,0,0.0298,0.00561,0.00186,0.0845,0.291,99.055,260067,4
1995-09-16,30,Can I Touch You...There?,Michael Bolton,,False,38,30,3,0.555,0.841,0,-6.704,1,0.351,0.281,0,0.244,0.802,82.871,315893,4
1995-09-16,31,Somethin' 4 Da Honeyz,Montell Jordan,,False,22,21,6,0.72,0.7,4,-8.333,0,0.0802,0.0119,0,0.202,0.764,93.167,276107,4
1995-09-16,32,Brown Sugar,D'Angelo,,False,32,27,12,0.718,0.486,9,-8.342,1,0.168,0.53,0.0342,0.102,0.589,83.077,262893,4
1995-09-16,33,Let Her Cry,Hootie & The Blowfish,,False,29,9,28,0.352,0.698,7,-6.278,1,0.0303,0.0353,0,0.113,0.256,142.57,318533,4
1995-09-16,34,Freek'n You,Jodeci,,False,27,14,14,0.709,0.52,5,-9.365,0,0.0301,0.0682,0,0.0629,0.453,134.173,379240,4
1995-09-16,35,You Used To Love Me,Faith Evans,,False,25,24,12,0.702,0.458,0,-8.195,1,0.0348,0.247,1.64e-06,0.126,0.679,89.266,269173,4
1995-09-16,36,Sugar Hill,AZ,,False,31,31,10,0.682,0.647,8,-7.332,1,0.189,0.000693,5.97e-06,0.0693,0.529,181.86,249760,4
1995-09-16,37,'Til You Do Me Right,After 7,,False,40,37,11,0.663,0.462,2,-8.784,0,0.0252,0.306,0,0.0687,0.431,76.794,295000,4
1995-09-16,38,Come And Get Your Love,Real McCoy,,False,34,19,15,0.736,0.864,8,-6.567,1,0.0397,0.0179,1.62e-05,0.345,0.763,108.828,194560,4
1995-09-16,39,Can't Cry Anymore,Sheryl Crow,,False,36,36,11,0.836,0.541,7,-10.881,1,0.0546,0.0313,9.08e-06,0.0603,0.888,110.694,221840,4
1995-09-16,40,Total Eclipse Of The Heart,Nicki French,,False,35,2,25,0.575,0.912,0,-7.039,1,0.0285,0.00463,6.01e-05,0.352,0.591,135.988,232347,4
1995-09-16,41,Tell Me,Groove Theory,,False,43,41,4,0.8,0.361,6,-10.849,0,0.0635,0.0355,3.75e-06,0.0668,0.887,93.059,236067,4
1995-09-16,42,Good,Better Than Ezra,,False,39,30,12,0.615,0.657,7,-6.873,1,0.029,0.000372,0.0204,0.132,0.792,109.95,185093,4
1995-09-16,43,Have You Ever Really Loved A Woman?,Bryan Adams,,False,41,1,23,0.57,0.478,7,-10.185,1,0.0322,0.536,1.33e-05,0.0931,0.358,145.517,291667,3
1995-09-16,44,I Know,Dionne Farris,,False,42,4,34,0.589,0.962,7,-6.815,1,0.181,0.0502,0.00225,0.242,0.503,103.396,227827,4
1995-09-16,45,I Wanna B With U,Fun Factory,,False,46,45,9,0.762,0.863,7,-4.124,1,0.0472,0.0869,0,0.101,0.57,100.003,213600,4
1995-09-16,46,Let Me Be The One,Blessid Union Of Souls,,False,49,46,7,0.562,0.799,7,-8.958,1,0.0463,0.095,2.25e-05,0.217,0.425,88.032,278333,4
1995-09-16,47,Comedown,Bush,,False,51,47,3,0.46,0.81,11,-5.008,0,0.0557,6.54e-05,0.000189,0.123,0.38,139.671,326667,4
1995-09-16,48,Feel Me Flow,Naughty By Nature,,False,44,17,15,0.805,0.754,8,-6.679,0,0.156,0.0468,1.79e-06,0.0855,0.844,90.214,212560,4
1995-09-16,49,I Believe,Blessid Union Of Souls,,False,47,8,31,0.491,0.458,11,-8.159,1,0.027,0.653,0,0.164,0.238,141.724,267493,4
1995-09-16,50,Macarena (Bayside Boys Mix),Los Del Rio,,False,59,50,3,0.927,0.721,8,-12.561,1,0.0908,0.422,4.36e-05,0.0422,0.965,103.018,249382,4
1995-09-16,51,Pretty Girl,Jon B,,False,55,51,3,0.696,0.521,0,-9.32,1,0.0339,0.398,0,0.339,0.646,93.056,258107,4
1995-09-16,52,This Ain't A Love Song,Bon Jovi,,False,45,14,15,0.348,0.635,4,-6.836,1,0.0386,0.0932,0,0.126,0.144,87.974,306240,3
1995-09-16,53,Heaven,Solo,,False,63,53,6,0.405,0.237,0,-9.502,1,0.0351,0.94,0,0.144,0.361,101.51,256492,3
1995-09-16,54,Walk In The Sun,Bruce Hornsby,,False,57,54,4,0.703,0.804,2,-7.338,1,0.0291,0.12,0.00632,0.0541,0.965,122.013,282053,4
1995-09-16,55,Best Friend,Brandy,,False,52,34,16,0.696,0.49,6,-6.631,0,0.0347,0.155,0.000351,0.0563,0.557,179.825,288840,4
1995-09-16,56,Feels So Good,Xscape,,False,54,32,13,0.712,0.454,7,-9.029,1,0.0478,0.0162,1.23e-06,0.111,0.659,82.619,212040,4
1995-09-16,57,MC's Act Like They Don't Know,KRS-One,,False,91,57,2,0.855,0.798,1,-4.018,1,0.237,0.0101,0.000615,0.628,0.855,90.429,295933,4
1995-09-16,58,"Hold Me, Thrill Me, Kiss Me, Kill Me",U2,,False,50,16,13,0.368,0.852,10,-6.978,0,0.0433,7.47e-05,0.258,0.218,0.347,171.692,284600,4
1995-09-16,60,Breakfast At Tiffany's,Deep Blue Something,,False,64,60,5,0.622,0.829,2,-5.548,1,0.029,0.11,0,0.0954,0.539,110.367,257373,4
1995-09-16,61,The Bomb! (These Sounds Fall Into My Mind),The Bucketheads,,False,56,49,12,0.781,0.881,9,-3.804,0,0.0423,0.0119,0.389,0.0797,0.868,125.935,203827,4
1995-09-16,62,Scatman (Ski-Ba-Bop-Ba-Dop-Bop),Scatman John,,False,62,62,5,0.65,0.82,5,-10.9,0,0.0356,0.0655,0.00274,0.215,0.757,135.982,215973,4
1995-09-16,63,Somebody's Crying,Chris Isaak,,False,60,45,15,0.539,0.579,5,-8.058,1,0.0291,0.231,0.0212,0.265,0.718,114.339,168280,4
1995-09-16,64,Pull Up To The Bumper,Patra,,False,67,60,7,0.798,0.801,1,-5.858,1,0.139,0.0773,0.000384,0.2,0.667,107.516,291493,4
1995-09-16,65,I'll Be There For You/You're All I Need To Get By,Method Man Featuring Mary J. Blige,,False,61,3,20,0.722,0.745,4,-6.059,0,0.0536,0.151,6.26e-06,0.337,0.607,95.021,309947,4
1995-09-16,66,Crazy Cool,Paula Abdul,,False,74,66,2,0.642,0.834,1,-5.967,0,0.111,0.0375,3.55e-06,0.12,0.569,87.955,282427,4
1995-09-16,67,We Must Be In Love,Pure Soul,,False,70,65,7,0.628,0.389,5,-11.89,0,0.0294,0.342,1.04e-06,0.508,0.162,122.044,249122,3
1995-09-16,68,"Summertime In The LBC (From ""The Show"")",The Dove Shack,,False,68,68,6,0.695,0.361,5,-9.699,1,0.0318,0.492,2.43e-05,0.0857,0.471,98.998,238771,4
1995-09-16,69,You Have The Right To Remain Silent,Perfect Stranger,,False,73,61,7,0.577,0.436,2,-10.988,1,0.0275,0.411,0,0.107,0.442,163.928,210867,4
1995-09-16,71,I Can't Tell You Why,Brownstone,,False,66,54,10,0.476,0.453,11,-13.593,0,0.0306,0.27,0.000253,0.107,0.41,176.067,245992,4
1995-09-16,72,Molly (Sixteen Candles),Sponge,,False,69,55,6,0.459,0.673,1,-8.846,1,0.028,1.49e-05,0.00174,0.0505,0.549,101.159,221500,4
1995-09-16,73,On The Down Low,Brian McKnight,,False,79,73,5,0.66,0.689,4,-8.442,1,0.206,0.407,0.000731,0.0737,0.72,185.994,298773,4
1995-09-16,74,Misery,Soul Asylum,,False,58,20,12,0.38,0.643,0,-8.304,1,0.0287,4.86e-05,2.67e-05,0.244,0.297,113.674,264360,4
1995-09-16,75,So Many Tears,2Pac,,False,76,44,12,0.899,0.6,1,-7.451,1,0.154,0.0184,1.68e-05,0.0725,0.586,92.717,239227,4
1995-09-16,76,Vibin',Boyz II Men,,False,65,65,3,0.707,0.445,1,-10.081,1,0.0337,0.0187,0.0011,0.0699,0.605,90.981,267893,4
1995-09-16,77,Sentimental,Deborah Cox,,False,89,77,2,0.773,0.79,5,-8.057,1,0.0782,0.193,0,0.0356,0.712,88.977,270333,4
1995-09-16,78,"Jeeps, Lex Coups, Bimaz & Benz",Lost Boyz,,False,78,78,2,0.562,0.652,1,-9.253,0,0.426,0.0103,0,0.557,0.545,177.987,272467,4
1995-09-16,79,Send Me On My Way,Rusted Root,,False,80,79,3,0.5,0.681,0,-9.556,1,0.0672,0.114,4.01e-05,0.139,0.745,119.46,263333,4
1995-09-16,81,Missing,Everything But The Girl,,False,81,81,6,0.677,0.484,9,-10.506,0,0.0324,0.077,4.75e-05,0.135,0.697,123.534,247200,4
1995-09-16,82,Human Nature,Madonna,,False,72,46,13,0.691,0.571,10,-7.737,0,0.0347,0.0313,0.206,0.118,0.641,92.528,293933,4
1995-09-16,83,Keeper Of The Flame,Martin Page,,False,90,83,5,0.679,0.765,7,-10.017,1,0.0378,0.216,0.000303,0.0427,0.885,77.726,364000,4
1995-09-16,84,Round & Round,Twinz,,False,94,84,5,0.632,0.478,11,-7.921,0,0.321,0.0111,6.36e-05,0.34,0.532,94.644,221067,4
1995-09-16,86,Made In England,Elton John,,False,75,52,10,0.615,0.88,0,-8.499,1,0.0411,0.0386,0.00371,0.364,0.707,139.001,308107,4
1995-09-16,87,Sick Of Myself,Matthew Sweet,,False,92,58,17,0.433,0.829,11,-7.715,1,0.044,0.0126,2.36e-05,0.084,0.822,122.733,218560,4
1995-09-16,88,Awake,Letters To Cleo,,False,98,88,2,0.493,0.916,4,-7.173,1,0.0501,3.75e-05,2.41e-05,0.115,0.589,128.615,234627,4
1995-09-16,89,Sittin' On Chrome,Masta Ace Incorporated,6g6iuGWVZVvNDylillKqrL,True,0,89,1,0.862,0.616,1,-10.76,1,0.223,0.00324,0.000592,0.321,0.552,91.065,247973,4
1995-09-16,91,Take Your Time (Do It Right),Max-A-Million,,False,83,64,11,0.842,0.961,5,-6.134,1,0.0421,0.0193,0.0087,0.425,0.939,122.979,220333,4
1995-09-16,92,Big Yellow Taxi,Amy Grant,,False,87,67,14,0.547,0.832,4,-3.071,1,0.0419,0.388,0,0.109,0.887,82.071,181853,4
1995-09-16,93,Hey Now (Girls Just Want To Have Fun),Cyndi Lauper,,False,93,93,2,0.78,0.755,6,-5.604,1,0.0392,0.0461,0.00875,0.383,0.862,101.557,232907,4
1995-09-16,94,Come With Me,Shai,09s7AzC1vXpkIBS8xphJgP,True,0,94,1,0.57,0.32,2,-8.965,1,0.0323,0.644,0,0.244,0.321,183.524,279960,3
1995-09-16,95,"One Boy, One Girl",Collin Raye,3GgpNSCZrgp8O4al5gwdRu,True,0,95,1,0.607,0.483,0,-7.294,1,0.0257,0.671,0,0.0978,0.252,114.353,244000,4
1995-09-16,96,"Return Of The Crooklyn Dodgers (From ""Clockers"")",Crooklyn Dodgers '95,7tojsPuAq9a1puP9ApOJnV,True,0,96,1,0.814,0.819,1,-7.642,1,0.242,0.00381,1.29e-06,0.295,0.566,93.752,304801,4
1995-09-16,97,Not On Your Love,Jeff Carson,04bs5EpVXhbPkqV9uwOAM9,True,0,97,1,0.563,0.524,6,-7.62,1,0.0225,0.432,0,0.272,0.252,86.496,202333,4
1995-09-16,98,My Up And Down,Adina Howard,04bs5EpVXhbPkqV9uwOAM9,False,88,68,10,0.712,0.647,8,-4.149,1,0.0987,0.206,1.05e-06,0.046,0.7,140.216,221093,4
1995-09-16,99,Hey Man Nice Shot,Filter,04bs5EpVXhbPkqV9uwOAM9,False,86,76,7,0.479,0.588,2,-10.773,1,0.0339,0.00214,0.709,0.319,0.305,177.014,314440,4
1995-09-16,100,Stutter,Elastica,04bs5EpVXhbPkqV9uwOAM9,False,82,67,9,0.176,0.98,11,-3.154,1,0.0721,0.0384,0.552,0.237,0.302,172.566,142200,3
