date,position,title,artist,spotify_id,is_new,last_pos,peak_pos,weeks,danceability,energy,key,loudness,mode,speechiness,acousticness,instrumentalness,liveness,valence,tempo,duration_ms,time_signature
2016-12-17,1,Black Beatles,Rae Sremmurd Featuring Gucci Mane,5jROdl6MhcmP3O7h2sVgtw,False,1,1,12,0.794,0.632,0,-6.163,1,0.0649,0.142,0,0.128,0.355,145.926,291893,4
2016-12-17,2,Starboy,The Weeknd Featuring Daft Punk,5jROdl6MhcmP3O7h2sVgtw,False,3,2,11,0.676,0.588,7,-7.025,1,0.275,0.137,8.47e-06,0.137,0.484,186.012,230461,4
2016-12-17,3,Closer,The Chainsmokers Featuring Halsey,5jROdl6MhcmP3O7h2sVgtw,False,2,1,18,0.748,0.524,8,-5.599,1,0.0338,0.414,0,0.111,0.661,95.01,244960,4
2016-12-17,4,Side To Side,Ariana Grande Featuring Nicki Minaj,5jROdl6MhcmP3O7h2sVgtw,False,6,4,14,0.65,0.736,6,-5.84,0,0.229,0.0528,0,0.235,0.613,159.173,226160,4
2016-12-17,5,24K Magic,Bruno Mars,5jROdl6MhcmP3O7h2sVgtw,False,4,4,8,0.818,0.803,1,-4.282,1,0.0797,0.034,0,0.153,0.632,106.97,225983,4
2016-12-17,6,Juju On That Beat (TZ Anthem),Zay Hilfigerrr & Zayion McCall,5jROdl6MhcmP3O7h2sVgtw,False,5,5,10,0.807,0.887,1,-3.892,1,0.275,0.00381,0,0.391,0.78,160.517,144244,4
2016-12-17,7,Let Me Love You,DJ Snake Featuring Justin Bieber,5jROdl6MhcmP3O7h2sVgtw,False,8,4,17,0.649,0.716,8,-5.371,1,0.0349,0.0863,2.63e-05,0.135,0.163,99.988,205947,4
2016-12-17,8,Don't Wanna Know,Maroon 5 Featuring Kendrick Lamar,5jROdl6MhcmP3O7h2sVgtw,False,10,8,8,0.783,0.61,7,-6.124,1,0.0696,0.343,0,0.0983,0.418,100.047,214265,4
2016-12-17,9,Heathens,twenty one pilots,5jROdl6MhcmP3O7h2sVgtw,False,7,2,24,0.732,0.396,4,-9.348,0,0.0286,0.0841,3.58e-05,0.105,0.548,90.024,195920,4
2016-12-17,10,Broccoli,D.R.A.M. Featuring Lil Yachty,5jROdl6MhcmP3O7h2sVgtw,False,9,5,25,0.825,0.485,8,-11.479,1,0.395,0.187,0,0.0904,0.792,145.976,233278,4
2016-12-17,11,Fake Love,Drake,5jROdl6MhcmP3O7h2sVgtw,False,11,10,6,0.928,0.481,9,-9.35,0,0.287,0.105,0,0.176,0.613,134.007,210937,4
2016-12-17,12,Starving,Hailee Steinfeld & Grey Featuring Zedd,5jROdl6MhcmP3O7h2sVgtw,False,13,12,18,0.728,0.616,4,-4.238,1,0.0645,0.378,0,0.105,0.508,99.962,181880,4
2016-12-17,13,I Hate U I Love U,gnash Featuring Olivia O'Brien,5jROdl6MhcmP3O7h2sVgtw,False,14,10,33,0.492,0.275,6,-13.4,0,0.3,0.687,0,0.101,0.18,92.6,251034,4
2016-12-17,14,Caroline,Amine,5jROdl6MhcmP3O7h2sVgtw,False,12,12,13,0.94,0.335,5,-10.179,0,0.505,0.17,0,0.262,0.707,120.04,209640,4
2016-12-17,15,Scars To Your Beautiful,Alessia Cara,5jROdl6MhcmP3O7h2sVgtw,False,15,15,14,0.573,0.739,0,-5.74,1,0.129,0.0285,0,0.111,0.451,97.085,230227,4
2016-12-17,16,Party Monster,The Weeknd,5jROdl6MhcmP3O7h2sVgtw,False,39,16,2,0.573,0.63,1,-8.389,1,0.105,0.189,2.31e-05,0.259,0.218,77.525,249213,4
2016-12-17,17,Bad Things,Machine Gun Kelly x Camila Cabello,5jROdl6MhcmP3O7h2sVgtw,False,28,17,5,0.679,0.697,2,-4.75,1,0.14,0.232,0,0.178,0.287,137.816,239289,4
2016-12-17,18,The Greatest,Sia Featuring Kendrick Lamar,5jROdl6MhcmP3O7h2sVgtw,False,18,18,13,0.668,0.725,1,-6.127,1,0.266,0.0102,0.000479,0.0561,0.729,191.944,210227,4
2016-12-17,19,Cold Water,Major Lazer Featuring Justin Bieber & MO,5jROdl6MhcmP3O7h2sVgtw,False,16,2,19,0.608,0.798,6,-5.092,0,0.0432,0.0736,0,0.156,0.501,92.943,185360,4
2016-12-17,20,Treat You Better,Shawn Mendes,5jROdl6MhcmP3O7h2sVgtw,False,17,6,26,0.443,0.82,10,-4.091,0,0.34,0.107,0,0.107,0.771,82.697,187973,4
2016-12-17,21,Unsteady,X Ambassadors,5jROdl6MhcmP3O7h2sVgtw,False,20,20,29,0.389,0.665,0,-6.169,1,0.0644,0.178,0.000732,0.116,0.199,117.055,193547,4
2016-12-17,22,I Feel It Coming,The Weeknd Featuring Daft Punk,5jROdl6MhcmP3O7h2sVgtw,False,48,22,2,0.773,0.815,0,-5.933,0,0.128,0.415,0,0.087,0.559,92.973,269177,4
2016-12-17,23,All I Want For Christmas Is You,Mariah Carey,5jROdl6MhcmP3O7h2sVgtw,False,0,11,15,0.695,0.652,11,-7.828,0,0.0751,0.000441,5.66e-06,0.0667,0.744,128.024,401680,4
2016-12-17,24,Cheap Thrills,Sia Featuring Sean Paul,5jROdl6MhcmP3O7h2sVgtw,False,21,1,42,0.628,0.698,6,-5.608,0,0.105,0.0472,0.00143,0.0907,0.732,89.976,211667,4
2016-12-17,25,Can't Stop The Feeling!,Justin Timberlake,5jROdl6MhcmP3O7h2sVgtw,False,19,1,30,0.669,0.832,0,-5.72,1,0.0682,0.0106,0,0.0968,0.7,113.035,237547,4
2016-12-17,26,OOOUUU,Young M.A,5jROdl6MhcmP3O7h2sVgtw,False,22,19,14,0.635,0.847,7,-3.152,1,0.447,0.533,0,0.154,0.568,166.072,234650,4
2016-12-17,27,Sidewalks,The Weeknd Featuring Kendrick Lamar,4h90qkbnW1Qq6pBhoPvwko,True,0,27,1,0.542,0.72,1,-5.136,0,0.0628,0.147,0,0.348,0.623,149.828,231360,4
2016-12-17,28,In The Name Of Love,Martin Garrix & Bebe Rexha,4h90qkbnW1Qq6pBhoPvwko,False,24,24,16,0.501,0.519,4,-5.88,0,0.0409,0.109,0,0.454,0.168,133.99,195707,4
2016-12-17,29,Don't Let Me Down,The Chainsmokers Featuring Daya,4h90qkbnW1Qq6pBhoPvwko,False,23,3,42,0.532,0.869,11,-5.094,1,0.172,0.157,0.00508,0.136,0.422,159.803,208373,4
2016-12-17,30,Love On The Brain,Rihanna,4h90qkbnW1Qq6pBhoPvwko,False,34,30,7,0.509,0.637,4,-4.83,0,0.0471,0.0717,1.08e-05,0.0789,0.378,172.006,224000,3
2016-12-17,31,Reminder,The Weeknd,37F0uwRSrdzkBiuj0D5UHI,True,0,31,1,0.706,0.505,8,-6.923,1,0.193,0.142,0,0.164,0.388,160.053,218880,4
2016-12-17,32,Blue Ain't Your Color,Keith Urban,37F0uwRSrdzkBiuj0D5UHI,False,25,24,12,0.69,0.416,7,-7.865,1,0.0335,0.617,1.37e-06,0.102,0.479,82.45,230600,3
2016-12-17,33,This Is What You Came For,Calvin Harris Featuring Rihanna,37F0uwRSrdzkBiuj0D5UHI,False,26,3,31,0.63,0.928,9,-2.787,0,0.0331,0.199,0.124,0.148,0.465,123.963,222160,4
2016-12-17,34,Six Feet Under,The Weeknd,4mU5iXHeLgbR94siF7p1sY,True,0,34,1,0.772,0.504,6,-8.219,0,0.0761,0.129,0,0.125,0.244,140.035,237573,4
2016-12-17,35,All Time Low,Jon Bellion,4mU5iXHeLgbR94siF7p1sY,False,32,32,8,0.617,0.567,0,-4.188,1,0.0828,0.0584,0,0.0933,0.505,90.246,217603,4
2016-12-17,36,Chill Bill,Rob $tone Featuring J. Davi$ & Spooks,4mU5iXHeLgbR94siF7p1sY,False,30,29,18,0.886,0.427,6,-10.028,1,0.145,0.0312,0.00099,0.0906,0.23,108.034,177184,4
2016-12-17,37,Do You Mind,"DJ Khaled Featuring Nicki Minaj, Chris Brown, August Alsina, Jeremih, Future & Rick Ross",4mU5iXHeLgbR94siF7p1sY,False,27,27,17,0.412,0.548,10,-6.981,1,0.243,0.0173,0,0.181,0.176,81.293,325615,4
2016-12-17,38,Ride,twenty one pilots,4mU5iXHeLgbR94siF7p1sY,False,31,5,38,0.645,0.713,6,-5.355,1,0.0393,0.00835,0,0.113,0.566,74.989,214507,4
2016-12-17,39,May We All,Florida Georgia Line Featuring Tim McGraw,4mU5iXHeLgbR94siF7p1sY,False,33,30,14,0.514,0.918,7,-4.306,1,0.0365,0.0409,0,0.342,0.64,150.033,226173,4
2016-12-17,40,This Town,Niall Horan,4mU5iXHeLgbR94siF7p1sY,False,29,25,10,0.677,0.401,9,-8.467,1,0.0308,0.712,0,0.116,0.195,111.825,232852,4
2016-12-17,41,X,21 Savage & Metro Boomin Featuring Future,4mU5iXHeLgbR94siF7p1sY,False,36,36,12,0.835,0.413,1,-9.81,1,0.396,0.373,0.00133,0.101,0.111,149.004,258880,4
2016-12-17,42,Needed Me,Rihanna,4mU5iXHeLgbR94siF7p1sY,False,38,7,44,0.671,0.314,5,-8.091,0,0.244,0.11,0,0.0825,0.296,110.898,191600,4
2016-12-17,43,Die For You,The Weeknd,2bk3kDxxFLHafZDuw06Fxs,True,0,43,1,0.602,0.528,1,-7.152,0,0.0556,0.11,0,0.157,0.455,133.851,260256,4
2016-12-17,44,Rockin',The Weeknd,36YCdzT57us0LhDmCYtrNE,True,0,44,1,0.738,0.885,9,-5.547,0,0.206,0.0133,0,0.0821,0.752,112.878,232880,4
2016-12-17,45,One Dance,Drake Featuring WizKid & Kyla,36YCdzT57us0LhDmCYtrNE,False,37,1,35,0.792,0.625,1,-5.609,1,0.0536,0.00776,0.0018,0.329,0.37,103.967,173987,4
2016-12-17,46,All I Know,The Weeknd Featuring Future,0NWqNXBJTpXbkI5rPWNy3p,True,0,46,1,0.467,0.417,8,-10.614,0,0.074,0.421,0.000202,0.102,0.171,120.021,321027,4
2016-12-17,47,Secrets,The Weeknd,00NAQYOP4AmWR549nnYJZu,True,0,47,1,0.664,0.771,0,-5.779,1,0.0533,0.0155,9.6e-06,0.46,0.763,109.945,265600,4
2016-12-17,48,True Colors,The Weeknd,1oGdVdYjeQvojGKDddxLQQ,True,0,48,1,0.624,0.424,1,-8.237,1,0.24,0.286,0,0.173,0.584,76.671,206013,4
2016-12-17,49,Bad And Boujee,Migos Featuring Lil Uzi Vert,1oGdVdYjeQvojGKDddxLQQ,False,54,49,3,0.927,0.665,11,-5.313,1,0.244,0.061,0,0.123,0.175,127.076,343150,4
2016-12-17,50,Mercy,Shawn Mendes,1oGdVdYjeQvojGKDddxLQQ,False,35,35,11,0.57,0.347,11,-6.649,0,0.0358,0.711,0,0.11,0.43,74.054,219160,4
2016-12-17,51,Bounce Back,Big Sean,1oGdVdYjeQvojGKDddxLQQ,False,51,51,4,0.78,0.575,1,-5.628,0,0.139,0.106,0,0.129,0.273,81.502,222360,4
2016-12-17,52,How Far I'll Go,Auli'i Cravalho,6mb6lVLNrcUgLnEN8QnDJd,True,0,52,1,0.571,0.307,1,-10.958,0,0.0499,0.649,0,0.178,0.108,83.72,163387,4
2016-12-17,53,Love Me Now,John Legend,6mb6lVLNrcUgLnEN8QnDJd,False,43,41,6,0.488,0.762,8,-3.842,1,0.0865,0.591,0,0.0763,0.709,123.889,210293,4
2016-12-17,54,Used To This,Future Featuring Drake,6mb6lVLNrcUgLnEN8QnDJd,False,40,14,4,0.618,0.727,3,-7.224,0,0.208,0.0312,0,0.196,0.401,164.992,180520,4
2016-12-17,55,False Alarm,The Weeknd,6mb6lVLNrcUgLnEN8QnDJd,False,0,55,3,0.517,0.677,8,-6.373,0,0.0746,0.0324,3.37e-05,0.189,0.192,173.978,220307,4
2016-12-17,56,Hallelujah,Pentatonix,6mb6lVLNrcUgLnEN8QnDJd,False,65,32,6,0.364,0.378,7,-7.381,0,0.0331,0.47,0,0.339,0.366,89.918,268960,3
2016-12-17,57,You Was Right,Lil Uzi Vert,6mb6lVLNrcUgLnEN8QnDJd,False,52,52,21,0.843,0.359,0,-7.417,1,0.461,0.069,0,0.12,0.156,81.987,163944,4
2016-12-17,58,Pick Up The Phone,Young Thug And Travis Scott Featuring Quavo,6mb6lVLNrcUgLnEN8QnDJd,False,49,43,16,0.711,0.739,7,-3.804,0,0.129,0.114,0,0.226,0.43,136.919,252256,4
2016-12-17,59,Wanna Be That Song,Brett Eldredge,6mb6lVLNrcUgLnEN8QnDJd,False,57,57,9,0.518,0.686,9,-4.911,1,0.0313,0.114,0,0.114,0.334,144.065,236227,4
2016-12-17,60,Come And See Me,PARTYNEXTDOOR Featuring Drake,6mb6lVLNrcUgLnEN8QnDJd,False,56,55,22,0.717,0.347,11,-10.265,0,0.0636,0.0511,2.43e-06,0.087,0.0589,84.987,235477,4
2016-12-17,61,Stargirl Interlude,The Weeknd Featuring Lana Del Rey,4EDijkJdHBZZ0GwJ12iTAj,True,0,61,1,0.638,0.474,5,-12.7,0,0.124,0.351,0.191,0.105,0.441,179.771,111640,4
2016-12-17,62,Tiimmy Turner,Desiigner,4EDijkJdHBZZ0GwJ12iTAj,False,45,34,19,0.603,0.725,6,-3.054,1,0.0393,0.174,0,0.0786,0.304,122.803,239853,4
2016-12-17,63,Sleep Without You,Brett Young,4EDijkJdHBZZ0GwJ12iTAj,False,47,47,12,0.626,0.707,5,-5.755,0,0.0425,0.0169,0,0.0772,0.653,88.543,187813,4
2016-12-17,64,Song For Another Time,Old Dominion,4EDijkJdHBZZ0GwJ12iTAj,False,60,60,10,0.498,0.804,11,-3.995,1,0.0332,0.125,0,0.167,0.697,166.054,191827,4
2016-12-17,65,Fresh Eyes,Andy Grammer,4EDijkJdHBZZ0GwJ12iTAj,False,59,59,9,0.828,0.56,0,-6.685,1,0.0327,0.548,3.66e-05,0.15,0.872,122.054,198001,4
2016-12-17,66,Sneakin',Drake Featuring 21 Savage,4EDijkJdHBZZ0GwJ12iTAj,False,50,28,6,0.806,0.558,8,-6.538,1,0.172,0.00496,1.45e-06,0.16,0.26,85.011,251333,4
2016-12-17,67,Attention,The Weeknd,6pDVjCUA3B1vg9waKutAsv,True,0,67,1,0.671,0.428,4,-7.052,0,0.124,0.688,0.000182,0.119,0.362,148.04,197653,4
2016-12-17,68,Nothing Without You,The Weeknd,57qiTKh8bVX0VtfUNTQqhw,True,0,68,1,0.575,0.634,1,-8.1,1,0.068,0.0646,0,0.0878,0.191,109.825,198653,4
2016-12-17,69,A Lonely Night,The Weeknd,0ifooM33X1iBxVYyOkSbXW,True,0,69,1,0.853,0.663,7,-6.955,0,0.0755,0.0431,8.71e-06,0.0891,0.864,113.998,220173,4
2016-12-17,70,No Heart,21 Savage & Metro Boomin,0ifooM33X1iBxVYyOkSbXW,False,61,57,6,0.906,0.444,4,-8.692,0,0.384,0.136,6.44e-05,0.173,0.678,140.063,235040,4
2016-12-17,71,Love To Lay,The Weeknd,27BgDmciSjoxTG0almHTpZ,True,0,71,1,0.711,0.807,7,-5.052,0,0.0608,0.052,0,0.214,0.698,116.971,223293,4
2016-12-17,72,Ordinary Life,The Weeknd,15k2nBQJ0teDmPZHrOXL2N,True,0,72,1,0.537,0.587,7,-7.486,0,0.0771,0.0275,0,0.0961,0.365,149.748,221920,4
2016-12-17,73,Too Much Sauce,DJ ESCO Featuring Future & Lil Uzi Vert,15k2nBQJ0teDmPZHrOXL2N,False,62,61,15,0.96,0.547,6,-6.992,0,0.0786,0.0496,0,0.216,0.186,121.01,223093,4
2016-12-17,74,Middle Of A Memory,Cole Swindell,15k2nBQJ0teDmPZHrOXL2N,False,58,46,19,0.531,0.746,11,-4.228,1,0.0329,0.0972,0,0.102,0.304,139.788,226307,4
2016-12-17,75,1 Night,Lil Yachty,15k2nBQJ0teDmPZHrOXL2N,False,55,49,17,0.764,0.475,0,-12.618,1,0.114,0.345,0,0.14,0.34,129.974,243270,4
2016-12-17,76,Say You Won't Let Go,James Arthur,15k2nBQJ0teDmPZHrOXL2N,False,68,68,6,0.358,0.557,10,-7.398,1,0.059,0.695,0,0.0902,0.494,85.043,211467,4
2016-12-17,77,HandClap,Fitz And The Tantrums,15k2nBQJ0teDmPZHrOXL2N,False,63,63,10,0.636,0.836,8,-3.004,1,0.0427,0.00609,0.000157,0.0828,0.715,139.956,193253,4
2016-12-17,78,Water Under The Bridge,Adele,15k2nBQJ0teDmPZHrOXL2N,False,80,70,4,0.59,0.833,5,-6.503,0,0.0615,0.0142,5.4e-06,0.105,0.538,94.963,240439,4
2016-12-17,79,Dirty Laundry,Carrie Underwood,15k2nBQJ0teDmPZHrOXL2N,False,70,69,7,0.456,0.874,10,-4.129,0,0.114,0.0595,1.12e-05,0.111,0.5,200.179,204093,4
2016-12-17,80,Better Man,Little Big Town,15k2nBQJ0teDmPZHrOXL2N,False,69,53,5,0.514,0.836,5,-3.663,1,0.0381,0.112,0,0.0878,0.501,143.888,263120,4
2016-12-17,81,Setting The World On Fire,Kenny Chesney Featuring P!nk,15k2nBQJ0teDmPZHrOXL2N,False,67,29,18,0.61,0.822,0,-4.422,1,0.0355,0.0171,1.88e-06,0.093,0.437,93.993,217467,4
2016-12-17,82,All We Know,The Chainsmokers Featuring Phoebe Ryan,15k2nBQJ0teDmPZHrOXL2N,False,66,18,9,0.662,0.586,0,-8.821,1,0.0307,0.097,0.00272,0.115,0.296,90.0,194080,4
2016-12-17,83,You're Welcome,Dwayne Johnson,6U4VqEHy4n5VeiH4pQPL24,True,0,83,1,0.788,0.745,5,-7.072,1,0.258,0.29,0,0.0373,0.672,135.278,163893,4
2016-12-17,84,That's My Girl,Fifth Harmony,6U4VqEHy4n5VeiH4pQPL24,False,73,73,2,0.596,0.851,5,-4.245,0,0.121,0.0358,3.19e-05,0.365,0.612,202.049,204013,4
2016-12-17,85,Distraction,Kehlani,2wSQyp6VzUopSFBinRo1iD,True,0,85,1,0.66,0.698,5,-6.266,0,0.0467,0.0266,0,0.296,0.396,120.959,235693,4
2016-12-17,86,Star Of The Show,Thomas Rhett,2wSQyp6VzUopSFBinRo1iD,False,82,82,5,0.695,0.641,7,-5.807,1,0.0261,0.142,0,0.131,0.664,101.974,181200,4
2016-12-17,87,A Little More Summertime,Jason Aldean,2wSQyp6VzUopSFBinRo1iD,False,64,52,13,0.482,0.823,9,-4.446,1,0.0661,0.0386,3.69e-05,0.0948,0.451,167.665,219547,4
2016-12-17,88,How Far I'll Go,Alessia Cara,1ehPJRt49h6N0LoryqKZXq,True,0,88,1,0.31,0.54,9,-9.629,1,0.346,0.163,0.000129,0.0713,0.148,180.994,175507,4
2016-12-17,89,Selfish,PnB Rock,1ehPJRt49h6N0LoryqKZXq,False,81,81,4,0.638,0.6,1,-5.84,0,0.0438,0.114,0,0.187,0.0399,101.981,245604,4
2016-12-17,90,Chantaje,Shakira Featuring Maluma,1ehPJRt49h6N0LoryqKZXq,False,77,77,3,0.852,0.773,8,-2.921,0,0.0776,0.187,3.05e-05,0.159,0.907,102.034,195840,4
2016-12-17,91,How I'll Always Be,Tim McGraw,1ehPJRt49h6N0LoryqKZXq,False,87,87,7,0.578,0.825,2,-4.693,1,0.0331,0.312,1.4e-05,0.0912,0.654,93.035,213453,4
2016-12-17,92,A Guy With A Girl,Blake Shelton,1ehPJRt49h6N0LoryqKZXq,False,92,92,3,0.552,0.893,0,-4.593,1,0.0383,0.0158,0,0.105,0.777,163.948,189467,4
2016-12-17,93,We Know The Way,Opetaia Foa'i & Lin-Manuel Miranda,6YH2r9NyEJTjlRmKOCvxgJ,True,0,93,1,0.689,0.578,9,-8.737,1,0.0368,0.36,0,0.11,0.391,98.043,141413,4
2016-12-17,94,Look Alive,Rae Sremmurd,6YH2r9NyEJTjlRmKOCvxgJ,False,72,72,6,0.786,0.583,0,-7.415,1,0.0393,0.0552,1.84e-06,0.326,0.229,120.024,228000,4
2016-12-17,95,What They Want,Russ,6YH2r9NyEJTjlRmKOCvxgJ,False,83,83,6,0.71,0.404,1,-10.04,0,0.379,0.484,0,0.0953,0.398,139.553,165853,4
2016-12-17,96,Fade,Kanye West,6YH2r9NyEJTjlRmKOCvxgJ,False,71,47,13,0.752,0.765,9,-5.805,0,0.0908,0.118,0,0.31,0.309,105.998,193748,4
2016-12-17,97,Capsize,Frenship & Emily Warren,6YH2r9NyEJTjlRmKOCvxgJ,False,84,78,10,0.683,0.708,5,-6.244,0,0.0305,0.0398,0.155,0.686,0.355,92.991,237707,4
2016-12-17,98,Make Me (Cry),Noah Cyrus Featuring Labrinth,2BrzlUj1u1CtvaJDGIKpsP,True,0,98,1,0.588,0.471,0,-7.287,1,0.0577,0.592,0.00146,0.0733,0.209,152.881,242081,4
2016-12-17,100,Sex With Me,Rihanna,,False,95,92,6,0.58,0.532,1,-5.668,0,0.0424,0.294,0,0.0948,0.39,112.049,206400,4
