date,position,title,artist,spotify_id,is_new,last_pos,peak_pos,weeks,danceability,energy,key,loudness,mode,speechiness,acousticness,instrumentalness,liveness,valence,tempo,duration_ms,time_signature
2018-12-08,1,Sicko Mode,Travis Scott,0TkJIyL69RAUIbNwGub6uR,False,2,1,17,0.834,0.73,8,-3.714,1,0.222,0.00513,0,0.124,0.446,155.008,312820,4
2018-12-08,2,"Thank U, Next",Ariana Grande,0TkJIyL69RAUIbNwGub6uR,False,1,1,4,0.717,0.653,1,-5.634,1,0.0658,0.229,0,0.101,0.412,106.966,207320,4
2018-12-08,3,Happier,Marshmello & Bastille,0TkJIyL69RAUIbNwGub6uR,False,3,3,15,0.687,0.792,5,-2.749,1,0.0452,0.191,0,0.167,0.671,100.015,214290,4
2018-12-08,4,Without Me,Halsey,0TkJIyL69RAUIbNwGub6uR,False,4,4,8,0.752,0.488,6,-7.05,1,0.0705,0.297,9.11e-06,0.0936,0.533,136.041,201661,4
2018-12-08,5,High Hopes,Panic! At The Disco,0TkJIyL69RAUIbNwGub6uR,False,6,5,17,0.579,0.904,5,-2.729,1,0.0618,0.193,0,0.064,0.681,82.014,190947,4
2018-12-08,6,Mo Bamba,Sheck Wes,0TkJIyL69RAUIbNwGub6uR,False,7,6,14,0.729,0.625,4,-5.266,1,0.0315,0.194,0.00986,0.248,0.261,146.034,183907,4
2018-12-08,7,ZEZE,Kodak Black Featuring Travis Scott & Offset,0TkJIyL69RAUIbNwGub6uR,False,10,2,7,0.861,0.603,8,-5.788,0,0.176,0.0521,0,0.0924,0.504,98.043,228760,4
2018-12-08,8,Drip Too Hard,Lil Baby & Gunna,0TkJIyL69RAUIbNwGub6uR,False,9,4,11,0.897,0.662,1,-6.903,0,0.292,0.0852,0,0.534,0.389,112.511,145543,4
2018-12-08,9,Girls Like You,Maroon 5 Featuring Cardi B,0TkJIyL69RAUIbNwGub6uR,False,8,1,27,0.609,0.529,0,-6.859,1,0.106,0.545,0,0.127,0.474,60.349,235680,4
2018-12-08,10,Lucid Dreams,Juice WRLD,0TkJIyL69RAUIbNwGub6uR,False,5,2,29,0.511,0.566,6,-7.23,0,0.2,0.349,0,0.34,0.218,83.903,239836,4
2018-12-08,11,Better Now,Post Malone,0TkJIyL69RAUIbNwGub6uR,False,11,3,31,0.68,0.578,10,-5.804,1,0.04,0.331,0,0.135,0.341,145.038,231267,4
2018-12-08,12,Youngblood,5 Seconds Of Summer,0TkJIyL69RAUIbNwGub6uR,False,12,7,26,0.596,0.854,7,-5.114,0,0.463,0.0169,0,0.124,0.152,120.274,203418,4
2018-12-08,13,Breathin,Ariana Grande,0TkJIyL69RAUIbNwGub6uR,False,13,13,15,0.568,0.656,8,-5.413,1,0.0433,0.0211,1.37e-05,0.213,0.364,100.049,198160,4
2018-12-08,14,All I Want For Christmas Is You,Mariah Carey,0TkJIyL69RAUIbNwGub6uR,False,29,9,26,0.695,0.652,11,-7.828,0,0.0751,0.000441,5.66e-06,0.0667,0.744,128.024,401680,4
2018-12-08,15,Wake Up In The Sky,Gucci Mane X Bruno Mars X Kodak Black,0TkJIyL69RAUIbNwGub6uR,False,14,14,11,0.8,0.578,4,-5.144,0,0.0485,0.00381,0,0.359,0.367,143.01,204665,4
2018-12-08,16,Trip,Ella Mai,0TkJIyL69RAUIbNwGub6uR,False,15,11,17,0.477,0.61,11,-5.628,0,0.144,0.225,0,0.107,0.358,79.882,213993,4
2018-12-08,17,Sunflower (Spider-Man: Into The Spider-Verse),Post Malone & Swae Lee,0TkJIyL69RAUIbNwGub6uR,False,16,9,6,0.76,0.479,2,-5.574,1,0.0466,0.556,0,0.0703,0.913,89.911,158040,4
2018-12-08,18,Eastside,"benny blanco, Halsey & Khalid",0TkJIyL69RAUIbNwGub6uR,False,17,17,20,0.56,0.68,6,-7.648,0,0.321,0.555,0,0.116,0.319,89.391,173800,4
2018-12-08,19,MIA,Bad Bunny Featuring Drake,0TkJIyL69RAUIbNwGub6uR,False,18,5,7,0.817,0.539,6,-6.349,0,0.0621,0.0141,0.000496,0.099,0.158,97.062,210368,4
2018-12-08,20,Love Lies,Khalid & Normani,0TkJIyL69RAUIbNwGub6uR,False,19,9,41,0.708,0.648,6,-5.626,1,0.0449,0.0956,0,0.134,0.338,143.955,201707,4
2018-12-08,21,It's The Most Wonderful Time Of The Year,Andy Williams,0TkJIyL69RAUIbNwGub6uR,False,0,21,6,0.24,0.598,7,-8.435,1,0.0369,0.766,0,0.117,0.776,201.629,151933,3
2018-12-08,22,Taki Taki,"DJ Snake Featuring Selena Gomez, Ozuna & Cardi B",0TkJIyL69RAUIbNwGub6uR,False,22,11,9,0.842,0.801,8,-4.167,0,0.228,0.157,4.82e-06,0.0642,0.617,95.881,212500,4
2018-12-08,23,Rockin' Around The Christmas Tree,Brenda Lee,0TkJIyL69RAUIbNwGub6uR,False,0,14,23,0.589,0.472,8,-8.749,1,0.0502,0.614,0,0.505,0.898,67.196,126267,4
2018-12-08,24,Money,Cardi B,0TkJIyL69RAUIbNwGub6uR,False,21,13,6,0.95,0.59,8,-6.508,0,0.29,0.00534,0,0.11,0.219,130.003,183527,4
2018-12-08,25,Natural,Imagine Dragons,0TkJIyL69RAUIbNwGub6uR,False,20,13,19,0.704,0.611,2,-6.112,1,0.0409,0.217,0,0.0812,0.22,100.0,189467,4
2018-12-08,26,A Holly Jolly Christmas,Burl Ives,0TkJIyL69RAUIbNwGub6uR,False,0,26,6,0.683,0.375,0,-13.056,1,0.0303,0.579,0,0.076,0.888,140.467,135533,4
2018-12-08,27,Leave Me Alone,Flipp Dinero,0TkJIyL69RAUIbNwGub6uR,False,28,27,11,0.792,0.743,7,-2.806,1,0.0851,0.107,0,0.183,0.742,150.024,195637,4
2018-12-08,28,Shallow,Lady Gaga & Bradley Cooper,0TkJIyL69RAUIbNwGub6uR,False,23,5,9,0.572,0.385,7,-6.362,1,0.0308,0.371,0,0.231,0.323,95.799,215733,4
2018-12-08,29,Better,Khalid,0TkJIyL69RAUIbNwGub6uR,False,43,29,11,0.596,0.552,0,-10.278,0,0.097,0.0765,0.334,0.104,0.112,97.949,229320,4
2018-12-08,30,Beautiful,Bazzi Featuring Camila Cabello,0TkJIyL69RAUIbNwGub6uR,False,30,30,17,0.638,0.717,2,-4.722,1,0.0337,0.346,0,0.105,0.249,100.027,180000,4
2018-12-08,31,I Like It,"Cardi B, Bad Bunny & J Balvin",0TkJIyL69RAUIbNwGub6uR,False,24,1,34,0.816,0.726,5,-3.998,0,0.129,0.099,0,0.372,0.65,136.048,253390,4
2018-12-08,32,Broken,lovelytheband,0TkJIyL69RAUIbNwGub6uR,False,35,29,20,0.666,0.728,7,-5.808,1,0.0419,0.00175,4.26e-06,0.0429,0.51,122.996,204878,4
2018-12-08,33,Jingle Bell Rock,Bobby Helms,0TkJIyL69RAUIbNwGub6uR,False,0,29,21,0.754,0.424,2,-8.463,1,0.0363,0.643,0,0.0652,0.806,119.705,130973,4
2018-12-08,34,God Is A Woman,Ariana Grande,0TkJIyL69RAUIbNwGub6uR,False,26,8,20,0.602,0.658,1,-5.934,1,0.0558,0.0233,6e-05,0.237,0.268,145.031,197547,4
2018-12-08,35,Taste,Tyga Featuring Offset,0TkJIyL69RAUIbNwGub6uR,False,27,8,27,0.884,0.559,0,-7.442,1,0.12,0.0236,0,0.101,0.342,97.994,232959,4
2018-12-08,36,FEFE,6ix9ine Featuring Nicki Minaj & Murda Beatz,0TkJIyL69RAUIbNwGub6uR,False,38,3,19,0.931,0.387,1,-9.127,1,0.412,0.088,0,0.136,0.376,125.978,179405,4
2018-12-08,37,In My Feelings,Drake,0TkJIyL69RAUIbNwGub6uR,False,25,1,22,0.835,0.626,1,-5.833,1,0.125,0.0589,6e-05,0.396,0.35,91.03,217925,4
2018-12-08,38,Speechless,Dan + Shay,0TkJIyL69RAUIbNwGub6uR,False,33,33,12,0.616,0.438,1,-5.968,1,0.0298,0.356,0,0.24,0.386,135.929,213387,4
2018-12-08,39,The Christmas Song (Merry Christmas To You),Nat King Cole,0TkJIyL69RAUIbNwGub6uR,False,0,37,13,0.319,0.21,1,-15.231,1,0.0341,0.92,8.06e-05,0.138,0.209,78.696,192160,4
2018-12-08,40,Uproar,Lil Wayne,0TkJIyL69RAUIbNwGub6uR,False,37,7,9,0.743,0.87,1,-2.188,1,0.212,0.0595,0,0.299,0.884,99.079,194184,4
2018-12-08,41,Lose It,Kane Brown,0TkJIyL69RAUIbNwGub6uR,False,40,28,20,0.544,0.854,4,-4.968,0,0.0289,0.00245,1.2e-06,0.249,0.436,91.966,178987,4
2018-12-08,42,She Got The Best Of Me,Luke Combs,0TkJIyL69RAUIbNwGub6uR,False,34,34,16,0.533,0.907,11,-3.793,1,0.0406,0.0292,0,0.386,0.7,150.99,183160,4
2018-12-08,43,Last Christmas,Wham!,0TkJIyL69RAUIbNwGub6uR,False,0,41,5,0.735,0.478,2,-12.472,1,0.0293,0.189,2.48e-06,0.355,0.947,107.682,262960,4
2018-12-08,44,Yes Indeed,Lil Baby & Drake,0TkJIyL69RAUIbNwGub6uR,False,31,6,29,0.963,0.346,5,-9.309,0,0.53,0.0355,0,0.108,0.562,119.957,142273,4
2018-12-08,45,Tequila,Dan + Shay,0TkJIyL69RAUIbNwGub6uR,False,36,21,38,0.489,0.581,11,-5.731,1,0.0281,0.0312,0,0.132,0.494,86.016,196747,4
2018-12-08,46,Nonstop,Drake,0TkJIyL69RAUIbNwGub6uR,False,32,2,22,0.912,0.412,7,-8.074,1,0.123,0.0165,0.0126,0.104,0.423,154.983,238614,4
2018-12-08,47,Ring,Cardi B Featuring Kehlani,0TkJIyL69RAUIbNwGub6uR,False,41,28,19,0.765,0.491,1,-7.859,0,0.145,0.0626,0,0.0994,0.56,105.965,177140,4
2018-12-08,48,Dangerous,Meek Mill Featuring Jeremih & PnB Rock,0TkJIyL69RAUIbNwGub6uR,False,51,48,15,0.734,0.493,0,-7.528,1,0.308,0.0467,0,0.0477,0.562,86.043,233750,4
2018-12-08,49,Best Shot,Jimmie Allen,0TkJIyL69RAUIbNwGub6uR,False,47,46,11,0.629,0.464,4,-8.72,1,0.0334,0.75,0,0.0853,0.523,156.051,195053,4
2018-12-08,50,Boo'd Up,Ella Mai,0TkJIyL69RAUIbNwGub6uR,False,42,5,35,0.561,0.779,10,-5.107,0,0.0531,0.0862,0,0.078,0.235,81.965,256064,4
2018-12-08,51,Lie,NF,0TkJIyL69RAUIbNwGub6uR,False,48,48,18,0.513,0.661,5,-6.419,1,0.24,0.161,0,0.246,0.179,94.791,209213,4
2018-12-08,52,When The Party's Over,Billie Eilish,0TkJIyL69RAUIbNwGub6uR,False,52,52,6,0.367,0.111,4,-14.084,1,0.0972,0.978,3.97e-05,0.0897,0.198,82.642,196077,4
2018-12-08,53,Drunk Me,Mitchell Tenpenny,0TkJIyL69RAUIbNwGub6uR,False,55,53,16,0.499,0.797,2,-3.77,1,0.0554,0.199,0,0.0933,0.408,176.024,211768,4
2018-12-08,54,BAD!,XXXTENTACION,0TkJIyL69RAUIbNwGub6uR,False,39,16,3,0.8,0.526,8,-5.153,1,0.0716,0.334,0.00174,0.0571,0.746,129.874,150475,4
2018-12-08,55,Armed And Dangerous,Juice WRLD,0TkJIyL69RAUIbNwGub6uR,False,53,44,3,0.736,0.67,10,-6.702,1,0.311,0.186,0,0.114,0.845,130.032,169999,4
2018-12-08,57,Arms Around You,XXXTENTACION x Lil Pump Featuring Maluma & Swae Lee,1756lCPutsooqSmOiq4kIJ,False,49,28,5,0.703,0.723,9,-5.45,0,0.0412,0.0302,2.06e-06,0.126,0.288,104.969,198903,4
2018-12-08,58,MAMA,6ix9ine Featuring Nicki Minaj & Kanye West,5FlmoOiXokZHJvESrFbsyg,True,0,58,1,0.761,0.672,1,-5.887,1,0.212,0.0893,9.77e-06,0.14,0.437,160.077,192405,3
2018-12-08,59,KIKA,6ix9ine Featuring Tory Lanez,6VRwEqn7BvsN0dChfDrMAf,True,0,59,1,0.745,0.715,1,-3.368,0,0.245,0.128,0,0.182,0.342,94.513,136032,4
2018-12-08,60,You Say,Lauren Daigle,6VRwEqn7BvsN0dChfDrMAf,False,58,44,20,0.494,0.632,5,-6.89,1,0.0342,0.682,0,0.0869,0.0797,147.873,274693,4
2018-12-08,61,STOOPID,6ix9ine Featuring Bobby Shmurda,6VRwEqn7BvsN0dChfDrMAf,False,85,25,8,0.724,0.685,3,-4.068,0,0.321,0.114,0,0.1,0.862,150.016,143250,4
2018-12-08,62,TIC TOC,6ix9ine Featuring Lil Baby,2UbGTULrgk641ZzV4vWfXK,True,0,62,1,0.82,0.691,6,-6.646,0,0.0723,0.0115,0,0.344,0.683,142.027,135739,4
2018-12-08,63,Close Friends,Lil Baby,2UbGTULrgk641ZzV4vWfXK,False,57,28,8,0.676,0.578,10,-4.669,0,0.375,0.0509,0,0.0796,0.698,158.896,203881,4
2018-12-08,64,Fine China,Future & Juice WRLD,2UbGTULrgk641ZzV4vWfXK,False,64,26,6,0.656,0.542,7,-7.358,1,0.323,0.0484,0,0.126,0.551,166.111,141587,4
2018-12-08,65,Be Alright,Dean Lewis,2UbGTULrgk641ZzV4vWfXK,False,76,65,5,0.553,0.586,11,-6.319,1,0.0362,0.697,0,0.0813,0.443,126.684,196373,4
2018-12-08,66,Topanga,Trippie Redd,2UbGTULrgk641ZzV4vWfXK,False,61,52,5,0.755,0.615,4,-8.245,1,0.0454,0.00587,1.75e-06,0.109,0.039,105.955,215364,4
2018-12-08,67,That's On Me,Yella Beezy,2UbGTULrgk641ZzV4vWfXK,False,56,56,18,0.803,0.648,4,-9.185,0,0.198,0.0288,0,0.0904,0.538,131.923,219552,4
2018-12-08,68,Smile (Living My Best Life),Lil' Duval Featuring Snoop Dogg & Ball Greezy,2UbGTULrgk641ZzV4vWfXK,False,60,56,14,0.874,0.727,8,-7.689,1,0.0777,0.09,5.83e-06,0.0759,0.427,98.97,214160,4
2018-12-08,69,Come Out And Play,Billie Eilish,7wC5eZcFS1Q1BsQ35DU6H4,True,0,69,1,0.64,0.321,0,-14.604,1,0.0931,0.693,0.0307,0.114,0.177,145.045,210376,4
2018-12-08,70,10 Freaky Girls,Metro Boomin Featuring 21 Savage,7wC5eZcFS1Q1BsQ35DU6H4,False,63,42,4,0.81,0.353,6,-9.931,0,0.31,0.588,0,0.102,0.0727,88.031,208293,4
2018-12-08,71,WAKA,6ix9ine Featuring A Boogie Wit da Hoodie,057sdYirt745dVbe48m7Hl,True,0,71,1,0.772,0.812,0,-3.995,0,0.153,0.0834,0,0.115,0.655,97.407,128769,4
2018-12-08,72,1400 / 999 Freestyle,Trippie Redd Featuring Juice WRLD,057sdYirt745dVbe48m7Hl,False,68,55,3,0.825,0.572,6,-6.067,0,0.0864,0.0079,0,0.113,0.568,141.991,175954,4
2018-12-08,73,No Stylist,French Montana Featuring Drake,057sdYirt745dVbe48m7Hl,False,66,47,10,0.765,0.704,5,-4.589,0,0.127,0.0215,0,0.227,0.498,147.055,192172,4
2018-12-08,74,Burning Man,Dierks Bentley Featuring Brothers Osborne,057sdYirt745dVbe48m7Hl,False,69,69,6,0.609,0.807,5,-7.221,1,0.0972,0.00403,5.42e-06,0.0926,0.492,119.073,238493,4
2018-12-08,75,Talk To Me,Tory Lanez & Rich The Kid,057sdYirt745dVbe48m7Hl,False,72,72,5,0.698,0.66,0,-7.883,1,0.052,0.0226,0,0.0622,0.451,159.949,248521,4
2018-12-08,76,Backin' It Up,Pardison Fontaine Featuring Cardi B,057sdYirt745dVbe48m7Hl,False,65,65,7,0.796,0.68,10,-4.853,0,0.353,0.0886,0,0.268,0.565,164.932,190466,4
2018-12-08,77,Consequences,Camila Cabello,057sdYirt745dVbe48m7Hl,False,82,77,4,0.455,0.292,0,-6.792,1,0.0563,0.889,0,0.106,0.43,84.339,178467,5
2018-12-08,78,I'm A Mess,Bebe Rexha,057sdYirt745dVbe48m7Hl,False,59,35,20,0.63,0.694,11,-6.257,0,0.0253,0.00281,0,0.0719,0.216,97.005,195519,4
2018-12-08,79,Hangin' On,Chris Young,057sdYirt745dVbe48m7Hl,False,67,63,13,0.434,0.831,8,-4.774,1,0.0453,0.0651,0,0.119,0.596,156.034,185440,4
2018-12-08,80,Dip,Tyga & Nicki Minaj,057sdYirt745dVbe48m7Hl,False,71,63,5,0.885,0.543,2,-6.338,1,0.2,0.0311,0,0.154,0.43,99.026,195992,4
2018-12-08,81,Good Girl,Dustin Lynch,057sdYirt745dVbe48m7Hl,False,88,81,3,0.711,0.696,7,-5.05,1,0.0869,0.16,0,0.17,0.694,80.512,189533,4
2018-12-08,82,This Feeling,The Chainsmokers Featuring Kelsea Ballerini,057sdYirt745dVbe48m7Hl,False,73,73,7,0.575,0.571,1,-7.906,1,0.0439,0.0558,0,0.0912,0.449,105.049,197947,4
2018-12-08,83,Lovely,Billie Eilish & Khalid,057sdYirt745dVbe48m7Hl,False,80,78,7,0.351,0.296,4,-10.109,0,0.0333,0.934,0,0.095,0.12,115.284,200186,4
2018-12-08,84,Ella Quiere Beber,Anuel AA & Romeo Santos,057sdYirt745dVbe48m7Hl,False,79,79,4,0.75,0.665,8,-3.083,1,0.124,0.265,0,0.0515,0.697,95.239,219357,4
2018-12-08,85,Never Recover,Lil Baby & Gunna Featuring Drake,057sdYirt745dVbe48m7Hl,False,70,15,8,0.753,0.686,1,-5.415,0,0.284,0.0677,0,0.193,0.886,132.055,194732,4
2018-12-08,86,BEBE,6ix9ine Featuring Anuel AA,057sdYirt745dVbe48m7Hl,False,0,30,5,0.635,0.902,0,-3.559,1,0.109,0.172,0,0.125,0.286,102.063,217822,4
2018-12-08,87,Rich,Maren Morris,057sdYirt745dVbe48m7Hl,False,62,62,8,0.565,0.855,5,-4.189,1,0.0557,0.0445,0,0.32,0.852,74.98,208893,4
2018-12-08,88,Sixteen,Thomas Rhett,057sdYirt745dVbe48m7Hl,False,87,87,3,0.705,0.531,1,-7.031,1,0.0281,0.0135,2.11e-06,0.165,0.425,107.013,178333,4
2018-12-08,89,Blue Tacoma,Russell Dickerson,057sdYirt745dVbe48m7Hl,False,77,52,15,0.458,0.897,9,-4.879,1,0.0402,0.0183,0,0.174,0.728,160.131,212067,4
2018-12-08,90,You,Jacquees,01jIO8SJFnpSiNLH1JaBZ5,True,0,90,1,0.735,0.453,8,-8.264,0,0.0602,0.413,0,0.104,0.335,115.002,217387,4
2018-12-08,91,Space Cadet,Metro Boomin Featuring Gunna,01jIO8SJFnpSiNLH1JaBZ5,False,74,51,4,0.901,0.464,5,-9.789,0,0.0645,0.368,1.71e-05,0.238,0.638,109.004,203267,4
2018-12-08,92,Last Shot,Kip Moore,01jIO8SJFnpSiNLH1JaBZ5,False,90,90,3,0.487,0.859,4,-4.403,1,0.0488,0.00204,0,0.322,0.377,148.037,228480,4
2018-12-08,93,Best Part,Daniel Caesar Featuring H.E.R.,01jIO8SJFnpSiNLH1JaBZ5,False,83,75,19,0.524,0.364,7,-10.209,1,0.0367,0.808,0,0.1,0.436,75.24,209831,4
2018-12-08,94,Girl Like You,Jason Aldean,01jIO8SJFnpSiNLH1JaBZ5,False,99,94,2,0.543,0.88,3,-4.204,0,0.0365,0.035,0.000227,0.304,0.483,144.057,193067,4
2018-12-08,95,Don't Come Out The House,Metro Boomin Featuring 21 Savage,01jIO8SJFnpSiNLH1JaBZ5,False,78,38,4,0.87,0.35,1,-6.082,1,0.277,0.00661,0.000483,0.108,0.175,74.963,168347,4
2018-12-08,96,Ocean Eyes,Billie Eilish,01jIO8SJFnpSiNLH1JaBZ5,False,97,96,2,0.511,0.363,4,-7.65,0,0.041,0.816,0.0317,0.084,0.169,144.892,200379,4
2018-12-08,97,I Love It,Kanye West & Lil Pump,01jIO8SJFnpSiNLH1JaBZ5,False,75,6,12,0.901,0.522,2,-8.304,1,0.33,0.0114,0,0.259,0.329,104.053,127947,4
2018-12-08,98,Falling Down,Lil Peep & XXXTENTACION,01jIO8SJFnpSiNLH1JaBZ5,False,84,13,11,0.669,0.574,4,-6.442,0,0.0286,0.0175,0.00294,0.146,0.273,120.013,196400,4
2018-12-08,99,Noticed,Lil Mosey,01jIO8SJFnpSiNLH1JaBZ5,False,93,80,10,0.699,0.558,11,-7.622,1,0.0603,0.462,0,0.116,0.493,79.992,165000,4
2018-12-08,100,Close To Me,Ellie Goulding X Diplo Featuring Swae Lee,01jIO8SJFnpSiNLH1JaBZ5,False,98,98,2,0.572,0.75,1,-5.042,0,0.0604,0.0946,0,0.378,0.475,144.081,182627,4
