date,position,title,artist,spotify_id,is_new,last_pos,peak_pos,weeks,danceability,energy,key,loudness,mode,speechiness,acousticness,instrumentalness,liveness,valence,tempo,duration_ms,time_signature
2010-01-16,1,TiK ToK,Ke$ha,4xInIiKipU1mtUogJ3ZdYr,False,1,1,13,0.755,0.837,2,-2.718,0,0.142,0.0991,0,0.289,0.714,120.028,199693,4
2010-01-16,2,Bad Romance,Lady Gaga,4xInIiKipU1mtUogJ3ZdYr,False,3,2,10,0.696,0.921,0,-3.755,1,0.0363,0.00314,5.24e-05,0.0842,0.714,119.001,294573,4
2010-01-16,3,Replay,Iyaz,4xInIiKipU1mtUogJ3ZdYr,False,2,2,20,0.706,0.751,9,-6.323,1,0.0708,0.173,0,0.168,0.195,91.031,182307,4
2010-01-16,4,Empire State Of Mind,Jay-Z + Alicia Keys,4xInIiKipU1mtUogJ3ZdYr,False,5,1,17,0.491,0.956,11,-1.538,1,0.392,0.0295,0,0.46,0.811,173.585,276920,4
2010-01-16,5,Fireflies,Owl City,4xInIiKipU1mtUogJ3ZdYr,False,4,1,20,0.512,0.662,3,-6.797,1,0.0439,0.0275,0,0.118,0.472,180.114,228347,4
2010-01-16,6,Sexy Chick,David Guetta Featuring Akon,4xInIiKipU1mtUogJ3ZdYr,False,9,6,22,0.809,0.562,11,-7.694,0,0.0534,0.0816,0.000418,0.105,0.798,130.003,194347,4
2010-01-16,7,Down,Jay Sean Featuring Lil Wayne,4xInIiKipU1mtUogJ3ZdYr,False,7,1,27,0.657,0.695,2,-4.493,1,0.0321,0.0108,0,0.0822,0.683,65.997,212107,4
2010-01-16,8,Whatcha Say,Jason Derulo,4xInIiKipU1mtUogJ3ZdYr,False,6,1,21,0.615,0.711,11,-5.507,1,0.0779,0.0444,0,0.145,0.711,144.036,221253,4
2010-01-16,9,I Gotta Feeling,The Black Eyed Peas,4xInIiKipU1mtUogJ3ZdYr,False,14,1,30,0.744,0.774,0,-6.399,1,0.0268,0.0751,0,0.512,0.649,127.958,289187,4
2010-01-16,10,Party In The U.S.A.,Miley Cyrus,4xInIiKipU1mtUogJ3ZdYr,False,8,2,21,0.652,0.698,10,-4.667,0,0.042,0.00112,0.000115,0.0886,0.47,96.021,202067,4
2010-01-16,11,Do You Remember,Jay Sean Featuring Sean Paul & Lil Jon,4xInIiKipU1mtUogJ3ZdYr,False,10,10,9,0.855,0.668,11,-4.892,1,0.0644,0.0242,0,0.102,0.803,125.846,210307,4
2010-01-16,12,BedRock,Young Money Featuring Lloyd,4xInIiKipU1mtUogJ3ZdYr,False,12,12,6,0.733,0.664,8,-6.163,1,0.295,0.102,0,0.191,0.557,148.005,288133,4
2010-01-16,13,Meet Me Halfway,The Black Eyed Peas,4xInIiKipU1mtUogJ3ZdYr,False,11,7,16,0.8,0.621,11,-6.838,0,0.0651,0.00409,2.47e-05,0.131,0.448,130.002,284413,4
2010-01-16,14,Paparazzi,Lady Gaga,4xInIiKipU1mtUogJ3ZdYr,False,15,6,19,0.762,0.692,5,-3.973,0,0.0438,0.113,0,0.094,0.397,114.906,208307,4
2010-01-16,15,Hard,Rihanna Featuring Jeezy,4xInIiKipU1mtUogJ3ZdYr,False,18,11,7,0.31,0.746,1,-3.599,1,0.111,0.0121,0,0.649,0.163,182.032,250600,4
2010-01-16,16,3,Britney Spears,4xInIiKipU1mtUogJ3ZdYr,False,13,1,13,0.697,0.709,5,-1.917,0,0.0455,0.0452,0,0.138,0.787,134.91,213173,4
2010-01-16,17,You Belong With Me,Taylor Swift,4xInIiKipU1mtUogJ3ZdYr,False,19,2,37,0.687,0.783,6,-4.44,1,0.0386,0.162,1.35e-05,0.114,0.443,129.964,231133,4
2010-01-16,18,Drop The World,Lil Wayne Featuring Eminem,3e21cX0CVwzkQXiHz7WUQZ,True,0,18,1,0.663,0.91,1,-1.629,1,0.317,0.0719,0,0.244,0.342,144.993,229227,4
2010-01-16,19,Forever,"Drake Featuring Kanye West, Lil Wayne & Eminem",3e21cX0CVwzkQXiHz7WUQZ,False,16,8,16,0.415,0.926,5,-1.304,0,0.374,0.253,0,0.256,0.542,158.423,357347,4
2010-01-16,20,Need You Now,Lady Antebellum,3e21cX0CVwzkQXiHz7WUQZ,False,22,5,21,0.587,0.622,4,-5.535,1,0.0303,0.0927,0.000636,0.2,0.231,107.943,277573,4
2010-01-16,21,How Low,Ludacris,3e21cX0CVwzkQXiHz7WUQZ,False,23,13,4,0.785,0.498,1,-6.977,1,0.0533,0.00248,1.23e-06,0.224,0.418,143.96,201587,4
2010-01-16,22,Sweet Dreams,Beyonce,3e21cX0CVwzkQXiHz7WUQZ,False,24,10,24,0.694,0.825,1,-5.986,1,0.111,0.0895,1.86e-05,0.0618,0.788,121.949,208067,4
2010-01-16,23,Two Is Better Than One,Boys Like Girls Featuring Taylor Swift,3e21cX0CVwzkQXiHz7WUQZ,False,20,20,11,0.521,0.702,0,-5.189,1,0.0331,0.189,0,0.0962,0.25,127.976,242840,4
2010-01-16,24,One Time,Justin Bieber,3e21cX0CVwzkQXiHz7WUQZ,False,17,17,24,0.691,0.853,1,-2.528,0,0.0372,0.0631,7.13e-05,0.082,0.762,145.999,215867,4
2010-01-16,25,Use Somebody,Kings Of Leon,3e21cX0CVwzkQXiHz7WUQZ,False,35,4,49,0.276,0.715,0,-5.356,1,0.0432,0.00552,0.000417,0.201,0.173,137.028,230760,4
2010-01-16,26,Already Gone,Kelly Clarkson,3e21cX0CVwzkQXiHz7WUQZ,False,28,13,23,0.209,0.872,9,-2.996,1,0.0757,0.217,0,0.0768,0.294,78.139,281560,4
2010-01-16,27,Evacuate The Dancefloor,Cascada,3e21cX0CVwzkQXiHz7WUQZ,False,27,25,21,0.76,0.696,0,-5.811,1,0.0491,0.0195,0,0.278,0.903,127.029,205884,4
2010-01-16,28,Fifteen,Taylor Swift,3e21cX0CVwzkQXiHz7WUQZ,False,25,23,18,0.556,0.651,7,-4.396,1,0.0266,0.067,0,0.145,0.203,95.485,294333,4
2010-01-16,29,"Hey, Soul Sister",Train,3e21cX0CVwzkQXiHz7WUQZ,False,34,29,14,0.673,0.886,1,-4.44,0,0.0431,0.185,0,0.0826,0.795,97.012,216773,4
2010-01-16,30,Live Like We're Dying,Kris Allen,3e21cX0CVwzkQXiHz7WUQZ,False,32,30,10,0.589,0.893,0,-2.948,1,0.0397,0.0273,0,0.343,0.94,92.011,212507,4
2010-01-16,31,I Can Transform Ya,Chris Brown Featuring Lil Wayne & Swizz Beatz,3e21cX0CVwzkQXiHz7WUQZ,False,21,20,13,0.541,0.953,5,-4.229,1,0.107,0.048,0,0.192,0.856,111.378,228640,5
2010-01-16,32,Tie Me Down,New Boyz Featuring Ray J,3e21cX0CVwzkQXiHz7WUQZ,False,26,26,12,0.42,0.787,8,-4.467,1,0.294,0.0104,0,0.198,0.38,97.967,178808,4
2010-01-16,33,According To You,Orianthi,3e21cX0CVwzkQXiHz7WUQZ,False,36,33,5,0.619,0.917,5,-2.582,1,0.0507,0.0233,1.21e-05,0.0986,0.552,131.002,200347,4
2010-01-16,34,Run This Town,"Jay-Z, Rihanna & Kanye West",3e21cX0CVwzkQXiHz7WUQZ,False,31,2,23,0.632,0.924,1,-1.802,1,0.29,0.281,0,0.263,0.441,86.844,267520,4
2010-01-16,35,Cowboy Casanova,Carrie Underwood,3e21cX0CVwzkQXiHz7WUQZ,False,29,11,16,0.597,0.82,5,-2.529,1,0.0582,0.0328,0,0.119,0.576,119.969,236787,4
2010-01-16,36,Money To Blow,Birdman Featuring Lil Wayne & Drake,3e21cX0CVwzkQXiHz7WUQZ,False,33,26,13,0.709,0.579,6,-8.686,1,0.063,0.00934,0,0.353,0.697,133.028,258587,4
2010-01-16,37,Telephone,Lady Gaga Featuring Beyonce,3e21cX0CVwzkQXiHz7WUQZ,False,37,30,6,0.825,0.832,5,-5.853,0,0.0403,0.00587,0.000789,0.114,0.713,122.021,220627,4
2010-01-16,38,Fallin' For You,Colbie Caillat,3e21cX0CVwzkQXiHz7WUQZ,False,38,12,27,0.644,0.834,4,-6.473,1,0.0275,0.156,0,0.112,0.593,117.043,215547,4
2010-01-16,39,One Less Lonely Girl,Justin Bieber,3e21cX0CVwzkQXiHz7WUQZ,False,30,16,12,0.58,0.75,4,-4.421,1,0.194,0.159,0,0.274,0.728,86.938,229107,4
2010-01-16,40,Say Aah,Trey Songz Featuring Fabolous,3e21cX0CVwzkQXiHz7WUQZ,False,42,34,8,0.724,0.87,1,-3.614,0,0.113,0.00453,0,0.833,0.81,93.01,207547,4
2010-01-16,41,Gangsta Luv,Snoop Dogg Featuring The-Dream,3e21cX0CVwzkQXiHz7WUQZ,False,41,35,11,0.59,0.735,2,-4.924,1,0.297,0.0277,0,0.0818,0.398,102.076,256547,4
2010-01-16,42,Naturally,Selena Gomez & The Scene,3e21cX0CVwzkQXiHz7WUQZ,False,39,39,2,0.605,0.902,10,-5.406,0,0.0511,0.0185,1.01e-06,0.0534,0.875,132.612,202587,4
2010-01-16,43,Smile,Uncle Kracker,3e21cX0CVwzkQXiHz7WUQZ,False,44,43,22,0.541,0.812,4,-3.764,1,0.0336,0.203,0,0.42,0.607,141.056,201627,4
2010-01-16,44,Give It Up To Me,Shakira Featuring Lil Wayne,3e21cX0CVwzkQXiHz7WUQZ,False,40,29,8,0.841,0.729,5,-6.311,0,0.0705,0.443,0,0.122,0.688,115.984,183573,4
2010-01-16,45,If You Only Knew,Shinedown,3e21cX0CVwzkQXiHz7WUQZ,False,47,42,10,0.449,0.956,9,-4.011,0,0.0398,0.000347,0,0.325,0.321,97.011,226640,4
2010-01-16,46,Imma Be,The Black Eyed Peas,3e21cX0CVwzkQXiHz7WUQZ,False,66,46,5,0.597,0.517,0,-6.963,1,0.365,0.179,0,0.307,0.412,92.035,257560,4
2010-01-16,47,White Liar,Miranda Lambert,3e21cX0CVwzkQXiHz7WUQZ,False,49,38,12,0.35,0.777,10,-4.33,1,0.0336,0.0499,0.000742,0.413,0.419,185.04,287760,4
2010-01-16,48,Baby By Me,50 Cent Featuring Ne-Yo,3e21cX0CVwzkQXiHz7WUQZ,False,46,28,10,0.611,0.827,0,-4.665,0,0.0876,0.0045,0.0132,0.0283,0.355,190.058,213360,4
2010-01-16,49,The Truth,Jason Aldean,3e21cX0CVwzkQXiHz7WUQZ,False,54,47,9,0.496,0.577,9,-5.305,1,0.0257,0.234,2.4e-06,0.109,0.381,143.014,238413,4
2010-01-16,50,In My Head,Jason Derulo,3e21cX0CVwzkQXiHz7WUQZ,False,59,50,4,0.762,0.748,0,-4.15,0,0.033,0.0266,0,0.348,0.851,110.009,199027,4
2010-01-16,51,Southern Voice,Tim McGraw,3e21cX0CVwzkQXiHz7WUQZ,False,60,49,11,0.63,0.877,9,-4.106,1,0.0321,0.0446,0,0.113,0.758,112.051,242427,4
2010-01-16,52,Haven't Met You Yet,Michael Buble,3e21cX0CVwzkQXiHz7WUQZ,False,63,52,14,0.615,0.733,8,-4.808,1,0.0335,0.152,0,0.109,0.796,122.58,244587,4
2010-01-16,53,Do I,Luke Bryan,3e21cX0CVwzkQXiHz7WUQZ,False,50,34,18,0.581,0.691,9,-5.33,1,0.0333,0.257,0,0.11,0.299,137.985,239413,4
2010-01-16,54,Consider Me Gone,Reba,3e21cX0CVwzkQXiHz7WUQZ,False,61,38,14,0.587,0.732,8,-3.851,1,0.0296,0.098,0,0.0917,0.453,97.031,218053,4
2010-01-16,55,Try Sleeping With A Broken Heart,Alicia Keys,3e21cX0CVwzkQXiHz7WUQZ,False,55,27,7,0.496,0.82,5,-5.155,1,0.112,0.158,0.246,0.13,0.549,110.977,249013,5
2010-01-16,56,Life After You,Daughtry,3e21cX0CVwzkQXiHz7WUQZ,False,57,56,5,0.396,0.796,5,-3.253,1,0.0357,0.0597,0,0.407,0.362,154.037,207213,3
2010-01-16,57,Spotlight,Gucci Mane Featuring Usher,3e21cX0CVwzkQXiHz7WUQZ,False,52,42,10,0.781,0.806,10,-4.2,0,0.137,0.0982,0,0.403,0.69,125.019,236080,4
2010-01-16,58,Uprising,Muse,3e21cX0CVwzkQXiHz7WUQZ,False,51,37,17,0.602,0.905,2,-4.046,1,0.0775,0.000202,0.064,0.117,0.411,128.019,304840,4
2010-01-16,59,Russian Roulette,Rihanna,3e21cX0CVwzkQXiHz7WUQZ,False,43,9,11,0.48,0.486,6,-5.754,0,0.0447,0.046,0,0.107,0.265,80.051,227533,4
2010-01-16,60,All The Right Moves,OneRepublic,3e21cX0CVwzkQXiHz7WUQZ,False,56,53,13,0.529,0.948,0,-3.522,1,0.0475,0.259,1.01e-05,0.283,0.651,146.02,238000,4
2010-01-16,61,Carry Out,Timbaland Featuring Justin Timberlake,3e21cX0CVwzkQXiHz7WUQZ,False,71,31,5,0.531,0.574,10,-6.693,0,0.113,0.114,0.0308,0.256,0.272,115.68,232467,5
2010-01-16,62,I Invented Sex,Trey Songz Featuring Drake,3e21cX0CVwzkQXiHz7WUQZ,False,62,42,11,0.69,0.76,0,-4.778,1,0.0587,0.0678,0,0.184,0.468,89.958,247933,4
2010-01-16,63,Never Gonna Be Alone,Nickelback,3e21cX0CVwzkQXiHz7WUQZ,False,58,58,10,0.544,0.802,4,-4.152,1,0.0282,0.00155,7.34e-05,0.122,0.59,130.022,227027,4
2010-01-16,64,It Kills Me,Melanie Fiona,3e21cX0CVwzkQXiHz7WUQZ,False,70,49,7,0.618,0.764,8,-4.375,1,0.0411,0.228,0,0.0972,0.479,107.452,250413,4
2010-01-16,65,Why Don't We Just Dance,Josh Turner,3e21cX0CVwzkQXiHz7WUQZ,False,74,64,8,0.677,0.776,5,-5.933,1,0.0386,0.42,0.000689,0.0954,0.642,121.834,192800,4
2010-01-16,66,I Wanna Make You Close Your Eyes,Dierks Bentley,3e21cX0CVwzkQXiHz7WUQZ,False,75,52,14,0.599,0.61,1,-5.745,1,0.0232,0.104,4.83e-05,0.115,0.359,95.979,239119,4
2010-01-16,67,Body Language,Jesse McCartney Featuring T-Pain,3e21cX0CVwzkQXiHz7WUQZ,False,45,35,14,0.644,0.748,0,-4.467,1,0.0364,0.0309,0,0.154,0.538,161.434,219213,4
2010-01-16,68,Hillbilly Bone,Blake Shelton Featuring Trace Adkins,3e21cX0CVwzkQXiHz7WUQZ,False,65,65,2,0.611,0.964,7,-3.076,1,0.0464,0.0441,7.37e-05,0.109,0.9,144.014,225280,4
2010-01-16,69,Crawl,Chris Brown,3e21cX0CVwzkQXiHz7WUQZ,False,53,53,6,0.41,0.743,5,-6.356,0,0.0591,0.0416,0,0.113,0.417,176.048,236253,4
2010-01-16,70,Whataya Want From Me,Adam Lambert,3e21cX0CVwzkQXiHz7WUQZ,False,68,68,3,0.44,0.683,11,-4.732,0,0.0489,0.00706,0,0.0593,0.445,185.948,227320,4
2010-01-16,71,History In The Making,Darius Rucker,3e21cX0CVwzkQXiHz7WUQZ,False,81,64,10,0.475,0.718,0,-5.638,1,0.034,0.0373,0,0.326,0.453,157.722,209480,4
2010-01-16,72,Eight Second Ride,Jake Owen,3e21cX0CVwzkQXiHz7WUQZ,False,76,70,9,0.645,0.843,0,-4.072,1,0.0475,0.104,0,0.249,0.534,92.357,187320,3
2010-01-16,73,I Will Not Bow,Breaking Benjamin,3e21cX0CVwzkQXiHz7WUQZ,False,64,40,18,0.533,0.955,8,-3.708,1,0.0653,0.000165,1.36e-05,0.38,0.55,107.984,216733,4
2010-01-16,74,Someday,Rob Thomas,3e21cX0CVwzkQXiHz7WUQZ,False,84,72,9,0.573,0.905,10,-5.954,1,0.0343,0.0408,0,0.113,0.683,135.943,247800,4
2010-01-16,75,Shut It Down,Pitbull Featuring Akon,3e21cX0CVwzkQXiHz7WUQZ,False,87,69,5,0.754,0.693,9,-6.483,0,0.0844,0.0059,1.59e-06,0.0515,0.411,128.062,226093,4
2010-01-16,76,Break,Three Days Grace,3e21cX0CVwzkQXiHz7WUQZ,False,73,73,17,0.578,0.897,0,-3.906,1,0.0357,0.000666,0,0.0924,0.737,115.491,193107,4
2010-01-16,77,Red Light,David Nail,3e21cX0CVwzkQXiHz7WUQZ,False,83,54,15,0.387,0.804,9,-2.601,1,0.0372,0.0917,1.98e-05,0.171,0.428,163.853,246333,3
2010-01-16,78,Wasted,Gucci Mane Featuring Plies Or OJ Da Juiceman,3e21cX0CVwzkQXiHz7WUQZ,False,78,36,18,0.702,0.727,5,-3.443,1,0.155,0.0827,0,0.0831,0.549,155.093,249840,4
2010-01-16,79,Heartbreak Warfare,John Mayer,3e21cX0CVwzkQXiHz7WUQZ,False,93,79,4,0.624,0.554,2,-8.113,1,0.0225,0.191,0.00131,0.299,0.311,97.031,269720,4
2010-01-16,80,Papers,Usher,3e21cX0CVwzkQXiHz7WUQZ,False,80,31,12,0.802,0.556,1,-5.395,1,0.0418,0.0339,0,0.0958,0.158,120.047,261413,4
2010-01-16,81,Steady Mobbin',Young Money Featuring Gucci Mane,3e21cX0CVwzkQXiHz7WUQZ,False,48,48,2,0.488,0.691,0,-8.09,0,0.279,0.0219,0,0.501,0.697,156.141,310733,4
2010-01-16,82,I Am,Mary J. Blige,3e21cX0CVwzkQXiHz7WUQZ,False,67,65,4,0.449,0.715,11,-3.636,0,0.271,0.11,0,0.532,0.516,169.916,203520,4
2010-01-16,83,Funhouse,P!nk,3e21cX0CVwzkQXiHz7WUQZ,False,79,44,13,0.792,0.865,11,-3.04,0,0.0337,0.00503,1.64e-06,0.0375,0.833,103.935,204627,4
2010-01-16,84,Breakeven,The Script,3e21cX0CVwzkQXiHz7WUQZ,False,85,84,5,0.63,0.698,10,-4.51,1,0.0244,0.173,0,0.0789,0.529,94.023,261427,4
2010-01-16,85,I'm Going In,Drake Featuring Lil Wayne & Young Jeezy,3e21cX0CVwzkQXiHz7WUQZ,False,69,40,16,0.422,0.635,2,-8.25,0,0.105,0.403,0,0.0772,0.276,124.128,372587,4
2010-01-16,86,Drop It Low,Ester Dean Featuring Chris Brown,3e21cX0CVwzkQXiHz7WUQZ,False,77,38,17,0.723,0.714,11,-5.036,1,0.0537,0.0019,5.43e-05,0.0836,0.386,88.047,190533,4
2010-01-16,87,I Wanna Rock,Snoop Dogg,3e21cX0CVwzkQXiHz7WUQZ,False,89,75,4,0.521,0.849,5,-3.238,1,0.318,0.168,0,0.289,0.431,122.852,235987,5
2010-01-16,88,1901,Phoenix,3e21cX0CVwzkQXiHz7WUQZ,False,90,87,5,0.591,0.831,0,-5.647,1,0.0415,0.0605,4.67e-05,0.19,0.705,144.084,193107,4
2010-01-16,89,American Saturday Night,Brad Paisley,3e21cX0CVwzkQXiHz7WUQZ,False,0,86,4,0.487,0.938,4,-5.466,1,0.0533,0.0721,2.63e-05,0.522,0.733,157.795,274200,4
2010-01-16,90,Vanilla Twilight,Owl City,3e21cX0CVwzkQXiHz7WUQZ,False,72,72,3,0.582,0.529,11,-7.637,1,0.0248,0.00961,0.000554,0.113,0.567,166.134,231707,4
2010-01-16,91,Cryin' For Me (Wayman's Song),Toby Keith,3e21cX0CVwzkQXiHz7WUQZ,False,0,88,4,0.51,0.398,8,-7.685,0,0.0284,0.362,0.00139,0.112,0.261,156.08,285507,4
2010-01-16,92,Sex Therapy,Robin Thicke,3e21cX0CVwzkQXiHz7WUQZ,False,94,79,3,0.702,0.53,3,-4.384,1,0.0296,0.679,0,0.241,0.319,112.036,275147,4
2010-01-16,93,Hot Mess,Cobra Starship,3e21cX0CVwzkQXiHz7WUQZ,False,88,64,3,0.642,0.87,7,-4.096,1,0.11,0.00205,0,0.129,0.73,119.987,172293,4
2010-01-16,94,Gettin' You Home,Chris Young,3e21cX0CVwzkQXiHz7WUQZ,False,0,33,20,0.639,0.678,7,-5.02,1,0.0278,0.44,1.45e-06,0.221,0.531,106.966,212133,4
2010-01-16,95,Shots,LMFAO Featuring Lil Jon,3e21cX0CVwzkQXiHz7WUQZ,False,96,95,4,0.825,0.856,1,-1.912,1,0.0476,0.00851,1.4e-06,0.127,0.207,128.016,222133,4
2010-01-16,96,That's How Country Boys Roll,Billy Currington,3e21cX0CVwzkQXiHz7WUQZ,False,0,85,5,0.677,0.919,2,-3.009,1,0.0344,0.054,1.48e-06,0.113,0.902,120.961,224267,4
2010-01-16,97,Temporary Home,Carrie Underwood,3e21cX0CVwzkQXiHz7WUQZ,False,0,92,2,0.416,0.354,0,-6.357,1,0.0263,0.731,1e-06,0.0925,0.181,80.767,268560,4
2010-01-16,98,Halfway Gone,Lifehouse,3e21cX0CVwzkQXiHz7WUQZ,False,99,91,4,0.543,0.919,1,-4.831,0,0.0415,0.000449,0,0.243,0.498,125.023,195307,4
2010-01-16,99,American Honey,Lady Antebellum,3e21cX0CVwzkQXiHz7WUQZ,False,97,97,2,0.588,0.684,1,-5.154,1,0.0288,0.508,0,0.141,0.121,85.997,224867,4
2010-01-16,100,(If You're Wondering If I Want You To) I Want You To,Weezer,3e21cX0CVwzkQXiHz7WUQZ,False,0,81,9,0.654,0.81,4,-6.26,0,0.0288,0.00719,0.00251,0.165,0.661,114.623,200307,4
