date,position,title,artist,spotify_id,is_new,last_pos,peak_pos,weeks,danceability,energy,key,loudness,mode,speechiness,acousticness,instrumentalness,liveness,valence,tempo,duration_ms,time_signature
2018-02-10,1,God's Plan,Drake,0QVISdPWRllAmoDBG3DEHU,False,1,1,2,0.754,0.449,7,-9.211,1,0.109,0.0332,8.29e-05,0.552,0.357,77.169,198973,4
2018-02-10,2,Perfect,Ed Sheeran,0QVISdPWRllAmoDBG3DEHU,False,2,1,23,0.598,0.448,8,-6.312,1,0.0232,0.162,0,0.106,0.168,95.009,263400,3
2018-02-10,3,Finesse,Bruno Mars & Cardi B,0QVISdPWRllAmoDBG3DEHU,False,5,3,5,0.704,0.859,5,-4.877,0,0.0996,0.0185,0,0.0215,0.926,105.115,217289,4
2018-02-10,4,Havana,Camila Cabello Featuring Young Thug,0QVISdPWRllAmoDBG3DEHU,False,3,1,25,0.765,0.523,2,-4.333,1,0.03,0.184,3.56e-05,0.132,0.394,104.988,217307,4
2018-02-10,5,Rockstar,Post Malone Featuring 21 Savage,0QVISdPWRllAmoDBG3DEHU,False,4,1,20,0.585,0.52,5,-6.136,0,0.0712,0.124,7.01e-05,0.131,0.129,159.801,218147,4
2018-02-10,6,Bad At Love,Halsey,0QVISdPWRllAmoDBG3DEHU,False,6,5,22,0.675,0.751,0,-3.539,1,0.0296,0.0604,0,0.0893,0.612,118.384,181279,4
2018-02-10,7,New Rules,Dua Lipa,0QVISdPWRllAmoDBG3DEHU,False,8,7,27,0.762,0.7,9,-6.021,0,0.0694,0.00261,1.56e-05,0.153,0.608,116.073,209320,4
2018-02-10,8,MotorSport,"Migos, Nicki Minaj & Cardi B",0QVISdPWRllAmoDBG3DEHU,False,11,6,14,0.904,0.518,2,-5.32,1,0.183,0.0305,0,0.325,0.188,137.996,303077,4
2018-02-10,9,Say Something,Justin Timberlake Featuring Chris Stapleton,09ts3GnICqYEU5PkQCpJK3,True,0,9,1,0.707,0.632,10,-7.031,1,0.0789,0.103,1.09e-05,0.0841,0.372,97.04,278893,4
2018-02-10,10,Thunder,Imagine Dragons,09ts3GnICqYEU5PkQCpJK3,False,9,4,40,0.605,0.822,0,-4.833,1,0.0438,0.00671,0.134,0.147,0.288,167.997,187147,4
2018-02-10,11,Meant To Be,Bebe Rexha & Florida Georgia Line,09ts3GnICqYEU5PkQCpJK3,False,12,11,15,0.643,0.783,10,-6.458,1,0.0856,0.047,0,0.083,0.579,154.084,163870,4
2018-02-10,12,Stir Fry,Migos,09ts3GnICqYEU5PkQCpJK3,False,52,12,6,0.817,0.816,2,-5.402,1,0.269,0.00263,0,0.159,0.508,181.982,190288,4
2018-02-10,13,No Limit,G-Eazy Featuring A$AP Rocky & Cardi B,09ts3GnICqYEU5PkQCpJK3,False,10,4,21,0.838,0.771,1,-3.791,1,0.244,0.0117,0,0.0853,0.405,175.957,245387,4
2018-02-10,14,Let You Down,NF,09ts3GnICqYEU5PkQCpJK3,False,14,14,16,0.662,0.714,5,-5.68,0,0.121,0.312,0,0.179,0.464,147.997,212120,4
2018-02-10,15,Love.,Kendrick Lamar Featuring Zacari,09ts3GnICqYEU5PkQCpJK3,False,15,11,32,0.8,0.585,10,-7.343,1,0.0924,0.264,0,0.153,0.779,126.058,213400,4
2018-02-10,16,Him & I,G-Eazy & Halsey,09ts3GnICqYEU5PkQCpJK3,False,16,15,9,0.589,0.731,2,-6.343,1,0.0868,0.0534,0,0.308,0.191,87.908,268867,4
2018-02-10,17,I Fall Apart,Post Malone,09ts3GnICqYEU5PkQCpJK3,False,19,16,19,0.556,0.538,8,-5.408,0,0.0382,0.0689,0,0.196,0.291,143.95,223347,4
2018-02-10,18,Walk It Talk It,Migos Featuring Drake,6n4U3TlzUGhdSFbUUhTvLP,True,0,18,1,0.907,0.633,2,-5.145,1,0.184,0.0876,2.6e-06,0.106,0.395,145.914,276147,4
2018-02-10,19,Bartier Cardi,Cardi B Featuring 21 Savage,6n4U3TlzUGhdSFbUUhTvLP,False,20,14,6,0.908,0.524,1,-7.955,1,0.181,0.00111,0.000678,0.383,0.109,138.015,224285,4
2018-02-10,20,Too Good At Goodbyes,Sam Smith,6n4U3TlzUGhdSFbUUhTvLP,False,13,4,21,0.681,0.372,5,-8.237,1,0.0432,0.64,0,0.169,0.476,91.873,201000,4
2018-02-10,21,How Long,Charlie Puth,6n4U3TlzUGhdSFbUUhTvLP,False,21,21,17,0.845,0.561,1,-5.253,0,0.0778,0.211,3.49e-06,0.0383,0.811,109.974,200853,4
2018-02-10,22,Shape Of You,Ed Sheeran,6n4U3TlzUGhdSFbUUhTvLP,False,22,1,56,0.825,0.652,1,-3.183,0,0.0802,0.581,0,0.0931,0.931,95.977,233713,4
2018-02-10,23,The Middle,"Zedd, Maren Morris & Grey",09IStsImFySgyp0pIQdqAc,True,0,23,1,0.753,0.657,7,-3.061,1,0.0449,0.171,0,0.112,0.437,107.01,184732,4
2018-02-10,24,Gummo,6ix9ine,09IStsImFySgyp0pIQdqAc,False,18,12,12,0.66,0.775,2,-4.926,1,0.172,0.0553,0,0.129,0.635,157.036,157643,4
2018-02-10,25,Bodak Yellow (Money Moves),Cardi B,09IStsImFySgyp0pIQdqAc,False,23,1,31,0.926,0.703,11,-6.337,0,0.103,0.0659,0,0.231,0.485,125.022,223713,4
2018-02-10,26,Gucci Gang,Lil Pump,09IStsImFySgyp0pIQdqAc,False,17,3,21,0.936,0.523,5,-6.71,1,0.0597,0.239,0,0.117,0.699,119.889,124056,4
2018-02-10,27,Feel It Still,Portugal. The Man,09IStsImFySgyp0pIQdqAc,False,25,4,33,0.801,0.795,1,-5.115,0,0.0504,0.0417,0.000113,0.0717,0.754,79.028,163253,4
2018-02-10,28,You Make It Easy,Jason Aldean,6EGAfJaLUFzhS4zRBIEQ2J,True,0,28,1,0.375,0.574,7,-5.305,1,0.0315,0.143,0,0.11,0.406,132.025,196800,3
2018-02-10,29,Believer,Imagine Dragons,6EGAfJaLUFzhS4zRBIEQ2J,False,28,4,52,0.776,0.78,10,-4.374,0,0.128,0.0622,0,0.081,0.666,124.949,204347,4
2018-02-10,30,Wolves,Selena Gomez X Marshmello,6EGAfJaLUFzhS4zRBIEQ2J,False,26,20,15,0.725,0.804,11,-4.614,0,0.0422,0.124,0,0.204,0.31,124.996,197993,4
2018-02-10,31,Sky Walker,Miguel Featuring Travis Scott,6EGAfJaLUFzhS4zRBIEQ2J,False,29,29,19,0.674,0.506,6,-10.532,1,0.0434,0.173,0,0.0866,0.183,145.965,259333,4
2018-02-10,32,Never Be The Same,Camila Cabello,6EGAfJaLUFzhS4zRBIEQ2J,False,37,30,7,0.637,0.713,0,-4.333,1,0.0747,0.181,0.000637,0.137,0.243,129.923,226973,4
2018-02-10,33,1-800-273-8255,Logic Featuring Alessia Cara & Khalid,6EGAfJaLUFzhS4zRBIEQ2J,False,46,3,40,0.62,0.574,5,-7.788,0,0.0479,0.569,0,0.19,0.357,100.023,250173,4
2018-02-10,34,Plain Jane,A$AP Ferg Featuring Nicki Minaj,6EGAfJaLUFzhS4zRBIEQ2J,False,27,26,19,0.797,0.844,11,-5.482,1,0.275,0.0651,0,0.087,0.52,170.142,173600,4
2018-02-10,35,Young Dumb & Broke,Khalid,6EGAfJaLUFzhS4zRBIEQ2J,False,35,18,29,0.798,0.539,1,-6.351,1,0.0421,0.199,1.66e-05,0.165,0.394,136.949,202547,4
2018-02-10,36,Narcos,Migos,0wbnC9AUenxp613TYaJsGK,True,0,36,1,0.936,0.585,0,-6.914,1,0.125,0.0142,0,0.132,0.242,124.991,255379,4
2018-02-10,37,I Get The Bag,Gucci Mane Featuring Migos,0wbnC9AUenxp613TYaJsGK,False,24,11,24,0.89,0.633,11,-5.475,1,0.168,0.0232,0.000343,0.0993,0.425,139.948,233087,4
2018-02-10,38,Lights Down Low,MAX Featuring gnash,0wbnC9AUenxp613TYaJsGK,False,38,38,17,0.623,0.493,5,-7.727,0,0.0338,0.0632,0,0.104,0.594,81.019,223847,4
2018-02-10,39,Marry Me,Thomas Rhett,0wbnC9AUenxp613TYaJsGK,False,36,35,9,0.333,0.412,3,-8.633,1,0.029,0.0977,0,0.113,0.474,85.028,205453,4
2018-02-10,40,Roll In Peace,Kodak Black Featuring XXXTENTACION,0wbnC9AUenxp613TYaJsGK,False,31,31,24,0.747,0.524,10,-6.807,0,0.245,0.0306,0,0.2,0.363,140.053,213132,4
2018-02-10,41,Mine,Bazzi,0wbnC9AUenxp613TYaJsGK,False,56,41,2,0.71,0.789,4,-3.874,1,0.0722,0.0161,2.77e-06,0.451,0.717,142.929,131064,4
2018-02-10,42,Sorry Not Sorry,Demi Lovato,0wbnC9AUenxp613TYaJsGK,False,32,6,30,0.705,0.64,11,-6.928,0,0.225,0.0237,0,0.262,0.887,144.077,203760,4
2018-02-10,43,End Game,Taylor Swift Featuring Ed Sheeran & Future,0wbnC9AUenxp613TYaJsGK,False,30,18,11,0.649,0.589,2,-6.237,1,0.0558,0.00845,0,0.108,0.151,159.073,244827,4
2018-02-10,44,River,Eminem Featuring Ed Sheeran,0wbnC9AUenxp613TYaJsGK,False,34,11,7,0.748,0.749,8,-5.916,0,0.516,0.142,0,0.0713,0.659,90.09,221013,4
2018-02-10,45,Outside Today,YoungBoy Never Broke Again,0wbnC9AUenxp613TYaJsGK,False,51,45,3,0.851,0.666,11,-5.334,0,0.0694,0.139,0,0.105,0.0585,134.068,129105,4
2018-02-10,46,Ric Flair Drip,Offset & Metro Boomin,0wbnC9AUenxp613TYaJsGK,False,39,39,14,0.88,0.428,9,-8.28,1,0.206,0.149,5.07e-05,0.114,0.333,100.007,172800,4
2018-02-10,47,Lemon,N*E*R*D & Rihanna,0wbnC9AUenxp613TYaJsGK,False,40,40,13,0.916,0.727,1,-6.556,1,0.0861,0.00214,0.000145,0.118,0.201,94.997,219707,4
2018-02-10,48,BBO (Bad Bitches Only),Migos Featuring 21 Savage,4BHzHISX21PYwGXiBEUQ70,True,0,48,1,0.808,0.771,4,-5.719,0,0.0645,0.0413,1.29e-06,0.18,0.471,161.94,251859,4
2018-02-10,49,The Way Life Goes,Lil Uzi Vert Featuring Nicki Minaj,4BHzHISX21PYwGXiBEUQ70,False,42,24,23,0.703,0.757,1,-3.612,1,0.05,0.617,0,0.106,0.696,82.008,221747,4
2018-02-10,50,Let Me Go,Hailee Steinfeld & Alesso Featuring Florida Georgia Line & Watt,4BHzHISX21PYwGXiBEUQ70,False,45,40,19,0.664,0.708,8,-4.154,1,0.0474,0.0337,0,0.0841,0.742,103.07,174800,4
2018-02-10,51,Filthy,Justin Timberlake,4BHzHISX21PYwGXiBEUQ70,False,33,9,4,0.745,0.579,1,-5.771,1,0.138,0.0354,0.0118,0.246,0.645,97.002,293947,4
2018-02-10,52,Notice Me,Migos Featuring Post Malone,3OnOomd79OjqSYHchCQ6ht,True,0,52,1,0.793,0.344,6,-9.757,1,0.357,0.112,1.68e-06,0.15,0.45,166.105,233880,4
2018-02-10,53,Supastars,Migos,7yt6eiZQCkVFEzwGp4Pbor,True,0,53,1,0.782,0.686,1,-4.383,1,0.0594,0.253,0,0.08,0.334,75.948,293138,4
2018-02-10,54,All The Stars,Kendrick Lamar & SZA,7yt6eiZQCkVFEzwGp4Pbor,False,54,43,4,0.698,0.633,8,-4.946,1,0.0597,0.0605,0.000194,0.0926,0.552,96.924,232187,4
2018-02-10,55,Diplomatic Immunity,Drake,7yt6eiZQCkVFEzwGp4Pbor,False,7,7,2,0.654,0.839,9,-5.076,0,0.443,0.00531,0,0.308,0.549,74.886,255867,4
2018-02-10,56,Wait,Maroon 5,7yt6eiZQCkVFEzwGp4Pbor,False,88,56,3,0.655,0.603,8,-5.014,1,0.0555,0.0959,0,0.107,0.452,126.088,190643,4
2018-02-10,57,Yours,Russell Dickerson,7yt6eiZQCkVFEzwGp4Pbor,False,49,49,16,0.554,0.722,11,-6.005,1,0.034,0.119,0,0.0861,0.558,134.058,216960,4
2018-02-10,58,Written In The Sand,Old Dominion,7yt6eiZQCkVFEzwGp4Pbor,False,60,58,11,0.725,0.438,6,-9.602,1,0.0575,0.593,0,0.0842,0.76,83.984,184080,4
2018-02-10,59,Good Old Days,Macklemore Featuring Kesha,7yt6eiZQCkVFEzwGp4Pbor,False,55,54,15,0.712,0.51,8,-8.162,1,0.0633,0.446,2.46e-05,0.112,0.268,122.964,240507,4
2018-02-10,60,Losing Sleep,Chris Young,7yt6eiZQCkVFEzwGp4Pbor,False,62,60,19,0.584,0.621,1,-5.703,1,0.0443,0.0715,1.68e-06,0.389,0.634,92.003,178253,4
2018-02-10,61,Five More Minutes,Scotty McCreery,7yt6eiZQCkVFEzwGp4Pbor,False,64,61,9,0.494,0.634,7,-4.933,1,0.0282,0.259,1.15e-06,0.109,0.28,156.03,241147,4
2018-02-10,62,Broken Halos,Chris Stapleton,7yt6eiZQCkVFEzwGp4Pbor,False,85,62,10,0.613,0.564,8,-7.085,1,0.0251,0.134,1.65e-06,0.0585,0.538,78.388,180907,4
2018-02-10,63,KEKE,"6ix9ine, Fetty Wap & A Boogie Wit da Hoodie",7yt6eiZQCkVFEzwGp4Pbor,False,43,43,3,0.599,0.857,7,-5.7,1,0.299,0.0321,0,0.4,0.469,187.985,151915,4
2018-02-10,64,White Sand,"Migos Featuring Travis Scott, Ty Dolla $ign & Big Sean",2KokOIKdw4zZutDil85Ugh,True,0,64,1,0.827,0.591,5,-7.504,0,0.0744,0.0307,0,0.273,0.402,142.113,202835,4
2018-02-10,65,Betrayed,Lil Xan,2KokOIKdw4zZutDil85Ugh,False,73,65,12,0.821,0.434,10,-9.194,0,0.118,0.434,0,0.128,0.241,120.012,187173,4
2018-02-10,66,Pick It Up,Famous Dex Featuring A$AP Rocky,2KokOIKdw4zZutDil85Ugh,False,58,58,12,0.921,0.467,1,-8.443,1,0.119,0.0149,0.000238,0.334,0.287,135.995,191252,4
2018-02-10,67,Heaven,Kane Brown,2KokOIKdw4zZutDil85Ugh,False,67,67,6,0.677,0.556,9,-6.544,1,0.0306,0.263,0,0.105,0.521,80.009,179507,4
2018-02-10,68,Nowadays,Lil Skies Featuring Landon Cube,2KokOIKdw4zZutDil85Ugh,False,57,55,4,0.745,0.646,6,-6.987,0,0.17,0.157,0,0.338,0.46,79.993,203908,4
2018-02-10,69,You Broke Up With Me,Walker Hayes,2KokOIKdw4zZutDil85Ugh,False,70,67,15,0.847,0.699,0,-8.286,1,0.0733,0.525,0,0.267,0.874,120.002,196667,4
2018-02-10,70,Like I Loved You,Brett Young,2KokOIKdw4zZutDil85Ugh,False,63,46,19,0.582,0.568,1,-6.051,1,0.0297,0.196,0,0.0841,0.64,76.025,207187,4
2018-02-10,71,This Is Me,Keala Settle & The Greatest Showman Ensemble,2KokOIKdw4zZutDil85Ugh,False,66,58,5,0.284,0.704,2,-7.276,1,0.186,0.00583,0.000115,0.0424,0.1,191.702,234707,4
2018-02-10,72,Echame La Culpa,Luis Fonsi & Demi Lovato,2KokOIKdw4zZutDil85Ugh,False,68,47,11,0.733,0.897,0,-3.652,1,0.0389,0.0391,0,0.117,0.649,96.006,173800,4
2018-02-10,73,Gang Gang,Migos,6RKkHI2fkmgZq7uQPPav8f,True,0,73,1,0.731,0.627,2,-9.76,1,0.0754,0.261,0,0.112,0.5,90.03,181319,4
2018-02-10,74,One Foot,WALK THE MOON,6RKkHI2fkmgZq7uQPPav8f,False,75,74,5,0.582,0.821,0,-4.861,1,0.0365,0.00754,2.1e-06,0.818,0.468,100.025,261373,4
2018-02-10,75,New Freezer,Rich The Kid Featuring Kendrick Lamar,2EgB4n6XyBsuNUbuarr4eG,True,0,75,1,0.884,0.698,0,-9.101,1,0.364,0.0405,0,0.195,0.575,140.068,191938,4
2018-02-10,76,All On Me,Devin Dawson,2EgB4n6XyBsuNUbuarr4eG,False,81,76,10,0.634,0.668,5,-5.488,1,0.0291,0.14,0,0.216,0.635,80.989,224627,4
2018-02-10,77,No Smoke,YoungBoy Never Broke Again,2EgB4n6XyBsuNUbuarr4eG,False,61,61,9,0.658,0.736,9,-6.097,0,0.308,0.113,0,0.0978,0.804,143.966,160000,4
2018-02-10,78,Tell Me You Love Me,Demi Lovato,2EgB4n6XyBsuNUbuarr4eG,False,79,53,10,0.705,0.64,11,-6.928,0,0.225,0.0237,0,0.262,0.887,144.077,203760,4
2018-02-10,79,La Modelo,Ozuna x Cardi B,2EgB4n6XyBsuNUbuarr4eG,False,76,52,6,0.574,0.734,1,-2.697,1,0.0728,0.241,0.00806,0.0962,0.769,98.023,255507,4
2018-02-10,80,Red Roses,Lil Skies Featuring Landon Cube,2EgB4n6XyBsuNUbuarr4eG,False,74,69,4,0.691,0.683,0,-7.335,1,0.0954,0.547,0,0.221,0.456,140.002,262544,4
2018-02-10,81,Rewrite The Stars,Zac Efron & Zendaya,2EgB4n6XyBsuNUbuarr4eG,False,77,70,5,0.684,0.619,10,-7.005,1,0.0386,0.0716,0,0.122,0.284,125.046,217440,4
2018-02-10,82,Candy Paint,Post Malone,2EgB4n6XyBsuNUbuarr4eG,False,78,50,15,0.664,0.667,4,-5.941,1,0.154,0.64,1.22e-06,0.0753,0.381,180.064,227533,4
2018-02-10,83,Higher We Go (Intro),Migos,43dOwOq0mB4i6j4SpcSkqC,True,0,83,1,0.825,0.547,8,-3.938,1,0.0859,0.0936,0,0.22,0.184,152.007,255849,4
2018-02-10,84,Legends,Kelsea Ballerini,43dOwOq0mB4i6j4SpcSkqC,False,87,79,9,0.577,0.727,4,-5.848,1,0.0319,0.0547,0,0.0891,0.24,112.041,244467,4
2018-02-10,85,Auto Pilot,Migos,4Kw3CztmD15X1QGDnnHmLD,True,0,85,1,0.928,0.721,11,-5.774,1,0.15,0.0714,0,0.225,0.254,129.997,287992,4
2018-02-10,86,Codeine Dreaming,Kodak Black Featuring Lil Wayne,4Kw3CztmD15X1QGDnnHmLD,False,72,52,10,0.736,0.604,1,-7.357,0,0.222,0.0652,6.43e-05,0.124,0.574,155.007,264532,4
2018-02-10,87,Emoji A Chain,Migos,0G9rmRmQDFk9O2tzZLyRkc,True,0,87,1,0.894,0.324,1,-8.24,1,0.179,0.0399,0,0.126,0.407,139.972,315185,4
2018-02-10,88,Beautiful Trauma,P!nk,0G9rmRmQDFk9O2tzZLyRkc,False,91,88,6,0.412,0.619,7,-6.39,1,0.0725,0.0868,2.55e-06,0.4,0.234,95.977,250053,4
2018-02-10,89,Round Here Buzz,Eric Church,0G9rmRmQDFk9O2tzZLyRkc,False,80,56,19,0.638,0.441,2,-9.064,1,0.0347,0.0422,1.33e-05,0.107,0.473,76.078,214627,4
2018-02-10,90,Sick Boy,The Chainsmokers,0G9rmRmQDFk9O2tzZLyRkc,False,65,65,2,0.663,0.577,11,-7.518,0,0.0531,0.109,0,0.12,0.454,89.996,193200,4
2018-02-10,91,Rubbin Off The Paint,YBN Nahmir,0G9rmRmQDFk9O2tzZLyRkc,False,69,46,13,0.734,0.751,1,-7.26,1,0.285,0.00529,0,0.183,0.56,161.997,159916,4
2018-02-10,92,El Farsante,Ozuna & Romeo Santos,7uYgVgRSgqluZclLS7wpp4,True,0,92,1,0.737,0.742,6,-2.875,1,0.0441,0.218,0,0.316,0.386,119.966,258000,4
2018-02-10,93,IDGAF,Dua Lipa,7uYgVgRSgqluZclLS7wpp4,False,92,92,3,0.836,0.543,7,-5.975,1,0.095,0.0397,0,0.0824,0.507,97.027,217947,4
2018-02-10,94,Most People Are Good,Luke Bryan,79LAFAkR1ATb4iIQvZuCL0,True,0,94,1,0.586,0.732,8,-6.171,1,0.0279,0.176,0,0.148,0.582,150.109,221801,4
2018-02-10,95,Mayores,Becky G Featuring Bad Bunny,79LAFAkR1ATb4iIQvZuCL0,False,94,74,15,0.745,0.836,5,-4.336,0,0.0444,0.145,0.00314,0.116,0.874,96.993,203187,4
2018-02-10,96,CC,Migos Featuring Gucci Mane,35ffVv9x4mtzBh5rF1K9sP,True,0,96,1,0.85,0.731,9,-6.705,0,0.193,0.231,0,0.0886,0.822,134.009,259340,4
2018-02-10,97,Best Friend,"Sofi Tukker Featuring NERVO, The Knocks & Alisa Ueno",35ffVv9x4mtzBh5rF1K9sP,False,89,81,5,0.699,0.7,11,-5.704,1,0.0392,0.0109,0.0794,0.152,0.3,102.023,184880,4
2018-02-10,98,MIC Drop,BTS Featuring Desiigner,35ffVv9x4mtzBh5rF1K9sP,False,84,28,10,0.606,0.848,11,-3.952,1,0.184,0.0114,1.06e-06,0.206,0.54,170.01,307676,4
2018-02-10,99,King's Dead,"Jay Rock, Kendrick Lamar, Future & James Blake",35ffVv9x4mtzBh5rF1K9sP,False,83,83,3,0.645,0.705,1,-5.008,1,0.299,0.000813,0,0.128,0.376,137.133,229670,4
2018-02-10,100,Corazon,Maluma X Nego do Borel,35ffVv9x4mtzBh5rF1K9sP,False,93,87,5,0.722,0.738,9,-6.073,0,0.247,0.328,1.47e-05,0.198,0.748,198.075,184720,4
