date,position,title,artist,spotify_id,is_new,last_pos,peak_pos,weeks,danceability,energy,key,loudness,mode,speechiness,acousticness,instrumentalness,liveness,valence,tempo,duration_ms,time_signature
2020-11-14,1,Mood,24kGoldn Featuring iann dior,5avVDmK9FVJpd3MDO8I3Zl,False,3,1,13,0.7,0.722,7,-3.558,0,0.0369,0.221,0,0.272,0.756,90.989,140526,4
2020-11-14,2,Positions,Ariana Grande,5avVDmK9FVJpd3MDO8I3Zl,False,1,1,2,0.737,0.802,0,-4.771,1,0.0878,0.468,0,0.0931,0.682,144.015,172325,4
2020-11-14,3,Laugh Now Cry Later,Drake Featuring Lil Durk,5avVDmK9FVJpd3MDO8I3Zl,False,4,2,12,0.761,0.518,0,-8.871,1,0.134,0.244,3.47e-05,0.107,0.522,133.976,261493,4
2020-11-14,4,Blinding Lights,The Weeknd,5avVDmK9FVJpd3MDO8I3Zl,False,5,1,49,0.514,0.73,1,-5.934,1,0.0598,0.00146,9.54e-05,0.0897,0.334,171.005,200040,4
2020-11-14,5,I Hope,Gabby Barrett Featuring Charlie Puth,5avVDmK9FVJpd3MDO8I3Zl,False,6,5,45,0.466,0.536,6,-6.227,1,0.0429,0.0951,0,0.114,0.377,75.998,210773,4
2020-11-14,6,Savage Love (Laxed - Siren Beat),Jawsh 685 x Jason Derulo,5avVDmK9FVJpd3MDO8I3Zl,False,8,1,21,0.767,0.481,0,-8.52,0,0.0803,0.234,0,0.269,0.761,150.076,171375,4
2020-11-14,7,Lemonade,Internet Money & Gunna Featuring Don Toliver & NAV,5avVDmK9FVJpd3MDO8I3Zl,False,9,7,12,0.799,0.66,1,-6.153,0,0.079,0.256,0,0.111,0.471,140.04,195429,4
2020-11-14,8,34+35,Ariana Grande,6Im9k8u9iIzKMrmV7BWtlF,True,0,8,1,0.83,0.585,0,-6.476,1,0.094,0.237,0,0.248,0.485,109.978,173711,4
2020-11-14,9,Dakiti,Bad Bunny & Jhay Cortez,47EiUVwUp4C9fGccaPuUCS,True,0,9,1,0.731,0.573,4,-10.059,0,0.0544,0.401,5.22e-05,0.113,0.145,109.928,205090,4
2020-11-14,10,WAP,Cardi B Featuring Megan Thee Stallion,47EiUVwUp4C9fGccaPuUCS,False,7,1,13,0.935,0.454,1,-7.509,1,0.375,0.0194,0,0.0824,0.357,133.073,187541,4
2020-11-14,11,Holy,Justin Bieber Featuring Chance The Rapper,47EiUVwUp4C9fGccaPuUCS,False,10,3,7,0.673,0.704,6,-8.056,1,0.36,0.196,0,0.0898,0.372,86.919,212093,4
2020-11-14,12,For The Night,Pop Smoke Featuring Lil Baby & DaBaby,47EiUVwUp4C9fGccaPuUCS,False,14,6,18,0.823,0.586,6,-6.606,0,0.2,0.114,0,0.193,0.347,125.971,190476,4
2020-11-14,13,Rockstar,DaBaby Featuring Roddy Ricch,47EiUVwUp4C9fGccaPuUCS,False,11,1,29,0.746,0.69,11,-7.956,1,0.164,0.247,0,0.101,0.497,89.977,181733,4
2020-11-14,14,Before You Go,Lewis Capaldi,47EiUVwUp4C9fGccaPuUCS,False,13,9,40,0.459,0.575,3,-4.858,1,0.0573,0.604,0,0.0885,0.183,111.881,215107,4
2020-11-14,15,Go Crazy,Chris Brown & Young Thug,47EiUVwUp4C9fGccaPuUCS,False,16,9,26,0.755,0.578,0,-8.932,0,0.145,0.316,0,0.25,0.581,94.148,176960,4
2020-11-14,16,Dynamite,BTS,47EiUVwUp4C9fGccaPuUCS,False,12,1,11,0.746,0.765,6,-4.41,0,0.0993,0.0112,0,0.0936,0.737,114.044,199054,4
2020-11-14,17,Watermelon Sugar,Harry Styles,47EiUVwUp4C9fGccaPuUCS,False,15,1,33,0.548,0.816,0,-4.209,1,0.0465,0.122,0,0.335,0.557,95.39,174000,4
2020-11-14,18,Forever After All,Luke Combs,47EiUVwUp4C9fGccaPuUCS,False,2,2,2,0.487,0.65,0,-5.195,1,0.0253,0.191,0,0.0933,0.456,151.964,232533,4
2020-11-14,19,Kings & Queens,Ava Max,47EiUVwUp4C9fGccaPuUCS,False,22,19,13,0.637,0.69,1,-4.057,0,0.0405,0.00786,0,0.124,0.457,129.857,162399,4
2020-11-14,20,Said Sum,Moneybagg Yo,47EiUVwUp4C9fGccaPuUCS,False,17,17,18,0.929,0.667,8,-6.789,0,0.353,0.0185,0,0.1,0.274,126.998,155168,4
2020-11-14,21,Lonely,Justin Bieber & benny blanco,47EiUVwUp4C9fGccaPuUCS,False,27,14,3,0.631,0.239,11,-7.071,0,0.0398,0.864,0,0.116,0.0927,79.859,149297,4
2020-11-14,23,More Than My Hometown,Morgan Wallen,,False,23,23,21,0.62,0.869,6,-5.479,1,0.0462,0.615,0,0.131,0.597,126.019,216573,4
2020-11-14,24,Whats Poppin,"Jack Harlow Featuring DaBaby, Tory Lanez & Lil Wayne",,False,20,2,39,0.904,0.723,11,-5.224,0,0.26,0.0631,0,0.185,0.835,145.013,227478,4
2020-11-14,25,ily,surf mesa Featuring Emilee,,False,25,25,24,0.674,0.774,11,-7.567,0,0.0892,0.0686,0.00188,0.393,0.33,112.05,176547,4
2020-11-14,26,Bang!,AJR,,False,28,26,18,0.74,0.516,1,-6.233,0,0.0507,0.0183,0,0.0558,0.698,139.918,170858,4
2020-11-14,27,One Of Them Girls,Lee Brice,,False,26,17,23,0.643,0.79,4,-6.079,1,0.0462,0.294,0,0.107,0.8,95.987,188893,4
2020-11-14,28,Got What I Got,Jason Aldean,,False,21,16,23,0.512,0.58,3,-6.658,0,0.029,0.621,1.72e-05,0.513,0.303,159.847,178147,3
2020-11-14,29,Levitating,Dua Lipa Featuring DaBaby,,False,42,29,5,0.702,0.825,6,-3.787,0,0.0601,0.00883,0,0.0674,0.915,102.977,203064,4
2020-11-14,30,What You Know Bout Love,Pop Smoke,,False,29,25,9,0.709,0.548,10,-8.493,1,0.353,0.65,1.59e-06,0.133,0.543,83.995,160000,4
2020-11-14,31,Come & Go,Juice WRLD x Marshmello,,False,24,2,17,0.625,0.814,0,-5.181,1,0.0657,0.0172,0,0.158,0.535,144.991,205485,4
2020-11-14,32,Motive,Ariana Grande Featuring Doja Cat,5GkQIP5mWPi4KZLLXeuFTT,True,0,32,1,0.789,0.742,10,-5.664,0,0.0652,0.0681,0,0.166,0.661,116.965,167990,4
2020-11-14,33,Wonder,Shawn Mendes,5GkQIP5mWPi4KZLLXeuFTT,False,32,18,5,0.333,0.637,1,-4.904,0,0.0581,0.131,1.8e-05,0.149,0.132,139.898,172693,4
2020-11-14,34,Love You Like I Used To,Russell Dickerson,5GkQIP5mWPi4KZLLXeuFTT,False,37,34,9,0.501,0.788,10,-4.624,1,0.0415,0.12,0,0.137,0.61,152.047,186613,4
2020-11-14,35,Off The Table,Ariana Grande Featuring The Weeknd,7E1jVNoWuemqUryI4FxsVD,True,0,35,1,0.411,0.522,0,-7.295,1,0.0981,0.519,0,0.398,0.382,88.332,239949,1
2020-11-14,36,One Beer,HARDY Featuring Lauren Alaina & Devin Dawson,7E1jVNoWuemqUryI4FxsVD,False,36,36,22,0.516,0.745,2,-8.352,1,0.0774,0.563,0,0.275,0.825,186.004,173173,3
2020-11-14,37,Adore You,Harry Styles,7E1jVNoWuemqUryI4FxsVD,False,31,6,48,0.676,0.771,8,-3.675,1,0.0483,0.0237,7e-06,0.102,0.569,99.048,207133,4
2020-11-14,38,Pretty Heart,Parker McCollum,7E1jVNoWuemqUryI4FxsVD,False,43,38,17,0.562,0.683,7,-4.427,1,0.0296,0.00531,0,0.107,0.385,132.003,244798,4
2020-11-14,39,The Woo,Pop Smoke Featuring 50 Cent & Roddy Ricch,7E1jVNoWuemqUryI4FxsVD,False,35,11,18,0.49,0.618,1,-5.655,1,0.104,0.0221,3.77e-06,0.259,0.286,99.7,201600,4
2020-11-14,40,pov,Ariana Grande,3UoULw70kMsiVXxW0L3A33,True,0,40,1,0.487,0.534,0,-5.664,0,0.0555,0.36,0,0.1,0.173,131.798,201882,4
2020-11-14,41,Better Together,Luke Combs,3UoULw70kMsiVXxW0L3A33,False,30,30,5,0.552,0.225,0,-11.501,1,0.0477,0.827,0,0.111,0.67,138.002,219573,4
2020-11-14,42,Rags2Riches,Rod Wave Featuring ATR Son Son,3UoULw70kMsiVXxW0L3A33,False,40,12,19,0.874,0.443,5,-9.628,0,0.241,0.147,0,0.124,0.298,118.004,235988,4
2020-11-14,43,Just Like Magic,Ariana Grande,7Dx9Z6Aon1qPS2N0rHSWTe,True,0,43,1,0.719,0.607,8,-5.156,1,0.165,0.08,0,0.125,0.464,128.006,149900,4
2020-11-14,44,Roses,SAINt JHN,7Dx9Z6Aon1qPS2N0rHSWTe,False,39,4,33,0.769,0.719,8,-5.472,1,0.0474,0.0143,0.00777,0.359,0.863,121.955,176867,4
2020-11-14,45,Diamonds,Sam Smith,7Dx9Z6Aon1qPS2N0rHSWTe,False,58,45,7,0.653,0.667,10,-6.764,0,0.0423,0.154,0,0.107,0.556,104.181,213869,4
2020-11-14,46,Happy Anywhere,Blake Shelton Featuring Gwen Stefani,7Dx9Z6Aon1qPS2N0rHSWTe,False,46,45,15,0.538,0.745,8,-5.774,1,0.0387,0.1,0,0.063,0.669,165.755,170173,4
2020-11-14,47,Shut Up,Ariana Grande,3ko9jEHNt4O5fjKN65ULJp,True,0,47,1,0.499,0.462,0,-5.308,1,0.0312,0.801,0,0.0946,0.599,127.698,157710,4
2020-11-14,48,Thriller,Michael Jackson,3ko9jEHNt4O5fjKN65ULJp,False,0,4,20,0.764,0.887,11,-3.726,1,0.0744,0.0816,0.00011,0.847,0.72,118.427,358053,4
2020-11-14,49,Nasty,Ariana Grande,0sci7ppTZFm4mjcH3nu8yO,True,0,49,1,0.772,0.506,6,-6.558,0,0.139,0.0814,1.1e-05,0.182,0.456,127.894,200733,4
2020-11-14,50,Break My Heart,Dua Lipa,0sci7ppTZFm4mjcH3nu8yO,False,44,13,32,0.73,0.729,4,-3.434,0,0.0883,0.167,1.39e-06,0.349,0.467,113.013,221820,4
2020-11-14,51,Everywhere But On,Matt Stell,0sci7ppTZFm4mjcH3nu8yO,False,48,48,9,0.563,0.722,6,-3.972,1,0.0279,0.0345,0,0.0795,0.309,149.903,192587,4
2020-11-14,52,Safety Net,Ariana Grande Featuring Ty Dolla $ign,14gkWVFMwdxBMyqBw1wmIg,True,0,52,1,0.552,0.599,1,-5.75,0,0.0404,0.0703,0,0.0986,0.0916,161.884,208457,4
2020-11-14,53,Mood Swings,Pop Smoke Featuring Lil Tjay,14gkWVFMwdxBMyqBw1wmIg,False,47,17,18,0.48,0.602,10,-6.335,0,0.368,0.487,0,0.0848,0.269,179.798,213333,4
2020-11-14,54,Tyler Herro,Jack Harlow,14gkWVFMwdxBMyqBw1wmIg,False,34,34,2,0.794,0.756,5,-7.16,0,0.136,0.11,0,0.247,0.775,123.066,156498,4
2020-11-14,55,Mr. Right Now,21 Savage & Metro Boomin Featuring Drake,14gkWVFMwdxBMyqBw1wmIg,False,49,10,5,0.647,0.667,5,-5.563,1,0.304,0.231,0,0.133,0.704,172.08,193839,4
2020-11-14,56,Lovin' On You,Luke Combs,14gkWVFMwdxBMyqBw1wmIg,False,41,23,19,0.572,0.949,4,-4.865,1,0.06,0.00165,0.000195,0.163,0.53,118.974,194867,4
2020-11-14,57,Some Girls,Jameson Rodgers,14gkWVFMwdxBMyqBw1wmIg,False,45,29,13,0.431,0.831,8,-5.108,1,0.0474,0.0791,0,0.312,0.352,167.96,184893,4
2020-11-14,58,I Should Probably Go To Bed,Dan + Shay,14gkWVFMwdxBMyqBw1wmIg,False,50,42,14,0.721,0.277,1,-7.128,1,0.0365,0.634,0,0.112,0.309,131.935,171827,4
2020-11-14,59,Franchise,Travis Scott Featuring Young Thug & M.I.A.,14gkWVFMwdxBMyqBw1wmIg,False,51,1,6,0.835,0.699,8,-5.405,0,0.277,0.00671,0,0.195,0.547,154.981,202795,4
2020-11-14,60,Hawai,Maluma & The Weeknd,14gkWVFMwdxBMyqBw1wmIg,False,64,55,11,0.766,0.788,6,-3.128,0,0.312,0.105,5.81e-06,0.142,0.609,179.984,200482,4
2020-11-14,61,You Broke Me First.,Tate McRae,14gkWVFMwdxBMyqBw1wmIg,False,55,55,11,0.642,0.374,4,-9.386,1,0.0545,0.786,0,0.0906,0.0799,124.099,169266,4
2020-11-14,62,Popstar,DJ Khaled Featuring Drake,14gkWVFMwdxBMyqBw1wmIg,False,54,3,16,0.8,0.56,5,-4.818,0,0.261,0.057,0,0.134,0.45,163.071,200221,4
2020-11-14,63,Six Thirty,Ariana Grande,2IKJtXeR5UsaUjZB46fTOK,True,0,63,1,0.739,0.516,0,-7.154,1,0.0539,0.67,0,0.151,0.434,120.109,183874,4
2020-11-14,64,"Big, Big Plans",Chris Lane,2IKJtXeR5UsaUjZB46fTOK,False,67,64,5,0.574,0.58,7,-6.091,1,0.0278,0.076,0,0.12,0.4,149.974,187307,4
2020-11-14,65,My Hair,Ariana Grande,6u7gmPOz7pzzaeR9xSBpsR,True,0,65,1,0.686,0.526,0,-6.842,1,0.0374,0.0815,7.75e-06,0.144,0.372,92.013,158436,4
2020-11-14,66,24,Money Man Featuring Lil Baby,6u7gmPOz7pzzaeR9xSBpsR,False,52,49,12,0.868,0.638,2,-7.746,1,0.0736,0.146,0.0565,0.0931,0.459,126.03,182857,4
2020-11-14,67,My Ex's Best Friend,Machine Gun Kelly X blackbear,6u7gmPOz7pzzaeR9xSBpsR,False,57,28,12,0.731,0.675,5,-5.134,0,0.0434,0.00473,0,0.141,0.298,124.939,139461,4
2020-11-14,68,Ain't Always The Cowboy,Jon Pardi,6u7gmPOz7pzzaeR9xSBpsR,False,65,61,10,0.539,0.837,9,-3.458,1,0.0385,0.0094,0,0.262,0.551,151.913,220881,4
2020-11-14,69,Starting Over,Chris Stapleton,6u7gmPOz7pzzaeR9xSBpsR,False,63,57,10,0.638,0.538,10,-8.445,1,0.0315,0.452,0.000415,0.0695,0.318,89.124,240413,4
2020-11-14,70,Obvious,Ariana Grande,0q85C1JiECyYIQthz1posA,True,0,70,1,0.624,0.672,0,-5.334,1,0.106,0.0967,0,0.155,0.26,159.852,146959,4
2020-11-14,71,West Side,Ariana Grande,1whfVLMKWqAX3uk97VXsNN,True,0,71,1,0.688,0.455,11,-8.632,0,0.199,0.186,0,0.0794,0.557,87.865,132279,4
2020-11-14,72,7 Summers,Morgan Wallen,1whfVLMKWqAX3uk97VXsNN,False,60,6,12,0.466,0.786,0,-5.13,1,0.0328,0.417,6.1e-05,0.125,0.571,203.903,210507,4
2020-11-14,73,Wishing Well,Juice WRLD,1whfVLMKWqAX3uk97VXsNN,False,62,5,17,0.65,0.613,9,-6.13,0,0.128,0.00336,0,0.267,0.0804,149.972,194621,4
2020-11-14,74,U 2 Luv,Ne-Yo & Jeremih,1whfVLMKWqAX3uk97VXsNN,False,66,66,5,0.628,0.597,6,-7.083,1,0.15,0.131,0.000335,0.0961,0.667,177.742,208216,4
2020-11-14,75,Love Language,Ariana Grande,6NYtLvyThMT0oALFdJFdzq,True,0,75,1,0.688,0.573,10,-5.03,0,0.208,0.0686,0,0.0749,0.553,110.034,179861,4
2020-11-14,76,Tap In,Saweetie,6NYtLvyThMT0oALFdJFdzq,False,59,20,17,0.954,0.696,10,-7.117,0,0.204,0.00576,0.000498,0.0754,0.432,100.036,139413,4
2020-11-14,77,B.S.,Jhene Aiko Featuring H.E.R.,6NYtLvyThMT0oALFdJFdzq,False,75,24,14,0.617,0.525,8,-10.426,0,0.12,0.554,1.1e-06,0.135,0.377,135.781,212867,4
2020-11-14,78,Don't Stop,Megan Thee Stallion Featuring Young Thug,6NYtLvyThMT0oALFdJFdzq,False,72,30,5,0.933,0.757,2,-3.212,1,0.117,0.00184,0,0.135,0.544,137.993,187941,4
2020-11-14,79,Hit Different,SZA Featuring Ty Dolla $ign,6NYtLvyThMT0oALFdJFdzq,False,68,29,9,0.679,0.516,0,-6.371,0,0.0452,0.199,0,0.0965,0.716,120.074,202008,4
2020-11-14,80,Weeeeee,Trippie Redd,2PI3qpTqYowwMzOSQRuj73,True,0,80,1,0.729,0.503,0,-8.229,1,0.081,0.111,0,0.123,0.152,134.927,152920,4
2020-11-14,81,Martin & Gina,Polo G,2PI3qpTqYowwMzOSQRuj73,False,73,61,14,0.832,0.534,1,-7.813,0,0.253,0.345,0,0.165,0.116,93.924,132833,4
2020-11-14,82,Midnight Sky,Miley Cyrus,2PI3qpTqYowwMzOSQRuj73,False,56,14,12,0.705,0.814,4,-5.466,0,0.0346,0.00115,0.00312,0.203,0.259,110.0,223279,4
2020-11-14,83,Runnin,21 Savage & Metro Boomin,2PI3qpTqYowwMzOSQRuj73,False,61,9,5,0.819,0.626,10,-4.574,0,0.202,0.00748,0.101,0.167,0.415,143.01,195906,4
2020-11-14,84,Heather,Conan Gray,2PI3qpTqYowwMzOSQRuj73,False,71,46,12,0.357,0.425,5,-7.301,1,0.0333,0.584,0,0.322,0.27,102.078,198040,3
2020-11-14,85,Good Time,Niko Moon,2PI3qpTqYowwMzOSQRuj73,False,81,74,5,0.79,0.646,5,-5.878,1,0.0447,0.132,0,0.295,0.641,138.047,214707,4
2020-11-14,86,Golden,Harry Styles,2PI3qpTqYowwMzOSQRuj73,False,74,74,3,0.448,0.838,4,-5.257,0,0.0557,0.21,0.000131,0.131,0.254,139.863,208907,4
2020-11-14,87,Throat Baby (Go Baby),BRS Kash,2PI3qpTqYowwMzOSQRuj73,False,93,87,3,0.878,0.475,1,-8.42,0,0.324,0.00984,0,0.167,0.397,131.988,211610,4
2020-11-14,88,Practice,DaBaby,2PI3qpTqYowwMzOSQRuj73,False,86,86,2,0.849,0.536,1,-7.307,1,0.349,0.0239,0,0.126,0.308,141.964,122587,4
2020-11-14,89,Put Your Records On,Ritt Momney,2PI3qpTqYowwMzOSQRuj73,False,80,79,5,0.399,0.491,6,-10.778,0,0.0538,0.0563,0.00089,0.11,0.151,91.066,210463,4
2020-11-14,90,Blind,DaBaby Featuring Young Thug,2PI3qpTqYowwMzOSQRuj73,False,83,78,7,0.709,0.679,11,-6.503,0,0.346,0.0115,0,0.0971,0.754,162.973,153467,4
2020-11-14,91,Relacion,"Sech, Daddy Yankee & J Balvin Featuring ROSALIA & Farruko",2PI3qpTqYowwMzOSQRuj73,False,79,64,9,0.793,0.771,5,-3.417,1,0.0959,0.0337,1.51e-06,0.284,0.835,171.943,247308,4
2020-11-14,92,Stay Down,"Lil Durk, 6LACK & Young Thug",2dNMeXpQBF7EZKm8hqfRhh,True,0,92,1,0.813,0.57,3,-8.409,0,0.265,0.0909,0,0.0982,0.676,109.07,169330,4
2020-11-14,93,Kacey Talk,YoungBoy Never Broke Again,2dNMeXpQBF7EZKm8hqfRhh,False,85,50,12,0.877,0.607,10,-7.818,0,0.15,0.535,0,0.138,0.773,127.055,151249,4
2020-11-14,94,Champagne Night,Lady A,2dNMeXpQBF7EZKm8hqfRhh,False,90,90,3,0.523,0.927,4,-2.796,1,0.0489,0.0272,5.98e-06,0.168,0.939,149.929,185070,4
2020-11-14,95,Hole In The Bottle,Kelsea Ballerini,2dNMeXpQBF7EZKm8hqfRhh,False,87,87,4,0.598,0.839,4,-4.605,1,0.111,0.106,0,0.372,0.783,105.084,156276,4
2020-11-14,96,Happy Does,Kenny Chesney,2dNMeXpQBF7EZKm8hqfRhh,False,92,85,3,0.715,0.665,6,-5.486,1,0.0383,0.3,0,0.123,0.597,109.018,168733,4
2020-11-14,97,So Done,The Kid LAROI,2dNMeXpQBF7EZKm8hqfRhh,False,77,77,2,0.719,0.598,9,-6.254,1,0.077,0.232,0,0.115,0.303,142.592,126521,4
2020-11-14,98,Thick,DJ Chose Featuring BeatKing,0YYNIGKgAk34vZkV2NySie,True,0,98,1,0.87,0.752,4,-6.615,1,0.372,0.0352,1.1e-06,0.269,0.591,145.118,178834,4
2020-11-14,99,La Toxica,Farruko,0YYNIGKgAk34vZkV2NySie,False,98,98,2,0.659,0.701,9,-4.107,1,0.164,0.0882,0,0.0866,0.623,91.97,180520,4
2020-11-14,100,Take You Dancing,Jason Derulo,59qrUpoplZxbIZxk6X0Bm3,True,0,100,1,0.789,0.711,2,-4.248,1,0.041,0.0332,0,0.0876,0.753,112.985,190306,4
