date,position,title,artist,spotify_id,is_new,last_pos,peak_pos,weeks,danceability,energy,key,loudness,mode,speechiness,acousticness,instrumentalness,liveness,valence,tempo,duration_ms,time_signature
2012-06-09,1,Somebody That I Used To Know,Gotye Featuring Kimbra,5ksoJlQJtduEkwQTo7UN7X,False,1,1,21,0.864,0.495,0,-7.036,1,0.037,0.591,0.000133,0.0992,0.72,129.062,244973,4
2012-06-09,2,Call Me Maybe,Carly Rae Jepsen,5ksoJlQJtduEkwQTo7UN7X,False,2,2,14,0.783,0.58,7,-6.548,1,0.0408,0.0114,2.28e-06,0.108,0.66,120.021,193400,4
2012-06-09,3,Payphone,Maroon 5 Featuring Wiz Khalifa,5ksoJlQJtduEkwQTo7UN7X,False,3,2,6,0.739,0.756,4,-4.828,1,0.0394,0.0136,0,0.37,0.523,110.028,231387,4
2012-06-09,4,We Are Young,fun. Featuring Janelle Monae,5ksoJlQJtduEkwQTo7UN7X,False,4,1,23,0.378,0.638,10,-5.576,1,0.075,0.02,7.66e-05,0.0849,0.735,184.086,250627,4
2012-06-09,5,Starships,Nicki Minaj,5ksoJlQJtduEkwQTo7UN7X,False,5,5,15,0.747,0.716,11,-2.457,0,0.075,0.135,0,0.251,0.751,125.008,210627,4
2012-06-09,6,Wild Ones,Flo Rida Featuring Sia,5ksoJlQJtduEkwQTo7UN7X,False,6,5,21,0.608,0.86,5,-5.324,0,0.0554,0.0991,0,0.262,0.437,127.075,232947,4
2012-06-09,7,What Makes You Beautiful,One Direction,5ksoJlQJtduEkwQTo7UN7X,False,7,4,15,0.726,0.787,4,-2.494,1,0.0737,0.009,0,0.0596,0.888,124.99,199987,4
2012-06-09,8,Glad You Came,The Wanted,5ksoJlQJtduEkwQTo7UN7X,False,8,3,20,0.61,0.841,7,-4.579,0,0.0692,0.056,9.85e-06,0.118,0.431,126.889,198187,4
2012-06-09,9,Boyfriend,Justin Bieber,5ksoJlQJtduEkwQTo7UN7X,False,9,2,9,0.717,0.55,10,-6.019,0,0.0521,0.0358,0.00196,0.126,0.332,96.976,171333,4
2012-06-09,10,Home,Phillip Phillips,4rsW3WCZBGwhHfJWuHRwyT,True,0,10,1,0.606,0.826,0,-6.04,1,0.0307,0.0256,1.56e-05,0.117,0.322,121.04,210173,4
2012-06-09,11,Where Have You Been,Rihanna,4rsW3WCZBGwhHfJWuHRwyT,False,13,11,6,0.719,0.847,0,-6.34,0,0.0916,0.00201,0.0204,0.221,0.444,127.963,242680,4
2012-06-09,12,Drive By,Train,4rsW3WCZBGwhHfJWuHRwyT,False,10,10,20,0.765,0.837,1,-3.113,0,0.032,0.00107,1.06e-05,0.0801,0.721,122.028,195973,4
2012-06-09,13,Scream,Usher,4rsW3WCZBGwhHfJWuHRwyT,False,15,13,5,0.616,0.862,7,-5.18,0,0.0973,0.00117,0,0.179,0.569,127.992,234693,4
2012-06-09,14,Back In Time,Pitbull,4rsW3WCZBGwhHfJWuHRwyT,False,16,14,8,0.729,0.911,0,-4.5,1,0.045,0.00205,1.39e-06,0.295,0.74,127.087,207760,4
2012-06-09,15,Stronger (What Doesn't Kill You),Kelly Clarkson,4rsW3WCZBGwhHfJWuHRwyT,False,11,1,23,0.562,0.939,0,-4.282,1,0.0475,0.046,0,0.112,0.684,116.044,221947,4
2012-06-09,16,Brokenhearted,Karmin,4rsW3WCZBGwhHfJWuHRwyT,False,23,16,12,0.765,0.765,1,-2.732,0,0.0585,0.00765,3.82e-06,0.0527,0.886,120.001,227147,4
2012-06-09,17,Lights,Ellie Goulding,4rsW3WCZBGwhHfJWuHRwyT,False,22,17,23,0.681,0.802,8,-5.836,0,0.0347,0.0271,0.0496,0.127,0.791,120.053,212707,4
2012-06-09,18,Feel So Close,Calvin Harris,4rsW3WCZBGwhHfJWuHRwyT,False,12,12,16,0.707,0.924,7,-2.842,1,0.031,0.000972,0.00703,0.204,0.919,127.937,206413,4
2012-06-09,19,Springsteen,Eric Church,4rsW3WCZBGwhHfJWuHRwyT,False,20,19,13,0.692,0.809,2,-5.935,1,0.0255,0.1,9.77e-05,0.185,0.927,104.023,263387,4
2012-06-09,20,Part Of Me,Katy Perry,4rsW3WCZBGwhHfJWuHRwyT,False,14,1,15,0.678,0.918,5,-4.63,1,0.0355,0.000417,0,0.0744,0.769,130.028,216160,4
2012-06-09,21,Take Care,Drake Featuring Rihanna,4rsW3WCZBGwhHfJWuHRwyT,False,17,7,28,0.629,0.515,0,-10.358,0,0.265,0.0267,1.22e-05,0.0888,0.299,121.845,277387,4
2012-06-09,22,Drunk On You,Luke Bryan,4rsW3WCZBGwhHfJWuHRwyT,False,24,22,13,0.558,0.872,9,-4.401,1,0.0449,0.178,0,0.173,0.472,143.971,213547,4
2012-06-09,23,The Motto,Drake Featuring Lil Wayne,4rsW3WCZBGwhHfJWuHRwyT,False,18,14,28,0.766,0.442,1,-8.558,1,0.356,0.000107,6.12e-05,0.111,0.39,201.8,181573,4
2012-06-09,24,Mercy,"Kanye West, Big Sean, Pusha T, 2 Chainz",4rsW3WCZBGwhHfJWuHRwyT,False,26,21,8,0.563,0.496,6,-9.381,0,0.406,0.0685,5.8e-05,0.173,0.426,139.993,329320,4
2012-06-09,25,Titanium,David Guetta Featuring Sia,4rsW3WCZBGwhHfJWuHRwyT,False,30,25,7,0.604,0.788,0,-3.673,0,0.103,0.0678,0.153,0.127,0.301,126.06,245040,4
2012-06-09,26,Rumour Has It,Adele,4rsW3WCZBGwhHfJWuHRwyT,False,21,16,24,0.612,0.749,0,-5.014,1,0.0446,0.615,0,0.167,0.574,120.052,223267,4
2012-06-09,27,Good Girl,Carrie Underwood,4rsW3WCZBGwhHfJWuHRwyT,False,25,18,14,0.617,0.839,0,-2.849,0,0.0655,0.0286,0,0.19,0.741,128.91,205560,4
2012-06-09,28,Drank In My Cup,Kirko Bangz,4rsW3WCZBGwhHfJWuHRwyT,False,28,28,16,0.451,0.632,8,-7.98,0,0.297,0.0114,0,0.198,0.234,132.89,232160,4
2012-06-09,29,Somethin' 'Bout A Truck,Kip Moore,4rsW3WCZBGwhHfJWuHRwyT,False,31,29,16,0.554,0.794,11,-5.417,1,0.035,0.0697,0,0.63,0.79,176.01,213827,4
2012-06-09,30,I Won't Give Up,Jason Mraz,4rsW3WCZBGwhHfJWuHRwyT,False,29,8,21,0.585,0.303,4,-10.058,1,0.0398,0.694,0,0.115,0.142,136.703,240166,3
2012-06-09,31,Birthday Cake,Rihanna Featuring Chris Brown,4rsW3WCZBGwhHfJWuHRwyT,False,32,24,14,0.702,0.826,3,-6.498,1,0.0529,0.32,0.000227,0.355,0.329,80.014,78200,4
2012-06-09,32,Climax,Usher,4rsW3WCZBGwhHfJWuHRwyT,False,27,17,14,0.647,0.478,8,-8.837,1,0.0782,0.547,2.69e-05,0.156,0.333,135.877,232907,4
2012-06-09,33,Faded,Tyga Featuring Lil Wayne,4rsW3WCZBGwhHfJWuHRwyT,False,36,33,19,0.831,0.667,1,-8.438,1,0.188,0.0103,0,0.35,0.339,95.073,206667,4
2012-06-09,34,Dance Again,Jennifer Lopez Featuring Pitbull,4rsW3WCZBGwhHfJWuHRwyT,False,19,17,8,0.792,0.856,11,-5.236,0,0.067,0.0159,2.88e-06,0.0981,0.714,127.988,237267,4
2012-06-09,35,Wide Awake,Katy Perry,5JLv62qFIS1DR3zGEcApRt,True,0,35,1,0.514,0.683,5,-5.099,1,0.0367,0.0749,2.64e-06,0.392,0.575,159.814,220947,4
2012-06-09,36,We Found Love,Rihanna Featuring Calvin Harris,5JLv62qFIS1DR3zGEcApRt,False,34,1,36,0.734,0.766,1,-4.485,1,0.0383,0.025,0.00138,0.108,0.6,127.986,215227,4
2012-06-09,37,Fly Over States,Jason Aldean,5JLv62qFIS1DR3zGEcApRt,False,33,32,14,0.487,0.736,7,-3.269,1,0.0326,0.069,0,0.114,0.184,81.587,218200,4
2012-06-09,38,Set Fire To The Rain,Adele,5JLv62qFIS1DR3zGEcApRt,False,35,1,39,0.603,0.67,2,-3.882,0,0.0249,0.00408,1.68e-06,0.112,0.446,107.993,242974,4
2012-06-09,39,Party Rock Anthem,LMFAO Featuring Lauren Bennett & GoonRock,5JLv62qFIS1DR3zGEcApRt,False,38,1,62,0.75,0.727,5,-4.21,0,0.142,0.0189,0,0.266,0.359,129.993,262173,4
2012-06-09,40,Everybody Talks,Neon Trees,5JLv62qFIS1DR3zGEcApRt,False,42,40,11,0.471,0.924,8,-3.906,1,0.0586,0.00301,0,0.313,0.725,154.961,177280,4
2012-06-09,41,Cashin' Out,Ca$h Out,5JLv62qFIS1DR3zGEcApRt,False,41,41,7,0.831,0.665,1,-3.627,0,0.0711,0.149,0,0.0636,0.663,129.989,238760,4
2012-06-09,42,Sexy And I Know It,LMFAO,5JLv62qFIS1DR3zGEcApRt,False,39,1,39,0.707,0.861,7,-4.225,1,0.316,0.1,0,0.191,0.795,130.021,199480,4
2012-06-09,43,Give Your Heart A Break,Demi Lovato,5JLv62qFIS1DR3zGEcApRt,False,43,43,8,0.651,0.695,6,-3.218,1,0.0487,0.23,0,0.144,0.569,123.008,205347,4
2012-06-09,44,(Kissed You) Good Night,Gloriana,5JLv62qFIS1DR3zGEcApRt,False,72,44,8,0.523,0.747,11,-6.125,1,0.0292,0.0807,0,0.11,0.294,118.97,232903,4
2012-06-09,45,Good Feeling,Flo Rida,5JLv62qFIS1DR3zGEcApRt,False,40,3,35,0.706,0.89,1,-4.444,0,0.0688,0.0588,0.00286,0.306,0.684,128.011,248133,4
2012-06-09,46,Even If It Breaks Your Heart,Eli Young Band,5JLv62qFIS1DR3zGEcApRt,False,54,46,11,0.495,0.527,0,-4.742,1,0.0351,0.000159,0.0163,0.1,0.574,208.067,220520,4
2012-06-09,47,Turn Me On,David Guetta Featuring Nicki Minaj,5JLv62qFIS1DR3zGEcApRt,False,37,4,26,0.705,0.794,8,-2.266,1,0.0593,0.0488,0,0.575,0.412,127.961,199680,4
2012-06-09,48,Moves Like Jagger,Maroon 5 Featuring Christina Aguilera,5JLv62qFIS1DR3zGEcApRt,False,49,1,49,0.708,0.784,11,-3.742,0,0.049,0.012,0,0.368,0.697,128.015,202859,4
2012-06-09,49,Beez In The Trap,Nicki Minaj Featuring 2 Chainz,5JLv62qFIS1DR3zGEcApRt,False,55,49,8,0.813,0.782,9,-6.005,1,0.218,0.0227,0.00165,0.0956,0.681,150.003,268493,4
2012-06-09,50,No Hurry,Zac Brown Band,5JLv62qFIS1DR3zGEcApRt,False,56,50,12,0.565,0.531,3,-5.809,1,0.0287,0.375,0,0.312,0.407,146.027,226227,4
2012-06-09,51,So Good,B.o.B,5JLv62qFIS1DR3zGEcApRt,False,52,11,14,0.66,0.9,7,-5.02,1,0.14,0.0403,0,0.219,0.591,85.51,213253,4
2012-06-09,52,Better Than I Used To Be,Tim McGraw,5JLv62qFIS1DR3zGEcApRt,False,57,52,19,0.452,0.566,5,-5.964,1,0.0292,0.175,1.24e-05,0.0888,0.407,138.154,201000,4
2012-06-09,53,Leave You Alone,Young Jeezy Featuring Ne-Yo,5JLv62qFIS1DR3zGEcApRt,False,53,51,11,0.671,0.666,11,-7.769,0,0.044,0.163,0,0.426,0.442,94.573,329267,4
2012-06-09,54,"Work Hard, Play Hard",Wiz Khalifa,5JLv62qFIS1DR3zGEcApRt,False,58,17,5,0.787,0.666,11,-4.475,1,0.0485,0.0409,1.91e-05,0.296,0.485,140.008,219027,4
2012-06-09,55,UP!,LoveRance Featuring IamSu & Skipper or 50 Cent,5JLv62qFIS1DR3zGEcApRt,False,46,46,13,0.881,0.416,1,-13.488,1,0.158,0.322,0,0.0927,0.468,96.997,256766,4
2012-06-09,56,We Run The Night,Havana Brown Featuring Pitbull,5JLv62qFIS1DR3zGEcApRt,False,65,56,9,0.697,0.861,9,-4.389,0,0.144,0.00482,1.83e-06,0.41,0.703,127.023,228200,4
2012-06-09,57,Over You,Miranda Lambert,5JLv62qFIS1DR3zGEcApRt,False,51,35,19,0.566,0.507,6,-6.973,1,0.0279,0.535,0.00619,0.107,0.141,158.119,253373,4
2012-06-09,58,You Don't Know Her Like I Do,Brantley Gilbert,5JLv62qFIS1DR3zGEcApRt,False,64,58,18,0.49,0.716,4,-6.681,1,0.0441,0.022,0.00048,0.0526,0.288,74.988,286520,4
2012-06-09,59,Right By My Side,Nicki Minaj Featuring Chris Brown,5JLv62qFIS1DR3zGEcApRt,False,60,51,8,0.567,0.858,1,-4.848,1,0.275,0.0176,0,0.127,0.493,161.911,265333,4
2012-06-09,60,Eyes Open,Taylor Swift,5JLv62qFIS1DR3zGEcApRt,False,45,19,10,0.598,0.724,7,-7.225,1,0.0345,0.00678,0.00182,0.0839,0.297,137.115,244587,4
2012-06-09,61,The Fighter,Gym Class Heroes Featuring Ryan Tedder,5JLv62qFIS1DR3zGEcApRt,False,95,61,2,0.592,0.926,7,-3.469,1,0.126,0.0775,0,0.187,0.432,99.018,228533,4
2012-06-09,62,Ayy Ladies,Travis Porter Featuring Tyga,5JLv62qFIS1DR3zGEcApRt,False,61,53,13,0.905,0.782,10,-3.604,0,0.164,0.096,0,0.0623,0.798,96.055,211293,4
2012-06-09,63,HYFR (Hell Ya F*****g Right),Drake Featuring Lil Wayne,5JLv62qFIS1DR3zGEcApRt,False,63,63,12,0.444,0.627,7,-8.744,0,0.252,0.123,0,0.0795,0.359,98.21,206627,3
2012-06-09,64,Some Nights,fun.,5JLv62qFIS1DR3zGEcApRt,False,67,62,14,0.672,0.738,0,-7.045,1,0.0506,0.0178,6.75e-05,0.0927,0.392,107.938,277040,4
2012-06-09,65,Come Over,Kenny Chesney,5JLv62qFIS1DR3zGEcApRt,False,59,59,2,0.466,0.704,1,-7.169,1,0.0353,0.1,2.71e-05,0.0744,0.481,176.043,248427,4
2012-06-09,66,5-1-5-0,Dierks Bentley,5JLv62qFIS1DR3zGEcApRt,False,73,66,3,0.554,0.849,1,-5.181,0,0.0357,0.0246,0.000233,0.31,0.683,116.992,182893,4
2012-06-09,67,Too Close,Alex Clare,5JLv62qFIS1DR3zGEcApRt,False,48,48,9,0.584,0.712,11,-4.311,0,0.0395,0.0112,1.05e-06,0.114,0.286,126.043,256560,4
2012-06-09,68,Beers Ago,Toby Keith,5JLv62qFIS1DR3zGEcApRt,False,70,68,6,0.565,0.84,0,-4.641,1,0.0296,0.0284,0,0.0928,0.742,144.04,206640,4
2012-06-09,69,Burn It Down,Linkin Park,5JLv62qFIS1DR3zGEcApRt,False,66,30,6,0.585,0.972,9,-4.45,0,0.0534,0.0143,0,0.0707,0.585,110.006,230253,4
2012-06-09,70,Take It To The Head,"DJ Khaled Featuring Chris Brown, Rick Ross, Nicki Minaj & Lil Wayne",5JLv62qFIS1DR3zGEcApRt,False,71,63,8,0.714,0.846,11,-2.802,0,0.0787,0.00146,0,0.682,0.634,141.976,267173,4
2012-06-09,71,Heart Attack,Trey Songz,5JLv62qFIS1DR3zGEcApRt,False,69,65,8,0.608,0.863,11,-4.87,1,0.131,0.0593,0,0.228,0.476,150.029,233147,4
2012-06-09,72,Turn Up The Music,Chris Brown,5JLv62qFIS1DR3zGEcApRt,False,68,10,15,0.594,0.841,1,-5.792,1,0.102,0.000238,2.22e-06,0.156,0.643,129.925,227973,4
2012-06-09,73,No Lie,2 Chainz Featuring Drake,5JLv62qFIS1DR3zGEcApRt,False,62,45,3,0.634,0.665,6,-5.984,0,0.176,0.0172,0,0.365,0.611,131.108,237827,4
2012-06-09,74,One Thing,One Direction,5JLv62qFIS1DR3zGEcApRt,False,76,62,9,0.713,0.718,2,-3.806,1,0.0278,0.00233,0,0.0838,0.656,126.999,197600,4
2012-06-09,75,Let's Go,Calvin Harris Featuring Ne-Yo,5JLv62qFIS1DR3zGEcApRt,False,89,75,3,0.71,0.882,4,-2.932,0,0.0595,0.00777,0.00771,0.294,0.875,128.016,232800,4
2012-06-09,76,Around My Way (Freedom Ain't Free),Lupe Fiasco,2Vba5MBCdGqcE57GSiOstv,True,0,76,1,0.482,0.877,8,-3.714,0,0.374,0.0526,0,0.366,0.635,205.037,255773,4
2012-06-09,77,Wanted,Hunter Hayes,2Vba5MBCdGqcE57GSiOstv,False,77,77,5,0.421,0.476,0,-7.692,1,0.0298,0.268,0,0.0816,0.3,169.784,228840,4
2012-06-09,78,Tongue Tied,Grouplove,2Vba5MBCdGqcE57GSiOstv,False,74,69,5,0.56,0.936,3,-5.835,1,0.0439,0.00847,0,0.161,0.371,112.96,218013,4
2012-06-09,79,Time Is Love,Josh Turner,2Vba5MBCdGqcE57GSiOstv,False,79,79,9,0.663,0.814,2,-4.987,1,0.0466,0.0653,0.000252,0.0823,0.547,111.97,200373,4
2012-06-09,80,Crew Love,Drake Featuring The Weeknd,2Vba5MBCdGqcE57GSiOstv,False,82,80,10,0.418,0.546,0,-9.057,0,0.238,0.227,0,0.229,0.294,160.152,208813,4
2012-06-09,81,Both Of Us,B.o.B Featuring Taylor Swift,2Vba5MBCdGqcE57GSiOstv,False,91,18,4,0.677,0.722,7,-7.088,1,0.0522,0.0213,0,0.207,0.0483,125.091,216120,4
2012-06-09,82,Little Talks,Of Monsters And Men,2Vba5MBCdGqcE57GSiOstv,False,81,80,8,0.457,0.757,1,-5.177,1,0.032,0.0206,0,0.146,0.417,102.961,266600,4
2012-06-09,83,Midnight City,M83.,2Vba5MBCdGqcE57GSiOstv,False,78,72,12,0.526,0.712,11,-6.525,0,0.0356,0.0161,0,0.179,0.32,105.009,241440,4
2012-06-09,84,Nobody's Perfect,J. Cole Featuring Missy Elliott,2Vba5MBCdGqcE57GSiOstv,False,90,84,2,0.793,0.498,8,-11.208,0,0.17,0.0974,1.26e-05,0.13,0.427,119.988,190653,4
2012-06-09,85,Why Ya Wanna,Jana Kramer,2Vba5MBCdGqcE57GSiOstv,False,88,85,4,0.299,0.676,4,-3.187,1,0.051,0.273,0,0.113,0.298,167.498,221373,3
2012-06-09,86,Postcard From Paris,The Band Perry,2Vba5MBCdGqcE57GSiOstv,False,87,86,3,0.54,0.688,8,-5.366,1,0.0304,0.0732,0,0.0804,0.524,143.888,215147,4
2012-06-09,87,Fine By Me,Andy Grammer,2Vba5MBCdGqcE57GSiOstv,False,84,84,8,0.583,0.791,11,-4.087,1,0.0318,0.00877,0,0.0451,0.878,89.993,172893,4
2012-06-09,88,Banjo,Rascal Flatts,2Vba5MBCdGqcE57GSiOstv,False,75,51,15,0.617,0.862,2,-6.356,1,0.0337,0.0186,0,0.161,0.769,101.971,256133,4
2012-06-09,89,Don't Wake Me Up,Chris Brown,18VfHIPaCo0s6FTi1Fnp6T,True,0,89,1,0.602,0.691,7,-5.197,0,0.051,0.0548,0,0.144,0.206,127.967,222307,4
2012-06-09,90,Undefeated,Jason Derulo,5jAgU2QzailYWu02FzkxsT,True,0,90,1,0.612,0.835,0,-4.158,1,0.0388,0.000474,0,0.293,0.549,129.915,216280,4
2012-06-09,91,Angel Eyes,Love And Theft,5jAgU2QzailYWu02FzkxsT,False,98,91,2,0.656,0.696,8,-5.917,1,0.0261,0.0134,0,0.0753,0.966,108.015,186627,4
2012-06-09,92,Same Damn Time,Future,5jAgU2QzailYWu02FzkxsT,False,97,92,4,0.718,0.862,11,-4.915,1,0.0445,0.0135,0,0.24,0.305,138.97,273000,4
2012-06-09,93,Tonight (Best You Ever Had),John Legend Featuring Ludacris,5jAgU2QzailYWu02FzkxsT,False,99,79,6,0.693,0.813,7,-4.361,0,0.066,0.0496,0,0.289,0.515,90.008,239453,4
2012-06-09,94,Drink On It,Blake Shelton,5jAgU2QzailYWu02FzkxsT,False,80,39,18,0.643,0.725,7,-5.632,1,0.0231,0.0365,1.2e-06,0.326,0.683,93.975,211067,4
2012-06-09,95,Cowboys And Angels,Dustin Lynch,5jAgU2QzailYWu02FzkxsT,False,100,95,2,0.355,0.55,10,-5.772,1,0.0285,0.245,3.2e-05,0.0979,0.26,73.842,227720,4
2012-06-09,96,How We Do (Party),Rita Ora,05j9ehtmZsj8BL07s9rZ75,True,0,96,1,0.738,0.922,7,-3.94,1,0.0835,0.0034,0,0.0986,0.689,116.024,247027,4
2012-06-09,98,Got My Country On,Chris Cagle,,False,86,86,9,0.505,0.839,7,-4.557,1,0.0538,0.185,0,0.0406,0.511,160.154,233787,4
2012-06-09,99,Ai Se Eu Te Pego,Michel Telo,,False,94,81,9,0.688,0.62,11,-8.029,0,0.22,0.753,5.32e-06,0.157,0.727,170.011,360960,4
2012-06-09,100,Bangarang,Skrillex Featuring Sirah,,False,96,72,14,0.716,0.972,7,-2.302,1,0.196,0.0145,3.22e-05,0.317,0.576,110.026,215253,4
