date,position,title,artist,spotify_id,is_new,last_pos,peak_pos,weeks,danceability,energy,key,loudness,mode,speechiness,acousticness,instrumentalness,liveness,valence,tempo,duration_ms,time_signature
1991-08-31,1,(Everything I Do) I Do It For You,Bryan Adams,6KYw0mdNPgSBn3UWJt7o4u,False,1,1,10,0.508,0.834,2,-6.205,1,0.0386,0.0183,0,0.0732,0.774,139.131,216053,4
1991-08-31,2,Fading Like A Flower (Every Time You Leave),Roxette,6KYw0mdNPgSBn3UWJt7o4u,False,4,2,12,0.609,0.668,0,-5.738,1,0.026,0.195,0,0.219,0.319,105.419,230680,4
1991-08-31,3,It Ain't Over 'til It's Over,Lenny Kravitz,6KYw0mdNPgSBn3UWJt7o4u,False,2,2,13,0.679,0.568,6,-10.74,1,0.0423,0.422,0.00928,0.322,0.93,159.69,242640,4
1991-08-31,4,Wind Of Change,Scorpions,6KYw0mdNPgSBn3UWJt7o4u,False,7,4,14,0.452,0.524,0,-10.108,1,0.0351,0.315,0,0.103,0.246,151.505,312360,4
1991-08-31,5,The Promise Of A New Day,Paula Abdul,6KYw0mdNPgSBn3UWJt7o4u,False,8,5,7,0.754,0.82,1,-8.622,1,0.062,0.0911,1.62e-06,0.0805,0.896,119.835,272893,4
1991-08-31,6,Every Heartbeat,Amy Grant,6KYw0mdNPgSBn3UWJt7o4u,False,3,2,12,0.648,0.89,2,-3.834,1,0.0429,0.288,0,0.119,0.808,126.956,213733,4
1991-08-31,7,3 A.M. Eternal,The KLF,6KYw0mdNPgSBn3UWJt7o4u,False,9,7,11,0.732,0.577,0,-11.716,1,0.0506,0.000826,0.925,0.363,0.332,120.013,200073,4
1991-08-31,8,I Can't Wait Another Minute,Hi-Five,6KYw0mdNPgSBn3UWJt7o4u,False,10,8,11,0.625,0.644,8,-8.801,1,0.0287,0.357,0,0.102,0.638,147.435,301640,4
1991-08-31,9,Motownphilly,Boyz II Men,6KYw0mdNPgSBn3UWJt7o4u,False,11,9,12,0.754,0.857,2,-9.699,1,0.0605,0.0143,2.14e-05,0.278,0.785,114.144,235227,4
1991-08-31,11,Summertime,D.J. Jazzy Jeff & The Fresh Prince,,False,5,4,12,0.677,0.54,7,-14.439,1,0.0627,0.0455,1.84e-06,0.845,0.469,95.116,270973,4
1991-08-31,12,Crazy,Seal,,False,13,12,11,0.643,0.699,4,-11.102,0,0.039,0.436,0.109,0.166,0.89,102.877,269427,4
1991-08-31,13,"Time, Love And Tenderness",Michael Bolton,,False,16,13,8,0.51,0.808,6,-8.649,0,0.0475,0.0281,0,0.295,0.738,170.037,330307,4
1991-08-31,14,Unforgettable,Natalie Cole,,False,14,14,8,0.307,0.289,5,-13.369,1,0.0281,0.851,0.000126,0.0798,0.145,85.948,210907,4
1991-08-31,15,I Adore Mi Amor,Color Me Badd,,False,18,15,6,0.683,0.476,3,-9.995,0,0.027,0.243,0,0.0787,0.725,91.99,289200,4
1991-08-31,16,Too Many Walls,Cathy Dennis,,False,17,16,9,0.729,0.578,10,-11.04,1,0.0267,0.377,2.44e-05,0.0886,0.649,97.146,264680,4
1991-08-31,17,Temptation,Corina,,False,6,6,16,0.609,0.771,7,-10.663,1,0.0428,0.000274,0.05,0.038,0.565,118.352,241533,4
1991-08-31,18,Good Vibrations,Marky Mark & The Funky Bunch Featuring Loleatta Holloway,,False,22,18,7,0.711,0.951,1,-8.406,1,0.0537,0.00189,0.366,0.0229,0.903,121.656,269307,4
1991-08-31,19,Now That We Found Love,Heavy D & The Boyz,,False,21,19,10,0.744,0.697,8,-14.753,1,0.0631,0.039,0,0.171,0.683,119.955,258200,4
1991-08-31,20,The Motown Song,Rod Stewart,,False,20,20,9,0.654,0.837,9,-6.121,1,0.0455,0.155,0,0.113,0.778,116.0,238013,4
1991-08-31,21,Love Of A Lifetime,Firehouse,,False,23,21,10,0.472,0.48,1,-11.893,1,0.0308,0.000204,0.00275,0.0914,0.126,123.023,286573,4
1991-08-31,22,I'll Be There,The Escape Club,,False,15,8,15,0.57,0.385,1,-12.027,0,0.0251,0.383,0.0012,0.0924,0.188,99.86,347867,4
1991-08-31,23,My Name Is Not Susan,Whitney Houston,,False,24,23,6,0.787,0.899,7,-7.896,1,0.0562,0.178,0,0.358,0.536,101.098,279840,4
1991-08-31,24,Shiny Happy People,R.E.M.,,False,27,24,6,0.452,0.909,9,-3.977,1,0.0366,0.0313,0.0603,0.23,0.805,124.623,225787,4
1991-08-31,25,Just Like You,Robbie Nevil,,False,25,25,9,0.697,0.716,2,-11.987,1,0.0408,0.113,0,0.345,0.847,98.243,246600,4
1991-08-31,26,It Hit Me Like A Hammer,Huey Lewis & The News,,False,29,26,7,0.607,0.742,8,-11.151,1,0.0316,0.0772,0,0.126,0.736,145.3,241893,3
1991-08-31,27,P.A.S.S.I.O.N.,Rhythm Syndicate,,False,19,2,14,0.737,0.753,2,-8.416,0,0.0399,0.0135,0.0562,0.0738,0.562,110.89,217993,4
1991-08-31,28,Something To Talk About,Bonnie Raitt,,False,34,28,7,0.795,0.64,1,-13.478,1,0.0294,0.0631,2.13e-06,0.0692,0.954,102.633,227573,4
1991-08-31,29,Pop Goes The Weasel,3rd Bass,,False,30,29,8,0.663,0.599,2,-13.299,1,0.378,0.0145,0,0.15,0.259,200.312,235627,4
1991-08-31,30,Learning To Fly,Tom Petty And The Heartbreakers,,False,28,28,10,0.651,0.766,0,-9.935,1,0.0299,0.206,0.00103,0.362,0.949,116.74,242107,4
1991-08-31,31,Romantic,Karyn White,,False,36,31,3,0.68,0.941,1,-7.509,0,0.0374,0.484,7.43e-05,0.0656,0.823,110.264,247160,4
1991-08-31,32,Hole Hearted,Extreme,,False,37,32,5,0.4,0.747,6,-9.438,1,0.045,0.163,0,0.0774,0.674,203.396,219289,4
1991-08-31,33,Everybody Plays The Fool,Aaron Neville,,False,35,33,7,0.789,0.352,10,-14.022,1,0.143,0.224,0.00147,0.0536,0.431,87.894,266107,4
1991-08-31,34,Do Anything,Natural Selection,,False,40,34,4,0.654,0.749,11,-9.221,0,0.0537,0.0746,0,0.114,0.663,93.847,237373,4
1991-08-31,35,Emotions,Mariah Carey,0cELvuwJW1acISUHYB6suj,True,0,35,1,0.74,0.752,9,-7.008,0,0.0359,0.0409,0.00125,0.0233,0.939,114.851,248093,4
1991-08-31,36,You Could Be Mine,Guns N' Roses,0cELvuwJW1acISUHYB6suj,False,33,29,8,0.35,0.985,10,-5.676,0,0.122,0.00876,0.551,0.36,0.323,151.007,343640,4
1991-08-31,37,"Right Here, Right Now",Jesus Jones,0cELvuwJW1acISUHYB6suj,False,26,2,21,0.657,0.608,2,-13.565,1,0.0287,0.0088,3.45e-06,0.103,0.723,106.862,189293,4
1991-08-31,38,Enter Sandman,Metallica,0cELvuwJW1acISUHYB6suj,False,47,38,2,0.579,0.824,6,-8.71,0,0.03,0.00206,0.00903,0.059,0.635,123.331,331573,4
1991-08-31,39,The Sound Of Your Voice,38 Special,0cELvuwJW1acISUHYB6suj,False,44,39,8,0.616,0.786,4,-9.973,1,0.0281,0.0148,0,0.224,0.79,136.043,299600,4
1991-08-31,40,Got A Love For You,Jomanda,0cELvuwJW1acISUHYB6suj,False,41,40,9,0.708,0.604,6,-13.591,0,0.0437,4.18e-05,0.639,0.0489,0.632,119.9,454960,4
1991-08-31,41,Hard To Handle,The Black Crowes,0cELvuwJW1acISUHYB6suj,False,31,26,11,0.599,0.79,4,-3.58,1,0.043,0.00257,0.00181,0.312,0.961,103.783,188067,4
1991-08-31,42,Love. . .Thy Will Be Done,Martika,0cELvuwJW1acISUHYB6suj,False,45,42,4,0.663,0.34,2,-10.995,1,0.0286,0.4,0.00363,0.163,0.269,91.38,302773,4
1991-08-31,44,Love And Understanding,Cher,,False,32,17,12,0.668,0.75,0,-9.717,1,0.0267,0.0332,3.5e-06,0.0383,0.646,116.07,282040,4
1991-08-31,45,The One And Only,Chesney Hawkes,,False,56,45,5,0.681,0.697,4,-11.063,1,0.0327,0.357,0,0.388,0.775,119.956,223667,4
1991-08-31,46,Only Time Will Tell,Nelson,,False,39,28,11,0.455,0.417,0,-16.817,0,0.0303,0.316,1.44e-06,0.0608,0.464,142.25,233718,4
1991-08-31,47,With You,Tony Terry,,False,49,47,10,0.619,0.492,8,-9.532,1,0.0328,0.455,0,0.106,0.553,131.888,305827,4
1991-08-31,48,Don't Want To Be A Fool,Luther Vandross,,False,55,48,5,0.632,0.576,7,-8.345,1,0.0234,0.482,0,0.151,0.323,95.321,275133,4
1991-08-31,49,There She Goes,The La's,,False,53,49,7,0.536,0.854,7,-6.907,1,0.0298,0.0129,0.743,0.156,0.905,122.733,162160,4
1991-08-31,50,Rush Rush,Paula Abdul,,False,42,1,17,0.706,0.44,4,-11.577,1,0.0493,0.763,0,0.0958,0.395,90.012,292933,4
1991-08-31,51,Unbelievable,EMF,,False,38,1,21,0.637,0.849,1,-6.855,1,0.0362,0.000341,0.0386,0.141,0.936,104.074,209813,4
1991-08-31,52,Place In This World,Michael W. Smith,,False,43,6,18,0.446,0.559,4,-8.319,1,0.0285,0.388,1.78e-05,0.153,0.372,145.419,240173,4
1991-08-31,53,Running Back To You,Vanessa Williams,,False,60,53,4,0.723,0.865,5,-10.517,1,0.0451,0.0358,0.51,0.335,0.875,115.303,280000,4
1991-08-31,54,That's The Way Love Goes,Young M.C.,,False,54,54,5,0.849,0.694,6,-14.43,0,0.0642,0.0232,0.00252,0.0524,0.932,118.309,229307,4
1991-08-31,55,My Fallen Angel,Coro,,False,57,54,8,0.76,0.733,10,-9.312,0,0.0675,0.00621,0.0105,0.0401,0.797,124.058,340773,4
1991-08-31,58,Kiss Them For Me,Siouxsie & The Banshees,,False,74,58,3,0.6,0.949,7,-5.473,0,0.0556,0.187,0.00539,0.105,0.752,99.387,277147,4
1991-08-31,59,The Real Love,Bob Seger & The Silver Bullet Band,,False,77,59,2,0.721,0.546,5,-6.845,1,0.0269,0.0362,0.00487,0.114,0.612,115.387,279867,4
1991-08-31,60,Let The Beat Hit 'Em,Lisa Lisa And Cult Jam,,False,51,37,11,0.792,0.731,1,-9.659,1,0.0502,0.00263,0.0126,0.303,0.838,113.007,278267,4
1991-08-31,61,Real Real Real,Jesus Jones,,False,84,61,2,0.596,0.547,0,-13.136,1,0.0331,0.0478,4.92e-05,0.157,0.697,110.209,188760,4
1991-08-31,62,Latin Active,Lighter Shade Of Brown Featuring Teardrop & Shiro,,False,59,59,7,0.938,0.628,4,-7.587,0,0.158,0.0364,0,0.33,0.758,119.996,211733,4
1991-08-31,63,Walk Through Fire,Bad Company,,False,87,63,2,0.626,0.698,7,-10.311,1,0.0325,0.00316,0.0211,0.331,0.72,122.965,288560,4
1991-08-31,64,Just Want To Hold You,Jasmine Guy,,False,68,64,5,0.611,0.368,8,-13.701,1,0.0362,0.3,4.05e-05,0.0567,0.451,161.986,251867,4
1991-08-31,65,Face The Music,RTZ,,False,75,65,3,0.666,0.909,4,-11.076,1,0.0955,0.341,0,0.246,0.535,118.137,245907,4
1991-08-31,66,Power Windows,Billy Falcon,,False,72,66,3,0.716,0.568,9,-10.478,1,0.0293,0.0743,0,0.0536,0.393,103.027,244373,4
1991-08-31,67,Silver Thunderbird,Marc Cohn,,False,69,67,4,0.475,0.267,7,-15.35,1,0.034,0.721,0,0.0815,0.56,138.942,278720,4
1991-08-31,68,Piece Of My Heart,Tara Kemp,,False,46,7,17,0.536,0.823,1,-10.696,1,0.0687,0.111,0.000432,0.0543,0.916,200.128,289740,4
1991-08-31,70,Tonite,DJ Quik,,False,89,70,2,0.965,0.449,0,-15.225,1,0.237,0.0502,1.17e-06,0.267,0.722,105.392,323267,4
1991-08-31,71,Gett Off,Prince And The N.P.G.,,False,78,66,3,0.655,0.628,10,-11.407,0,0.0947,0.00448,0.000751,0.29,0.602,99.842,271667,4
1991-08-31,73,Can You Stop The Rain,Peabo Bryson,,False,67,52,11,0.684,0.359,3,-12.867,0,0.0368,0.353,0,0.233,0.144,119.942,334933,4
1991-08-31,74,I'm Not Your Puppet,Hi-C,,False,83,74,3,0.718,0.729,0,-5.389,0,0.267,0.0403,0,0.171,0.651,188.51,360480,4
1991-08-31,75,Do You Want Me,Salt-N-Pepa,,False,48,21,24,0.899,0.451,11,-14.009,0,0.0511,0.0756,3.22e-05,0.044,0.973,121.575,232267,4
1991-08-31,76,Turn It Up,Oaktown's 3.5.7,,False,66,66,5,0.78,0.852,11,-5.617,0,0.0505,0.00115,0.000313,0.314,0.875,126.989,223733,4
1991-08-31,77,When Love Cries,Donna Summer,,False,80,77,3,0.67,0.766,4,-11.024,0,0.0672,0.0976,0.00495,0.0472,0.456,95.754,319107,4
1991-08-31,78,Here I Am (Come And Take Me),UB40,,False,61,7,24,0.802,0.621,5,-7.932,0,0.0377,0.0975,0.0256,0.0627,0.81,95.906,242093,4
1991-08-31,79,Louder Than Love,TKA,,False,79,79,4,0.686,0.652,6,-10.505,0,0.0387,0.0941,0.109,0.1,0.523,122.063,318893,4
1991-08-31,80,Love On A Rooftop,Desmond Child,,False,52,40,11,0.613,0.754,3,-8.128,1,0.031,0.179,1.59e-06,0.211,0.662,107.967,318227,4
1991-08-31,81,This Beat Is Hot,B.G. The Prince Of Rap,,False,88,81,3,0.777,0.829,9,-14.003,1,0.0558,0.027,0.00306,0.0417,0.598,111.998,248000,4
1991-08-31,82,Let's Talk About Sex,Salt-N-Pepa,,False,93,82,2,0.863,0.543,6,-13.497,1,0.13,0.0507,0,0.241,0.799,106.929,213267,4
1991-08-31,83,I'll Never Let You Go,Steelheart,,False,73,23,25,0.341,0.651,1,-9.829,1,0.0423,0.0119,0.148,0.0875,0.31,143.934,306560,4
1991-08-31,84,"Nights Like This (From ""The Five Heartbeats"")",After 7,,False,63,24,15,0.707,0.644,8,-7.017,1,0.0287,0.174,0,0.069,0.576,97.127,242000,4
1991-08-31,85,"I Wanna Sex You Up (From ""New Jack City"")",Color Me Badd,,False,65,2,22,0.551,0.591,6,-8.404,0,0.12,0.00549,6.55e-06,0.0416,0.474,201.81,236947,4
1991-08-31,86,Chorus,Erasure,,False,86,83,4,0.613,0.655,5,-12.989,1,0.0302,0.209,0.000754,0.171,0.69,129.906,266267,4
1991-08-31,87,The Dream Is Still Alive,Wilson Phillips,,False,62,12,14,0.582,0.676,5,-7.496,1,0.0265,0.303,0,0.234,0.496,108.291,248800,4
1991-08-31,88,More Than Words,Extreme,,False,70,1,24,0.626,0.134,6,-14.898,1,0.0298,0.467,0,0.113,0.239,91.893,334107,4
1991-08-31,89,Get Serious,Cut 'N' Move,,False,76,76,5,0.81,0.695,5,-12.172,1,0.0755,0.00137,0.0142,0.0914,0.603,108.948,229107,4
1991-08-31,90,Straight To Your Heart,Bad English,3FUnv761z4m18RjaObRxmV,True,0,90,1,0.564,0.825,8,-7.081,1,0.0365,0.0877,7.47e-06,0.246,0.585,127.112,249027,4
1991-08-31,91,She's Gone (Lady),Steelheart,2fvObZjCzCF57MKmn1ePPO,True,0,91,1,0.416,0.559,0,-10.751,0,0.0349,0.00346,0.085,0.148,0.152,137.17,392400,4
1991-08-31,93,Can't Forget You,Gloria Estefan,,False,82,43,13,0.565,0.426,2,-10.705,1,0.0343,0.339,0,0.365,0.28,142.179,254173,4
1991-08-31,94,"Just Ask Me To (From ""Boyz N The Hood"")",Tevin Campbell,,False,95,88,4,0.738,0.816,1,-6.74,1,0.0528,0.0579,3.91e-06,0.0862,0.682,109.899,248040,4
1991-08-31,96,"Gonna Catch You (From ""Cool As Ice"")",Lonnie Gordon,227rjyNRWbipxz1bMnZ4ZE,True,0,96,1,0.84,0.668,7,-9.071,1,0.0461,0.000825,1.05e-05,0.223,0.953,121.649,231040,4
1991-08-31,97,The Devil Came Up To Michigan,K.M.C. KRU,1wXszVOwKdfIafYTnHSkHv,True,0,97,1,0.86,0.636,2,-15.511,1,0.145,0.172,4.9e-05,0.368,0.842,128.012,226933,4
1991-08-31,99,Walking In Memphis,Marc Cohn,,False,90,13,23,0.567,0.512,0,-8.831,1,0.0357,0.545,0,0.296,0.334,130.271,252613,4
1991-08-31,100,When The Lights Go Out,Gerardo,,False,98,98,2,0.824,0.793,5,-10.403,0,0.0528,0.0314,4.49e-05,0.163,0.965,111.279,244867,4
