date,position,title,artist,spotify_id,is_new,last_pos,peak_pos,weeks,danceability,energy,key,loudness,mode,speechiness,acousticness,instrumentalness,liveness,valence,tempo,duration_ms,time_signature
2008-07-12,1,I Kissed A Girl,Katy Perry,1y0ZoHeeEd0XTT8X7SnSq3,False,1,1,8,0.699,0.76,5,-3.173,1,0.0677,0.00223,0,0.132,0.696,129.996,179640,4
2008-07-12,2,Lollipop,Lil Wayne Featuring Static Major,1y0ZoHeeEd0XTT8X7SnSq3,False,2,1,16,0.829,0.428,0,-9.469,1,0.0831,0.056,0.00413,0.137,0.45,148.075,299333,4
2008-07-12,3,Bleeding Love,Leona Lewis,1y0ZoHeeEd0XTT8X7SnSq3,False,3,1,20,0.638,0.656,5,-5.886,1,0.0357,0.188,0,0.146,0.225,104.036,262467,4
2008-07-12,4,Take A Bow,Rihanna,1y0ZoHeeEd0XTT8X7SnSq3,False,4,1,12,0.697,0.467,9,-7.536,1,0.0715,0.248,0,0.0941,0.572,82.082,229413,4
2008-07-12,5,Burnin' Up,Jonas Brothers,2VEsmoek0sol9MnJFyoG9e,True,0,5,1,0.667,0.954,2,-3.462,1,0.0817,0.0296,0,0.331,0.807,114.0,175093,4
2008-07-12,6,Viva La Vida,Coldplay,2VEsmoek0sol9MnJFyoG9e,False,6,1,8,0.486,0.617,5,-7.115,0,0.0287,0.0954,3.23e-06,0.109,0.417,138.015,242373,4
2008-07-12,7,Bust It Baby Part 2,Plies Featuring Ne-Yo,2VEsmoek0sol9MnJFyoG9e,False,8,7,14,0.713,0.548,8,-11.495,1,0.052,0.052,0,0.239,0.927,158.025,235506,4
2008-07-12,8,Forever,Chris Brown,2VEsmoek0sol9MnJFyoG9e,False,7,7,10,0.672,0.82,11,-4.456,1,0.0459,0.0368,0.000188,0.184,0.438,120.005,278573,4
2008-07-12,9,This Is Me,Demi Lovato & Joe Jonas,2VEsmoek0sol9MnJFyoG9e,False,11,9,2,0.421,0.821,1,-2.783,1,0.0372,0.00971,0,0.1,0.594,91.245,189173,4
2008-07-12,10,Pocketful Of Sunshine,Natasha Bedingfield,2VEsmoek0sol9MnJFyoG9e,False,5,5,20,0.721,0.88,9,-3.896,0,0.0454,0.191,0,0.0769,0.655,110.021,202907,4
2008-07-12,11,Disturbia,Rihanna,2VEsmoek0sol9MnJFyoG9e,False,18,11,2,0.707,0.813,11,-4.515,0,0.0571,0.0863,0,0.168,0.722,124.921,238627,4
2008-07-12,12,Shake It,Metro Station,2VEsmoek0sol9MnJFyoG9e,False,13,10,13,0.618,0.955,4,-3.836,1,0.0798,0.00221,3.09e-06,0.486,0.79,150.034,179947,4
2008-07-12,13,When I Grow Up,The Pussycat Dolls,2VEsmoek0sol9MnJFyoG9e,False,9,9,5,0.671,0.685,11,-5.762,0,0.05,0.00165,0,0.398,0.368,118.449,245680,4
2008-07-12,14,A Milli,Lil Wayne,2VEsmoek0sol9MnJFyoG9e,False,21,14,10,0.674,0.695,6,-8.636,0,0.278,0.0387,0.00202,0.194,0.773,151.486,221840,4
2008-07-12,15,Damaged,Danity Kane,2VEsmoek0sol9MnJFyoG9e,False,17,10,16,0.774,0.653,8,-5.158,0,0.05,0.0912,0,0.151,0.818,120.01,244267,4
2008-07-12,16,7 Things,Miley Cyrus,2VEsmoek0sol9MnJFyoG9e,False,10,10,4,0.59,0.903,1,-4.478,0,0.0363,0.0232,0,0.0786,0.542,107.023,213453,4
2008-07-12,17,Leavin',Jesse McCartney,2VEsmoek0sol9MnJFyoG9e,False,15,10,10,0.687,0.71,9,-5.84,1,0.0522,0.0283,3.71e-06,0.0689,0.886,79.235,216880,4
2008-07-12,18,No Air,Jordin Sparks Duet With Chris Brown,2VEsmoek0sol9MnJFyoG9e,False,12,3,26,0.475,0.501,11,-5.125,1,0.0309,0.715,0,0.0666,0.371,159.972,253693,4
2008-07-12,19,All I Want To Do,Sugarland,2VEsmoek0sol9MnJFyoG9e,False,91,19,2,0.709,0.725,4,-4.999,1,0.0556,0.208,4.54e-05,0.158,0.759,97.046,213360,4
2008-07-12,20,Love In This Club,Usher Featuring Young Jeezy,2VEsmoek0sol9MnJFyoG9e,False,14,1,20,0.573,0.712,0,-5.976,1,0.0732,0.0572,0,0.167,0.346,140.012,259720,4
2008-07-12,21,Sexy Can I,Ray J & Yung Berg,2VEsmoek0sol9MnJFyoG9e,False,16,3,22,0.575,0.686,1,-6.008,1,0.319,0.296,0,0.617,0.926,172.167,204040,4
2008-07-12,22,What You Got,Colby O'Donis Featuring Akon,2VEsmoek0sol9MnJFyoG9e,False,19,14,18,0.775,0.641,1,-6.718,1,0.038,0.0327,0,0.18,0.305,119.974,243013,4
2008-07-12,23,Dangerous,Kardinal Offishall Featuring Akon,2VEsmoek0sol9MnJFyoG9e,False,24,23,8,0.949,0.79,8,-5.957,1,0.0756,0.00437,0,0.0816,0.807,117.002,246053,4
2008-07-12,24,Lolli Lolli (Pop That Body),"Three 6 Mafia Featuring Project Pat, Young D & Superpower",2VEsmoek0sol9MnJFyoG9e,False,26,24,7,0.89,0.946,2,-5.673,1,0.0489,0.0188,0.000128,0.11,0.872,120.0,251373,4
2008-07-12,25,It's Not My Time,3 Doors Down,2VEsmoek0sol9MnJFyoG9e,False,23,17,19,0.532,0.935,0,-4.798,1,0.0619,0.00133,8.37e-06,0.106,0.309,128.025,241960,4
2008-07-12,26,I Luv Your Girl,The-Dream,2VEsmoek0sol9MnJFyoG9e,False,25,21,10,0.723,0.322,8,-9.702,1,0.0341,0.014,0,0.119,0.0406,90.063,267867,4
2008-07-12,27,Get Like Me,David Banner Featuring Chris Brown,2VEsmoek0sol9MnJFyoG9e,False,32,27,8,0.609,0.751,1,-4.198,1,0.488,0.00312,0,0.228,0.653,60.896,224547,3
2008-07-12,28,4 Minutes,Madonna Featuring Justin Timberlake & Timbaland,2VEsmoek0sol9MnJFyoG9e,False,22,3,15,0.753,0.931,2,-4.922,1,0.0652,0.00994,0.00696,0.234,0.767,113.029,189693,4
2008-07-12,29,Closer,Ne-Yo,2VEsmoek0sol9MnJFyoG9e,False,28,25,11,0.711,0.753,4,-6.461,0,0.0766,0.028,2.96e-05,0.152,0.588,126.051,234360,4
2008-07-12,30,Realize,Colbie Caillat,2VEsmoek0sol9MnJFyoG9e,False,27,20,21,0.693,0.594,1,-6.408,1,0.0325,0.13,0,0.115,0.192,123.932,244107,4
2008-07-12,31,Play My Music,Jonas Brothers,2VEsmoek0sol9MnJFyoG9e,False,20,20,2,0.471,0.875,2,-3.499,1,0.087,0.000652,0,0.239,0.759,177.98,197507,4
2008-07-12,32,Get Silly,V.I.C.,2VEsmoek0sol9MnJFyoG9e,False,29,29,10,0.846,0.814,1,-4.945,1,0.353,0.0769,0,0.0588,0.671,75.01,227120,4
2008-07-12,33,In Love With A Girl,Gavin DeGraw,2VEsmoek0sol9MnJFyoG9e,False,34,24,17,0.439,0.906,3,-4.8,1,0.0439,0.0193,0,0.373,0.687,161.905,206000,4
2008-07-12,34,Love Song,Sara Bareilles,2VEsmoek0sol9MnJFyoG9e,False,31,4,35,0.583,0.786,2,-3.142,0,0.0301,0.0208,0,0.188,0.573,123.055,258827,4
2008-07-12,35,Heaven Sent,Keyshia Cole,2VEsmoek0sol9MnJFyoG9e,False,39,33,9,0.642,0.742,2,-3.614,0,0.0429,0.0832,0,0.0887,0.407,78.858,232880,4
2008-07-12,36,Gotta Find You,Joe Jonas,2VEsmoek0sol9MnJFyoG9e,False,30,30,2,0.326,0.743,11,-5.139,1,0.0352,0.0491,0,0.0874,0.459,80.475,241867,4
2008-07-12,37,Mercy,Duffy,2VEsmoek0sol9MnJFyoG9e,False,40,27,10,0.793,0.859,0,-3.774,1,0.0332,0.266,0.000356,0.133,0.964,129.911,219920,4
2008-07-12,38,Say,John Mayer,2VEsmoek0sol9MnJFyoG9e,False,42,12,25,0.485,0.723,10,-6.565,1,0.0317,0.541,1.12e-06,0.075,0.541,167.845,230213,4
2008-07-12,39,Summertime,New Kids On The Block,2VEsmoek0sol9MnJFyoG9e,False,43,39,7,0.632,0.785,4,-7.336,1,0.101,0.00972,0,0.0676,0.786,83.94,202413,4
2008-07-12,40,In The Ayer,Flo Rida Featuring will.i.am,2VEsmoek0sol9MnJFyoG9e,False,38,38,2,0.83,0.746,5,-6.286,0,0.0579,0.00456,0,0.26,0.646,125.992,220507,4
2008-07-12,41,American Boy,Estelle Featuring Kanye West,2VEsmoek0sol9MnJFyoG9e,False,37,35,11,0.727,0.729,0,-2.99,1,0.326,0.171,0,0.07,0.512,117.932,284733,4
2008-07-12,42,Low,Flo Rida Featuring T-Pain,2VEsmoek0sol9MnJFyoG9e,False,36,1,36,0.918,0.609,10,-5.64,0,0.0791,0.0928,0,0.139,0.304,128.008,231400,4
2008-07-12,43,Life In A Northern Town,Sugarland Featuring Little Big Town & Jake Owen,0TwCdMeFjEltHiNjtii8Jk,True,0,43,1,0.548,0.653,0,-6.055,1,0.0386,0.392,1.33e-05,0.973,0.214,117.856,254347,4
2008-07-12,44,Stop And Stare,OneRepublic,0TwCdMeFjEltHiNjtii8Jk,False,41,12,29,0.492,0.859,4,-4.274,1,0.0332,0.0659,0,0.0756,0.251,92.474,223853,4
2008-07-12,45,Last Name,Carrie Underwood,0TwCdMeFjEltHiNjtii8Jk,False,35,19,13,0.395,0.869,3,-3.154,1,0.109,0.194,0,0.0874,0.688,159.833,241053,4
2008-07-12,46,Got Money,Lil Wayne Featuring T-Pain,0TwCdMeFjEltHiNjtii8Jk,False,52,13,5,0.694,0.661,7,-4.847,1,0.118,0.00188,0,0.676,0.702,82.48,244627,4
2008-07-12,47,Put On,Young Jeezy Featuring Kanye West,0TwCdMeFjEltHiNjtii8Jk,False,58,36,4,0.654,0.77,9,-6.091,0,0.0353,0.00342,0,0.0887,0.272,137.616,321293,4
2008-07-12,48,Take You Down,Chris Brown,0TwCdMeFjEltHiNjtii8Jk,False,48,43,11,0.387,0.64,11,-5.817,0,0.081,0.107,0,0.319,0.617,59.989,245933,4
2008-07-12,49,I'm Yours,Jason Mraz,0TwCdMeFjEltHiNjtii8Jk,False,62,49,11,0.686,0.457,11,-8.322,1,0.0468,0.595,0,0.105,0.718,150.953,242187,4
2008-07-12,50,Better As A Memory,Kenny Chesney,0TwCdMeFjEltHiNjtii8Jk,False,46,46,12,0.576,0.302,2,-11.845,1,0.033,0.433,3.3e-05,0.133,0.145,70.932,252707,4
2008-07-12,51,The Time Of My Life,David Cook,0TwCdMeFjEltHiNjtii8Jk,False,51,3,6,0.414,0.578,8,-6.383,1,0.0287,0.0541,0,0.124,0.281,154.96,216147,3
2008-07-12,52,All Around Me,Flyleaf,0TwCdMeFjEltHiNjtii8Jk,False,45,40,17,0.473,0.871,9,-4.893,1,0.0456,0.0216,0,0.0525,0.47,146.975,198507,4
2008-07-12,53,Home,Blake Shelton,0TwCdMeFjEltHiNjtii8Jk,False,53,52,12,0.576,0.455,7,-7.587,1,0.0267,0.583,2.73e-05,0.0912,0.206,127.856,227040,4
2008-07-12,54,Good Time,Alan Jackson,0TwCdMeFjEltHiNjtii8Jk,False,59,54,8,0.652,0.767,9,-10.445,1,0.0372,0.0355,6.92e-06,0.397,0.73,132.017,306773,4
2008-07-12,55,Should've Said No,Taylor Swift,0TwCdMeFjEltHiNjtii8Jk,False,64,55,6,0.476,0.777,4,-3.771,0,0.0289,0.0103,0,0.196,0.472,167.964,242200,4
2008-07-12,56,Back When I Knew It All,Montgomery Gentry,0TwCdMeFjEltHiNjtii8Jk,False,56,56,13,0.533,0.732,2,-5.592,1,0.034,0.00499,2.25e-06,0.125,0.516,148.261,228587,4
2008-07-12,57,Handlebars,Flobots,0TwCdMeFjEltHiNjtii8Jk,False,54,49,12,0.704,0.571,5,-7.136,1,0.0969,0.0222,0,0.101,0.524,141.888,206813,4
2008-07-12,59,Touch My Body,Mariah Carey,,False,44,1,20,0.714,0.665,4,-7.736,0,0.0509,0.0996,0,0.226,0.842,78.515,204733,4
2008-07-12,60,If I Never See Your Face Again,Maroon 5 Featuring Rihanna,,False,55,53,8,0.745,0.867,1,-2.446,1,0.0374,0.017,0,0.281,0.936,106.006,201000,4
2008-07-12,61,You Look Good In My Shirt,Keith Urban,,False,93,61,2,0.653,0.865,7,-6.395,1,0.0325,0.0075,1.18e-06,0.0629,0.828,116.966,227733,4
2008-07-12,62,We Rock,Cast Of Camp Rock,,False,33,33,2,0.638,0.953,8,-3.491,0,0.11,0.00635,0,0.12,0.799,143.849,190933,4
2008-07-12,63,Lookin Boy,Hot Stylz Featuring Yung Joc,,False,70,63,4,0.85,0.687,0,-5.995,0,0.308,0.213,0,0.0724,0.502,149.989,207013,4
2008-07-12,64,The Boss,Rick Ross Featuring T-Pain,,False,57,17,20,0.423,0.842,7,-4.072,1,0.357,0.00876,0,0.309,0.611,83.59,225653,4
2008-07-12,65,Come On Over,Jessica Simpson,4Z4HrH47UW6Vc4s76hAsSL,True,0,65,1,0.675,0.859,11,-2.57,1,0.0318,0.214,0,0.117,0.556,110.037,171413,4
2008-07-12,66,Teenage Love Affair,Alicia Keys,4Z4HrH47UW6Vc4s76hAsSL,False,61,54,8,0.636,0.826,11,-4.668,1,0.162,0.632,0,0.197,0.679,87.665,190200,4
2008-07-12,67,I'm Still A Guy,Brad Paisley,4Z4HrH47UW6Vc4s76hAsSL,False,60,33,16,0.494,0.599,2,-6.836,1,0.0316,0.104,0,0.0882,0.457,163.729,248787,3
2008-07-12,68,Gunpowder And Lead,Miranda Lambert,4Z4HrH47UW6Vc4s76hAsSL,False,66,64,8,0.333,0.907,0,-3.191,1,0.0959,0.153,0,0.395,0.353,187.826,191693,4
2008-07-12,69,Bye Bye,Mariah Carey,4Z4HrH47UW6Vc4s76hAsSL,False,49,19,11,0.788,0.585,10,-4.884,1,0.0558,0.297,0,0.346,0.84,136.003,266827,4
2008-07-12,70,Girls Around The World,Lloyd Featuring Lil Wayne,4Z4HrH47UW6Vc4s76hAsSL,False,67,67,6,0.727,0.831,7,-8.699,1,0.126,0.0288,0.00038,0.145,0.579,97.6,229800,4
2008-07-12,71,Just Got Started Lovin' You,James Otto,4Z4HrH47UW6Vc4s76hAsSL,False,65,27,19,0.705,0.606,7,-7.047,1,0.0243,0.159,0.00149,0.242,0.876,98.001,234640,4
2008-07-12,72,Moving Mountains,Usher,4Z4HrH47UW6Vc4s76hAsSL,False,69,69,5,0.72,0.734,6,-4.515,1,0.0316,0.0856,0,0.303,0.37,115.999,298053,4
2008-07-12,73,She Got It,2 Pistols Featuring T-Pain & Tay Dizm,4Z4HrH47UW6Vc4s76hAsSL,False,63,24,20,0.53,0.745,10,-6.19,0,0.106,0.00436,0,0.345,0.269,134.068,274053,4
2008-07-12,74,Violet Hill,Coldplay,4Z4HrH47UW6Vc4s76hAsSL,False,68,40,8,0.33,0.58,1,-7.875,0,0.0374,0.0614,0.00129,0.115,0.11,76.093,222653,4
2008-07-12,75,Fall For You,Secondhand Serenade,4Z4HrH47UW6Vc4s76hAsSL,False,77,75,3,0.387,0.442,0,-7.086,1,0.0352,0.19,0,0.0788,0.382,169.481,185600,4
2008-07-12,76,Put A Girl In It,Brooks & Dunn,4Z4HrH47UW6Vc4s76hAsSL,False,74,74,5,0.589,0.952,4,-3.316,1,0.0619,0.0327,0.00103,0.062,0.771,119.967,207880,4
2008-07-12,77,Pork And Beans,Weezer,4Z4HrH47UW6Vc4s76hAsSL,False,71,64,9,0.599,0.624,6,-6.622,1,0.0339,0.0109,8.06e-06,0.158,0.706,119.838,189400,4
2008-07-12,78,Homecoming,Kanye West Featuring Chris Martin,4Z4HrH47UW6Vc4s76hAsSL,False,73,69,6,0.667,0.747,1,-7.059,1,0.189,0.337,0,0.115,0.918,86.917,203493,4
2008-07-12,79,One Step At A Time,Jordin Sparks,5o4W6yWSJD9e9Ea8YC9WjF,True,0,79,1,0.766,0.692,1,-4.672,1,0.0289,0.0825,0,0.0384,0.691,102.028,205160,4
2008-07-12,80,Trying To Stop Your Leaving,Dierks Bentley,5o4W6yWSJD9e9Ea8YC9WjF,False,76,73,13,0.617,0.57,7,-5.562,1,0.0302,0.00847,5.15e-05,0.0985,0.395,111.846,218147,4
2008-07-12,81,Game's Pain,The Game Featuring Keyshia Cole,5o4W6yWSJD9e9Ea8YC9WjF,False,75,75,5,0.754,0.769,6,-4.658,0,0.354,0.0863,0,0.0534,0.372,97.012,261773,4
2008-07-12,82,Never Would Have Made It,Marvin Sapp,5o4W6yWSJD9e9Ea8YC9WjF,False,100,82,3,0.338,0.559,0,-7.053,1,0.118,0.252,0,0.38,0.276,168.489,415133,4
2008-07-12,83,Inside The Fire,Disturbed,5o4W6yWSJD9e9Ea8YC9WjF,False,80,73,13,0.463,0.962,7,-6.43,1,0.0704,0.000233,0.109,0.0906,0.66,94.003,231573,4
2008-07-12,84,Every Day,Rascal Flatts,5o4W6yWSJD9e9Ea8YC9WjF,False,72,45,16,0.296,0.725,8,-5.466,1,0.0461,0.0347,0,0.0881,0.247,113.031,254213,4
2008-07-12,85,I Still Miss You,Keith Anderson,5o4W6yWSJD9e9Ea8YC9WjF,False,89,85,3,0.505,0.763,3,-5.386,1,0.0297,0.14,0,0.0949,0.446,156.024,235907,4
2008-07-12,86,I Saw God Today,George Strait,5o4W6yWSJD9e9Ea8YC9WjF,False,78,33,19,0.588,0.587,3,-6.89,1,0.0302,0.599,0,0.162,0.381,147.897,203200,4
2008-07-12,87,The Way That I Love You,Ashanti,5o4W6yWSJD9e9Ea8YC9WjF,False,79,37,17,0.544,0.895,3,-4.124,0,0.114,0.0188,0.00132,0.0571,0.463,79.788,267680,4
2008-07-12,88,Thunder,Boys Like Girls,1MrNveiYvWyKNAMiqn8xS8,True,0,88,1,0.508,0.821,2,-5.279,1,0.0395,0.223,0,0.316,0.463,75.057,236680,4
2008-07-12,89,Picture To Burn,Taylor Swift,1MrNveiYvWyKNAMiqn8xS8,False,82,28,20,0.658,0.877,7,-2.098,1,0.0323,0.173,0,0.0962,0.821,105.586,173067,4
2008-07-12,90,Love Remains The Same,Gavin Rossdale,1MrNveiYvWyKNAMiqn8xS8,False,90,76,4,0.406,0.632,4,-5.115,1,0.0344,0.236,0,0.18,0.109,149.258,249440,4
2008-07-12,91,Last Time,Trey Songz,1MrNveiYvWyKNAMiqn8xS8,False,95,69,13,0.629,0.624,2,-7.957,1,0.0915,0.209,0,0.215,0.66,119.964,261707,4
2008-07-12,92,Mr. Carter,Lil Wayne Featuring Jay-Z,1MrNveiYvWyKNAMiqn8xS8,False,84,62,4,0.485,0.71,7,-6.288,1,0.364,0.0444,0,0.35,0.473,170.942,316267,4
2008-07-12,93,That's What You Get,Paramore,1MrNveiYvWyKNAMiqn8xS8,False,97,89,4,0.528,0.831,8,-3.607,1,0.0429,9.43e-05,0,0.141,0.632,131.094,220480,3
2008-07-12,94,Bartender Song,Rehab,1gewemPOUilb21s7CfMS55,True,0,94,1,0.667,0.673,4,-6.006,1,0.0536,0.117,0,0.343,0.706,151.834,229040,4
2008-07-12,95,Believe,Staind,098lPAWl2OmsCx64TXH5OQ,True,0,95,1,0.537,0.736,10,-4.721,0,0.0284,0.000659,0.00281,0.15,0.227,113.933,257307,4
2008-07-12,96,Love Don't Live Here,Lady Antebellum,098lPAWl2OmsCx64TXH5OQ,False,81,53,18,0.653,0.871,1,-3.83,1,0.0315,0.0625,3.61e-06,0.144,0.619,139.934,230400,4
2008-07-12,97,Addicted,Saving Abel,098lPAWl2OmsCx64TXH5OQ,False,98,96,3,0.512,0.864,7,-4.146,1,0.0338,0.000821,0,0.0982,0.527,138.018,222827,4
2008-07-12,98,I Will Possess Your Heart,Death Cab For Cutie,098lPAWl2OmsCx64TXH5OQ,False,85,70,12,0.605,0.619,9,-8.971,0,0.0261,0.423,0.313,0.0732,0.578,133.074,505773,4
2008-07-12,99,Here I Am,Rick Ross Featuring Nelly & Avery Storm,6XTFqWZrzfPi9WoZeDr36H,True,0,99,1,0.746,0.717,10,-5.788,0,0.127,0.189,0,0.0704,0.475,109.754,209547,4
2008-07-12,100,Shut Up And Let Me Go,The Ting Tings,6XTFqWZrzfPi9WoZeDr36H,False,92,55,4,0.852,0.927,7,-4.497,1,0.0581,0.0109,0.00268,0.054,0.887,107.993,171227,4
