date,position,title,artist,spotify_id,is_new,last_pos,peak_pos,weeks,danceability,energy,key,loudness,mode,speechiness,acousticness,instrumentalness,liveness,valence,tempo,duration_ms,time_signature
2007-06-09,1,Umbrella,Rihanna Featuring Jay-Z,1fLlRApgzxWweF1JTf8yM5,False,41,1,7,0.583,0.829,1,-4.603,1,0.134,0.00864,0,0.0426,0.575,174.028,275987,4
2007-06-09,2,Party Like A Rockstar,Shop Boyz,1fLlRApgzxWweF1JTf8yM5,False,51,2,6,0.656,0.92,6,-4.133,0,0.0441,0.00495,0.00633,0.347,0.784,150.068,214640,4
2007-06-09,3,Makes Me Wonder,Maroon 5,1fLlRApgzxWweF1JTf8yM5,False,1,1,8,0.799,0.856,7,-2.427,1,0.0352,0.00383,0.00062,0.0621,0.892,113.994,212227,4
2007-06-09,4,Buy U A Drank (Shawty Snappin'),T-Pain Featuring Yung Joc,1fLlRApgzxWweF1JTf8yM5,False,2,1,14,0.451,0.55,1,-8.137,1,0.262,0.0108,0,0.0737,0.594,80.001,227960,4
2007-06-09,5,Home,Daughtry,1fLlRApgzxWweF1JTf8yM5,False,5,5,13,0.443,0.853,6,-3.885,1,0.0361,0.00217,1.77e-06,0.198,0.338,143.986,255652,4
2007-06-09,6,Summer Love,Justin Timberlake,1fLlRApgzxWweF1JTf8yM5,False,9,6,7,0.606,0.591,0,-7.228,0,0.087,0.0756,0,0.328,0.477,95.802,252973,4
2007-06-09,7,Girlfriend,Avril Lavigne,1fLlRApgzxWweF1JTf8yM5,False,3,1,13,0.56,0.959,7,-2.433,1,0.102,0.000738,0.000206,0.209,0.67,163.983,216600,4
2007-06-09,8,Big Girls Don't Cry,Fergie,1fLlRApgzxWweF1JTf8yM5,False,21,8,6,0.708,0.641,7,-4.296,1,0.0335,0.205,0,0.0945,0.253,113.082,268120,4
2007-06-09,9,Never Again,Kelly Clarkson,1fLlRApgzxWweF1JTf8yM5,False,17,8,5,0.514,0.91,7,-2.978,0,0.0714,0.00168,0.00187,0.224,0.472,145.907,217293,4
2007-06-09,10,"Pop, Lock & Drop It",Huey,1fLlRApgzxWweF1JTf8yM5,False,6,6,14,0.723,0.644,11,-6.863,0,0.222,0.00308,0,0.352,0.645,144.09,261027,4
2007-06-09,11,Give It To Me,Timbaland Featuring Nelly Furtado & Justin Timberlake,1fLlRApgzxWweF1JTf8yM5,False,4,1,16,0.975,0.711,8,-3.904,1,0.0632,0.168,0.000552,0.0799,0.815,110.621,234027,4
2007-06-09,12,Before He Cheats,Carrie Underwood,1fLlRApgzxWweF1JTf8yM5,False,8,8,39,0.519,0.749,6,-3.318,0,0.0405,0.271,0,0.119,0.29,147.905,199947,4
2007-06-09,13,I Tried,Bone Thugs-N-Harmony Featuring Akon,1fLlRApgzxWweF1JTf8yM5,False,7,6,9,0.727,0.71,4,-6.142,1,0.0742,0.0104,0,0.107,0.378,81.995,287480,4
2007-06-09,14,U + Ur Hand,P!nk,1fLlRApgzxWweF1JTf8yM5,False,11,9,22,0.709,0.891,0,-3.688,1,0.0528,0.00144,0,0.034,0.886,141.04,214387,4
2007-06-09,15,This Is My Now,Jordin Sparks,6P5mjh3dfcYJ6JoDd4tdWI,True,0,15,1,0.467,0.56,6,-5.37,1,0.0287,0.199,0,0.0942,0.179,147.905,230627,4
2007-06-09,16,Glamorous,Fergie Featuring Ludacris,6P5mjh3dfcYJ6JoDd4tdWI,False,10,1,20,0.81,0.755,0,-6.408,1,0.201,0.288,0,0.0857,0.623,130.99,246573,4
2007-06-09,17,Thnks Fr Th Mmrs,Fall Out Boy,6P5mjh3dfcYJ6JoDd4tdWI,False,14,14,7,0.459,0.891,10,-5.057,0,0.0623,0.00511,0,0.106,0.588,154.837,203507,4
2007-06-09,18,You Give Love A Bad Name,Blake Lewis,4bEetASsP3txfP1GWr2pAi,True,0,18,1,0.683,0.707,8,-9.019,1,0.047,0.00123,0.000169,0.278,0.491,122.007,190203,4
2007-06-09,19,The Sweet Escape,Gwen Stefani Featuring Akon,4bEetASsP3txfP1GWr2pAi,False,16,2,24,0.756,0.77,1,-3.502,1,0.0343,0.191,0,0.178,0.73,119.961,246467,4
2007-06-09,20,What I've Done,Linkin Park,4bEetASsP3txfP1GWr2pAi,False,12,7,8,0.623,0.93,5,-5.285,1,0.0324,0.0141,1.64e-06,0.138,0.287,120.119,205613,4
2007-06-09,21,Get It Shawty,Lloyd,4bEetASsP3txfP1GWr2pAi,False,20,18,11,0.822,0.905,5,-4.032,0,0.241,0.123,0,0.0496,0.674,128.014,209533,4
2007-06-09,23,Because Of You,Ne-Yo,,False,13,2,13,0.81,0.538,0,-5.784,0,0.0356,0.528,0,0.0951,0.828,109.97,266840,4
2007-06-09,24,Don't Matter,Akon,,False,18,1,19,0.798,0.443,2,-6.062,1,0.0403,0.244,0,0.326,0.354,125.232,293053,4
2007-06-09,25,Last Night,Diddy Featuring Keyshia Cole,,False,19,10,19,0.916,0.849,3,-5.034,0,0.0639,0.166,0.000193,0.0859,0.974,121.002,255773,4
2007-06-09,26,This Is Why I'm Hot,Mims,,False,25,1,19,0.621,0.6,8,-6.349,1,0.576,0.277,0,0.495,0.485,80.021,253707,4
2007-06-09,27,Hey There Delilah,Plain White T's,,False,27,27,9,0.656,0.291,2,-10.572,1,0.0293,0.872,0,0.114,0.298,103.971,232533,4
2007-06-09,28,Like A Boy,Ciara,,False,22,19,13,0.701,0.724,0,-5.751,0,0.145,0.267,0,0.0867,0.425,132.035,237053,4
2007-06-09,29,Cupid's Chokehold/Breakfast In America,Gym Class Heroes Featuring Patrick Stump,,False,23,4,21,0.72,0.744,1,-6.938,0,0.12,0.237,0,0.255,0.619,78.953,243773,4
2007-06-09,30,Big Things Poppin' (Do It),T.I.,0eMdAjfAfGS1AoeXgiyGXP,True,0,30,1,0.597,0.715,7,-6.741,1,0.036,0.00425,0.911,0.191,0.539,169.036,289987,4
2007-06-09,31,Outta My System,Bow Wow Featuring T-Pain & Johnta Austin,0eMdAjfAfGS1AoeXgiyGXP,False,24,22,13,0.772,0.59,6,-6.957,1,0.183,0.0917,0,0.101,0.743,83.998,238267,4
2007-06-09,32,The Way I Live,Baby Boy Da Prince Featuring Lil Boosie,0eMdAjfAfGS1AoeXgiyGXP,False,26,21,24,0.88,0.438,0,-7.562,1,0.248,0.0147,0,0.0907,0.714,90.02,324907,4
2007-06-09,33,Do You Know? (The Ping Pong Song)/Dimelo,Enrique Iglesias,0eMdAjfAfGS1AoeXgiyGXP,False,33,33,2,0.755,0.763,8,-4.328,1,0.0501,0.0513,0,0.0326,0.696,114.992,218053,4
2007-06-09,34,It's Not Over,Daughtry,0eMdAjfAfGS1AoeXgiyGXP,False,29,4,27,0.428,0.919,10,-3.245,0,0.0618,0.0503,0,0.245,0.294,145.927,214831,4
2007-06-09,35,Wait For You,Elliott Yamin,0eMdAjfAfGS1AoeXgiyGXP,False,31,31,6,0.764,0.487,0,-6.734,1,0.0281,0.25,0,0.184,0.352,116.027,261320,4
2007-06-09,36,We Takin' Over,"DJ Khaled Featuring T.I., Akon, Rick Ross, Fat Joe, Lil' Wayne & Baby",0eMdAjfAfGS1AoeXgiyGXP,False,28,28,9,0.765,0.872,10,-4.241,0,0.0775,0.143,0,0.495,0.578,112.607,263280,4
2007-06-09,37,2 Step,Unk,0eMdAjfAfGS1AoeXgiyGXP,False,35,29,16,0.763,0.797,11,-2.274,0,0.0977,0.0583,0,0.299,0.645,77.003,195787,4
2007-06-09,38,Rock Yo Hips,Crime Mob Featuring Lil Scrappy,0eMdAjfAfGS1AoeXgiyGXP,False,37,30,16,0.847,0.667,6,-5.7,1,0.17,0.0869,0,0.443,0.707,77.492,226547,4
2007-06-09,39,If Everyone Cared,Nickelback,0eMdAjfAfGS1AoeXgiyGXP,False,30,17,19,0.519,0.85,6,-4.678,0,0.0354,0.000246,0.014,0.279,0.211,132.022,218013,4
2007-06-09,40,Better Than Me,Hinder,0eMdAjfAfGS1AoeXgiyGXP,False,34,31,13,0.449,0.682,2,-5.295,0,0.029,0.205,0,0.175,0.254,139.924,223533,4
2007-06-09,41,Face Down,The Red Jumpsuit Apparatus,0eMdAjfAfGS1AoeXgiyGXP,False,32,24,42,0.545,0.932,7,-2.189,0,0.0399,0.000665,0,0.127,0.464,92.956,192000,4
2007-06-09,42,Wipe Me Down,Lil Boosie Featuring Foxx & Webbie,0eMdAjfAfGS1AoeXgiyGXP,False,70,42,4,0.836,0.906,1,-2.902,1,0.279,0.000426,0,0.227,0.718,165.091,272347,4
2007-06-09,43,Ticks,Brad Paisley,0eMdAjfAfGS1AoeXgiyGXP,False,43,40,9,0.623,0.79,4,-6.316,1,0.0283,0.0312,3.77e-05,0.106,0.718,94.433,273160,4
2007-06-09,44,Say It Right,Nelly Furtado,0eMdAjfAfGS1AoeXgiyGXP,False,39,1,29,0.871,0.869,1,-6.308,1,0.139,0.0409,0.00111,0.053,0.834,116.95,223080,4
2007-06-09,45,Please Don't Go,Tank,0eMdAjfAfGS1AoeXgiyGXP,False,42,42,12,0.718,0.455,10,-9.614,0,0.116,0.755,0,0.553,0.402,125.123,286507,3
2007-06-09,46,Teardrops On My Guitar,Taylor Swift,0eMdAjfAfGS1AoeXgiyGXP,False,44,44,12,0.621,0.417,10,-6.941,1,0.0231,0.288,0,0.119,0.289,99.953,203040,4
2007-06-09,47,Good Directions,Billy Currington,0eMdAjfAfGS1AoeXgiyGXP,False,47,42,12,0.716,0.72,5,-2.183,1,0.0319,0.307,0,0.135,0.464,122.512,215853,4
2007-06-09,48,Beautiful Liar,Beyonce & Shakira,0eMdAjfAfGS1AoeXgiyGXP,False,36,3,11,0.764,0.751,8,-3.74,1,0.0703,0.00554,0.000237,0.164,0.418,91.977,199853,4
2007-06-09,49,Lean Like A Cholo,Down A.K.A. Kilo,0eMdAjfAfGS1AoeXgiyGXP,False,55,49,4,0.877,0.839,8,-3.988,1,0.275,0.102,0,0.0735,0.926,71.977,198217,5
2007-06-09,50,What Goes Around...Comes Around,Justin Timberlake,0eMdAjfAfGS1AoeXgiyGXP,False,46,1,25,0.687,0.723,7,-4.751,1,0.0709,0.122,0.00102,0.573,0.432,76.0,448573,4
2007-06-09,51,Lost In This Moment,Big & Rich,0eMdAjfAfGS1AoeXgiyGXP,False,49,49,10,0.599,0.574,11,-7.363,1,0.0434,0.32,0,0.226,0.677,147.751,210843,4
2007-06-09,52,Anonymous,Bobby Valentino Featuring Timbaland,0eMdAjfAfGS1AoeXgiyGXP,False,50,50,3,0.715,0.766,8,-3.373,1,0.0322,0.0144,0,0.0544,0.597,124.991,283880,4
2007-06-09,53,Working Class Hero,Green Day,0eMdAjfAfGS1AoeXgiyGXP,False,0,53,2,0.3,0.643,11,-6.164,0,0.0366,0.0063,1.81e-06,0.147,0.211,108.798,263733,4
2007-06-09,55,Like This,Kelly Rowland Featuring Eve,,False,53,53,10,0.676,0.73,1,-5.963,1,0.267,0.00193,0,0.0627,0.489,178.117,215853,4
2007-06-09,56,Moments,Emerson Drive,,False,57,56,10,0.498,0.481,9,-8.04,1,0.0278,0.193,0,0.0868,0.303,141.911,298027,4
2007-06-09,57,Stolen,Dashboard Confessional,,False,52,44,8,0.636,0.838,3,-3.988,1,0.0329,0.00143,1.22e-05,0.0573,0.318,101.584,199107,4
2007-06-09,58,Wasted,Carrie Underwood,,False,54,37,17,0.548,0.775,8,-3.285,1,0.0306,0.0936,0,0.0721,0.311,94.998,274267,4
2007-06-09,59,When I See U,Fantasia,,False,62,59,8,0.569,0.596,8,-6.486,1,0.171,0.457,8.99e-05,0.205,0.757,93.134,217347,4
2007-06-09,60,Forever,Papa Roach,,False,58,55,9,0.575,0.591,2,-5.916,0,0.028,0.0173,0,0.173,0.332,107.967,246333,4
2007-06-09,61,I Don't Wanna Stop,Ozzy Osbourne,,False,83,61,3,0.578,0.937,5,-3.926,1,0.0724,0.000963,2.25e-06,0.4,0.769,137.937,239827,4
2007-06-09,62,Find Out Who Your Friends Are,Tracy Lawrence,,False,63,62,8,0.524,0.797,2,-4.777,1,0.0329,0.209,0,0.286,0.783,159.859,227840,4
2007-06-09,63,Rehab,Amy Winehouse,,False,72,63,6,0.434,0.872,0,-2.974,1,0.0702,0.0473,1.83e-06,0.396,0.732,71.515,213760,4
2007-06-09,64,Go Getta,Young Jeezy Featuring R. Kelly,,False,56,18,19,0.392,0.751,3,-6.586,0,0.155,0.105,0,0.15,0.438,173.825,229347,4
2007-06-09,66,A Broken Wing,Jordin Sparks,150wFDgriAl7kDVSRU8auU,True,0,66,1,0.636,0.34,11,-8.414,1,0.027,0.311,0,0.312,0.342,97.582,207629,3
2007-06-09,67,The Great Escape,Boys Like Girls,150wFDgriAl7kDVSRU8auU,False,96,67,2,0.423,0.94,1,-4.012,0,0.0635,0.00166,0,0.178,0.505,149.934,206520,4
2007-06-09,68,Straight To The Bank,50 Cent,150wFDgriAl7kDVSRU8auU,False,59,32,3,0.642,0.846,7,-3.856,1,0.423,0.112,0,0.045,0.519,179.548,190653,4
2007-06-09,69,Little Wonders,Rob Thomas,150wFDgriAl7kDVSRU8auU,False,61,58,9,0.163,0.616,9,-9.996,1,0.044,0.0286,0,0.0826,0.33,81.993,224720,4
2007-06-09,70,Sexy Lady,Yung Berg Featuring Junior,150wFDgriAl7kDVSRU8auU,False,68,68,5,0.374,0.669,0,-7.098,1,0.303,0.00051,0,0.304,0.274,184.978,229840,4
2007-06-09,71,Stand,Rascal Flatts,150wFDgriAl7kDVSRU8auU,False,60,46,15,0.603,0.761,0,-4.753,1,0.0314,0.0238,0,0.235,0.526,93.858,208133,4
2007-06-09,72,Lucky Man,Montgomery Gentry,150wFDgriAl7kDVSRU8auU,False,75,72,6,0.578,0.471,4,-7.27,1,0.0289,0.368,0,0.159,0.532,133.061,196707,4
2007-06-09,73,Icky Thump,The White Stripes,150wFDgriAl7kDVSRU8auU,False,77,26,5,0.417,0.63,9,-7.24,1,0.0898,0.0209,0.0134,0.0543,0.341,94.214,254533,4
2007-06-09,74,Impacto,Daddy Yankee Featuring Fergie,150wFDgriAl7kDVSRU8auU,False,78,74,3,0.794,0.864,8,-5.964,1,0.0755,0.00889,0.000145,0.0398,0.9,100.516,185107,4
2007-06-09,75,High Maintenance Woman,Toby Keith,150wFDgriAl7kDVSRU8auU,False,67,67,15,0.648,0.912,2,-3.879,1,0.0336,0.0313,0,0.38,0.799,123.024,201333,4
2007-06-09,76,4 In The Morning,Gwen Stefani,64fSdRkaB7ksxI9suUGYmi,True,0,76,1,0.698,0.826,10,-6.261,1,0.031,0.2,0.00013,0.114,0.502,92.409,291107,4
2007-06-09,77,A Woman's Love,Alan Jackson,64fSdRkaB7ksxI9suUGYmi,False,73,73,9,0.592,0.555,4,-8.868,1,0.0316,0.506,0.0527,0.14,0.39,139.404,253640,4
2007-06-09,78,Like This,Mims,64fSdRkaB7ksxI9suUGYmi,False,82,78,3,0.771,0.693,7,-7.483,1,0.293,0.0317,0,0.342,0.525,97.163,203627,4
2007-06-09,79,Wrapped,George Strait,64fSdRkaB7ksxI9suUGYmi,False,79,79,6,0.586,0.762,11,-4.055,1,0.0263,0.253,0,0.109,0.59,114.067,247880,4
2007-06-09,80,I Who Have Nothing,Jordin Sparks,27HAAPrkkMYYa871R5QtYV,True,0,80,1,0.492,0.294,9,-12.65,0,0.0375,0.236,0.881,0.364,0.204,133.26,169618,4
2007-06-09,81,Settlin',Sugarland,27HAAPrkkMYYa871R5QtYV,False,66,54,17,0.624,0.934,3,-1.825,1,0.0479,0.112,0.000221,0.127,0.573,122.056,207067,4
2007-06-09,82,teachme,Musiq Soulchild,27HAAPrkkMYYa871R5QtYV,False,87,82,3,0.499,0.61,8,-5.11,0,0.135,0.473,0,0.0722,0.436,172.969,260773,3
2007-06-09,83,Beautiful Girls,Sean Kingston,1hGy2eLcmC8eKx7qr1tOqx,True,0,83,1,0.762,0.661,1,-6.075,0,0.0687,0.15,0,0.256,0.769,130.009,225373,4
2007-06-09,84,I Told You So,Keith Urban,1hGy2eLcmC8eKx7qr1tOqx,False,85,84,3,0.627,0.841,1,-5.885,0,0.0316,0.00788,1.47e-06,0.0552,0.73,105.995,242760,4
2007-06-09,85,(You Want To) Make A Memory,Bon Jovi,1hGy2eLcmC8eKx7qr1tOqx,False,69,27,4,0.532,0.887,0,-3.757,1,0.0335,0.0778,0.000214,0.294,0.795,122.511,249293,4
2007-06-09,86,"This Ain't A Scene, It's An Arms Race",Fall Out Boy,1hGy2eLcmC8eKx7qr1tOqx,False,65,2,19,0.435,0.887,9,-4.07,1,0.0636,0.000747,0,0.0327,0.408,199.935,212040,4
2007-06-09,87,Johnny Cash,Jason Aldean,1hGy2eLcmC8eKx7qr1tOqx,False,86,86,6,0.626,0.856,8,-4.114,1,0.0463,0.0081,3.8e-06,0.13,0.699,112.078,190560,4
2007-06-09,88,Tambourine,Eve,1hGy2eLcmC8eKx7qr1tOqx,False,84,72,3,0.82,0.854,1,-4.153,1,0.22,0.239,0,0.359,0.574,102.623,192440,4
2007-06-09,89,Last Dollar (Fly Away),Tim McGraw,1hGy2eLcmC8eKx7qr1tOqx,False,71,13,13,0.48,0.621,4,-4.814,1,0.0372,0.206,0,0.134,0.713,207.676,237120,4
2007-06-09,90,A Different World,Bucky Covington,1hGy2eLcmC8eKx7qr1tOqx,False,88,63,6,0.62,0.686,9,-5.027,1,0.0276,0.0327,0,0.101,0.464,128.962,208573,4
2007-06-09,91,First Time,Lifehouse,1hGy2eLcmC8eKx7qr1tOqx,False,74,48,3,0.442,0.952,3,-2.214,1,0.0541,2.41e-05,0,0.205,0.505,130.682,203640,4
2007-06-09,92,Buddy,Musiq Soulchild,1hGy2eLcmC8eKx7qr1tOqx,False,64,36,18,0.735,0.839,6,-4.705,0,0.271,0.0534,0,0.0942,0.834,89.942,223813,4
2007-06-09,93,Candyman,Christina Aguilera,1hGy2eLcmC8eKx7qr1tOqx,False,80,25,17,0.686,0.789,8,-4.713,0,0.23,0.0125,0.0147,0.142,0.72,172.976,194213,4
2007-06-09,94,I Need You,Tim McGraw With Faith Hill,1hGy2eLcmC8eKx7qr1tOqx,False,93,93,2,0.532,0.434,4,-12.471,1,0.0333,0.365,0.0166,0.114,0.336,79.648,244297,3
2007-06-09,95,Lip Gloss,Lil Mama,1Y4ZdPOOgCUhBcKZOrUFiS,True,0,95,1,0.619,0.87,2,-4.956,1,0.501,0.41,1.37e-06,0.0571,0.94,188.772,219773,4
2007-06-09,96,Make Me Better,Fabolous Featuring Ne-Yo,0YkJU6TjjwzsVXUPRIO0DB,True,0,96,1,0.607,0.599,11,-6.886,1,0.0995,0.33,0,0.199,0.562,86.491,253573,4
2007-06-09,97,Get Me Bodied,Beyonce,0YkJU6TjjwzsVXUPRIO0DB,False,90,90,3,0.865,0.829,0,-6.981,0,0.315,0.0673,0,0.253,0.651,96.511,205813,4
2007-06-09,98,I'll Stand By You,Carrie Underwood,0YkJU6TjjwzsVXUPRIO0DB,False,38,6,5,0.715,0.148,4,-13.954,0,0.0373,0.472,0.211,0.123,0.403,123.992,229893,4
2007-06-09,100,Don't Make Me,Blake Shelton,,False,89,79,6,0.513,0.546,5,-5.703,1,0.0282,0.0181,0,0.122,0.245,141.876,246560,4
