date,position,title,artist,spotify_id,is_new,last_pos,peak_pos,weeks,danceability,energy,key,loudness,mode,speechiness,acousticness,instrumentalness,liveness,valence,tempo,duration_ms,time_signature
2009-10-24,1,3,Britney Spears,6pymOcrCnMuCWdgGVTvUgP,True,0,1,1,0.697,0.709,5,-1.917,0,0.0455,0.0452,0,0.138,0.787,134.91,213173,4
2009-10-24,2,Down,Jay Sean Featuring Lil Wayne,6pymOcrCnMuCWdgGVTvUgP,False,1,1,15,0.657,0.695,2,-4.493,1,0.0321,0.0108,0,0.0822,0.683,65.997,212107,4
2009-10-24,3,Party In The U.S.A.,Miley Cyrus,6pymOcrCnMuCWdgGVTvUgP,False,2,2,9,0.652,0.698,10,-4.667,0,0.042,0.00112,0.000115,0.0886,0.47,96.021,202067,4
2009-10-24,4,Whatcha Say,Jason Derulo,6pymOcrCnMuCWdgGVTvUgP,False,4,4,9,0.615,0.711,11,-5.507,1,0.0779,0.0444,0,0.145,0.711,144.036,221253,4
2009-10-24,5,Run This Town,"Jay-Z, Rihanna & Kanye West",6pymOcrCnMuCWdgGVTvUgP,False,3,2,11,0.632,0.924,1,-1.802,1,0.29,0.281,0,0.263,0.441,86.844,267520,4
2009-10-24,6,I Gotta Feeling,The Black Eyed Peas,6pymOcrCnMuCWdgGVTvUgP,False,5,1,18,0.744,0.774,0,-6.399,1,0.0268,0.0751,0,0.512,0.649,127.958,289187,4
2009-10-24,7,Paparazzi,Lady Gaga,6pymOcrCnMuCWdgGVTvUgP,False,6,6,7,0.762,0.692,5,-3.973,0,0.0438,0.113,0,0.094,0.397,114.906,208307,4
2009-10-24,8,You Belong With Me,Taylor Swift,6pymOcrCnMuCWdgGVTvUgP,False,7,2,25,0.687,0.783,6,-4.44,1,0.0386,0.162,1.35e-05,0.114,0.443,129.964,231133,4
2009-10-24,9,Fireflies,Owl City,6pymOcrCnMuCWdgGVTvUgP,False,11,9,8,0.512,0.662,3,-6.797,1,0.0439,0.0275,0,0.118,0.472,180.114,228347,4
2009-10-24,10,Use Somebody,Kings Of Leon,6pymOcrCnMuCWdgGVTvUgP,False,9,4,37,0.276,0.715,0,-5.356,1,0.0432,0.00552,0.000417,0.201,0.173,137.028,230760,4
2009-10-24,11,Obsessed,Mariah Carey,6pymOcrCnMuCWdgGVTvUgP,False,8,7,14,0.742,0.468,10,-5.557,0,0.0625,0.0465,0,0.826,0.369,86.443,242200,4
2009-10-24,12,Sweet Dreams,Beyonce,6pymOcrCnMuCWdgGVTvUgP,False,12,12,12,0.694,0.825,1,-5.986,1,0.111,0.0895,1.86e-05,0.0618,0.788,121.949,208067,4
2009-10-24,13,Empire State Of Mind,Jay-Z + Alicia Keys,6pymOcrCnMuCWdgGVTvUgP,False,10,5,5,0.491,0.956,11,-1.538,1,0.392,0.0295,0,0.46,0.811,173.585,276920,4
2009-10-24,14,Replay,Iyaz,6pymOcrCnMuCWdgGVTvUgP,False,24,14,8,0.706,0.751,9,-6.323,1,0.0708,0.173,0,0.168,0.195,91.031,182307,4
2009-10-24,15,Forever,"Drake Featuring Kanye West, Lil Wayne & Eminem",6pymOcrCnMuCWdgGVTvUgP,False,13,8,4,0.415,0.926,5,-1.304,0,0.374,0.253,0,0.256,0.542,158.423,357347,4
2009-10-24,16,One Less Lonely Girl,Justin Bieber,69ghzc538EQSVon2Gm3wrr,True,0,16,1,0.58,0.75,4,-4.421,1,0.194,0.159,0,0.274,0.728,86.938,229107,4
2009-10-24,17,Meet Me Halfway,The Black Eyed Peas,69ghzc538EQSVon2Gm3wrr,False,32,17,4,0.8,0.621,11,-6.838,0,0.0651,0.00409,2.47e-05,0.131,0.448,130.002,284413,4
2009-10-24,18,Say Hey (I Love You),Michael Franti & Spearhead Featuring Cherine Anderson,69ghzc538EQSVon2Gm3wrr,False,18,18,12,0.738,0.983,5,-4.374,0,0.0855,0.038,5.93e-06,0.183,0.957,92.998,235760,4
2009-10-24,19,Already Gone,Kelly Clarkson,69ghzc538EQSVon2Gm3wrr,False,23,19,11,0.209,0.872,9,-2.996,1,0.0757,0.217,0,0.0768,0.294,78.139,281560,4
2009-10-24,20,Cowboy Casanova,Carrie Underwood,69ghzc538EQSVon2Gm3wrr,False,14,11,4,0.597,0.82,5,-2.529,1,0.0582,0.0328,0,0.119,0.576,119.969,236787,4
2009-10-24,21,One Time,Justin Bieber,69ghzc538EQSVon2Gm3wrr,False,26,21,12,0.691,0.853,1,-2.528,0,0.0372,0.0631,7.13e-05,0.082,0.762,145.999,215867,4
2009-10-24,22,Hotel Room Service,Pitbull,69ghzc538EQSVon2Gm3wrr,False,15,8,17,0.851,0.629,1,-8.385,1,0.175,0.00705,0.000372,0.0746,0.789,125.984,237640,4
2009-10-24,23,Break Up,Mario Featuring Gucci Mane & Sean Garrett,69ghzc538EQSVon2Gm3wrr,False,16,14,17,0.44,0.517,0,-7.355,1,0.363,0.428,0,0.173,0.475,73.881,249027,4
2009-10-24,24,Need You Now,Lady Antebellum,69ghzc538EQSVon2Gm3wrr,False,30,24,9,0.587,0.622,4,-5.535,1,0.0303,0.0927,0.000636,0.2,0.231,107.943,277573,4
2009-10-24,25,Sexy Chick,David Guetta Featuring Akon,69ghzc538EQSVon2Gm3wrr,False,34,25,10,0.809,0.562,11,-7.694,0,0.0534,0.0816,0.000418,0.105,0.798,130.003,194347,4
2009-10-24,26,Throw It In The Bag,Fabolous Featuring The-Dream,69ghzc538EQSVon2Gm3wrr,False,19,14,19,0.789,0.55,11,-7.423,0,0.0473,0.174,0,0.0614,0.696,172.049,231573,4
2009-10-24,27,Love Drunk,Boys Like Girls,69ghzc538EQSVon2Gm3wrr,False,29,22,15,0.44,0.976,10,-3.17,1,0.141,0.00177,3.39e-06,0.16,0.412,150.005,226707,4
2009-10-24,28,Fallin' For You,Colbie Caillat,69ghzc538EQSVon2Gm3wrr,False,31,12,15,0.644,0.834,4,-6.473,1,0.0275,0.156,0,0.112,0.593,117.043,215547,4
2009-10-24,29,Toes,Zac Brown Band,69ghzc538EQSVon2Gm3wrr,False,33,29,12,0.8,0.759,11,-5.398,1,0.0378,0.655,0,0.0897,0.821,129.979,262773,4
2009-10-24,30,It's My Life / Confessions Part II,Glee Cast,1NdBLNUZSEpBEITAt08ZmM,True,0,30,1,0.586,0.882,11,-3.794,0,0.0487,0.0385,0,0.32,0.706,131.008,111333,4
2009-10-24,31,She Wolf,Shakira,1NdBLNUZSEpBEITAt08ZmM,False,17,11,13,0.865,0.69,7,-7.448,1,0.0444,0.289,0.0138,0.225,0.868,121.983,188867,4
2009-10-24,32,Good Girls Go Bad,Cobra Starship Featuring Leighton Meester,1NdBLNUZSEpBEITAt08ZmM,False,22,7,20,0.594,0.874,0,-3.716,1,0.0815,0.0116,0,0.549,0.628,119.964,196413,4
2009-10-24,33,Be On You,Flo Rida Featuring Ne-Yo,1NdBLNUZSEpBEITAt08ZmM,False,20,19,13,0.398,0.709,4,-4.602,0,0.211,0.334,0,0.142,0.714,78.089,243227,1
2009-10-24,34,Successful,Drake Featuring Trey Songz & Lil Wayne,1NdBLNUZSEpBEITAt08ZmM,False,27,17,13,0.562,0.544,8,-5.065,1,0.369,0.536,0,0.17,0.231,159.517,375050,4
2009-10-24,35,American Ride,Toby Keith,1NdBLNUZSEpBEITAt08ZmM,False,40,35,11,0.519,0.907,9,-2.681,1,0.0665,0.0829,1.57e-06,0.325,0.794,174.085,165693,4
2009-10-24,36,Knock You Down,Keri Hilson Featuring Kanye West & Ne-Yo,1NdBLNUZSEpBEITAt08ZmM,False,25,3,29,0.588,0.877,8,-4.78,1,0.16,0.00952,0,0.171,0.645,155.165,326187,4
2009-10-24,37,Best I Ever Had,Drake,1NdBLNUZSEpBEITAt08ZmM,False,21,2,23,0.395,0.922,1,-2.176,1,0.375,0.19,0,0.134,0.558,162.361,257690,4
2009-10-24,38,Gettin' You Home,Chris Young,1NdBLNUZSEpBEITAt08ZmM,False,39,38,9,0.639,0.678,7,-5.02,1,0.0278,0.44,1.45e-06,0.221,0.531,106.966,212133,4
2009-10-24,39,Evacuate The Dancefloor,Cascada,1NdBLNUZSEpBEITAt08ZmM,False,42,39,9,0.76,0.696,0,-5.811,1,0.0491,0.0195,0,0.278,0.903,127.029,205884,4
2009-10-24,40,Halo / Walking On Sunshine,Glee Cast,2RF6eSUY1uOWaQjIC4rAFb,True,0,40,1,0.242,0.91,9,-5.19,1,0.113,0.0679,3.38e-06,0.137,0.253,193.886,125013,4
2009-10-24,41,Never Say Never,The Fray,2RF6eSUY1uOWaQjIC4rAFb,False,36,32,18,0.23,0.492,8,-5.767,1,0.0317,0.568,8.18e-06,0.176,0.262,160.139,256613,4
2009-10-24,42,Only You Can Love Me This Way,Keith Urban,2RF6eSUY1uOWaQjIC4rAFb,False,45,42,13,0.566,0.429,2,-9.478,1,0.0286,0.457,3.38e-05,0.173,0.325,147.957,247680,4
2009-10-24,43,Big Green Tractor,Jason Aldean,2RF6eSUY1uOWaQjIC4rAFb,False,37,18,18,0.623,0.59,4,-5.014,1,0.028,0.646,0,0.295,0.579,137.071,204200,4
2009-10-24,44,Battlefield,Jordin Sparks,2RF6eSUY1uOWaQjIC4rAFb,False,35,10,22,0.613,0.634,2,-3.472,1,0.0339,0.0178,0,0.0719,0.37,144.953,241348,4
2009-10-24,45,Boom Boom Pow,The Black Eyed Peas,2RF6eSUY1uOWaQjIC4rAFb,False,38,1,31,0.867,0.857,9,-5.892,1,0.0663,0.13,0.00171,0.13,0.402,130.048,251440,4
2009-10-24,46,No Surprise,Daughtry,2RF6eSUY1uOWaQjIC4rAFb,False,41,15,23,0.508,0.823,3,-3.711,1,0.031,0.00741,0,0.104,0.152,95.98,270640,4
2009-10-24,47,Wasted,Gucci Mane Featuring Plies Or OJ Da Juiceman,2RF6eSUY1uOWaQjIC4rAFb,False,49,47,6,0.702,0.727,5,-3.443,1,0.155,0.0827,0,0.0831,0.549,155.093,249840,4
2009-10-24,48,I Know You Want Me (Calle Ocho),Pitbull,2RF6eSUY1uOWaQjIC4rAFb,False,44,2,33,0.817,0.733,2,-6.009,1,0.145,0.0152,4.31e-05,0.107,0.833,127.056,237120,4
2009-10-24,49,Drop It Low,Ester Dean Featuring Chris Brown,2RF6eSUY1uOWaQjIC4rAFb,False,46,46,5,0.723,0.714,11,-5.036,1,0.0537,0.0019,5.43e-05,0.0836,0.386,88.047,190533,4
2009-10-24,50,Please Don't Leave Me,P!nk,2RF6eSUY1uOWaQjIC4rAFb,False,48,17,26,0.589,0.845,6,-4.497,1,0.0378,0.00883,0,0.326,0.746,138.026,231560,4
2009-10-24,51,21 Guns,Green Day,2RF6eSUY1uOWaQjIC4rAFb,False,43,22,16,0.268,0.742,5,-4.939,1,0.0355,0.0518,0,0.626,0.416,159.779,321093,4
2009-10-24,52,I Can Transform Ya,Chris Brown Featuring Lil Wayne & Swizz Beatz,7n6TT5TDeS0A1DqEtSdapf,True,0,52,1,0.541,0.953,5,-4.229,1,0.107,0.048,0,0.192,0.856,111.378,228640,5
2009-10-24,53,Do I,Luke Bryan,7n6TT5TDeS0A1DqEtSdapf,False,59,53,6,0.581,0.691,9,-5.33,1,0.0333,0.257,0,0.11,0.299,137.985,239413,4
2009-10-24,54,Hell Of A Life,T.I.,4TMwtVTJKY0x4cZTrpvxt5,True,0,54,1,0.485,0.896,7,-2.461,0,0.576,0.0126,0,0.143,0.29,141.613,300011,4
2009-10-24,55,Imma Star (Everywhere We Are),Jeremih,4TMwtVTJKY0x4cZTrpvxt5,False,52,51,12,0.66,0.361,6,-10.418,1,0.089,0.438,0,0.39,0.604,148.073,261373,4
2009-10-24,56,Welcome To The Future,Brad Paisley,4TMwtVTJKY0x4cZTrpvxt5,False,53,53,10,0.516,0.86,7,-5.856,1,0.0319,0.0327,0.000131,0.162,0.43,141.702,351453,4
2009-10-24,57,I'm Alive,Kenny Chesney With Dave Matthews,4TMwtVTJKY0x4cZTrpvxt5,False,55,55,8,0.564,0.244,3,-11.149,1,0.0329,0.758,0.000607,0.106,0.346,78.076,197627,4
2009-10-24,58,All The Right Moves,OneRepublic,6wuBEmA0MG13fmH8cuYpq5,True,0,58,1,0.529,0.948,0,-3.522,1,0.0475,0.259,1.01e-05,0.283,0.651,146.02,238000,4
2009-10-24,59,LOL :-),Trey Songz Featuring Gucci Mane & Soulja Boy Tell'em,6wuBEmA0MG13fmH8cuYpq5,False,58,51,6,0.807,0.747,10,-5.495,1,0.112,0.00701,0,0.107,0.784,154.991,246907,4
2009-10-24,60,Ice Cream Paint Job,Dorrough,6wuBEmA0MG13fmH8cuYpq5,False,57,27,20,0.851,0.598,0,-8.356,1,0.439,0.000595,0,0.343,0.654,180.046,237320,4
2009-10-24,61,Face Drop,Sean Kingston,6wuBEmA0MG13fmH8cuYpq5,False,64,61,5,0.634,0.827,2,-3.687,1,0.0393,0.00104,0,0.326,0.739,83.994,184573,4
2009-10-24,62,Smile,Uncle Kracker,6wuBEmA0MG13fmH8cuYpq5,False,62,47,10,0.541,0.812,4,-3.764,1,0.0336,0.203,0,0.42,0.607,141.056,201627,4
2009-10-24,63,Small Town USA,Justin Moore,6wuBEmA0MG13fmH8cuYpq5,False,54,44,19,0.594,0.601,6,-5.996,1,0.029,0.122,5.69e-06,0.181,0.531,131.931,218853,4
2009-10-24,64,La La La,LMFAO,6wuBEmA0MG13fmH8cuYpq5,False,56,55,4,0.607,0.807,0,-6.548,0,0.126,0.0067,1.18e-06,0.251,0.565,128.046,210560,4
2009-10-24,65,Doesn't Mean Anything,Alicia Keys,6wuBEmA0MG13fmH8cuYpq5,False,65,61,3,0.712,0.407,4,-7.104,0,0.0308,0.036,0.000291,0.0963,0.0997,103.97,272613,4
2009-10-24,66,Funhouse,P!nk,6wuBEmA0MG13fmH8cuYpq5,False,74,66,3,0.792,0.865,11,-3.04,0,0.0337,0.00503,1.64e-06,0.0375,0.833,103.935,204627,4
2009-10-24,67,I Want To Know What Love Is,Mariah Carey,6wuBEmA0MG13fmH8cuYpq5,False,60,60,4,0.591,0.42,6,-6.399,1,0.0334,0.122,1.18e-06,0.168,0.318,79.957,207133,4
2009-10-24,68,Number One,R. Kelly Featuring Keri Hilson,6wuBEmA0MG13fmH8cuYpq5,False,72,68,7,0.65,0.813,0,-4.673,1,0.112,0.228,0,0.18,0.576,136.796,260867,4
2009-10-24,69,God In Me,"Mary Mary Featuring Kierra ""KiKi"" Sheard",6wuBEmA0MG13fmH8cuYpq5,False,70,68,15,0.673,0.673,5,-5.824,0,0.0948,0.0336,0,0.214,0.428,176.088,192680,4
2009-10-24,70,Uprising,Muse,6wuBEmA0MG13fmH8cuYpq5,False,67,37,5,0.602,0.905,2,-4.046,1,0.0775,0.000202,0.064,0.117,0.411,128.019,304840,4
2009-10-24,71,Body Language,Jesse McCartney Featuring T-Pain,6wuBEmA0MG13fmH8cuYpq5,False,0,71,2,0.644,0.748,0,-4.467,1,0.0364,0.0309,0,0.154,0.538,161.434,219213,4
2009-10-24,72,Starstrukk,3OH!3 Featuring Katy Perry,6wuBEmA0MG13fmH8cuYpq5,False,69,69,8,0.607,0.805,11,-5.579,0,0.0608,0.00175,0,0.231,0.232,139.894,202667,4
2009-10-24,73,I Will Not Bow,Breaking Benjamin,6wuBEmA0MG13fmH8cuYpq5,False,77,40,6,0.533,0.955,8,-3.708,1,0.0653,0.000165,1.36e-05,0.38,0.55,107.984,216733,4
2009-10-24,74,I'm Going In,Drake Featuring Lil Wayne & Young Jeezy,6wuBEmA0MG13fmH8cuYpq5,False,68,40,4,0.422,0.635,2,-8.25,0,0.105,0.403,0,0.0772,0.276,124.128,372587,4
2009-10-24,75,Runaway,Love And Theft,6wuBEmA0MG13fmH8cuYpq5,False,75,65,7,0.405,0.721,1,-6.97,1,0.283,0.329,0,0.252,0.815,92.854,280680,4
2009-10-24,76,Somebody To Love,Glee Cast,6wuBEmA0MG13fmH8cuYpq5,False,28,28,3,0.553,0.795,8,-4.001,1,0.0436,0.22,0,0.358,0.389,116.765,282147,3
2009-10-24,77,Fifteen,Taylor Swift,6wuBEmA0MG13fmH8cuYpq5,False,81,65,6,0.556,0.651,7,-4.396,1,0.0266,0.067,0,0.145,0.203,95.485,294333,4
2009-10-24,78,Under,Pleasure P,6wuBEmA0MG13fmH8cuYpq5,False,79,78,7,0.675,0.678,5,-7.151,0,0.0625,0.202,1.49e-06,0.144,0.474,119.986,231160,4
2009-10-24,79,TiK ToK,Ke$ha,0HPD5WQqrq7wPWR7P7Dw1i,True,0,79,1,0.755,0.837,2,-2.718,0,0.142,0.0991,0,0.289,0.714,120.028,199693,4
2009-10-24,80,"Hey, Soul Sister",Train,0HPD5WQqrq7wPWR7P7Dw1i,False,98,80,2,0.673,0.886,1,-4.44,0,0.0431,0.185,0,0.0826,0.795,97.012,216773,4
2009-10-24,81,Wheels,Foo Fighters,0HPD5WQqrq7wPWR7P7Dw1i,False,73,73,2,0.426,0.792,9,-4.709,1,0.0374,0.000495,5.1e-06,0.142,0.557,161.994,278213,4
2009-10-24,82,Red Light,David Nail,0HPD5WQqrq7wPWR7P7Dw1i,False,85,82,3,0.387,0.804,9,-2.601,1,0.0372,0.0917,1.98e-05,0.171,0.428,163.853,246333,3
2009-10-24,83,I Wanna Make You Close Your Eyes,Dierks Bentley,0HPD5WQqrq7wPWR7P7Dw1i,False,91,83,2,0.599,0.61,1,-5.745,1,0.0232,0.104,4.83e-05,0.115,0.359,95.979,239119,4
2009-10-24,84,You're A Jerk,New Boyz,0HPD5WQqrq7wPWR7P7Dw1i,False,80,24,17,0.931,0.456,4,-6.206,1,0.348,0.153,0,0.0914,0.522,99.048,189053,4
2009-10-24,85,Love Your Love The Most,Eric Church,0HPD5WQqrq7wPWR7P7Dw1i,False,71,63,16,0.333,0.524,10,-6.788,1,0.0301,0.194,0,0.124,0.438,73.393,170387,4
2009-10-24,86,Consider Me Gone,Reba,0HPD5WQqrq7wPWR7P7Dw1i,False,96,86,2,0.587,0.732,8,-3.851,1,0.0296,0.098,0,0.0917,0.453,97.031,218053,4
2009-10-24,87,Bonfire,Craig Morgan,0HPD5WQqrq7wPWR7P7Dw1i,False,90,87,3,0.426,0.917,0,-2.968,1,0.103,0.119,0,0.153,0.506,175.716,179707,4
2009-10-24,88,Bad Habits,Maxwell,0HPD5WQqrq7wPWR7P7Dw1i,False,94,88,3,0.661,0.67,11,-7.645,0,0.258,0.0873,2.01e-06,0.0794,0.661,148.02,352280,4
2009-10-24,89,Break,Three Days Grace,0HPD5WQqrq7wPWR7P7Dw1i,False,86,86,5,0.578,0.897,0,-3.906,1,0.0357,0.000666,0,0.0924,0.737,115.491,193107,4
2009-10-24,90,Haven't Met You Yet,Michael Buble,0HPD5WQqrq7wPWR7P7Dw1i,False,0,65,2,0.615,0.733,8,-4.808,1,0.0335,0.152,0,0.109,0.796,122.58,244587,4
2009-10-24,91,Rain,Creed,2CIsr5cqDJeWffps0vtNeq,True,0,91,1,0.538,0.925,11,-3.178,1,0.0392,0.00209,0,0.258,0.443,98.016,208240,4
2009-10-24,92,Sounds Like Life To Me,Darryl Worley,2CIsr5cqDJeWffps0vtNeq,False,84,84,11,0.532,0.596,2,-6.512,1,0.0282,0.0224,0,0.134,0.418,85.944,223040,4
2009-10-24,93,The Fixer,Pearl Jam,2CIsr5cqDJeWffps0vtNeq,False,66,56,7,0.515,0.934,11,-5.079,0,0.0371,7.94e-05,0.0047,0.327,0.894,152.24,177560,3
2009-10-24,94,Young Forever,Jay-Z + Mr. Hudson,2CIsr5cqDJeWffps0vtNeq,False,83,41,5,0.637,0.69,9,-3.214,0,0.0693,0.417,0,0.211,0.103,140.329,253907,4
2009-10-24,95,Don't Stop Believin',Glee Cast,2CIsr5cqDJeWffps0vtNeq,False,76,4,6,0.473,0.604,7,-4.034,1,0.0337,0.0376,0,0.103,0.271,123.848,232000,4
2009-10-24,96,I'm In Miami Trick,LMFAO,2CIsr5cqDJeWffps0vtNeq,False,87,51,20,0.88,0.884,7,-4.188,1,0.18,0.00476,0,0.052,0.57,127.944,195253,4
2009-10-24,97,Honky Tonk Stomp,Brooks & Dunn Featuring Billy Gibbons,4xvMOj9QANlmQ7If03em5Q,True,0,97,1,0.632,0.927,9,-4.219,1,0.063,0.00413,2.84e-05,0.21,0.674,97.964,181227,4
2009-10-24,98,Shots,LMFAO Featuring Lil Jon,1V4jC0vJ5525lEF1bFgPX2,True,0,98,1,0.825,0.856,1,-1.912,1,0.0476,0.00851,1.4e-06,0.127,0.207,128.016,222133,4
2009-10-24,99,Check My Brain,Alice In Chains,1V4jC0vJ5525lEF1bFgPX2,False,92,92,4,0.441,0.845,10,-3.315,1,0.0462,3.28e-06,0.0533,0.723,0.304,113.989,237907,4
2009-10-24,100,Money To Blow,Birdman Featuring Lil Wayne & Drake,4gaz3uvhKgO078XcdzyPsl,True,0,100,1,0.709,0.579,6,-8.686,1,0.063,0.00934,0,0.353,0.697,133.028,258587,4
