date,position,title,artist,spotify_id,is_new,last_pos,peak_pos,weeks,danceability,energy,key,loudness,mode,speechiness,acousticness,instrumentalness,liveness,valence,tempo,duration_ms,time_signature
2020-01-11,1,Circles,Post Malone,2rTnVB1bvwxHtaIl4uVu7f,False,5,1,18,0.695,0.762,0,-3.497,1,0.0395,0.192,0.00244,0.0863,0.553,120.042,215280,4
2020-01-11,2,Memories,Maroon 5,2rTnVB1bvwxHtaIl4uVu7f,False,9,2,15,0.764,0.32,11,-7.209,1,0.0546,0.837,0,0.0822,0.575,91.019,189486,4
2020-01-11,3,The Box,Roddy Ricch,2rTnVB1bvwxHtaIl4uVu7f,False,13,3,4,0.896,0.586,10,-6.687,0,0.0559,0.104,0,0.79,0.642,116.971,196653,4
2020-01-11,4,Someone You Loved,Lewis Capaldi,2rTnVB1bvwxHtaIl4uVu7f,False,8,1,34,0.501,0.405,1,-5.679,1,0.0319,0.751,0,0.105,0.446,109.891,182161,4
2020-01-11,5,Roxanne,Arizona Zervas,2rTnVB1bvwxHtaIl4uVu7f,False,6,4,9,0.621,0.601,6,-5.616,0,0.148,0.0522,0,0.46,0.457,116.735,163636,5
2020-01-11,6,Good As Hell,Lizzo,2rTnVB1bvwxHtaIl4uVu7f,False,10,3,19,0.682,0.919,0,-3.18,0,0.0875,0.256,0,0.442,0.535,95.982,159736,4
2020-01-11,7,Dance Monkey,Tones And I,2rTnVB1bvwxHtaIl4uVu7f,False,14,7,13,0.824,0.588,6,-6.4,0,0.0924,0.692,0.000104,0.149,0.513,98.027,209438,4
2020-01-11,8,HIGHEST IN THE ROOM,Travis Scott,2rTnVB1bvwxHtaIl4uVu7f,False,38,1,13,0.598,0.427,7,-8.764,0,0.0317,0.0546,5.83e-06,0.21,0.0605,76.469,175721,4
2020-01-11,9,"10,000 Hours",Dan + Shay & Justin Bieber,2rTnVB1bvwxHtaIl4uVu7f,False,17,4,13,0.654,0.63,10,-4.644,1,0.0259,0.153,0,0.111,0.43,89.991,167693,4
2020-01-11,10,Lose You To Love Me,Selena Gomez,2rTnVB1bvwxHtaIl4uVu7f,False,18,1,11,0.488,0.343,4,-8.985,1,0.0436,0.556,0,0.21,0.0978,102.819,206459,4
2020-01-11,11,Senorita,Shawn Mendes & Camila Cabello,2rTnVB1bvwxHtaIl4uVu7f,False,26,1,28,0.759,0.54,9,-6.039,0,0.0287,0.037,0,0.0945,0.75,116.947,190960,4
2020-01-11,12,Ballin',Mustard & Roddy Ricch,2rTnVB1bvwxHtaIl4uVu7f,False,19,12,24,0.809,0.545,7,-6.678,1,0.0735,0.392,0,0.151,0.244,97.008,180435,4
2020-01-11,13,BOP,DaBaby,2rTnVB1bvwxHtaIl4uVu7f,False,20,11,14,0.769,0.787,11,-3.909,1,0.367,0.189,0,0.129,0.836,126.77,159715,4
2020-01-11,14,Bad Guy,Billie Eilish,2rTnVB1bvwxHtaIl4uVu7f,False,23,1,40,0.701,0.425,7,-10.965,1,0.375,0.328,0.13,0.1,0.562,135.128,194088,4
2020-01-11,15,Old Town Road,Lil Nas X Featuring Billy Ray Cyrus,2rTnVB1bvwxHtaIl4uVu7f,False,34,1,44,0.878,0.619,6,-5.56,1,0.102,0.0533,0,0.113,0.639,136.041,157067,4
2020-01-11,16,No Guidance,Chris Brown Featuring Drake,2rTnVB1bvwxHtaIl4uVu7f,False,25,5,30,0.696,0.454,1,-6.756,0,0.153,0.123,0,0.155,0.136,92.928,260640,4
2020-01-11,17,Panini,Lil Nas X,2rTnVB1bvwxHtaIl4uVu7f,False,30,5,28,0.717,0.598,5,-5.613,0,0.0809,0.22,0,0.122,0.496,153.905,151040,4
2020-01-11,18,Truth Hurts,Lizzo,2rTnVB1bvwxHtaIl4uVu7f,False,35,1,35,0.715,0.624,4,-3.046,0,0.114,0.11,0,0.123,0.412,158.087,173325,4
2020-01-11,19,Trampoline,SHAED,2rTnVB1bvwxHtaIl4uVu7f,False,46,13,31,0.689,0.412,7,-7.523,0,0.0301,0.488,0.00016,0.0659,0.537,126.754,184060,4
2020-01-11,20,Heartless,The Weeknd,2rTnVB1bvwxHtaIl4uVu7f,False,39,1,6,0.538,0.751,10,-5.487,0,0.128,0.0194,1.42e-06,0.145,0.244,169.985,198267,4
2020-01-11,21,Don't Start Now,Dua Lipa,2rTnVB1bvwxHtaIl4uVu7f,False,52,21,9,0.794,0.793,11,-4.521,0,0.0842,0.0125,0,0.0952,0.677,123.941,183290,4
2020-01-11,22,Bandit,Juice WRLD & YoungBoy Never Broke Again,2rTnVB1bvwxHtaIl4uVu7f,False,27,10,13,0.474,0.631,5,-5.884,0,0.343,0.0687,0,0.132,0.425,180.051,189323,4
2020-01-11,23,Everything I Wanted,Billie Eilish,2rTnVB1bvwxHtaIl4uVu7f,False,41,8,8,0.704,0.225,6,-14.454,0,0.0994,0.902,0.657,0.106,0.243,120.006,245426,4
2020-01-11,24,Hot,Young Thug Featuring Gunna,2rTnVB1bvwxHtaIl4uVu7f,False,33,11,20,0.855,0.651,0,-8.044,0,0.235,0.063,0,0.0772,0.559,111.997,193027,4
2020-01-11,25,Only Human,Jonas Brothers,2rTnVB1bvwxHtaIl4uVu7f,False,0,18,28,0.795,0.496,0,-5.883,1,0.0722,0.108,0,0.0645,0.874,94.01,183000,4
2020-01-11,26,One Man Band,Old Dominion,2rTnVB1bvwxHtaIl4uVu7f,False,54,20,19,0.706,0.358,6,-8.331,1,0.0347,0.677,0,0.107,0.478,75.991,186240,4
2020-01-11,27,Woah,Lil Baby,2rTnVB1bvwxHtaIl4uVu7f,False,47,16,8,0.884,0.617,11,-5.598,1,0.233,0.0153,0,0.19,0.402,142.952,183011,4
2020-01-11,28,I Don't Care,Ed Sheeran & Justin Bieber,2rTnVB1bvwxHtaIl4uVu7f,False,0,2,31,0.798,0.675,6,-5.041,1,0.0442,0.0912,0,0.0894,0.842,101.956,219947,4
2020-01-11,29,Sucker,Jonas Brothers,2rTnVB1bvwxHtaIl4uVu7f,False,0,1,39,0.842,0.734,1,-5.065,0,0.0588,0.0427,0,0.106,0.952,137.958,181027,4
2020-01-11,30,Even Though I'm Leaving,Luke Combs,2rTnVB1bvwxHtaIl4uVu7f,False,59,11,18,0.554,0.755,2,-6.04,1,0.0319,0.225,0,0.301,0.624,77.962,225253,4
2020-01-11,31,Falling,Trevor Daniel,2rTnVB1bvwxHtaIl4uVu7f,False,51,31,7,0.785,0.431,10,-8.756,0,0.0364,0.123,0,0.0887,0.236,127.085,159382,4
2020-01-11,32,Hot Girl Bummer,blackbear,2rTnVB1bvwxHtaIl4uVu7f,False,55,32,16,0.782,0.559,6,-7.106,0,0.0767,0.125,0,0.385,0.685,129.992,188344,1
2020-01-11,33,Ran$om,Lil Tecca,2rTnVB1bvwxHtaIl4uVu7f,False,50,4,31,0.536,0.715,7,-6.577,1,0.287,0.571,0.000418,0.471,0.391,179.631,60070,4
2020-01-11,34,Lover,Taylor Swift,2rTnVB1bvwxHtaIl4uVu7f,False,57,10,20,0.359,0.543,7,-7.582,1,0.0919,0.492,1.58e-05,0.118,0.453,68.534,221307,4
2020-01-11,35,Adore You,Harry Styles,2rTnVB1bvwxHtaIl4uVu7f,False,53,24,4,0.676,0.771,8,-3.675,1,0.0483,0.0237,7e-06,0.102,0.569,99.048,207133,4
2020-01-11,36,The Bones,Maren Morris,2rTnVB1bvwxHtaIl4uVu7f,False,64,36,15,0.612,0.57,11,-6.642,0,0.0347,0.278,0,0.0963,0.334,77.002,197293,4
2020-01-11,37,Graveyard,Halsey,2rTnVB1bvwxHtaIl4uVu7f,False,61,34,16,0.667,0.583,11,-5.127,0,0.0747,0.231,4.48e-05,0.181,0.187,92.043,181806,4
2020-01-11,38,Out West,JACKBOYS Featuring Young Thug,6gi6y1xwmVszDWkUqab1qw,True,0,38,1,0.802,0.591,8,-4.895,1,0.225,0.0104,0,0.196,0.309,139.864,157712,4
2020-01-11,39,On Chill,Wale Featuring Jeremih,6gi6y1xwmVszDWkUqab1qw,False,58,22,21,0.597,0.733,1,-6.017,1,0.41,0.134,0,0.159,0.639,171.016,214035,4
2020-01-11,40,Talk,Khalid,6gi6y1xwmVszDWkUqab1qw,False,0,3,44,0.901,0.4,0,-8.575,1,0.126,0.051,0,0.0599,0.346,135.984,197573,4
2020-01-11,41,Suicidal,YNW Melly & Juice WRLD,6gi6y1xwmVszDWkUqab1qw,False,56,41,6,0.655,0.441,9,-5.245,0,0.0629,0.474,0,0.099,0.273,139.957,225857,4
2020-01-11,42,Beautiful People,Ed Sheeran Featuring Khalid,6gi6y1xwmVszDWkUqab1qw,False,0,13,25,0.64,0.648,5,-8.113,0,0.187,0.124,0,0.0802,0.548,92.977,197867,4
2020-01-11,43,Suge,DaBaby,6gi6y1xwmVszDWkUqab1qw,False,0,7,36,0.876,0.662,2,-6.482,0,0.426,0.0608,0,0.127,0.844,75.445,163320,4
2020-01-11,44,Futsal Shuffle 2020,Lil Uzi Vert,6gi6y1xwmVszDWkUqab1qw,False,48,5,3,0.881,0.457,7,-8.191,0,0.156,0.0327,0,0.231,0.296,136.97,198913,4
2020-01-11,45,Juicy,Doja Cat & Tyga,6gi6y1xwmVszDWkUqab1qw,False,63,45,10,0.786,0.652,0,-2.607,1,0.0669,0.102,0,0.0697,0.483,170.031,203093,4
2020-01-11,46,No Idea,Don Toliver,6gi6y1xwmVszDWkUqab1qw,False,60,43,5,0.652,0.631,6,-5.718,0,0.0893,0.524,0.000579,0.165,0.35,127.998,154424,4
2020-01-11,47,Baby,Lil Baby & DaBaby,6gi6y1xwmVszDWkUqab1qw,False,0,21,21,0.97,0.463,10,-7.259,1,0.366,0.0957,0,0.151,0.46,108.003,142417,4
2020-01-11,48,GANG GANG,JACKBOYS & Sheck Wes,6uJONCdr2rC65BNmCnTBWK,True,0,48,1,0.859,0.6,7,-4.63,0,0.301,0.071,0,0.353,0.568,123.017,244761,4
2020-01-11,49,What If I Never Get Over You,Lady Antebellum,6uJONCdr2rC65BNmCnTBWK,False,71,47,19,0.576,0.724,0,-5.147,1,0.0274,0.016,0,0.107,0.34,93.029,206598,4
2020-01-11,50,My Oh My,Camila Cabello Featuring DaBaby,6uJONCdr2rC65BNmCnTBWK,False,62,50,4,0.724,0.491,8,-6.024,1,0.0296,0.018,1.29e-05,0.0887,0.383,105.046,170746,4
2020-01-11,51,Ridin' Roads,Dustin Lynch,6uJONCdr2rC65BNmCnTBWK,False,73,51,9,0.547,0.817,9,-4.255,1,0.0448,0.0986,0,0.136,0.592,142.118,205427,4
2020-01-11,52,HAD ENOUGH,Don Toliver Featuring Quavo & Offset,7LGWmZaoS7jZJ5tEi9EcDi,True,0,52,1,0.75,0.789,2,-4.578,1,0.108,0.253,0,0.129,0.673,147.957,157133,4
2020-01-11,53,Heat,Chris Brown Featuring Gunna,7LGWmZaoS7jZJ5tEi9EcDi,False,66,36,18,0.619,0.613,0,-5.83,1,0.0796,0.0614,0,0.117,0.483,82.419,232733,4
2020-01-11,54,Playing Games,Summer Walker,7LGWmZaoS7jZJ5tEi9EcDi,False,65,16,18,0.726,0.408,11,-6.606,0,0.0614,0.603,0,0.225,0.459,115.918,143227,4
2020-01-11,55,Into The Unknown,Idina Menzel & AURORA,7LGWmZaoS7jZJ5tEi9EcDi,False,67,46,6,0.323,0.405,10,-8.533,0,0.0413,0.849,0.000544,0.138,0.274,145.104,194848,5
2020-01-11,56,WHAT TO DO?,JACKBOYS Featuring Don Toliver,4AO1XhrgJczQ9bNVxdfKQe,True,0,56,1,0.643,0.594,9,-5.191,0,0.0312,0.0695,1.46e-05,0.115,0.195,118.037,250142,4
2020-01-11,57,VIBEZ,DaBaby,4AO1XhrgJczQ9bNVxdfKQe,False,68,21,14,0.768,0.652,1,-2.708,0,0.307,0.113,0,0.107,0.777,154.187,144935,4
2020-01-11,58,Heartache Medication,Jon Pardi,4AO1XhrgJczQ9bNVxdfKQe,False,75,58,14,0.621,0.791,9,-3.343,1,0.0265,0.0361,0,0.143,0.734,95.075,209110,4
2020-01-11,59,Blinding Lights,The Weeknd,4AO1XhrgJczQ9bNVxdfKQe,False,72,11,5,0.514,0.73,1,-5.934,1,0.0598,0.00146,9.54e-05,0.0897,0.334,171.005,200040,4
2020-01-11,60,Kinfolks,Sam Hunt,4AO1XhrgJczQ9bNVxdfKQe,False,80,60,12,0.569,0.807,0,-4.584,1,0.0464,0.0876,0,0.164,0.883,76.011,181933,4
2020-01-11,61,Remember You Young,Thomas Rhett,4AO1XhrgJczQ9bNVxdfKQe,False,82,53,16,0.396,0.51,6,-6.274,1,0.0327,0.355,0,0.113,0.299,113.994,180467,4
2020-01-11,62,Heart On Ice,Rod Wave,4AO1XhrgJczQ9bNVxdfKQe,False,70,54,8,0.733,0.389,10,-8.468,0,0.0738,0.0513,0,0.141,0.244,157.878,159670,3
2020-01-11,63,Take What You Want,Post Malone Featuring Ozzy Osbourne & Travis Scott,4AO1XhrgJczQ9bNVxdfKQe,False,77,8,17,0.499,0.8,1,-2.665,0,0.0502,0.0906,0,0.147,0.272,139.919,229573,4
2020-01-11,64,Homesick,Kane Brown,4AO1XhrgJczQ9bNVxdfKQe,False,88,64,7,0.701,0.5,8,-8.82,1,0.0303,0.46,0,0.234,0.409,97.028,205400,4
2020-01-11,65,Camelot,NLE Choppa,4AO1XhrgJczQ9bNVxdfKQe,False,74,37,16,0.787,0.713,7,-5.252,1,0.401,0.0849,0,0.717,0.761,175.046,148759,4
2020-01-11,66,RITMO (Bad Boys For Life),Black Eyed Peas X J Balvin,4AO1XhrgJczQ9bNVxdfKQe,False,86,66,6,0.721,0.716,10,-7.037,0,0.0657,0.0334,0.00084,0.237,0.667,104.994,221714,4
2020-01-11,67,Leave Em Alone,"Layton Greene, Lil Baby, City Girls & PnB Rock",4AO1XhrgJczQ9bNVxdfKQe,False,78,60,13,0.76,0.755,6,-4.735,0,0.19,0.0163,2.95e-06,0.0909,0.517,101.993,171647,4
2020-01-11,68,Start Wit Me,Roddy Ricch & Gunna,4AO1XhrgJczQ9bNVxdfKQe,False,76,58,7,0.886,0.479,4,-8.054,0,0.334,0.077,0,0.135,0.408,130.029,158692,4
2020-01-11,69,GATTI,"JACKBOYS, Pop Smoke & Travis Scott",40mjsnRjCpycdUw3xhS20g,True,0,69,1,0.594,0.676,2,-5.808,1,0.344,0.135,0,0.163,0.472,143.477,181145,4
2020-01-11,70,High Fashion,Roddy Ricch Featuring Mustard,07KXEDMj78x68D884wgVEm,True,0,70,1,0.831,0.499,11,-8.442,0,0.114,0.269,0,0.3,0.511,97.956,220487,4
2020-01-11,71,TOES,DaBaby Featuring Lil Baby & Moneybagg Yo,07KXEDMj78x68D884wgVEm,False,0,28,5,0.816,0.582,8,-4.141,1,0.341,0.0794,5.84e-06,0.0916,0.542,160.004,136366,4
2020-01-11,72,South Of The Border,Ed Sheeran Featuring Camila Cabello & Cardi B,07KXEDMj78x68D884wgVEm,False,100,53,4,0.857,0.621,9,-6.376,0,0.0825,0.148,0,0.0865,0.668,97.989,204467,4
2020-01-11,73,Slide,H.E.R. Featuring YG,07KXEDMj78x68D884wgVEm,False,85,73,2,0.827,0.469,10,-9.141,0,0.341,0.0807,8.12e-06,0.207,0.196,97.028,238321,4
2020-01-11,74,I Hope,Gabby Barrett Featuring Charlie Puth,23T0OX7QOiIUFShSzbJ5Uo,True,0,74,1,0.466,0.536,6,-6.227,1,0.0429,0.0951,0,0.114,0.377,75.998,210773,4
2020-01-11,75,Nice To Meet Ya,Niall Horan,23T0OX7QOiIUFShSzbJ5Uo,False,93,63,12,0.591,0.841,4,-4.351,0,0.0304,0.0119,0,0.395,0.392,109.034,158805,4
2020-01-11,76,Tusa,Karol G & Nicki Minaj,23T0OX7QOiIUFShSzbJ5Uo,False,98,76,5,0.803,0.715,2,-3.28,1,0.298,0.295,0.000134,0.0574,0.574,101.085,200960,4
2020-01-11,77,We Back,Jason Aldean,23T0OX7QOiIUFShSzbJ5Uo,False,0,77,5,0.433,0.928,4,-5.117,0,0.0512,0.0135,2.01e-06,0.32,0.552,155.938,197160,4
2020-01-11,78,223's,YNW Melly & 9lokknine,23T0OX7QOiIUFShSzbJ5Uo,False,84,34,17,0.932,0.547,0,-7.787,0,0.333,0.0388,0,0.0924,0.695,94.998,176640,4
2020-01-11,79,Easy,DaniLeigh Featuring Chris Brown,23T0OX7QOiIUFShSzbJ5Uo,False,90,79,9,0.799,0.301,7,-11.361,1,0.185,0.195,0,0.0816,0.511,100.026,186587,4
2020-01-11,80,Slow Dancing In The Dark,Joji,23T0OX7QOiIUFShSzbJ5Uo,False,89,69,13,0.515,0.479,3,-7.458,1,0.0261,0.544,0.00598,0.191,0.284,88.964,209274,4
2020-01-11,81,BEST ON EARTH,Russ & BIA,23T0OX7QOiIUFShSzbJ5Uo,False,97,81,4,0.846,0.748,5,-3.512,0,0.078,0.188,0,0.093,0.597,90.006,160720,4
2020-01-11,82,Watermelon Sugar,Harry Styles,23T0OX7QOiIUFShSzbJ5Uo,False,87,54,6,0.548,0.816,0,-4.209,1,0.0465,0.122,0,0.335,0.557,95.39,174000,4
2020-01-11,83,Vete,Bad Bunny,23T0OX7QOiIUFShSzbJ5Uo,False,91,33,6,0.886,0.672,1,-4.394,1,0.188,0.0363,8.78e-06,0.101,0.526,91.976,192024,4
2020-01-11,84,Make Me Want To,Jimmie Allen,0AYbVoeF03NYhM0fvKjAuU,True,0,84,1,0.519,0.872,2,-3.212,1,0.0616,0.0793,0,0.111,0.74,179.965,172280,4
2020-01-11,85,Enemies,Post Malone Featuring DaBaby,0AYbVoeF03NYhM0fvKjAuU,False,99,16,17,0.542,0.674,6,-4.169,1,0.21,0.0588,0,0.0955,0.667,76.388,196760,4
2020-01-11,86,What She Wants Tonight,Luke Bryan,0AYbVoeF03NYhM0fvKjAuU,False,0,86,2,0.484,0.903,8,-3.9,0,0.0882,0.0649,0,0.151,0.716,169.948,186988,4
2020-01-11,87,homecoming queen?,Kelsea Ballerini,0AYbVoeF03NYhM0fvKjAuU,False,0,82,4,0.462,0.512,9,-5.443,1,0.0334,0.478,0,0.0993,0.29,114.014,167796,4
2020-01-11,88,More Hearts Than Mine,Ingrid Andress,60RFlt48hm0l4Fu0JoccOl,True,0,88,1,0.375,0.428,0,-7.387,1,0.029,0.109,0,0.105,0.361,78.516,214787,4
2020-01-11,89,Tip Toe,Roddy Ricch Featuring A Boogie Wit da Hoodie,60RFlt48hm0l4Fu0JoccOl,False,95,73,5,0.757,0.673,1,-8.513,1,0.141,0.095,0,0.338,0.574,92.958,185806,3
2020-01-11,90,I Wish Grandpas Never Died,Riley Green,7Dxes6VnfbZYV0S2QTnVuT,True,0,90,1,0.445,0.492,6,-5.717,1,0.0294,0.036,0,0.122,0.24,148.013,250413,4
2020-01-11,91,Death,Trippie Redd Featuring DaBaby,7Dxes6VnfbZYV0S2QTnVuT,False,83,59,7,0.802,0.82,10,-5.969,0,0.146,0.0579,0,0.149,0.613,164.005,172196,4
2020-01-11,92,Yellow Hearts,Ant Saunders,7Dxes6VnfbZYV0S2QTnVuT,False,94,81,8,0.866,0.438,7,-8.943,1,0.0719,0.177,0,0.0743,0.695,129.039,223258,4
2020-01-11,93,Jerry Sprunger,Tory Lanez & T-Pain,7Dxes6VnfbZYV0S2QTnVuT,False,0,44,5,0.76,0.746,0,-5.331,0,0.227,0.137,0,0.0905,0.449,100.011,233546,4
2020-01-11,94,Let Me Know (I Wonder Why Freestyle),Juice WRLD,7Dxes6VnfbZYV0S2QTnVuT,False,81,78,3,0.635,0.537,7,-7.895,0,0.0832,0.172,0,0.418,0.383,125.028,215381,4
2020-01-11,95,Loco Contigo,"DJ Snake, J. Balvin & Tyga",7Dxes6VnfbZYV0S2QTnVuT,False,0,95,2,0.694,0.758,11,-2.986,1,0.218,0.278,1.34e-06,0.102,0.371,192.091,185195,4
2020-01-11,96,Candy,Doja Cat,7Dxes6VnfbZYV0S2QTnVuT,False,96,86,6,0.689,0.516,8,-5.857,1,0.0444,0.513,0,0.163,0.209,124.876,190920,4
2020-01-11,97,Heartless,Diplo Presents Thomas Wesley Featuring Morgan Wallen,7Dxes6VnfbZYV0S2QTnVuT,False,0,78,4,0.765,0.556,11,-6.417,1,0.0512,0.275,0,0.0824,0.274,111.033,169227,4
2020-01-11,98,China,"Anuel AA, Daddy Yankee, Karol G, Ozuna & J Balvin",7Dxes6VnfbZYV0S2QTnVuT,False,0,43,18,0.786,0.808,7,-3.702,1,0.0882,0.0846,0.000289,0.0822,0.609,105.027,301714,4
2020-01-11,99,Slow Dance In A Parking Lot,Jordan Davis,6MBUUSIWCzaXW4q58Ktrv9,True,0,99,1,0.523,0.837,7,-4.494,1,0.0335,0.301,0,0.172,0.523,82.006,193929,4
2020-01-11,100,July,Noah Cyrus & Leon Bridges,6J2LdBN97cDWn0MLxYh9HB,True,0,100,1,0.708,0.186,9,-8.953,0,0.042,0.868,0,0.0779,0.322,72.541,156106,4
