date,position,title,artist,spotify_id,is_new,last_pos,peak_pos,weeks,danceability,energy,key,loudness,mode,speechiness,acousticness,instrumentalness,liveness,valence,tempo,duration_ms,time_signature
2001-01-20,1,Independent Women Part I,Destiny's Child,5cvMzT7kEvcxcdtcJz1vQY,False,1,1,18,0.747,0.638,6,-6.137,0,0.245,0.107,6.44e-06,0.126,0.947,97.99,217680,4
2001-01-20,2,It Wasn't Me,"Shaggy Feat. Ricardo ""RikRok"" Ducent",5cvMzT7kEvcxcdtcJz1vQY,False,2,2,12,0.853,0.606,0,-4.596,1,0.0713,0.0561,0,0.313,0.654,94.759,227600,4
2001-01-20,3,He Loves U Not,Dream,5cvMzT7kEvcxcdtcJz1vQY,False,3,2,17,0.595,0.877,1,-11.787,1,0.0579,0.026,2.85e-06,0.419,0.394,156.972,225813,4
2001-01-20,4,Case Of The Ex (Whatcha Gonna Do),Mya,5cvMzT7kEvcxcdtcJz1vQY,False,4,2,23,0.774,0.684,1,-4.721,0,0.0408,0.0687,9.34e-05,0.0765,0.354,98.001,236827,4
2001-01-20,5,With Arms Wide Open,Creed,5cvMzT7kEvcxcdtcJz1vQY,False,5,1,37,0.41,0.539,0,-8.412,1,0.0302,0.00425,0.00089,0.117,0.141,138.852,274800,4
2001-01-20,6,Ms. Jackson,OutKast,5cvMzT7kEvcxcdtcJz1vQY,False,7,6,11,0.843,0.806,4,-5.946,0,0.269,0.143,0,0.0771,0.613,94.948,270507,4
2001-01-20,7,If You're Gone,matchbox twenty,5cvMzT7kEvcxcdtcJz1vQY,False,8,7,14,0.544,0.659,9,-7.191,1,0.0298,0.427,1.33e-06,0.126,0.361,109.933,274933,4
2001-01-20,8,The Way You Love Me,Faith Hill,5cvMzT7kEvcxcdtcJz1vQY,False,6,6,38,0.627,0.716,2,-7.175,1,0.0352,0.127,0,0.0344,0.734,101.99,186067,4
2001-01-20,9,Again,Lenny Kravitz,5cvMzT7kEvcxcdtcJz1vQY,False,11,9,10,0.55,0.804,2,-5.218,1,0.0271,0.0148,4.33e-05,0.105,0.789,79.166,231667,4
2001-01-20,10,Love Don't Cost A Thing,Jennifer Lopez,5cvMzT7kEvcxcdtcJz1vQY,False,13,10,7,0.786,0.842,4,-5.115,0,0.0707,0.00305,3.54e-06,0.473,0.685,97.577,221227,4
2001-01-20,11,This I Promise You,'N Sync,5cvMzT7kEvcxcdtcJz1vQY,False,9,5,17,0.55,0.587,2,-6.279,1,0.0329,0.354,0,0.128,0.466,165.975,284760,4
2001-01-20,12,I Just Wanna Love U (Give It 2 Me),JAY-Z,5cvMzT7kEvcxcdtcJz1vQY,False,12,11,13,0.8,0.922,4,-5.125,0,0.24,0.301,9.31e-06,0.0352,0.801,98.631,227867,4
2001-01-20,13,Kryptonite,3 Doors Down,5cvMzT7kEvcxcdtcJz1vQY,False,14,3,42,0.545,0.865,11,-5.708,0,0.0286,0.00664,1.1e-05,0.168,0.543,99.009,233933,4
2001-01-20,14,I Wish,R. Kelly,5cvMzT7kEvcxcdtcJz1vQY,False,16,14,17,0.42,0.463,6,-9.056,1,0.12,0.068,0,0.119,0.659,78.83,334000,4
2001-01-20,15,Stronger,Britney Spears,5cvMzT7kEvcxcdtcJz1vQY,False,28,15,8,0.707,0.923,11,-3.957,1,0.0521,0.128,0.000437,0.273,0.842,108.049,203000,4
2001-01-20,16,Dance With Me,Debelah Morgan,5cvMzT7kEvcxcdtcJz1vQY,False,10,8,26,0.85,0.674,7,-7.981,0,0.0373,0.309,0.000645,0.0356,0.74,115.005,220107,4
2001-01-20,17,E.I.,Nelly,5cvMzT7kEvcxcdtcJz1vQY,False,15,15,16,0.834,0.481,2,-7.824,0,0.188,0.0732,0,0.0934,0.406,89.849,285907,4
2001-01-20,18,Crazy For This Girl,Evan And Jaron,5cvMzT7kEvcxcdtcJz1vQY,False,20,18,12,0.457,0.926,0,-5.461,1,0.038,0.000487,5.69e-05,0.0949,0.41,93.964,202027,4
2001-01-20,19,Don't Tell Me,Madonna,5cvMzT7kEvcxcdtcJz1vQY,False,22,19,7,0.699,0.618,7,-7.338,1,0.0594,0.0502,0.000925,0.0914,0.679,99.965,280973,4
2001-01-20,20,Danger (Been So Long),Mystikal Featuring Nivea,5cvMzT7kEvcxcdtcJz1vQY,False,23,20,6,0.92,0.861,7,-5.435,1,0.218,0.211,2.59e-05,0.0288,0.718,97.969,211400,4
2001-01-20,21,Most Girls,P!nk,5cvMzT7kEvcxcdtcJz1vQY,False,18,4,24,0.742,0.732,2,-6.046,0,0.0311,0.0424,0.00444,0.101,0.695,97.923,298960,4
2001-01-20,22,Beautiful Day,U2,5cvMzT7kEvcxcdtcJz1vQY,False,24,22,16,0.539,0.926,2,-6.495,1,0.0499,0.014,0.00136,0.36,0.454,136.279,246400,4
2001-01-20,23,Gotta Tell You,Samantha Mumba,5cvMzT7kEvcxcdtcJz1vQY,False,17,4,20,0.729,0.752,0,-4.478,0,0.028,0.229,0,0.19,0.792,110.007,201067,4
2001-01-20,24,Shape Of My Heart,Backstreet Boys,5cvMzT7kEvcxcdtcJz1vQY,False,26,9,15,0.575,0.786,9,-4.353,1,0.0296,0.252,0,0.159,0.518,96.102,230093,4
2001-01-20,25,What's Your Fantasy,Ludacris Featuring Shawnna,5cvMzT7kEvcxcdtcJz1vQY,False,27,21,17,0.915,0.79,6,-3.186,0,0.207,0.16,0,0.112,0.967,140.093,275907,4
2001-01-20,26,Crazy,K-Ci & JoJo,5cvMzT7kEvcxcdtcJz1vQY,False,35,26,7,0.677,0.648,0,-4.4,1,0.0259,0.0987,0,0.554,0.448,116.128,260267,4
2001-01-20,27,Put It On Me,Ja Rule Featuring Lil' Mo & Vita,5cvMzT7kEvcxcdtcJz1vQY,False,46,27,5,0.831,0.79,1,-4.714,0,0.165,0.0024,0,0.0515,0.791,93.14,262827,4
2001-01-20,28,Stutter,Joe Featuring Mystikal,5cvMzT7kEvcxcdtcJz1vQY,False,70,28,3,0.767,0.759,6,-6.516,1,0.117,0.0513,0,0.31,0.677,89.989,213027,4
2001-01-20,29,Bow Wow (That's My Name),Lil Bow Wow,5cvMzT7kEvcxcdtcJz1vQY,False,40,29,9,0.762,0.67,8,-6.2,0,0.257,0.0217,0,0.0786,0.591,93.066,213493,4
2001-01-20,30,Hemorrhage (In My Hands),Fuel,5cvMzT7kEvcxcdtcJz1vQY,False,31,30,13,0.301,0.823,1,-4.072,1,0.0433,0.000144,0.000309,0.0833,0.372,152.017,236867,4
2001-01-20,31,My First Love,Avant Featuring KeKe Wyatt,5cvMzT7kEvcxcdtcJz1vQY,False,32,26,12,0.643,0.368,11,-8.379,0,0.033,0.0237,1.35e-06,0.157,0.414,125.95,268516,4
2001-01-20,32,Liquid Dreams,O-Town,5cvMzT7kEvcxcdtcJz1vQY,False,19,10,5,0.823,0.7,0,-5.042,0,0.035,0.0264,0,0.0531,0.75,108.019,210400,4
2001-01-20,33,My Next Thirty Years,Tim McGraw,5cvMzT7kEvcxcdtcJz1vQY,False,33,27,14,0.605,0.804,5,-7.521,1,0.0363,0.265,4.93e-06,0.345,0.601,98.866,217733,4
2001-01-20,34,Pinch Me,Barenaked Ladies,5cvMzT7kEvcxcdtcJz1vQY,False,21,15,20,0.68,0.857,7,-4.132,1,0.0373,0.0151,2.88e-05,0.056,0.794,95.349,285160,4
2001-01-20,35,Without You,Dixie Chicks,5cvMzT7kEvcxcdtcJz1vQY,False,36,31,16,0.626,0.424,2,-8.952,1,0.0253,0.313,1.26e-05,0.134,0.173,91.812,210533,4
2001-01-20,36,Born To Fly,Sara Evans,5cvMzT7kEvcxcdtcJz1vQY,False,44,34,14,0.612,0.663,1,-9.314,1,0.035,0.00931,0.0152,0.0637,0.558,100.178,336360,4
2001-01-20,37,South Side,Moby Featuring Gwen Stefani,5cvMzT7kEvcxcdtcJz1vQY,False,37,37,8,0.61,0.723,4,-7.572,1,0.0422,0.0103,0.0447,0.0748,0.45,97.147,229733,4
2001-01-20,38,My Everything,98 Degrees,5cvMzT7kEvcxcdtcJz1vQY,False,43,38,7,0.637,0.523,4,-7.802,1,0.0326,0.296,0,0.101,0.238,125.979,231200,4
2001-01-20,39,Angel,Shaggy Featuring Rayvon,5cvMzT7kEvcxcdtcJz1vQY,False,56,39,4,0.74,0.766,6,-2.939,1,0.178,0.116,0,0.0406,0.807,170.531,235133,4
2001-01-20,40,No More (Baby I'ma Do Right),3LW,5cvMzT7kEvcxcdtcJz1vQY,False,45,40,12,0.721,0.723,2,-7.08,0,0.0631,0.102,4.4e-06,0.0651,0.761,88.933,263440,4
2001-01-20,41,Just Friends (Sunny),Musiq,5cvMzT7kEvcxcdtcJz1vQY,False,34,31,15,0.754,0.376,0,-7.561,1,0.204,0.404,0,0.358,0.554,95.018,251427,4
2001-01-20,42,Between Me And You,Ja Rule Featuring Christina Milian,5cvMzT7kEvcxcdtcJz1vQY,False,30,11,19,0.818,0.883,0,-4.547,1,0.0695,0.0202,0.000767,0.243,0.405,93.67,250173,4
2001-01-20,43,Tell Her,Lonestar,5cvMzT7kEvcxcdtcJz1vQY,False,47,43,10,0.58,0.487,7,-9.809,1,0.0318,0.437,0,0.0968,0.317,126.972,207560,4
2001-01-20,44,Music,Madonna,5cvMzT7kEvcxcdtcJz1vQY,False,29,1,24,0.736,0.802,7,-8.527,1,0.0663,0.00149,0.0876,0.14,0.871,119.854,225973,4
2001-01-20,45,I Lost It,Kenny Chesney,5cvMzT7kEvcxcdtcJz1vQY,False,42,34,14,0.584,0.429,3,-9.289,1,0.028,0.23,0,0.0708,0.355,138.884,234160,4
2001-01-20,46,So In Love With Two,Mikaila,5cvMzT7kEvcxcdtcJz1vQY,False,25,25,9,0.779,0.788,2,-4.63,0,0.0362,0.278,2.5e-06,0.0708,0.791,119.999,206933,4
2001-01-20,47,Promise,Jagged Edge,5cvMzT7kEvcxcdtcJz1vQY,False,50,47,5,0.751,0.568,5,-5.431,0,0.0872,0.136,0,0.0288,0.646,128.002,246720,4
2001-01-20,48,Bent,matchbox twenty,5cvMzT7kEvcxcdtcJz1vQY,False,38,1,39,0.518,0.83,6,-6.814,0,0.0386,0.0404,3.85e-06,0.375,0.527,95.468,256133,4
2001-01-20,49,Emotional,Carl Thomas,5cvMzT7kEvcxcdtcJz1vQY,False,52,47,9,0.548,0.542,1,-8.435,0,0.0409,0.544,0,0.148,0.389,83.106,271868,4
2001-01-20,50,One Woman Man,Dave Hollister,5cvMzT7kEvcxcdtcJz1vQY,False,51,50,7,0.627,0.647,11,-6.818,1,0.0294,0.0457,0,0.0655,0.521,91.015,272053,4
2001-01-20,52,Ashes By Now,Lee Ann Womack,,False,57,52,7,0.66,0.74,1,-7.175,1,0.0258,0.051,1.45e-05,0.0894,0.502,107.999,251173,4
2001-01-20,53,Burn,Jo Dee Messina,,False,59,53,8,0.43,0.708,7,-6.804,1,0.0351,0.133,0,0.238,0.356,173.706,281427,4
2001-01-20,54,Still On Your Side,BBMak,,False,64,54,4,0.517,0.808,10,-4.519,1,0.0262,0.0769,0,0.298,0.52,85.052,230960,4
2001-01-20,55,You Make Me Sick,P!nk,,False,67,55,3,0.77,0.686,11,-6.596,0,0.168,0.00223,2.03e-06,0.347,0.657,100.53,247533,4
2001-01-20,56,There Is No Arizona,Jamie O'Neal,,False,65,56,5,0.467,0.619,8,-6.046,0,0.0345,0.216,0,0.0886,0.346,167.907,236107,4
2001-01-20,57,We Danced,Brad Paisley,,False,53,29,15,0.596,0.465,9,-8.511,1,0.0253,0.385,0,0.106,0.141,73.013,225680,4
2001-01-20,58,Butterfly,Crazy Town,,False,75,58,3,0.736,0.811,9,-4.17,0,0.081,0.00132,0.000142,0.107,0.609,103.502,216733,4
2001-01-20,59,Babylon,David Gray,,False,62,59,8,0.737,0.543,8,-10.403,1,0.0374,0.0598,0.01,0.103,0.256,112.016,265667,4
2001-01-20,60,It's Over Now,112,,False,60,60,7,0.66,0.71,1,-4.541,1,0.0409,0.0106,7.01e-06,0.0736,0.233,97.988,264933,4
2001-01-20,61,You Shouldn't Kiss Me Like This,Toby Keith,,False,68,61,4,0.421,0.79,7,-4.457,1,0.0417,0.319,3.41e-06,0.257,0.303,168.643,221067,4
2001-01-20,62,Mamacita,Public Announcement,,False,39,39,5,0.712,0.771,1,-4.069,0,0.351,0.0566,0,0.063,0.746,94.937,226267,4
2001-01-20,63,Just Another Day In Paradise,Phil Vassar,,False,58,35,17,0.596,0.706,2,-5.562,1,0.0262,0.351,0,0.36,0.704,146.088,233880,4
2001-01-20,64,But For The Grace Of God,Keith Urban,,False,73,64,5,0.666,0.7,0,-6.083,1,0.0267,0.131,0,0.254,0.644,104.021,224107,4
2001-01-20,65,Wild Horses,Garth Brooks,,False,72,65,5,0.711,0.565,4,-4.213,1,0.027,0.589,4.58e-05,0.116,0.447,120.048,196093,4
2001-01-20,66,Loser,3 Doors Down,,False,61,55,14,0.493,0.88,6,-6.424,0,0.0693,0.0108,2.66e-05,0.226,0.389,147.913,264800,4
2001-01-20,67,www.memory,Alan Jackson,,False,63,45,12,0.701,0.503,5,-7.535,1,0.026,0.572,0,0.333,0.726,94.073,154200,4
2001-01-20,68,911,Wyclef Jean Featuring Mary J. Blige,,False,66,38,16,0.747,0.646,7,-9.185,1,0.191,0.273,3.7e-06,0.0931,0.73,87.011,259333,4
2001-01-20,69,Stranger In My House,Tamia,,False,79,69,2,0.676,0.601,0,-4.905,1,0.0297,0.103,0,0.147,0.206,119.94,285387,4
2001-01-20,70,This Everyday Love,Rascal Flatts,,False,77,70,5,0.673,0.812,0,-3.436,1,0.0468,0.348,0,0.106,0.96,95.024,184107,4
2001-01-20,71,Is That Your Chick,Memphis Bleek Featuring Jay-Z & Missy Elliott,,False,71,71,6,0.841,0.835,8,-6.191,0,0.308,0.263,0,0.108,0.702,133.024,294040,4
2001-01-20,72,Thank You,Dido,,False,80,72,2,0.722,0.595,1,-9.928,0,0.0415,0.284,0.000538,0.0694,0.738,79.98,217827,4
2001-01-20,73,She Bangs,Ricky Martin,,False,55,12,16,0.63,0.95,1,-4.012,1,0.0806,0.000915,6.51e-06,0.373,0.858,143.866,280627,4
2001-01-20,74,The Little Girl,John Michael Montgomery,,False,74,35,20,0.658,0.434,1,-8.527,1,0.025,0.354,1.75e-05,0.112,0.218,83.921,232640,4
2001-01-20,75,By Your Side,Sade,7H3ojI1BsVy0dEJENqMt1k,True,0,75,1,0.653,0.429,11,-10.473,1,0.0297,0.0849,0.00371,0.0693,0.627,146.073,274933,4
2001-01-20,76,A Good Day To Run,Darryl Worley,3Ye4dPI87Y3SP3pH0EC3rC,True,0,76,1,0.566,0.794,6,-5.537,1,0.0298,0.395,1.09e-05,0.145,0.725,147.106,188333,4
2001-01-20,77,Stan,Eminem Featuring Dido,3Ye4dPI87Y3SP3pH0EC3rC,False,69,51,12,0.78,0.768,6,-4.325,0,0.238,0.0371,2.34e-06,0.518,0.507,80.063,404107,4
2001-01-20,78,X,Xzibit,3Ye4dPI87Y3SP3pH0EC3rC,False,83,76,4,0.936,0.678,4,-3.012,0,0.21,0.0795,0,0.0838,0.822,96.911,255640,4
2001-01-20,79,One More Day,Diamond Rio,3TNoNv8Z80M3pfm6CcODsh,True,0,79,1,0.668,0.405,4,-7.629,1,0.0277,0.592,0,0.115,0.234,131.064,216173,4
2001-01-20,80,Rollin',Limp Bizkit,3TNoNv8Z80M3pfm6CcODsh,False,78,65,11,0.603,0.933,1,-3.358,1,0.171,0.00591,0,0.206,0.709,96.306,213760,4
2001-01-20,81,Meanwhile Back At The Ranch,The Clark Family Experience,3TNoNv8Z80M3pfm6CcODsh,False,82,80,10,0.585,0.84,7,-6.109,1,0.0324,0.0649,0,0.367,0.534,94.944,179467,4
2001-01-20,82,Could It Be,Jaheim,3TNoNv8Z80M3pfm6CcODsh,False,84,78,6,0.655,0.553,9,-6.854,0,0.0891,0.0636,1.73e-05,0.126,0.531,70.033,224667,4
2001-01-20,83,Oh No,Mos Def & Pharoahe Monch Featuring Nate Dogg,3TNoNv8Z80M3pfm6CcODsh,False,88,83,5,0.719,0.863,5,-4.148,0,0.435,0.414,5.19e-06,0.147,0.765,87.579,239933,1
2001-01-20,84,Girls Dem Sugar,Beenie Man Featuring Mya,3TNoNv8Z80M3pfm6CcODsh,False,85,54,14,0.603,0.782,2,-4.832,1,0.162,0.118,0,0.363,0.731,124.303,257893,5
2001-01-20,85,You Should've Told Me,Kelly Price,3TNoNv8Z80M3pfm6CcODsh,False,86,64,18,0.732,0.467,1,-4.951,1,0.07,0.235,0,0.0528,0.553,120.136,195080,4
2001-01-20,86,Southern Hospitality,Ludacris,4cNhx6OO1XpvwT6xZnb83B,True,0,86,1,0.623,0.896,0,-4.719,1,0.247,0.035,0,0.0941,0.613,95.158,300933,4
2001-01-20,87,After Party,Koffee Brown,4cNhx6OO1XpvwT6xZnb83B,False,98,87,2,0.802,0.552,5,-4.796,0,0.0503,0.0492,1.7e-06,0.0224,0.601,105.481,214560,4
2001-01-20,88,Cha-Cha Slide,Mr. C The Slide Man,4cNhx6OO1XpvwT6xZnb83B,False,96,88,3,0.88,0.439,6,-11.922,1,0.0601,0.000451,0.893,0.113,0.162,119.973,248785,4
2001-01-20,89,Feels Like Love,Vince Gill,4cNhx6OO1XpvwT6xZnb83B,False,91,52,20,0.55,0.832,10,-7.773,1,0.0296,0.133,3.96e-05,0.189,0.627,99.917,255773,4
2001-01-20,90,Lady (Hear Me Tonight),Modjo,4cNhx6OO1XpvwT6xZnb83B,False,95,90,3,0.72,0.808,6,-5.627,1,0.0379,0.00793,0.0293,0.0634,0.869,126.041,307154,4
2001-01-20,91,My Baby You,Marc Anthony,4cNhx6OO1XpvwT6xZnb83B,False,94,70,19,0.443,0.596,0,-5.366,0,0.0294,0.688,0,0.167,0.186,115.597,236960,4
2001-01-20,92,Original Prankster,The Offspring,4cNhx6OO1XpvwT6xZnb83B,False,89,70,9,0.664,0.877,2,-4.251,1,0.0334,0.000542,2.95e-05,0.284,0.961,146.804,220947,4
2001-01-20,93,Can't Fight The Moonlight,LeAnn Rimes,4cNhx6OO1XpvwT6xZnb83B,False,87,71,20,0.628,0.834,6,-6.341,0,0.0497,0.403,0,0.051,0.626,97.865,215507,4
2001-01-20,94,Liar,Profyle,4cNhx6OO1XpvwT6xZnb83B,False,81,14,19,0.694,0.617,10,-3.559,0,0.049,0.226,0,0.247,0.305,114.064,297893,4
2001-01-20,95,The Itch,Vitamin C,4cNhx6OO1XpvwT6xZnb83B,False,76,45,8,0.694,0.947,11,-3.91,0,0.0546,0.00621,0.0395,0.133,0.518,105.019,208733,4
2001-01-20,96,How Many Licks?,Lil' Kim Featuring Sisqo,4cNhx6OO1XpvwT6xZnb83B,False,0,75,7,0.777,0.846,10,-3.11,0,0.194,0.0508,0,0.309,0.646,105.45,232800,4
2001-01-20,97,Thank You In Advance,Boyz II Men,4cNhx6OO1XpvwT6xZnb83B,False,92,80,4,0.698,0.435,1,-6.876,1,0.0445,0.0897,0,0.275,0.208,119.988,251307,4
2001-01-20,98,Oklahoma,Billy Gilman,4cNhx6OO1XpvwT6xZnb83B,False,90,63,11,0.42,0.268,1,-10.217,1,0.0332,0.484,0,0.0892,0.27,138.595,244000,4
2001-01-20,99,A Little Gasoline,Terri Clark,4cNhx6OO1XpvwT6xZnb83B,False,99,75,6,0.629,0.655,2,-3.798,1,0.0302,0.103,0,0.12,0.764,76.7,188640,4
2001-01-20,100,Bouncing Off The Ceiling (Upside Down),A*Teens,4cNhx6OO1XpvwT6xZnb83B,False,93,93,3,0.739,0.756,9,-8.209,1,0.0326,0.039,0.0235,0.425,0.945,122.01,193552,4
