date,position,title,artist,spotify_id,is_new,last_pos,peak_pos,weeks,danceability,energy,key,loudness,mode,speechiness,acousticness,instrumentalness,liveness,valence,tempo,duration_ms,time_signature
2021-01-23,1,Drivers License,Olivia Rodrigo,7lPN2DXiMsVn7XUKtOW1CS,True,0,1,1,0.585,0.436,10,-8.761,1,0.0601,0.721,1.31e-05,0.105,0.132,143.874,242014,4
2021-01-23,2,Mood,24kGoldn Featuring iann dior,7lPN2DXiMsVn7XUKtOW1CS,False,1,1,23,0.7,0.722,7,-3.558,0,0.0369,0.221,0,0.272,0.756,90.989,140526,4
2021-01-23,3,Positions,Ariana Grande,7lPN2DXiMsVn7XUKtOW1CS,False,2,1,12,0.737,0.802,0,-4.771,1,0.0878,0.468,0,0.0931,0.682,144.015,172325,4
2021-01-23,4,Blinding Lights,The Weeknd,7lPN2DXiMsVn7XUKtOW1CS,False,3,1,58,0.514,0.73,1,-5.934,1,0.0598,0.00146,9.54e-05,0.0897,0.334,171.005,200040,4
2021-01-23,5,Go Crazy,Chris Brown & Young Thug,7lPN2DXiMsVn7XUKtOW1CS,False,5,5,36,0.755,0.578,0,-8.932,0,0.145,0.316,0,0.25,0.581,94.148,176960,4
2021-01-23,6,Levitating,Dua Lipa Featuring DaBaby,7lPN2DXiMsVn7XUKtOW1CS,False,7,6,15,0.702,0.825,6,-3.787,0,0.0601,0.00883,0,0.0674,0.915,102.977,203064,4
2021-01-23,7,Holy,Justin Bieber Featuring Chance The Rapper,7lPN2DXiMsVn7XUKtOW1CS,False,4,3,17,0.673,0.704,6,-8.056,1,0.36,0.196,0,0.0898,0.372,86.919,212093,4
2021-01-23,8,Bang!,AJR,7lPN2DXiMsVn7XUKtOW1CS,False,9,8,28,0.74,0.516,1,-6.233,0,0.0507,0.0183,0,0.0558,0.698,139.918,170858,4
2021-01-23,9,Wasted On You,Morgan Wallen,3cBsEDNhFI9E82vPj3kvi3,True,0,9,1,0.505,0.657,11,-5.24,0,0.0318,0.373,0.00107,0.126,0.252,196.0,178520,3
2021-01-23,10,Good Days,SZA,3cBsEDNhFI9E82vPj3kvi3,False,23,10,3,0.436,0.655,1,-8.37,0,0.0583,0.499,8.1e-06,0.688,0.412,121.002,279204,4
2021-01-23,11,34+35,Ariana Grande,3cBsEDNhFI9E82vPj3kvi3,False,13,8,11,0.83,0.585,0,-6.476,1,0.094,0.237,0,0.248,0.485,109.978,173711,4
2021-01-23,12,Lonely,Justin Bieber & benny blanco,3cBsEDNhFI9E82vPj3kvi3,False,18,12,13,0.631,0.239,11,-7.071,0,0.0398,0.864,0,0.116,0.0927,79.859,149297,4
2021-01-23,13,Laugh Now Cry Later,Drake Featuring Lil Durk,3cBsEDNhFI9E82vPj3kvi3,False,8,2,22,0.761,0.518,0,-8.871,1,0.134,0.244,3.47e-05,0.107,0.522,133.976,261493,4
2021-01-23,14,I Hope,Gabby Barrett Featuring Charlie Puth,3cBsEDNhFI9E82vPj3kvi3,False,10,3,55,0.466,0.536,6,-6.227,1,0.0429,0.0951,0,0.114,0.377,75.998,210773,4
2021-01-23,15,For The Night,Pop Smoke Featuring Lil Baby & DaBaby,3cBsEDNhFI9E82vPj3kvi3,False,11,6,28,0.823,0.586,6,-6.606,0,0.2,0.114,0,0.193,0.347,125.971,190476,4
2021-01-23,16,More Than My Hometown,Morgan Wallen,3cBsEDNhFI9E82vPj3kvi3,False,27,15,29,0.62,0.869,6,-5.479,1,0.0462,0.615,0,0.131,0.597,126.019,216573,4
2021-01-23,17,Therefore I Am,Billie Eilish,3cBsEDNhFI9E82vPj3kvi3,False,14,2,10,0.889,0.34,11,-7.773,0,0.0697,0.218,0.13,0.055,0.716,94.009,174321,4
2021-01-23,18,7 Summers,Morgan Wallen,3cBsEDNhFI9E82vPj3kvi3,False,53,6,21,0.466,0.786,0,-5.13,1,0.0328,0.417,6.1e-05,0.125,0.571,203.903,210507,4
2021-01-23,19,Lemonade,Internet Money & Gunna Featuring Don Toliver & NAV,3cBsEDNhFI9E82vPj3kvi3,False,12,6,22,0.799,0.66,1,-6.153,0,0.079,0.256,0,0.111,0.471,140.04,195429,4
2021-01-23,20,Body,Megan Thee Stallion,3cBsEDNhFI9E82vPj3kvi3,False,16,12,8,0.914,0.732,8,-6.1,0,0.241,0.0166,0,0.107,0.469,94.066,171067,4
2021-01-23,21,Save Your Tears,The Weeknd,3cBsEDNhFI9E82vPj3kvi3,False,46,21,5,0.68,0.826,0,-5.487,1,0.0309,0.0212,1.24e-05,0.543,0.644,118.051,215627,4
2021-01-23,22,Anyone,Justin Bieber,3cBsEDNhFI9E82vPj3kvi3,False,6,6,2,0.686,0.538,2,-8.026,1,0.0345,0.181,3.13e-06,0.113,0.584,115.884,190779,4
2021-01-23,23,Dakiti,Bad Bunny & Jhay Cortez,3cBsEDNhFI9E82vPj3kvi3,False,17,5,11,0.731,0.573,4,-10.059,0,0.0544,0.401,5.22e-05,0.113,0.145,109.928,205090,4
2021-01-23,24,Better Together,Luke Combs,3cBsEDNhFI9E82vPj3kvi3,False,19,19,15,0.552,0.225,0,-11.501,1,0.0477,0.827,0,0.111,0.67,138.002,219573,4
2021-01-23,25,Whoopty,CJ,3cBsEDNhFI9E82vPj3kvi3,False,21,21,10,0.719,0.648,3,-7.6,0,0.125,0.2,0,0.127,0.66,140.201,123263,4
2021-01-23,26,Somebody's Problem,Morgan Wallen,3cBsEDNhFI9E82vPj3kvi3,False,81,25,5,0.658,0.538,5,-7.676,1,0.0289,0.657,0,0.123,0.62,136.967,161773,4
2021-01-23,27,What You Know Bout Love,Pop Smoke,3cBsEDNhFI9E82vPj3kvi3,False,20,20,19,0.709,0.548,10,-8.493,1,0.353,0.65,1.59e-06,0.133,0.543,83.995,160000,4
2021-01-23,28,Kings & Queens,Ava Max,3cBsEDNhFI9E82vPj3kvi3,False,15,13,23,0.637,0.69,1,-4.057,0,0.0405,0.00786,0,0.124,0.457,129.857,162399,4
2021-01-23,29,Willow,Taylor Swift,3cBsEDNhFI9E82vPj3kvi3,False,22,1,5,0.392,0.574,7,-9.195,1,0.17,0.833,0.00179,0.145,0.529,81.112,214707,4
2021-01-23,30,I Should Probably Go To Bed,Dan + Shay,3cBsEDNhFI9E82vPj3kvi3,False,28,28,23,0.721,0.277,1,-7.128,1,0.0365,0.634,0,0.112,0.309,131.935,171827,4
2021-01-23,31,Before You Go,Lewis Capaldi,3cBsEDNhFI9E82vPj3kvi3,False,24,9,47,0.459,0.575,3,-4.858,1,0.0573,0.604,0,0.0885,0.183,111.881,215107,4
2021-01-23,32,Sand In My Boots,Morgan Wallen,0uRrG2jRR5tuifsYIJHEao,True,0,32,1,0.403,0.537,3,-6.628,1,0.031,0.59,0,0.112,0.414,69.877,202133,4
2021-01-23,33,You Broke Me First.,Tate McRae,0uRrG2jRR5tuifsYIJHEao,False,40,33,21,0.642,0.374,4,-9.386,1,0.0545,0.786,0,0.0906,0.0799,124.099,169266,4
2021-01-23,34,Rockstar,DaBaby Featuring Roddy Ricch,0uRrG2jRR5tuifsYIJHEao,False,26,1,38,0.746,0.69,11,-7.956,1,0.164,0.247,0,0.101,0.497,89.977,181733,4
2021-01-23,35,Dynamite,BTS,0uRrG2jRR5tuifsYIJHEao,False,25,1,21,0.746,0.765,6,-4.41,0,0.0993,0.0112,0,0.0936,0.737,114.044,199054,4
2021-01-23,36,Afterglow,Ed Sheeran,0uRrG2jRR5tuifsYIJHEao,False,29,29,4,0.641,0.324,11,-5.851,1,0.0299,0.698,0,0.328,0.273,110.184,185487,4
2021-01-23,37,On Me,Lil Baby,0uRrG2jRR5tuifsYIJHEao,False,38,30,6,0.856,0.564,6,-6.295,0,0.392,0.00327,0,0.134,0.483,77.972,135960,4
2021-01-23,38,Starting Over,Chris Stapleton,0uRrG2jRR5tuifsYIJHEao,False,30,25,20,0.638,0.538,10,-8.445,1,0.0315,0.452,0.000415,0.0695,0.318,89.124,240413,4
2021-01-23,39,Best Friend,Saweetie Featuring Doja Cat,2etHQJxIbV0soyPhelVs9Y,True,0,39,1,0.84,0.766,4,-4.12,1,0.136,0.00302,3.61e-06,0.0684,0.402,94.018,155884,4
2021-01-23,40,My Ex's Best Friend,Machine Gun Kelly X blackbear,2etHQJxIbV0soyPhelVs9Y,False,41,28,22,0.731,0.675,5,-5.134,0,0.0434,0.00473,0,0.141,0.298,124.939,139461,4
2021-01-23,41,Whats Poppin,"Jack Harlow Featuring DaBaby, Tory Lanez & Lil Wayne",2etHQJxIbV0soyPhelVs9Y,False,34,2,48,0.904,0.723,11,-5.224,0,0.26,0.0631,0,0.185,0.835,145.013,227478,4
2021-01-23,42,Warning,Morgan Wallen,64SCQtbRtmO28ks1QhS3w5,True,0,42,1,0.633,0.664,10,-5.037,1,0.0294,0.46,0,0.108,0.268,115.058,156747,4
2021-01-23,43,Savage Love (Laxed - Siren Beat),Jawsh 685 x Jason Derulo,64SCQtbRtmO28ks1QhS3w5,False,31,1,29,0.767,0.481,0,-8.52,0,0.0803,0.234,0,0.269,0.761,150.076,171375,4
2021-01-23,44,Good Time,Niko Moon,64SCQtbRtmO28ks1QhS3w5,False,48,44,15,0.79,0.646,5,-5.878,1,0.0447,0.132,0,0.295,0.641,138.047,214707,4
2021-01-23,45,Still Goin Down,Morgan Wallen,64SCQtbRtmO28ks1QhS3w5,False,98,45,4,0.58,0.751,7,-5.078,1,0.0267,0.49,0,0.277,0.718,148.108,186293,4
2021-01-23,46,865,Morgan Wallen,0sKEilrw1GrBlG6qsTCrP4,True,0,46,1,0.532,0.584,8,-5.254,1,0.0248,0.723,0,0.101,0.367,88.003,190680,4
2021-01-23,47,Diamonds,Sam Smith,0sKEilrw1GrBlG6qsTCrP4,False,39,39,17,0.653,0.667,10,-6.764,0,0.0423,0.154,0,0.107,0.556,104.181,213869,4
2021-01-23,48,WAP,Cardi B Featuring Megan Thee Stallion,0sKEilrw1GrBlG6qsTCrP4,False,35,1,23,0.935,0.454,1,-7.509,1,0.375,0.0194,0,0.0824,0.357,133.073,187541,4
2021-01-23,49,Hole In The Bottle,Kelsea Ballerini,0sKEilrw1GrBlG6qsTCrP4,False,45,45,13,0.598,0.839,4,-4.605,1,0.111,0.106,0,0.372,0.783,105.084,156276,4
2021-01-23,50,Hawai,Maluma & The Weeknd,0sKEilrw1GrBlG6qsTCrP4,False,43,12,21,0.766,0.788,6,-3.128,0,0.312,0.105,5.81e-06,0.142,0.609,179.984,200482,4
2021-01-23,51,Cry Baby,Megan Thee Stallion Featuring DaBaby,0sKEilrw1GrBlG6qsTCrP4,False,44,44,6,0.957,0.437,11,-7.882,1,0.359,0.00402,0,0.219,0.616,130.058,137984,4
2021-01-23,52,Cover Me Up,Morgan Wallen,0sKEilrw1GrBlG6qsTCrP4,False,0,52,2,0.549,0.44,7,-8.192,1,0.0264,0.232,7.37e-06,0.107,0.214,128.01,293707,3
2021-01-23,53,Champagne Night,Lady A,0sKEilrw1GrBlG6qsTCrP4,False,33,33,12,0.523,0.927,4,-2.796,1,0.0489,0.0272,5.98e-06,0.168,0.939,149.929,185070,4
2021-01-23,54,You're Mines Still,Yung Bleu Featuring Drake,0sKEilrw1GrBlG6qsTCrP4,False,56,52,6,0.613,0.615,5,-4.859,0,0.107,0.308,0,0.107,0.342,86.782,226220,4
2021-01-23,55,Monster,Shawn Mendes & Justin Bieber,0sKEilrw1GrBlG6qsTCrP4,False,36,8,8,0.652,0.383,2,-7.076,0,0.0516,0.0676,0,0.0828,0.549,145.765,178994,4
2021-01-23,56,B.S.,Jhene Aiko Featuring H.E.R.,0sKEilrw1GrBlG6qsTCrP4,False,52,24,23,0.617,0.525,8,-10.426,0,0.12,0.554,1.1e-06,0.135,0.377,135.781,212867,4
2021-01-23,57,Without You,The Kid LAROI,0sKEilrw1GrBlG6qsTCrP4,False,54,54,6,0.662,0.413,0,-7.357,1,0.0299,0.213,0,0.134,0.467,93.005,161385,4
2021-01-23,58,Holiday,Lil Nas X,0sKEilrw1GrBlG6qsTCrP4,False,47,37,9,0.81,0.511,5,-6.924,0,0.164,0.12,0,0.0832,0.837,151.947,154998,4
2021-01-23,59,"Big, Big Plans",Chris Lane,0sKEilrw1GrBlG6qsTCrP4,False,49,42,15,0.574,0.58,7,-6.091,1,0.0278,0.076,0,0.12,0.4,149.974,187307,4
2021-01-23,60,Love You Like I Used To,Russell Dickerson,0sKEilrw1GrBlG6qsTCrP4,False,50,31,19,0.501,0.788,10,-4.624,1,0.0415,0.12,0,0.137,0.61,152.047,186613,4
2021-01-23,61,Still Trappin',Lil Durk & King Von,0sKEilrw1GrBlG6qsTCrP4,False,59,53,3,0.877,0.677,5,-4.969,0,0.356,0.0439,0,0.0986,0.627,144.941,172185,4
2021-01-23,62,Dangerous,Morgan Wallen,1MX19fnaW1OUQoglWTYaOo,True,0,62,1,0.635,0.772,7,-4.825,1,0.0279,0.216,0,0.285,0.948,119.017,147893,4
2021-01-23,63,Neon Eyes,Morgan Wallen,3kOi5KZTcCOdqFlUjF9CDZ,True,0,63,1,0.576,0.843,11,-5.26,0,0.029,0.0214,8.04e-05,0.157,0.628,126.009,226147,4
2021-01-23,64,Damage,H.E.R.,3kOi5KZTcCOdqFlUjF9CDZ,False,66,64,5,0.646,0.696,1,-6.505,1,0.065,0.113,0,0.115,0.18,81.336,223415,4
2021-01-23,65,Mr. Right Now,21 Savage & Metro Boomin Featuring Drake,3kOi5KZTcCOdqFlUjF9CDZ,False,55,10,15,0.647,0.667,5,-5.563,1,0.304,0.231,0,0.133,0.704,172.08,193839,4
2021-01-23,66,More Surprised Than Me,Morgan Wallen,5NhcE6cuJjVYyVEKp97zOt,True,0,66,1,0.516,0.748,6,-6.049,1,0.0289,0.241,0,0.123,0.433,85.004,157440,4
2021-01-23,67,Forever After All,Luke Combs,5NhcE6cuJjVYyVEKp97zOt,False,51,2,12,0.487,0.65,0,-5.195,1,0.0253,0.191,0,0.0933,0.456,151.964,232533,4
2021-01-23,68,Back To The Streets,Saweetie Featuring Jhene Aiko,5NhcE6cuJjVYyVEKp97zOt,False,63,63,8,0.865,0.792,4,-4.207,1,0.0677,0.168,1.46e-05,0.107,0.562,101.985,189496,4
2021-01-23,69,Throat Baby (Go Baby),BRS Kash,5NhcE6cuJjVYyVEKp97zOt,False,58,58,13,0.878,0.475,1,-8.42,0,0.324,0.00984,0,0.167,0.397,131.988,211610,4
2021-01-23,70,Happy Does,Kenny Chesney,5NhcE6cuJjVYyVEKp97zOt,False,69,69,9,0.715,0.665,6,-5.486,1,0.0383,0.3,0,0.123,0.597,109.018,168733,4
2021-01-23,71,Tyler Herro,Jack Harlow,5NhcE6cuJjVYyVEKp97zOt,False,61,34,12,0.794,0.756,5,-7.16,0,0.136,0.11,0,0.247,0.775,123.066,156498,4
2021-01-23,72,Take You Dancing,Jason Derulo,5NhcE6cuJjVYyVEKp97zOt,False,57,57,6,0.789,0.711,2,-4.248,1,0.041,0.0332,0,0.0876,0.753,112.985,190306,4
2021-01-23,73,Prisoner,Miley Cyrus Featuring Dua Lipa,5NhcE6cuJjVYyVEKp97zOt,False,60,54,8,0.781,0.67,3,-3.912,0,0.0452,0.0103,0,0.0761,0.595,127.99,169333,4
2021-01-23,74,Livin' The Dream,Morgan Wallen,5NhcE6cuJjVYyVEKp97zOt,False,0,74,2,0.621,0.754,7,-5.904,0,0.0269,0.575,0.00484,0.213,0.441,127.036,239120,4
2021-01-23,75,Put Your Records On,Ritt Momney,5NhcE6cuJjVYyVEKp97zOt,False,67,67,13,0.399,0.491,6,-10.778,0,0.0538,0.0563,0.00089,0.11,0.151,91.066,210463,4
2021-01-23,76,What's Your Country Song,Thomas Rhett,5NhcE6cuJjVYyVEKp97zOt,False,68,68,4,0.355,0.706,5,-6.164,1,0.0309,0.000532,0,0.264,0.523,174.005,170373,4
2021-01-23,77,Beers And Sunshine,Darius Rucker,5NhcE6cuJjVYyVEKp97zOt,False,64,64,5,0.57,0.645,5,-5.816,1,0.0304,0.134,0,0.147,0.677,81.084,178279,4
2021-01-23,78,Back In Blood,Pooh Shiesty Featuring Lil Durk,5NhcE6cuJjVYyVEKp97zOt,False,93,78,2,0.759,0.538,8,-8.256,0,0.384,0.151,0,0.126,0.831,146.933,184490,4
2021-01-23,79,Long Live,Florida Georgia Line,5NhcE6cuJjVYyVEKp97zOt,False,79,79,2,0.612,0.842,7,-3.547,1,0.0372,0.185,0,0.151,0.596,129.973,152373,4
2021-01-23,80,Hit Different,SZA Featuring Ty Dolla $ign,5NhcE6cuJjVYyVEKp97zOt,False,62,29,18,0.679,0.516,0,-6.371,0,0.0452,0.199,0,0.0965,0.716,120.074,202008,4
2021-01-23,81,Monsters,All Time Low Featuring Demi Lovato & blackbear,5NhcE6cuJjVYyVEKp97zOt,False,70,70,3,0.369,0.845,0,-3.449,0,0.0611,0.0493,0,0.416,0.782,78.532,174068,4
2021-01-23,82,Down To One,Luke Bryan,5NhcE6cuJjVYyVEKp97zOt,False,72,72,3,0.62,0.776,8,-4.109,1,0.0365,0.358,4.31e-05,0.11,0.551,93.963,221633,4
2021-01-23,83,Whiskey'd My Way,Morgan Wallen,6AjPoqyODR5vJxx4dPcked,True,0,83,1,0.443,0.518,2,-6.373,1,0.0266,0.603,0.00225,0.0984,0.323,185.764,180787,3
2021-01-23,84,Your Bartender,Morgan Wallen,01FvQEvHETjWqcDpQDJdTb,True,0,84,1,0.555,0.771,4,-5.237,1,0.0282,0.247,7.26e-05,0.149,0.442,139.971,185093,4
2021-01-23,85,Golden,Harry Styles,01FvQEvHETjWqcDpQDJdTb,False,65,65,12,0.448,0.838,4,-5.257,0,0.0557,0.21,0.000131,0.131,0.254,139.863,208907,4
2021-01-23,86,Outlaw,Morgan Wallen Featuring Ben Burgess,2NK6dtSujGIyilnEgbw8MX,True,0,86,1,0.505,0.63,7,-5.758,1,0.0274,0.572,0,0.121,0.247,85.036,229747,4
2021-01-23,87,Just The Way,Parmalee x Blanco Brown,2NK6dtSujGIyilnEgbw8MX,False,75,75,3,0.426,0.829,9,-2.84,1,0.0569,0.107,0,0.317,0.814,180.241,193880,4
2021-01-23,88,Bichota,Karol G,2NK6dtSujGIyilnEgbw8MX,False,73,73,7,0.863,0.666,1,-4.158,0,0.152,0.212,0.000493,0.103,0.838,163.908,178947,4
2021-01-23,89,The Good Ones,Gabby Barrett,2NK6dtSujGIyilnEgbw8MX,False,77,77,3,0.519,0.552,2,-5.023,1,0.0259,0.18,0,0.149,0.331,89.957,215141,4
2021-01-23,90,Only Thing That's Gone,Morgan Wallen Featuring Chris Stapleton,4RuNKwejhQSChYaNgfosEg,True,0,90,1,0.5,0.803,2,-4.591,1,0.032,0.11,2.12e-05,0.296,0.451,150.058,196707,4
2021-01-23,91,Streets,Doja Cat,60ynsPSSKe6O3sfwRnIBRf,True,0,91,1,0.749,0.463,11,-8.433,1,0.0828,0.208,0.0371,0.337,0.19,90.028,226987,4
2021-01-23,92,This Bar,Morgan Wallen,075qcpR3BnxD5CWUIx1HTr,True,0,92,1,0.553,0.884,2,-5.306,1,0.0771,0.0921,0.00033,0.0463,0.248,110.074,185280,4
2021-01-23,93,Wonderin' Bout The Wind,Morgan Wallen,2p6hbwOB2u5hI4Uc8FDNL3,True,0,93,1,0.481,0.715,6,-5.626,1,0.0334,0.244,0,0.133,0.395,90.966,182227,4
2021-01-23,94,So Done,The Kid LAROI,2p6hbwOB2u5hI4Uc8FDNL3,False,80,59,10,0.719,0.598,9,-6.254,1,0.077,0.232,0,0.115,0.303,142.592,126521,4
2021-01-23,95,Pick Up Your Feelings,Jazmine Sullivan,2JLVZYEMmqPWbUoAJAMKfm,True,0,95,1,0.729,0.414,7,-6.138,0,0.0565,0.291,0,0.0793,0.565,85.729,232096,3
2021-01-23,96,Adderall (Corvette Corvette),Popp Hunna,2JLVZYEMmqPWbUoAJAMKfm,False,78,74,4,0.921,0.718,4,-3.545,0,0.299,0.217,0,0.189,0.677,141.06,176383,4
2021-01-23,97,Girl Like Me,Jazmine Sullivan Featuring H.E.R.,2sXydP9vPEYUH4uAWotuGu,True,0,97,1,0.5,0.638,6,-4.007,0,0.0756,0.66,0,0.366,0.698,81.145,224880,4
2021-01-23,98,Midnight Sky,Miley Cyrus,2sXydP9vPEYUH4uAWotuGu,False,71,14,20,0.705,0.814,4,-5.466,0,0.0346,0.00115,0.00312,0.203,0.259,110.0,223279,4
2021-01-23,99,Moonwalking In Calabasas,DDG,2sXydP9vPEYUH4uAWotuGu,False,82,82,3,0.928,0.341,11,-10.196,0,0.103,0.0614,0,0.162,0.745,129.966,170233,4
2021-01-23,100,Buss It,Erica Banks,78xj07VVFK5uHTaGPIu13S,True,0,100,1,0.956,0.502,9,-5.995,1,0.213,0.0593,0,0.238,0.795,110.003,187000,4
