date,position,title,artist,spotify_id,is_new,last_pos,peak_pos,weeks,danceability,energy,key,loudness,mode,speechiness,acousticness,instrumentalness,liveness,valence,tempo,duration_ms,time_signature
2006-08-26,1,London Bridge,Fergie,1qHRFZE8qykNXYZadzmi1m,False,1,1,4,0.769,0.609,1,-5.894,1,0.357,0.216,0,0.166,0.633,90.951,241307,4
2006-08-26,2,Crazy,Gnarls Barkley,1qHRFZE8qykNXYZadzmi1m,False,2,2,15,0.835,0.741,8,-1.609,1,0.0339,0.0172,0.0577,0.0826,0.612,111.963,182066,4
2006-08-26,3,Promiscuous,Nelly Furtado Featuring Timbaland,1qHRFZE8qykNXYZadzmi1m,False,3,1,15,0.795,0.978,10,-6.097,0,0.0459,0.046,8.29e-05,0.143,0.843,114.321,242200,4
2006-08-26,4,Me & U,Cassie,1qHRFZE8qykNXYZadzmi1m,False,4,3,18,0.803,0.454,8,-4.802,0,0.0294,0.352,0,0.0655,0.739,99.99,192213,4
2006-08-26,5,Buttons,The Pussycat Dolls Featuring Snoop Dogg,1qHRFZE8qykNXYZadzmi1m,False,5,4,14,0.57,0.821,2,-4.38,1,0.267,0.178,0,0.289,0.408,210.857,225560,4
2006-08-26,6,(When You Gonna) Give It Up To Me,Sean Paul Feat. Keyshia Cole,1qHRFZE8qykNXYZadzmi1m,False,7,6,12,0.951,0.6,0,-4.675,0,0.0685,0.106,0,0.0712,0.822,125.04,218573,4
2006-08-26,7,I Write Sins Not Tragedies,Panic! At The Disco,1qHRFZE8qykNXYZadzmi1m,False,10,7,24,0.569,0.83,9,-4.106,0,0.14,0.0807,0,0.114,0.609,170.094,186635,4
2006-08-26,8,Ain't No Other Man,Christina Aguilera,1qHRFZE8qykNXYZadzmi1m,False,8,6,10,0.862,0.742,7,-4.722,1,0.222,0.00376,0.00855,0.103,0.511,127.91,228907,4
2006-08-26,9,Sexy Love,Ne-Yo,1qHRFZE8qykNXYZadzmi1m,False,14,9,10,0.686,0.599,8,-4.487,1,0.0512,0.311,6.41e-05,0.065,0.401,94.014,220853,4
2006-08-26,10,Shoulder Lean,Young Dro Featuring T.I.,1qHRFZE8qykNXYZadzmi1m,False,12,10,11,0.7,0.518,4,-7.191,0,0.177,0.0471,0,0.1,0.542,75.973,258680,4
2006-08-26,11,Over My Head (Cable Car),The Fray,1qHRFZE8qykNXYZadzmi1m,False,11,8,27,0.592,0.729,8,-4.156,1,0.0448,0.022,0,0.0653,0.709,116.03,236267,4
2006-08-26,12,Deja Vu,Beyonce Featuring Jay Z,1qHRFZE8qykNXYZadzmi1m,False,6,4,9,0.644,0.746,7,-4.941,1,0.341,0.0071,1.22e-05,0.0743,0.355,105.253,240280,4
2006-08-26,13,U And Dat,E-40 Featuring T-Pain & Kandi Girl,1qHRFZE8qykNXYZadzmi1m,False,18,13,14,0.858,0.484,6,-7.448,0,0.277,0.0241,1.8e-06,0.123,0.329,99.992,202720,4
2006-08-26,14,Do It To It,Cherish Featuring Sean Paul Of The YoungBloodZ,1qHRFZE8qykNXYZadzmi1m,False,17,13,15,0.826,0.67,2,-5.559,1,0.169,0.00798,0,0.495,0.794,74.007,226293,4
2006-08-26,15,It's Goin' Down,Yung Joc,1qHRFZE8qykNXYZadzmi1m,False,9,3,20,0.888,0.577,1,-7.702,0,0.0612,0.0986,0,0.131,0.609,84.003,241840,4
2006-08-26,16,Unfaithful,Rihanna,1qHRFZE8qykNXYZadzmi1m,False,13,6,16,0.588,0.391,0,-8.607,0,0.0334,0.839,0,0.227,0.349,144.069,226973,4
2006-08-26,17,Hips Don't Lie,Shakira Featuring Wyclef Jean,1qHRFZE8qykNXYZadzmi1m,False,15,1,22,0.778,0.824,10,-5.892,0,0.0712,0.284,0,0.405,0.756,100.024,218093,4
2006-08-26,18,Bossy,Kelis Featuring Too $hort,1qHRFZE8qykNXYZadzmi1m,False,19,16,15,0.906,0.624,4,-5.556,1,0.179,0.000185,6.21e-06,0.0608,0.775,84.009,274947,4
2006-08-26,19,Snap Yo Fingers,Lil Jon Featuring E-40 & Sean Paul Of The YoungBloodZ,1qHRFZE8qykNXYZadzmi1m,False,16,7,21,0.835,0.757,8,-5.029,0,0.23,0.00647,0,0.29,0.626,82.038,274387,4
2006-08-26,20,Pullin' Me Back,Chingy Featuring Tyrese,1qHRFZE8qykNXYZadzmi1m,False,25,20,9,0.786,0.511,7,-6.66,1,0.286,0.0825,0,0.12,0.587,80.0,234133,4
2006-08-26,21,Get Up,Ciara Featuring Chamillionaire,1qHRFZE8qykNXYZadzmi1m,False,80,21,3,0.964,0.595,1,-6.887,0,0.109,0.0248,5.14e-06,0.0405,0.629,128.593,261880,4
2006-08-26,22,I Know You See It,Yung Joc Featuring Brandy 'Ms. B.' Hambrick,1qHRFZE8qykNXYZadzmi1m,False,26,22,7,0.744,0.368,1,-6.349,1,0.0524,0.0702,0,0.192,0.391,84.018,241307,4
2006-08-26,23,Far Away,Nickelback,1qHRFZE8qykNXYZadzmi1m,False,29,23,4,0.518,0.797,6,-5.153,1,0.0309,0.000681,0,0.107,0.293,132.918,238173,4
2006-08-26,24,A Public Affair,Jessica Simpson,1qHRFZE8qykNXYZadzmi1m,False,20,14,7,0.735,0.86,11,-3.878,0,0.0339,0.00525,0.000192,0.404,0.835,124.052,201467,4
2006-08-26,25,Move Along,The All-American Rejects,1qHRFZE8qykNXYZadzmi1m,False,21,15,29,0.518,0.916,3,-3.858,1,0.0454,0.000148,0,0.291,0.646,109.864,238880,4
2006-08-26,26,Dani California,Red Hot Chili Peppers,1qHRFZE8qykNXYZadzmi1m,False,23,6,19,0.556,0.913,0,-2.36,1,0.0437,0.0193,8.59e-06,0.346,0.73,96.184,282160,4
2006-08-26,27,So What,Field Mob Featuring Ciara,1qHRFZE8qykNXYZadzmi1m,False,22,10,19,0.931,0.486,6,-10.558,1,0.139,0.0579,0,0.161,0.896,120.026,216000,4
2006-08-26,28,Ridin',Chamillionaire Featuring Krayzie Bone,1qHRFZE8qykNXYZadzmi1m,False,24,1,26,0.787,0.799,8,-4.68,0,0.0993,0.189,0,0.3,0.835,143.052,303053,4
2006-08-26,29,When You Were Young,The Killers,70wYA8oYHoMzhRRkARoMhU,True,0,29,1,0.467,0.988,11,-3.313,1,0.112,0.000152,0.0484,0.28,0.321,130.433,220427,4
2006-08-26,30,Black Horse & The Cherry Tree,KT Tunstall,70wYA8oYHoMzhRRkARoMhU,False,27,20,23,0.748,0.786,4,-7.788,0,0.0641,0.328,0,0.34,0.917,104.833,172373,4
2006-08-26,31,Chasing Cars,Snow Patrol,70wYA8oYHoMzhRRkARoMhU,False,35,31,13,0.563,0.592,9,-4.571,1,0.0276,0.209,5.08e-05,0.132,0.136,104.016,267933,4
2006-08-26,32,Bad Day,Daniel Powter,70wYA8oYHoMzhRRkARoMhU,False,28,1,27,0.599,0.785,3,-4.013,1,0.0309,0.448,0.00336,0.151,0.52,140.046,233640,4
2006-08-26,33,About Us,Brooke Hogan Featuring Paul Wall,70wYA8oYHoMzhRRkARoMhU,False,53,33,2,0.805,0.796,1,-3.904,0,0.262,0.209,0,0.311,0.699,83.339,203347,4
2006-08-26,34,Savin' Me,Nickelback,70wYA8oYHoMzhRRkARoMhU,False,31,19,24,0.441,0.815,3,-4.088,1,0.0276,0.000731,0,0.414,0.522,164.007,219320,4
2006-08-26,35,SexyBack,Justin Timberlake,70wYA8oYHoMzhRRkARoMhU,False,52,35,6,0.967,0.583,7,-5.562,0,0.0789,0.0584,0,0.0519,0.964,117.0,242733,4
2006-08-26,36,If You're Going Through Hell (Before The Devil Even Knows),Rodney Atkins,70wYA8oYHoMzhRRkARoMhU,False,33,33,13,0.625,0.848,2,-4.008,1,0.0314,0.105,0,0.23,0.716,137.993,235427,4
2006-08-26,37,Unwritten,Natasha Bedingfield,70wYA8oYHoMzhRRkARoMhU,False,32,5,38,0.706,0.8,5,-6.333,1,0.0399,0.00584,0,0.0822,0.629,100.011,259333,4
2006-08-26,38,Leave The Pieces,The Wreckers,70wYA8oYHoMzhRRkARoMhU,False,34,34,12,0.514,0.679,6,-6.117,1,0.0273,0.0255,0,0.0594,0.496,164.109,210233,4
2006-08-26,39,Chain Hang Low,Jibbs,70wYA8oYHoMzhRRkARoMhU,False,69,39,2,0.792,0.589,4,-6.869,0,0.262,0.0259,0.000128,0.114,0.778,157.147,207587,4
2006-08-26,40,SOS,Rihanna,70wYA8oYHoMzhRRkARoMhU,False,36,1,27,0.677,0.671,7,-4.905,1,0.0361,0.004,5.07e-05,0.413,0.527,137.046,238920,4
2006-08-26,41,Brand New Girlfriend,Steve Holy,70wYA8oYHoMzhRRkARoMhU,False,46,41,9,0.669,0.861,2,-3.547,1,0.0929,0.0273,0,0.0586,0.72,133.82,220187,4
2006-08-26,42,Stars Are Blind,Paris Hilton,70wYA8oYHoMzhRRkARoMhU,False,30,18,8,0.745,0.695,2,-5.076,1,0.0271,0.00593,0,0.0615,0.519,102.014,236600,4
2006-08-26,43,What Hurts The Most,Rascal Flatts,70wYA8oYHoMzhRRkARoMhU,False,44,6,28,0.537,0.674,5,-5.134,0,0.0277,0.0088,0,0.265,0.33,136.002,214107,4
2006-08-26,44,Call On Me,Janet & Nelly,70wYA8oYHoMzhRRkARoMhU,False,38,25,8,0.714,0.67,8,-6.053,0,0.0445,0.341,1.89e-06,0.0772,0.771,82.008,204267,4
2006-08-26,45,What's Left Of Me,Nick Lachey,70wYA8oYHoMzhRRkARoMhU,False,39,6,25,0.421,0.728,7,-5.644,1,0.035,0.136,0,0.136,0.311,150.12,244667,4
2006-08-26,46,The Riddle,Five For Fighting,70wYA8oYHoMzhRRkARoMhU,False,40,40,4,0.59,0.562,10,-5.8,1,0.029,0.327,0,0.135,0.271,119.429,227027,4
2006-08-26,47,Hate Me,Blue October,70wYA8oYHoMzhRRkARoMhU,False,47,47,18,0.449,0.691,4,-5.65,0,0.0349,0.477,0,0.0966,0.201,93.267,380200,4
2006-08-26,48,Why You Wanna,T.I.,70wYA8oYHoMzhRRkARoMhU,False,37,29,18,0.802,0.772,1,-4.893,0,0.192,0.358,0,0.0603,0.654,96.046,215000,4
2006-08-26,49,Lips Of An Angel,Hinder,70wYA8oYHoMzhRRkARoMhU,False,61,49,5,0.476,0.736,2,-5.38,1,0.0343,0.0217,1.08e-06,0.203,0.251,129.084,261853,4
2006-08-26,50,Life Is A Highway,Rascal Flatts,70wYA8oYHoMzhRRkARoMhU,False,41,7,11,0.582,0.952,5,-3.848,1,0.0731,0.00324,0,0.223,0.655,103.027,276320,4
2006-08-26,51,Where'd You Go,Fort Minor Featuring Holly Brook,70wYA8oYHoMzhRRkARoMhU,False,45,4,19,0.684,0.819,1,-3.309,0,0.238,0.262,0.00197,0.113,0.25,179.999,231867,4
2006-08-26,52,S.E.X.,Lyfe Jennings,70wYA8oYHoMzhRRkARoMhU,False,65,52,4,0.501,0.468,8,-8.494,0,0.0507,0.31,2.04e-06,0.0923,0.712,105.769,198373,4
2006-08-26,53,Miss Murder,AFI,70wYA8oYHoMzhRRkARoMhU,False,55,24,15,0.308,0.873,8,-4.542,1,0.0533,0.00022,0.000729,0.0974,0.686,143.519,206587,4
2006-08-26,54,Hustlin',Rick Ross,70wYA8oYHoMzhRRkARoMhU,False,63,54,15,0.502,0.652,9,-7.224,1,0.3,0.0848,0,0.0675,0.648,136.08,254093,4
2006-08-26,55,The Diary Of Jane,Breaking Benjamin,70wYA8oYHoMzhRRkARoMhU,False,50,50,3,0.392,0.964,10,-4.441,0,0.0644,7.13e-05,0.0387,0.106,0.269,167.024,200547,4
2006-08-26,56,Gimme That,Chris Brown Featuring Lil Wayne,70wYA8oYHoMzhRRkARoMhU,False,49,15,19,0.678,0.572,11,-7.033,0,0.0466,0.00374,6.59e-05,0.118,0.444,87.165,186827,4
2006-08-26,57,Would You Go With Me,Josh Turner,70wYA8oYHoMzhRRkARoMhU,False,59,57,7,0.605,0.864,6,-5.365,1,0.0292,0.13,0.000827,0.113,0.736,122.918,228187,4
2006-08-26,58,Waiting On The World To Change,John Mayer,70wYA8oYHoMzhRRkARoMhU,False,56,21,5,0.577,0.756,2,-5.82,1,0.115,0.159,0.000232,0.249,0.663,176.75,201173,4
2006-08-26,59,Summertime,Kenny Chesney,70wYA8oYHoMzhRRkARoMhU,False,51,34,18,0.48,0.928,4,-5.501,1,0.0899,0.169,0,0.0479,0.713,167.986,206587,4
2006-08-26,60,Torn,LeToya,70wYA8oYHoMzhRRkARoMhU,False,48,31,17,0.422,0.894,11,-3.507,0,0.332,0.262,0,0.142,0.636,152.17,249253,4
2006-08-26,61,How To Save A Life,The Fray,70wYA8oYHoMzhRRkARoMhU,False,60,58,18,0.64,0.743,10,-4.08,1,0.0379,0.269,0,0.101,0.361,122.035,262533,4
2006-08-26,62,Me And My Gang,Rascal Flatts,70wYA8oYHoMzhRRkARoMhU,False,54,50,14,0.628,0.9,7,-3.719,1,0.0408,0.0775,0,0.0454,0.611,108.745,217987,4
2006-08-26,63,Bring It On Home,Little Big Town,70wYA8oYHoMzhRRkARoMhU,False,66,63,12,0.55,0.514,8,-7.348,1,0.0265,0.118,0,0.0906,0.311,138.105,260627,4
2006-08-26,64,The World,Brad Paisley,70wYA8oYHoMzhRRkARoMhU,False,58,45,17,0.446,0.947,4,-6.594,1,0.052,0.302,0.000692,0.0979,0.88,176.798,241680,4
2006-08-26,65,"Steady, As She Goes",The Raconteurs,70wYA8oYHoMzhRRkARoMhU,False,67,65,14,0.524,0.578,9,-4.563,1,0.12,0.0132,0.00921,0.108,0.537,123.669,215267,4
2006-08-26,66,Life Ain't Always Beautiful,Gary Allan,70wYA8oYHoMzhRRkARoMhU,False,62,61,15,0.481,0.508,2,-7.666,1,0.0248,0.216,0.000175,0.105,0.268,86.013,224613,4
2006-08-26,67,A Little Too Late,Toby Keith,70wYA8oYHoMzhRRkARoMhU,False,57,53,13,0.635,0.749,11,-5.815,1,0.0294,0.175,3.71e-05,0.139,0.628,100.95,248040,4
2006-08-26,68,Animal I Have Become,Three Days Grace,70wYA8oYHoMzhRRkARoMhU,False,72,60,13,0.553,0.853,8,-3.668,1,0.0339,0.000684,0,0.126,0.506,122.023,231400,4
2006-08-26,69,Crazy Bitch,Buckcherry,70wYA8oYHoMzhRRkARoMhU,False,73,59,15,0.661,0.978,1,-3.064,0,0.107,0.0247,0,0.0856,0.592,98.019,204960,4
2006-08-26,70,Gallery,Mario Vazquez,70wYA8oYHoMzhRRkARoMhU,False,82,70,4,0.593,0.651,9,-6.904,0,0.135,0.0169,0,0.141,0.323,86.535,223613,4
2006-08-26,71,Through Glass,Stone Sour,70wYA8oYHoMzhRRkARoMhU,False,87,71,2,0.545,0.753,3,-4.618,0,0.036,0.0417,0,0.389,0.434,105.754,282947,4
2006-08-26,72,I Love My B****,Busta Rhymes Featuring will.i.am & Kelis,70wYA8oYHoMzhRRkARoMhU,False,68,41,12,0.604,0.808,0,-5.805,0,0.314,0.0297,0,0.0493,0.688,193.894,227667,4
2006-08-26,73,Sunshine And Summertime,Faith Hill,70wYA8oYHoMzhRRkARoMhU,False,78,73,5,0.638,0.807,1,-6.489,1,0.032,0.0731,0,0.0594,0.778,118.997,207173,4
2006-08-26,74,Doing Too Much,Paula DeAnda Featuring Baby Bash,70wYA8oYHoMzhRRkARoMhU,False,64,41,15,0.716,0.668,2,-5.136,1,0.083,0.279,0,0.337,0.744,141.006,247431,4
2006-08-26,75,I Loved Her First,Heartland,0vZvEE9c2bmA6H8hVKxXEZ,True,0,75,1,0.405,0.384,4,-6.508,1,0.0263,0.3,0,0.106,0.176,137.492,212880,3
2006-08-26,76,Invisible,Ashlee Simpson,0vZvEE9c2bmA6H8hVKxXEZ,False,42,21,4,0.558,0.84,2,-2.852,1,0.0606,0.115,0,0.0866,0.725,168.36,224627,4
2006-08-26,77,Building Bridges,Brooks & Dunn With Sheryl Crow & Vince Gill,0vZvEE9c2bmA6H8hVKxXEZ,False,85,77,4,0.677,0.77,9,-4.245,1,0.0255,0.00717,1.04e-05,0.0425,0.686,105.009,262867,4
2006-08-26,78,Breathe (2 AM),Anna Nalick,0vZvEE9c2bmA6H8hVKxXEZ,False,77,45,33,0.386,0.452,2,-7.715,1,0.0278,0.417,0,0.0881,0.287,169.837,279827,3
2006-08-26,79,Say Goodbye,Chris Brown,5F7IJrXD6Fa3EmqoYE0gU4,True,0,79,1,0.8,0.502,1,-6.062,1,0.0371,0.00167,0,0.0784,0.388,115.091,289760,4
2006-08-26,80,Don't Forget To Remember Me,Carrie Underwood,5F7IJrXD6Fa3EmqoYE0gU4,False,74,49,17,0.434,0.608,2,-4.281,1,0.0311,0.564,0,0.283,0.331,78.606,240267,4
2006-08-26,81,Stay With You,Goo Goo Dolls,5F7IJrXD6Fa3EmqoYE0gU4,False,75,51,18,0.433,0.868,0,-3.03,1,0.0422,0.00127,2.87e-06,0.132,0.41,139.896,236267,4
2006-08-26,82,Swing,Trace Adkins,5F7IJrXD6Fa3EmqoYE0gU4,False,79,76,8,0.584,0.857,2,-5.103,1,0.033,0.00416,0.000896,0.276,0.742,108.027,216707,4
2006-08-26,83,MakeDamnSure,Taking Back Sunday,5F7IJrXD6Fa3EmqoYE0gU4,False,70,48,17,0.553,0.837,6,-5.608,1,0.0452,0.00941,0,0.372,0.432,140.495,208280,4
2006-08-26,84,Put Your Records On,Corinne Bailey Rae,5F7IJrXD6Fa3EmqoYE0gU4,False,84,74,7,0.739,0.511,9,-7.844,1,0.0362,0.167,1.34e-06,0.133,0.542,96.038,215360,4
2006-08-26,85,Entourage,Omarion,3up3fJWzT9VXVmPWuALqed,True,0,85,1,0.831,0.79,5,-1.578,0,0.039,0.0404,0,0.122,0.937,106.491,235067,4
2006-08-26,86,The Kill (Bury Me),30 Seconds To Mars,3up3fJWzT9VXVmPWuALqed,False,81,81,4,0.179,0.912,4,-3.881,0,0.0791,0.0014,0.000294,0.582,0.289,182.99,231533,3
2006-08-26,87,Enough Cryin,Mary J. Blige Featuring Brook-Lyn,3up3fJWzT9VXVmPWuALqed,False,76,32,19,0.784,0.587,9,-6.698,1,0.364,0.125,0.000101,0.0358,0.623,96.842,260893,4
2006-08-26,88,I Call It Love,Lionel Richie,3up3fJWzT9VXVmPWuALqed,False,89,88,4,0.681,0.753,8,-4.082,1,0.107,0.459,0,0.114,0.578,91.993,198427,4
2006-08-26,89,Suddenly I See,KT Tunstall,3up3fJWzT9VXVmPWuALqed,False,71,71,5,0.587,0.767,0,-5.713,1,0.0449,0.225,0,0.112,0.664,100.38,201707,4
2006-08-26,90,Give It Away,George Strait,3up3fJWzT9VXVmPWuALqed,False,99,90,2,0.674,0.646,5,-5.876,1,0.027,0.486,8.37e-05,0.262,0.613,148.1,209320,4
2006-08-26,91,Yee Haw,Jake Owen,3up3fJWzT9VXVmPWuALqed,False,86,83,7,0.672,0.934,7,-3.322,1,0.0333,0.0956,0,0.109,0.948,129.123,172507,4
2006-08-26,92,Everytime Tha Beat Drop,Monica Featuring Dem Franchize Boyz,3up3fJWzT9VXVmPWuALqed,False,94,92,2,0.762,0.644,7,-6.715,1,0.223,0.0522,0,0.0821,0.82,81.99,223293,4
2006-08-26,93,Not Ready To Make Nice,Dixie Chicks,3up3fJWzT9VXVmPWuALqed,False,91,23,16,0.425,0.554,6,-4.145,1,0.0298,0.134,8.56e-05,0.0963,0.288,83.917,237297,4
2006-08-26,94,Face Down,The Red Jumpsuit Apparatus,3up3fJWzT9VXVmPWuALqed,False,83,76,4,0.545,0.932,7,-2.189,0,0.0399,0.000665,0,0.127,0.464,92.956,192000,4
2006-08-26,95,Every Mile A Memory,Dierks Bentley,4g1KdhosR6v8qCT1F1Njev,True,0,95,1,0.452,0.703,2,-4.903,1,0.0356,0.0803,0.00131,0.162,0.392,177.915,232720,4
2006-08-26,96,Money Maker,Ludacris Featuring Pharrell,2JpUkUR0OsOlUUfm6iS8ic,True,0,96,1,0.551,0.598,1,-6.79,1,0.27,0.15,0,0.299,0.612,78.756,230613,4
2006-08-26,97,When The Stars Go Blue,Tim McGraw,2JpUkUR0OsOlUUfm6iS8ic,False,90,37,20,0.445,0.682,10,-6.686,1,0.0289,0.357,7.28e-06,0.109,0.631,181.64,235280,4
2006-08-26,98,Every Time I Hear Your Name,Keith Anderson,2JpUkUR0OsOlUUfm6iS8ic,False,92,64,19,0.562,0.757,1,-3.945,1,0.0253,0.277,0,0.0745,0.299,93.02,263027,4
2006-08-26,99,Need A Boss,Shareefa Featuring Ludacris,2JpUkUR0OsOlUUfm6iS8ic,False,93,91,3,0.684,0.797,0,-5.406,0,0.361,0.0457,3.72e-06,0.275,0.565,84.012,234813,4
2006-08-26,100,That Girl,Frankie J Featuring Mannie Fresh & Chamillionaire,5IKzScUFi0CLcVXnB1vb7k,True,0,100,1,0.662,0.745,6,-5.626,0,0.172,0.206,0,0.174,0.569,170.138,239293,4
