date,position,title,artist,spotify_id,is_new,last_pos,peak_pos,weeks,danceability,energy,key,loudness,mode,speechiness,acousticness,instrumentalness,liveness,valence,tempo,duration_ms,time_signature
2020-05-02,1,Blinding Lights,The Weeknd,78qd8dvwea0Gosb6Fe6j3k,False,1,1,21,0.514,0.73,1,-5.934,1,0.0598,0.00146,9.54e-05,0.0897,0.334,171.005,200040,4
2020-05-02,2,Toosie Slide,Drake,78qd8dvwea0Gosb6Fe6j3k,False,2,1,3,0.834,0.454,1,-9.75,0,0.201,0.321,6.15e-06,0.114,0.837,81.618,247059,4
2020-05-02,3,The Box,Roddy Ricch,78qd8dvwea0Gosb6Fe6j3k,False,3,1,20,0.896,0.586,10,-6.687,0,0.0559,0.104,0,0.79,0.642,116.971,196653,4
2020-05-02,4,Don't Start Now,Dua Lipa,78qd8dvwea0Gosb6Fe6j3k,False,4,2,25,0.794,0.793,11,-4.521,0,0.0842,0.0125,0,0.0952,0.677,123.941,183290,4
2020-05-02,5,Say So,Doja Cat Featuring Nicki Minaj,78qd8dvwea0Gosb6Fe6j3k,False,5,5,16,0.787,0.673,11,-4.577,0,0.158,0.256,3.57e-06,0.0904,0.786,110.962,237893,4
2020-05-02,6,Circles,Post Malone,78qd8dvwea0Gosb6Fe6j3k,False,7,1,34,0.695,0.762,0,-3.497,1,0.0395,0.192,0.00244,0.0863,0.553,120.042,215280,4
2020-05-02,7,Adore You,Harry Styles,78qd8dvwea0Gosb6Fe6j3k,False,6,6,20,0.676,0.771,8,-3.675,1,0.0483,0.0237,7e-06,0.102,0.569,99.048,207133,4
2020-05-02,8,Intentions,Justin Bieber Featuring Quavo,78qd8dvwea0Gosb6Fe6j3k,False,9,8,11,0.813,0.554,9,-6.631,1,0.0544,0.315,0,0.105,0.86,148.011,212869,4
2020-05-02,9,Rockstar,DaBaby Featuring Roddy Ricch,7ytR5pFWmSjzHJIeQkgog4,True,0,9,1,0.746,0.69,11,-7.956,1,0.164,0.247,0,0.101,0.497,89.977,181733,4
2020-05-02,10,Life Is Good,Future Featuring Drake,7ytR5pFWmSjzHJIeQkgog4,False,8,2,15,0.676,0.609,2,-5.831,0,0.481,0.0706,0,0.152,0.508,142.037,237735,4
2020-05-02,11,Everything I Wanted,Billie Eilish,7ytR5pFWmSjzHJIeQkgog4,False,10,8,24,0.704,0.225,6,-14.454,0,0.0994,0.902,0.657,0.106,0.243,120.006,245426,4
2020-05-02,12,My Oh My,Camila Cabello Featuring DaBaby,7ytR5pFWmSjzHJIeQkgog4,False,12,12,20,0.724,0.491,8,-6.024,1,0.0296,0.018,1.29e-05,0.0887,0.383,105.046,170746,4
2020-05-02,13,The Bones,Maren Morris,7ytR5pFWmSjzHJIeQkgog4,False,13,12,31,0.612,0.57,11,-6.642,0,0.0347,0.278,0,0.0963,0.334,77.002,197293,4
2020-05-02,14,Savage,Megan Thee Stallion,7ytR5pFWmSjzHJIeQkgog4,False,14,14,6,0.822,0.743,10,-4.772,0,0.28,0.016,0,0.127,0.636,84.459,242001,4
2020-05-02,15,Someone You Loved,Lewis Capaldi,7ytR5pFWmSjzHJIeQkgog4,False,11,1,50,0.501,0.405,1,-5.679,1,0.0319,0.751,0,0.105,0.446,109.891,182161,4
2020-05-02,16,I Hope,Gabby Barrett Featuring Charlie Puth,7ytR5pFWmSjzHJIeQkgog4,False,17,16,17,0.466,0.536,6,-6.227,1,0.0429,0.0951,0,0.114,0.377,75.998,210773,4
2020-05-02,17,Jump,DaBaby Featuring YoungBoy Never Broke Again,0oT9ElXYSxvnOOagP9efDq,True,0,17,1,0.896,0.72,0,-6.262,0,0.355,0.169,0,0.252,0.966,140.1,212093,4
2020-05-02,18,Memories,Maroon 5,0oT9ElXYSxvnOOagP9efDq,False,15,2,31,0.764,0.32,11,-7.209,1,0.0546,0.837,0,0.0822,0.575,91.019,189486,4
2020-05-02,19,Blueberry Faygo,Lil Mosey,0oT9ElXYSxvnOOagP9efDq,False,16,16,11,0.774,0.554,0,-7.909,1,0.0383,0.207,0,0.132,0.349,99.034,162547,4
2020-05-02,20,Nobody But You,Blake Shelton Duet With Gwen Stefani,0oT9ElXYSxvnOOagP9efDq,False,18,18,15,0.463,0.653,0,-5.515,1,0.0273,0.111,0.000136,0.172,0.233,143.912,194867,4
2020-05-02,21,Chasin' You,Morgan Wallen,0oT9ElXYSxvnOOagP9efDq,False,25,21,13,0.631,0.591,7,-5.785,1,0.0277,0.657,0,0.11,0.489,97.074,205453,4
2020-05-02,22,Roses,SAINt JHN,0oT9ElXYSxvnOOagP9efDq,False,26,22,5,0.769,0.719,8,-5.472,1,0.0474,0.0143,0.00777,0.359,0.863,121.955,176867,4
2020-05-02,23,Falling,Trevor Daniel,0oT9ElXYSxvnOOagP9efDq,False,22,22,23,0.785,0.431,10,-8.756,0,0.0364,0.123,0,0.0887,0.236,127.085,159382,4
2020-05-02,24,Hot Girl Bummer,blackbear,0oT9ElXYSxvnOOagP9efDq,False,20,11,32,0.782,0.559,6,-7.106,0,0.0767,0.125,0,0.385,0.685,129.992,188344,1
2020-05-02,25,High Fashion,Roddy Ricch Featuring Mustard,0oT9ElXYSxvnOOagP9efDq,False,29,20,17,0.831,0.499,11,-8.442,0,0.114,0.269,0,0.3,0.511,97.956,220487,4
2020-05-02,26,Roxanne,Arizona Zervas,0oT9ElXYSxvnOOagP9efDq,False,19,4,25,0.621,0.601,6,-5.616,0,0.148,0.0522,0,0.46,0.457,116.735,163636,5
2020-05-02,27,Death Bed,Powfu Featuring beabadoobee,0oT9ElXYSxvnOOagP9efDq,False,30,27,6,0.726,0.431,8,-8.765,0,0.135,0.731,0,0.696,0.348,144.026,173333,4
2020-05-02,28,Heartless,The Weeknd,0oT9ElXYSxvnOOagP9efDq,False,21,1,22,0.538,0.751,10,-5.487,0,0.128,0.0194,1.42e-06,0.145,0.244,169.985,198267,4
2020-05-02,29,Heart On Ice,Rod Wave,0oT9ElXYSxvnOOagP9efDq,False,28,25,24,0.733,0.389,10,-8.468,0,0.0738,0.0513,0,0.141,0.244,157.878,159670,3
2020-05-02,30,More Hearts Than Mine,Ingrid Andress,0oT9ElXYSxvnOOagP9efDq,False,32,30,17,0.375,0.428,0,-7.387,1,0.029,0.109,0,0.105,0.361,78.516,214787,4
2020-05-02,31,Dance Monkey,Tones And I,0oT9ElXYSxvnOOagP9efDq,False,24,4,29,0.824,0.588,6,-6.4,0,0.0924,0.692,0.000104,0.149,0.513,98.027,209438,4
2020-05-02,32,Ballin',Mustard & Roddy Ricch,0oT9ElXYSxvnOOagP9efDq,False,27,11,40,0.809,0.545,7,-6.678,1,0.0735,0.392,0,0.151,0.244,97.008,180435,4
2020-05-02,33,Find My Way,DaBaby,0oT9ElXYSxvnOOagP9efDq,False,51,22,3,0.836,0.624,4,-6.75,0,0.184,0.187,0,0.138,0.7,103.0,139890,4
2020-05-02,34,RITMO (Bad Boys For Life),Black Eyed Peas X J Balvin,0oT9ElXYSxvnOOagP9efDq,False,31,26,22,0.721,0.716,10,-7.037,0,0.0657,0.0334,0.00084,0.237,0.667,104.994,221714,4
2020-05-02,35,@ MEH,Playboi Carti,15JRvf02KKGHKgC31jrpuh,True,0,35,1,0.764,0.512,1,-6.814,1,0.3,0.00158,0,0.0899,0.586,81.541,118500,4
2020-05-02,36,I'm Ready,Sam Smith & Demi Lovato,6GJNINiIzgBRz1OWNpfU9c,True,0,36,1,0.501,0.664,10,-6.339,1,0.0402,0.00418,2.54e-05,0.284,0.125,155.072,200838,4
2020-05-02,37,Whats Poppin,"Jack Harlow Featuring DaBaby, Tory Lanez & Lil Wayne",6GJNINiIzgBRz1OWNpfU9c,False,36,36,11,0.904,0.723,11,-5.224,0,0.26,0.0631,0,0.185,0.835,145.013,227478,4
2020-05-02,38,Sunday Best,Surfaces,6GJNINiIzgBRz1OWNpfU9c,False,38,38,8,0.878,0.525,5,-6.832,1,0.0578,0.183,0,0.0714,0.694,112.022,158571,4
2020-05-02,39,Break My Heart,Dua Lipa,6GJNINiIzgBRz1OWNpfU9c,False,35,21,4,0.73,0.729,4,-3.434,0,0.0883,0.167,1.39e-06,0.349,0.467,113.013,221820,4
2020-05-02,40,Does To Me,Luke Combs Featuring Eric Church,6GJNINiIzgBRz1OWNpfU9c,False,48,40,6,0.616,0.849,0,-4.897,1,0.0373,0.311,0,0.311,0.638,113.065,223320,4
2020-05-02,41,"10,000 Hours",Dan + Shay & Justin Bieber,6GJNINiIzgBRz1OWNpfU9c,False,34,4,29,0.654,0.63,10,-4.644,1,0.0259,0.153,0,0.111,0.43,89.991,167693,4
2020-05-02,42,I Love Me,Demi Lovato,6GJNINiIzgBRz1OWNpfU9c,False,41,18,7,0.664,0.561,6,-7.031,1,0.0495,0.00261,0,0.0764,0.713,150.093,203672,4
2020-05-02,43,BOP,DaBaby,6GJNINiIzgBRz1OWNpfU9c,False,39,11,30,0.769,0.787,11,-3.909,1,0.367,0.189,0,0.129,0.836,126.77,159715,4
2020-05-02,44,PICK UP,DaBaby Featuring Quavo,5gNOINI5dXZVom2b36LMOd,True,0,44,1,0.915,0.612,1,-4.535,1,0.407,0.0944,0,0.115,0.758,129.93,118547,4
2020-05-02,45,Level Of Concern,twenty one pilots,5gNOINI5dXZVom2b36LMOd,False,23,23,2,0.754,0.583,4,-7.34,0,0.0432,0.32,0.00015,0.144,0.77,122.012,220051,4
2020-05-02,46,Stupid Love,Lady Gaga,5gNOINI5dXZVom2b36LMOd,False,33,5,8,0.68,0.825,8,-4.296,1,0.0702,0.00173,0.000122,0.27,0.784,117.987,193533,4
2020-05-02,47,I Hope You're Happy Now,Carly Pearce & Lee Brice,5gNOINI5dXZVom2b36LMOd,False,42,42,16,0.591,0.815,10,-4.725,1,0.0366,0.168,8.68e-06,0.142,0.306,118.024,198689,4
2020-05-02,48,No Guidance,Chris Brown Featuring Drake,5gNOINI5dXZVom2b36LMOd,False,40,5,46,0.696,0.454,1,-6.756,0,0.153,0.123,0,0.155,0.136,92.928,260640,4
2020-05-02,49,Hard To Forget,Sam Hunt,5gNOINI5dXZVom2b36LMOd,False,49,40,4,0.689,0.689,4,-5.517,1,0.045,0.23,0,0.57,0.664,130.069,204760,4
2020-05-02,50,NASTY,DaBaby Featuring Ashanti & Megan Thee Stallion,3oHiR89Y8gn6xt3YGAAzFj,True,0,50,1,0.768,0.635,10,-4.925,1,0.15,0.0289,0,0.312,0.64,160.992,215053,4
2020-05-02,51,Beer Can't Fix,Thomas Rhett Featuring Jon Pardi,3oHiR89Y8gn6xt3YGAAzFj,False,44,44,6,0.711,0.774,7,-4.068,1,0.0308,0.0317,0,0.124,0.939,111.016,209733,4
2020-05-02,52,Catch,Brett Young,3oHiR89Y8gn6xt3YGAAzFj,False,37,29,13,0.566,0.765,2,-6.337,1,0.0439,0.0248,0,0.0783,0.604,156.036,196440,4
2020-05-02,53,LIGHTSKIN SH*T,DaBaby Featuring Future & jetsonmade,16oi4OiKmkO51l60F5R9kR,True,0,53,1,0.932,0.578,9,-4.478,1,0.366,0.115,0,0.115,0.623,129.991,111173,4
2020-05-02,54,Dior,Pop Smoke,16oi4OiKmkO51l60F5R9kR,False,46,30,10,0.548,0.805,7,-5.732,1,0.351,0.212,0.000389,0.408,0.648,142.094,216387,4
2020-05-02,55,In Your Eyes,The Weeknd,16oi4OiKmkO51l60F5R9kR,False,45,16,5,0.667,0.721,7,-5.349,0,0.033,0.00248,6.24e-05,0.0753,0.703,100.018,237522,4
2020-05-02,56,After A Few,Travis Denning,16oi4OiKmkO51l60F5R9kR,False,55,55,4,0.617,0.849,10,-4.316,0,0.0355,0.0146,0,0.194,0.695,106.998,213493,4
2020-05-02,57,Before You Go,Lewis Capaldi,16oi4OiKmkO51l60F5R9kR,False,57,57,12,0.459,0.575,3,-4.858,1,0.0573,0.604,0,0.0885,0.183,111.881,215107,4
2020-05-02,58,Slide,H.E.R. Featuring YG,16oi4OiKmkO51l60F5R9kR,False,43,43,18,0.827,0.469,10,-9.141,0,0.341,0.0807,8.12e-06,0.207,0.196,97.028,238321,4
2020-05-02,59,Supalonely,BENEE Featuring Gus Dapperton,16oi4OiKmkO51l60F5R9kR,False,58,58,6,0.863,0.631,7,-4.689,1,0.0534,0.305,3.04e-05,0.123,0.817,128.977,223480,4
2020-05-02,60,Sum 2 Prove,Lil Baby,16oi4OiKmkO51l60F5R9kR,False,53,16,15,0.823,0.552,4,-7.57,0,0.324,0.0174,0,0.122,0.418,124.038,205760,4
2020-05-02,61,More Than My Hometown,Morgan Wallen,5OELUCYgOHKFAvCERnAvfS,True,0,61,1,0.62,0.869,6,-5.479,1,0.0462,0.615,0,0.131,0.597,126.019,216573,4
2020-05-02,62,BEST ON EARTH,Russ & BIA,5OELUCYgOHKFAvCERnAvfS,False,52,46,20,0.846,0.748,5,-3.512,0,0.078,0.188,0,0.093,0.597,90.006,160720,4
2020-05-02,63,CAN'T STOP,DaBaby,57crda5Lx9OVaYCzb4Wrnd,True,0,63,1,0.732,0.707,11,-5.849,0,0.304,0.0348,0,0.399,0.832,140.04,168373,4
2020-05-02,64,BLAME IT ON BABY,DaBaby,0jWm0VyD8p3MrSInczpows,True,0,64,1,0.875,0.687,9,-5.734,1,0.387,0.236,0,0.141,0.864,109.791,125907,4
2020-05-02,65,Walk Em Down,NLE Choppa Featuring Roddy Ricch,0jWm0VyD8p3MrSInczpows,False,60,57,5,0.867,0.744,2,-5.171,1,0.227,0.268,0,0.0713,0.645,84.005,173288,4
2020-05-02,66,Godzilla,Eminem Featuring Juice WRLD,0jWm0VyD8p3MrSInczpows,False,56,3,14,0.808,0.745,10,-5.26,0,0.342,0.145,0,0.292,0.829,165.995,210800,4
2020-05-02,67,Heartless,Diplo Presents Thomas Wesley Featuring Morgan Wallen,0jWm0VyD8p3MrSInczpows,False,68,65,13,0.765,0.556,11,-6.417,1,0.0512,0.275,0,0.0824,0.274,111.033,169227,4
2020-05-02,68,Yo Perreo Sola,Bad Bunny,0jWm0VyD8p3MrSInczpows,False,62,53,6,0.86,0.758,11,-5.16,1,0.0695,0.021,6.54e-05,0.344,0.453,97.014,172127,4
2020-05-02,69,SAD SHIT,DaBaby,6ChpgWt7s2ksM1Y3l0D9sk,True,0,69,1,0.835,0.466,6,-8.949,0,0.391,0.195,0,0.372,0.562,124.885,217467,4
2020-05-02,70,Tusa,Karol G & Nicki Minaj,6ChpgWt7s2ksM1Y3l0D9sk,False,69,42,21,0.803,0.715,2,-3.28,1,0.298,0.295,0.000134,0.0574,0.574,101.085,200960,4
2020-05-02,71,DROP,DaBaby Featuring A Boogie Wit da Hoodie & London On Da Track,5rFGVn8fCFjnRwCebW0XbS,True,0,71,1,0.833,0.589,9,-6.384,0,0.231,0.121,0,0.299,0.536,96.455,149613,4
2020-05-02,72,Out West,JACKBOYS Featuring Young Thug,5rFGVn8fCFjnRwCebW0XbS,False,71,38,15,0.802,0.591,8,-4.895,1,0.225,0.0104,0,0.196,0.309,139.864,157712,4
2020-05-02,73,Slow Dance In A Parking Lot,Jordan Davis,5rFGVn8fCFjnRwCebW0XbS,False,50,37,16,0.523,0.837,7,-4.494,1,0.0335,0.301,0,0.172,0.523,82.006,193929,4
2020-05-02,74,TALK ABOUT IT,DaBaby,3QSLoxRguKgK0knOG7EGyn,True,0,74,1,0.951,0.638,1,-5.614,1,0.308,0.00206,0,0.113,0.439,123.948,159093,4
2020-05-02,75,Believe It,PARTYNEXTDOOR & Rihanna,3QSLoxRguKgK0knOG7EGyn,False,61,23,4,0.43,0.7,6,-5.35,1,0.264,0.0902,0,0.216,0.731,158.373,183219,4
2020-05-02,76,P*$$y Fairy (OTW),Jhene Aiko,3QSLoxRguKgK0knOG7EGyn,False,70,40,14,0.572,0.519,2,-7.092,0,0.212,0.536,0,0.102,0.35,128.331,181860,4
2020-05-02,77,If The World Was Ending,JP Saxe Featuring Julia Michaels,3QSLoxRguKgK0knOG7EGyn,False,73,73,4,0.464,0.473,1,-10.086,1,0.129,0.866,0,0.109,0.604,75.801,208687,4
2020-05-02,78,Turks,"NAV, Gunna & Travis Scott",3QSLoxRguKgK0knOG7EGyn,False,63,17,4,0.893,0.618,7,-4.425,0,0.112,0.0827,0,0.542,0.389,119.099,161377,4
2020-05-02,79,Come Thru,Summer Walker & Usher,3QSLoxRguKgK0knOG7EGyn,False,66,42,17,0.679,0.728,5,-3.092,0,0.154,0.159,0,0.107,0.46,152.001,181013,4
2020-05-02,80,You Should Be Sad,Halsey,3QSLoxRguKgK0knOG7EGyn,False,65,26,15,0.591,0.585,2,-6.35,1,0.0277,0.143,0,0.109,0.324,110.94,205473,4
2020-05-02,81,Homemade,Jake Owen,3QSLoxRguKgK0knOG7EGyn,False,67,39,13,0.51,0.838,6,-2.702,1,0.0469,0.396,0,0.195,0.574,145.922,192653,4
2020-05-02,82,Bluebird,Miranda Lambert,3QSLoxRguKgK0knOG7EGyn,False,75,75,3,0.661,0.633,7,-5.986,1,0.0348,0.038,2.75e-06,0.124,0.613,81.984,209760,4
2020-05-02,83,Be A Light,"Thomas Rhett Featuring Reba McEntire, Hillary Scott, Chris Tomlin & Keith Urban",3QSLoxRguKgK0knOG7EGyn,False,72,71,3,0.509,0.493,0,-6.676,1,0.0266,0.0397,1.32e-06,0.102,0.264,97.846,173961,4
2020-05-02,84,Emotionally Scarred,Lil Baby,3QSLoxRguKgK0knOG7EGyn,False,82,31,8,0.585,0.641,6,-4.269,0,0.133,0.0286,0,0.316,0.266,88.284,197530,4
2020-05-02,85,CHAMPION,DaBaby,19eeh4pgEGHdSTc26U1y89,True,0,85,1,0.828,0.538,0,-6.067,0,0.341,0.071,0,0.116,0.56,145.071,132813,4
2020-05-02,86,I Dare You,Kelly Clarkson,0o58NWBiVXewJNfNDKQyjw,True,0,86,1,0.655,0.719,2,-7.4,1,0.0368,0.0452,1.77e-05,0.109,0.435,124.034,216107,4
2020-05-02,87,Here And Now,Kenny Chesney,0o58NWBiVXewJNfNDKQyjw,False,79,79,3,0.506,0.813,9,-3.575,1,0.0532,0.0505,0,0.12,0.706,147.996,171493,4
2020-05-02,88,Myron,Lil Uzi Vert,0o58NWBiVXewJNfNDKQyjw,False,74,13,6,0.771,0.654,8,-6.976,0,0.298,0.055,0,0.214,0.573,155.047,224955,4
2020-05-02,89,In Between,Scotty McCreery,0o58NWBiVXewJNfNDKQyjw,False,93,89,2,0.592,0.928,11,-5.402,1,0.0558,0.0166,1.5e-05,0.123,0.393,121.996,221600,4
2020-05-02,90,Broke In A Minute,Tory Lanez,0o58NWBiVXewJNfNDKQyjw,False,64,64,2,0.929,0.7,0,-5.595,0,0.0906,0.144,0,0.349,0.802,120.009,132024,4
2020-05-02,91,That Way,Lil Uzi Vert,0o58NWBiVXewJNfNDKQyjw,False,83,20,8,0.719,0.611,7,-5.01,0,0.0403,0.0582,0,0.155,0.489,129.962,212354,4
2020-05-02,92,After Party,Don Toliver,527k23H0A4Q0UJN3vGs0Da,True,0,92,1,0.629,0.692,5,-8.045,1,0.0376,0.00981,0.331,0.603,0.453,162.948,167916,4
2020-05-02,93,July,Noah Cyrus & Leon Bridges,527k23H0A4Q0UJN3vGs0Da,False,85,85,8,0.708,0.186,9,-8.953,0,0.042,0.868,0,0.0779,0.322,72.541,156106,4
2020-05-02,94,Die From A Broken Heart,Maddie & Tae,527k23H0A4Q0UJN3vGs0Da,False,80,80,2,0.596,0.522,9,-6.633,1,0.0358,0.373,0,0.291,0.443,76.042,188320,4
2020-05-02,95,Ride It.,Regard,527k23H0A4Q0UJN3vGs0Da,False,96,95,2,0.88,0.751,7,-4.258,0,0.0874,0.177,6.43e-05,0.106,0.884,117.948,157606,4
2020-05-02,96,Captain Hook,Megan Thee Stallion,527k23H0A4Q0UJN3vGs0Da,False,95,74,3,0.863,0.633,10,-5.002,0,0.287,0.0118,0,0.285,0.545,163.991,176750,4
2020-05-02,97,God Whispered Your Name,Keith Urban,7Ce11Oh1kConF6UlkBWnaZ,True,0,97,1,0.594,0.6,2,-6.712,1,0.0498,0.306,0,0.149,0.5,145.967,232165,4
2020-05-02,98,PTSD,"G Herbo Featuring Chance The Rapper, Juice WRLD & Lil Uzi Vert",7Ce11Oh1kConF6UlkBWnaZ,False,90,38,4,0.883,0.808,1,-3.158,0,0.183,0.0317,0,0.207,0.805,119.012,232065,4
2020-05-02,99,Safaera,"Bad Bunny, Jowell & Randy & Nengo Flow",7Ce11Oh1kConF6UlkBWnaZ,False,86,81,6,0.607,0.829,2,-4.074,1,0.379,0.0103,0,0.107,0.685,96.172,295177,4
2020-05-02,100,Girl Of My Dreams,Rod Wave,7Ce11Oh1kConF6UlkBWnaZ,False,98,98,2,0.586,0.547,4,-7.383,0,0.095,0.502,0,0.0963,0.35,75.911,159817,4
