date,position,title,artist,spotify_id,is_new,last_pos,peak_pos,weeks,danceability,energy,key,loudness,mode,speechiness,acousticness,instrumentalness,liveness,valence,tempo,duration_ms,time_signature
1992-06-20,1,I'll Be There,Mariah Carey,,False,2,1,4,0.404,0.511,5,-9.427,1,0.0315,0.716,0,0.871,0.279,82.025,264160,4
1992-06-20,2,Baby Got Back,Sir Mix-A-Lot,,False,4,2,11,0.926,0.669,1,-11.271,1,0.301,0.0051,0,0.0887,0.642,128.462,262827,4
1992-06-20,3,Jump,Kris Kross,,False,1,1,12,0.749,0.745,2,-10.625,1,0.164,0.000501,0.00403,0.333,0.481,101.972,195107,4
1992-06-20,4,Under The Bridge,Red Hot Chili Peppers,,False,3,2,12,0.559,0.345,4,-13.496,1,0.0459,0.0576,0.000105,0.141,0.458,84.581,264307,4
1992-06-20,5,My Lovin' (You're Never Gonna Get It),En Vogue,,False,5,2,14,0.767,0.839,8,-5.519,1,0.0613,0.0318,9.31e-06,0.111,0.461,98.055,281613,4
1992-06-20,6,Damn I Wish I Was Your Lover,Sophie B. Hawkins,,False,6,6,10,0.546,0.781,11,-9.439,0,0.0506,0.22,1.51e-05,0.363,0.539,95.032,323267,4
1992-06-20,7,If You Asked Me To,Celine Dion,,False,8,7,9,0.46,0.437,7,-10.587,1,0.0304,0.128,0,0.025,0.227,172.382,234360,4
1992-06-20,8,Achy Breaky Heart,Billy Ray Cyrus,,False,12,8,7,0.8,0.563,9,-10.209,1,0.0303,0.051,0,0.0797,0.961,121.808,203373,4
1992-06-20,9,Tennessee,Arrested Development,,False,11,9,11,0.822,0.661,1,-10.234,0,0.164,0.0241,3.95e-06,0.315,0.67,99.883,272707,4
1992-06-20,10,The Best Things In Life Are Free,Luther Vandross And Janet Jackson With BBD And Ralph Tresvant,,False,10,10,4,0.852,0.863,6,-9.241,0,0.136,0.197,0,0.143,0.496,120.953,297907,4
1992-06-20,11,Live And Learn,Joe Public,,False,7,4,15,0.744,0.894,11,-9.448,0,0.0711,0.0794,0,0.139,0.683,106.637,262333,4
1992-06-20,12,In The Closet,Michael Jackson,,False,9,6,9,0.877,0.781,11,-3.775,0,0.0691,0.117,0.000746,0.149,0.606,110.494,390573,4
1992-06-20,13,Hold On My Heart,Genesis,,False,13,13,8,0.465,0.365,5,-12.633,0,0.0295,0.618,0.0113,0.0747,0.265,171.904,276373,4
1992-06-20,14,Wishing On A Star,The Cover Girls,,False,17,14,4,0.353,0.544,5,-10.812,0,0.0331,0.581,9.95e-05,0.0835,0.48,88.898,281200,4
1992-06-20,15,Just Another Day,Jon Secada,,False,19,15,10,0.717,0.642,1,-10.727,1,0.0287,0.0194,0.000249,0.043,0.732,105.894,327427,4
1992-06-20,16,Come & Talk To Me,Jodeci,,False,26,16,12,0.609,0.57,7,-14.773,1,0.0912,0.223,0,0.366,0.84,172.095,276267,4
1992-06-20,17,Ain't 2 Proud 2 Beg,TLC,,False,14,6,18,0.674,0.707,10,-10.799,0,0.0343,0.00265,0.00214,0.352,0.712,104.854,336560,4
1992-06-20,18,Just Take My Heart,Mr. Big,,False,16,16,11,0.508,0.362,0,-9.369,1,0.0349,0.483,0,0.0996,0.207,168.586,265307,4
1992-06-20,19,Life Is A Highway,Tom Cochrane,,False,29,19,6,0.683,0.751,5,-10.184,1,0.0346,0.0681,8.36e-06,0.248,0.841,103.036,266560,4
1992-06-20,20,I Will Remember You,Amy Grant,,False,25,20,9,0.513,0.658,0,-6.432,1,0.0277,0.0329,9.3e-05,0.0805,0.336,177.625,300560,4
1992-06-20,21,You Won't See Me Cry,Wilson Phillips,,False,21,21,7,0.47,0.442,9,-11.142,1,0.0266,0.582,1.79e-06,0.0899,0.129,76.765,233533,4
1992-06-20,22,Slow Motion,Color Me Badd,,False,18,18,7,0.783,0.885,6,-7.747,0,0.0648,0.00525,0.752,0.0435,0.941,92.042,265667,4
1992-06-20,23,Do It To Me,Lionel Richie,,False,28,23,8,0.696,0.515,0,-10.286,1,0.028,0.197,0.000115,0.462,0.501,91.48,270507,4
1992-06-20,24,Tears In Heaven,Eric Clapton,,False,15,2,20,0.695,0.336,9,-12.999,1,0.0313,0.8,0.00264,0.701,0.422,79.109,280000,4
1992-06-20,25,One,U2,,False,23,10,15,0.392,0.534,0,-8.793,1,0.0369,0.245,0.00104,0.155,0.325,181.305,276187,4
1992-06-20,26,Save The Best For Last,Vanessa Williams,,False,20,1,21,0.528,0.234,3,-15.784,1,0.0283,0.641,0,0.183,0.191,95.911,218733,4
1992-06-20,27,Everything About You,Ugly Kid Joe,,False,27,9,12,0.501,0.803,1,-8.449,1,0.0547,0.00881,1.78e-06,0.107,0.738,122.458,255160,4
1992-06-20,28,Bohemian Rhapsody,Queen,,False,22,2,38,0.392,0.402,0,-9.961,0,0.0536,0.288,0,0.243,0.228,143.883,354320,4
1992-06-20,29,Thought I'd Died And Gone To Heaven,Bryan Adams,,False,24,13,15,0.44,0.738,4,-8.193,1,0.0295,0.0657,0,0.0988,0.535,174.376,348400,4
1992-06-20,30,Too Funky,George Michael,,False,41,30,2,0.659,0.893,1,-8.324,1,0.076,0.0211,0.308,0.72,0.756,98.262,224933,4
1992-06-20,31,T.L.C.,Linear,,False,31,31,7,0.252,0.821,4,-6.916,1,0.0346,0.000372,0.635,0.204,0.452,86.312,190773,4
1992-06-20,32,Just For Tonight,Vanessa Williams,,False,37,32,5,0.57,0.352,9,-15.484,1,0.0311,0.324,0,0.0969,0.318,141.969,268600,4
1992-06-20,33,Lift Me Up,Howard Jones,,False,32,32,11,0.701,0.837,8,-4.266,1,0.0269,0.0414,6.77e-05,0.145,0.872,109.526,218613,4
1992-06-20,34,Keep On Walkin',CeCe Peniston,,False,43,34,5,0.766,0.712,6,-12.111,1,0.0427,0.00291,0.0201,0.226,0.655,104.974,270838,4
1992-06-20,35,They Want EFX,Das EFX,,False,39,35,7,0.755,0.459,5,-12.84,0,0.358,0.115,0,0.0851,0.597,98.454,221400,4
1992-06-20,36,Hazard,Richard Marx,,False,33,9,19,0.674,0.565,7,-10.417,0,0.0259,0.163,0.00169,0.0959,0.655,124.833,275373,4
1992-06-20,37,Nu Nu,Lidell Townsell,,False,35,26,17,0.936,0.55,3,-12.744,0,0.0548,0.00935,0.000322,0.0688,0.763,120.963,199627,4
1992-06-20,38,Let's Get Rocked,Def Leppard,,False,30,15,11,0.564,0.888,5,-6.763,1,0.0325,0.0109,6.68e-05,0.177,0.526,91.989,295957,4
1992-06-20,39,Friday I'm In Love,The Cure,,False,68,39,2,0.526,0.762,0,-12.437,0,0.0342,0.000972,0.000116,0.338,0.505,136.203,214400,4
1992-06-20,40,Make It Happen,Mariah Carey,,False,36,5,18,0.811,0.531,2,-8.537,0,0.0355,0.00657,0.0285,0.0801,0.752,107.853,307000,4
1992-06-20,41,Silent Prayer,Shanice,,False,38,31,9,0.466,0.405,9,-13.259,0,0.0365,0.136,0,0.102,0.159,141.758,303867,3
1992-06-20,42,Not The Only One,Bonnie Raitt,,False,34,34,10,0.726,0.731,5,-7.264,1,0.0383,0.411,7.18e-05,0.084,0.513,115.905,250533,4
1992-06-20,43,Closer To Me,The Outfield,,False,46,43,6,0.675,0.61,9,-12.398,1,0.0355,0.152,0.00135,0.124,0.821,120.98,197333,4
1992-06-20,44,Sometimes I Rhyme Slow,Nice & Smooth,,False,52,44,7,0.797,0.563,6,-14.138,0,0.123,0.119,0.323,0.0969,0.687,108.369,172267,4
1992-06-20,45,Baby-Baby-Baby,TLC,,False,60,45,3,0.679,0.597,11,-8.601,0,0.0439,0.0913,0.000673,0.0487,0.9,184.174,315040,4
1992-06-20,46,Why,Annie Lennox,,False,53,46,6,0.531,0.471,0,-9.267,1,0.0236,0.28,6.22e-05,0.133,0.119,90.941,293838,4
1992-06-20,47,Why Me Baby?,Keith Sweat,,False,48,44,11,0.718,0.524,5,-10.215,0,0.0282,0.0161,6.1e-06,0.195,0.345,132.782,327973,4
1992-06-20,48,Take This Heart,Richard Marx,,False,69,48,2,0.612,0.694,0,-8.277,1,0.026,0.00142,0.0012,0.0749,0.551,115.53,250667,4
1992-06-20,49,Honey Love,R. Kelly & Public Announcement,,False,63,49,5,0.693,0.65,4,-4.204,1,0.0441,0.109,0,0.167,0.452,71.034,243973,4
1992-06-20,50,Everything Changes,Kathy Troccoli,,False,40,14,18,0.749,0.874,6,-3.981,1,0.0332,0.0853,2.66e-06,0.0414,0.78,117.776,262200,4
1992-06-20,51,Giving Him Something He Can Feel,En Vogue,,False,87,51,3,0.496,0.298,9,-10.175,0,0.0405,0.306,1.72e-06,0.0875,0.705,203.824,235707,3
1992-06-20,52,Please Don't Go,Boyz II Men,,False,51,49,12,0.644,0.663,6,-12.847,0,0.0454,0.197,0,0.302,0.743,135.622,263960,4
1992-06-20,53,Helluva,Brotherhood Creed,,False,57,53,10,0.804,0.864,6,-7.148,1,0.125,0.0658,0,0.0609,0.765,105.414,249827,4
1992-06-20,54,Fall In Love Again,Eddie Money,,False,55,54,6,0.596,0.521,4,-8.357,1,0.0298,0.605,5.48e-06,0.0981,0.519,146.951,262333,4
1992-06-20,55,Maria,TKA,,False,44,44,12,0.658,0.887,6,-8.444,0,0.0638,0.0263,0.329,0.07,0.538,118.098,417120,4
1992-06-20,56,"Mr. Loverman (From ""Deep Cover"")",Shabba Ranks,,False,82,56,2,0.732,0.653,7,-9.143,1,0.159,0.0118,5.77e-05,0.116,0.669,172.948,336467,4
1992-06-20,57,Move This,Technotronic Featuring Ya Kid K,,False,91,57,2,0.782,0.96,10,-4.047,1,0.0347,0.0637,0,0.0788,0.979,120.682,296986,4
1992-06-20,58,Strawberry Letter 23,Tevin Campbell,,False,75,58,3,0.812,0.834,6,-7.722,1,0.0375,0.0663,0.000443,0.115,0.817,106.425,196880,4
1992-06-20,59,Good Stuff,The B-52s,70y8ayO7a32MwwPC0AQruT,True,0,59,1,0.754,0.78,1,-5.801,0,0.0299,0.0038,0.00226,0.0595,0.923,120.143,355093,4
1992-06-20,61,Remedy,The Black Crowes,,False,70,61,2,0.411,0.978,10,-3.801,0,0.0532,0.00138,3.97e-06,0.0782,0.353,160.478,322640,4
1992-06-20,62,Anything At All,Mitch Malloy,,False,49,49,8,0.537,0.97,6,-2.481,1,0.0455,0.000411,8.3e-06,0.331,0.695,119.155,242153,4
1992-06-20,63,James Brown Is Dead,L.A. Style,,False,71,63,10,0.599,0.976,0,-7.649,0,0.0859,0.0013,0.787,0.383,0.501,130.724,344400,4
1992-06-20,65,Whatever It Takes (To Make You Stay),Troop,7ypmnQBUevzJdnlUSmdndC,True,0,65,1,0.574,0.618,10,-11.135,0,0.085,0.0122,1.08e-06,0.155,0.843,92.024,319533,4
1992-06-20,66,3-2-1 Pump,Redhead Kingpin & The F.B.I.,7ypmnQBUevzJdnlUSmdndC,False,59,52,13,0.875,0.69,11,-11.484,0,0.0819,0.0241,6.07e-05,0.0627,0.53,127.143,265400,4
1992-06-20,67,Smells Like Nirvana,"""Weird Al"" Yankovic",7ypmnQBUevzJdnlUSmdndC,False,64,35,9,0.591,0.786,6,-7.664,1,0.0749,0.162,0.00178,0.28,0.729,120.762,224533,4
1992-06-20,68,Victim Of The Ghetto,The College Boyz,7ypmnQBUevzJdnlUSmdndC,False,77,68,5,0.673,0.649,1,-9.695,1,0.212,0.0282,0,0.0969,0.693,178.108,293440,4
1992-06-20,69,Love Me,Tracie Spencer,7ypmnQBUevzJdnlUSmdndC,False,66,48,13,0.652,0.366,1,-11.492,1,0.0301,0.5,2.7e-05,0.127,0.288,137.264,303800,4
1992-06-20,70,Will You Marry Me?,Paula Abdul,7ypmnQBUevzJdnlUSmdndC,False,45,19,12,0.623,0.7,11,-7.9,1,0.0575,0.422,3.12e-05,0.31,0.548,149.726,264867,3
1992-06-20,71,Boom! I Got Your Boyfriend,MC Luscious,7ypmnQBUevzJdnlUSmdndC,False,78,61,20,0.932,0.578,2,-14.006,1,0.166,0.0192,2.34e-05,0.0624,0.644,129.823,267533,4
1992-06-20,72,I'm The One You Need,Jody Watley,7ypmnQBUevzJdnlUSmdndC,False,58,19,16,0.761,0.729,7,-8.909,0,0.0352,0.182,0,0.245,0.631,112.184,261040,4
1992-06-20,73,You Think You Know Her,Cause And Effect,7ypmnQBUevzJdnlUSmdndC,False,61,38,17,0.648,0.699,0,-11.729,1,0.0328,0.0183,0.111,0.343,0.753,122.964,283933,4
1992-06-20,74,Come As You Are,Nirvana,7ypmnQBUevzJdnlUSmdndC,False,62,32,14,0.5,0.824,4,-5.846,0,0.0388,0.00016,0.00161,0.0916,0.539,120.125,218920,4
1992-06-20,75,Warm It Up,Kris Kross,7ypmnQBUevzJdnlUSmdndC,False,92,75,3,0.865,0.778,1,-10.05,1,0.249,0.0411,0,0.303,0.763,103.008,248333,4
1992-06-20,76,All You've Got,RTZ,7ypmnQBUevzJdnlUSmdndC,False,88,76,3,0.684,0.655,9,-10.417,1,0.0335,0.215,0,0.0676,0.682,110.33,244267,4
1992-06-20,77,"You Remind Me (From ""Strictly Business"")",Mary J. Blige,3IuJXTVipz0DGz70MaCfgW,True,0,77,1,0.656,0.768,11,-4.949,0,0.0593,0.259,4.16e-06,0.0944,0.507,95.067,258093,4
1992-06-20,78,57 Channels (And Nothin' On),Bruce Springsteen,42eWzCqHuCD5QRwzq3I24e,True,0,78,1,0.894,0.316,7,-18.975,1,0.0978,0.608,0.0153,0.111,0.64,132.061,145467,4
1992-06-20,79,All Woman,Lisa Stansfield,42eWzCqHuCD5QRwzq3I24e,False,83,56,16,0.583,0.338,7,-13.63,0,0.064,0.607,9.86e-06,0.0708,0.378,141.889,317373,4
1992-06-20,80,Take Time,Chris Walker,42eWzCqHuCD5QRwzq3I24e,False,73,29,15,0.648,0.743,7,-9.595,0,0.0592,0.0799,0,0.125,0.81,97.059,260840,4
1992-06-20,81,If You Want It,2nd II None,42eWzCqHuCD5QRwzq3I24e,False,81,64,12,0.93,0.547,0,-14.057,1,0.0607,0.00864,0,0.114,0.92,107.086,226667,4
1992-06-20,82,Scenario,A Tribe Called Quest,42eWzCqHuCD5QRwzq3I24e,False,89,82,3,0.795,0.6,2,-14.004,1,0.341,0.112,0.000171,0.111,0.633,101.78,250133,4
1992-06-20,83,Everything's Gonna Be Alright,Naughty By Nature,42eWzCqHuCD5QRwzq3I24e,False,76,53,20,0.883,0.647,10,-14.054,0,0.197,0.0633,0,0.254,0.739,101.649,291867,4
1992-06-20,84,Nothing Else Matters,Metallica,42eWzCqHuCD5QRwzq3I24e,False,86,34,13,0.558,0.364,4,-11.258,0,0.0265,0.0505,5.02e-06,0.0753,0.17,142.171,388733,3
1992-06-20,85,Don't Be Afraid,Aaron Hall,42eWzCqHuCD5QRwzq3I24e,False,85,44,15,0.507,0.709,9,-6.751,0,0.0484,0.133,0,0.447,0.36,135.814,271673,4
1992-06-20,86,This Is The Last Time,Laura Enea,42eWzCqHuCD5QRwzq3I24e,False,74,70,13,0.646,0.951,6,-5.528,0,0.0318,0.00141,0.00152,0.211,0.756,121.0,238943,4
1992-06-20,87,The Choice Is Yours,Black Sheep,42eWzCqHuCD5QRwzq3I24e,False,84,57,17,0.867,0.679,10,-12.028,0,0.207,0.0336,1.59e-06,0.0742,0.68,101.293,243200,4
1992-06-20,88,High,The Cure,42eWzCqHuCD5QRwzq3I24e,False,56,42,12,0.618,0.717,9,-12.107,1,0.03,0.0164,0.000339,0.0594,0.761,114.802,213333,4
1992-06-20,89,Twilight Zone,2 Unlimited,42eWzCqHuCD5QRwzq3I24e,False,90,89,2,0.709,0.907,6,-12.405,1,0.0452,0.0631,0.00186,0.138,0.746,127.9,246675,4
1992-06-20,90,Money Don't Matter 2 Night,Prince And The N.P.G.,42eWzCqHuCD5QRwzq3I24e,False,67,23,13,0.824,0.569,1,-10.386,1,0.0348,0.0292,2.35e-05,0.0595,0.703,110.129,286627,4
1992-06-20,91,Goodbye,Tevin Campbell,42eWzCqHuCD5QRwzq3I24e,False,94,85,11,0.506,0.818,4,-5.051,0,0.176,0.0291,0.000123,0.184,0.656,188.807,254280,4
1992-06-20,92,Your Song,Rod Stewart,42eWzCqHuCD5QRwzq3I24e,False,72,48,9,0.553,0.328,9,-10.797,1,0.0341,0.643,0,0.109,0.345,103.472,270960,4
1992-06-20,94,I Wanna Rock,Luke,,False,99,73,14,0.801,0.765,6,-11.968,0,0.203,0.0399,8.35e-06,0.429,0.624,138.052,279933,4
1992-06-20,96,Sleeping With The Lights On,Curtis Stigers,4FGlBXJbkqhLep9ZWUJfmc,True,0,96,1,0.675,0.822,5,-7.785,1,0.0447,0.169,2.78e-05,0.254,0.734,104.991,241893,4
1992-06-20,97,Love You All My Lifetime,Chaka Khan,4FGlBXJbkqhLep9ZWUJfmc,False,96,68,9,0.693,0.827,10,-6.437,0,0.0483,0.0114,0.189,0.32,0.906,103.087,281680,4
1992-06-20,98,Forever In Your Eyes,Mint Condition,5PsY36TgdGdCoYJAF7075a,True,0,98,1,0.604,0.493,7,-11.134,1,0.0387,0.159,1.94e-06,0.719,0.408,139.678,312693,4
1992-06-20,99,Please Don't Go,K.W.S.,41DTJjf2ZT7dTuZOKBNKbb,True,0,99,1,0.725,0.954,8,-7.234,1,0.0375,0.0437,0.0857,0.132,0.594,120.248,373600,4
1992-06-20,100,Slowly,Stacy Earl,64ZvR7ymMzcav17QqTnF0R,True,0,100,1,0.539,0.407,8,-13.017,1,0.0264,0.639,6.95e-05,0.0613,0.264,80.156,286667,4
