date,position,title,artist,spotify_id,is_new,last_pos,peak_pos,weeks,danceability,energy,key,loudness,mode,speechiness,acousticness,instrumentalness,liveness,valence,tempo,duration_ms,time_signature
2011-02-19,1,Black And Yellow,Wiz Khalifa,1lUQPlbxDG7x8O8rwbxTRt,False,4,1,18,0.684,0.834,2,-4.524,0,0.0675,0.0646,0,0.271,0.538,164.02,217667,4
2011-02-19,2,Grenade,Bruno Mars,1lUQPlbxDG7x8O8rwbxTRt,False,1,1,19,0.706,0.558,2,-7.237,0,0.0593,0.146,0,0.118,0.227,110.443,223253,4
2011-02-19,3,Firework,Katy Perry,1lUQPlbxDG7x8O8rwbxTRt,False,3,1,16,0.638,0.826,8,-4.968,1,0.0479,0.139,0,0.0803,0.649,124.072,227880,4
2011-02-19,4,F**kin' Perfect,P!nk,1lUQPlbxDG7x8O8rwbxTRt,False,2,2,6,0.57,0.646,7,-4.748,1,0.0331,0.0412,0,0.362,0.485,91.954,213413,4
2011-02-19,5,I Need A Doctor,Dr. Dre Featuring Eminem & Skylar Grey,70ATm56tH7OrQ1zurYssz0,True,0,5,1,0.594,0.946,3,-4.521,1,0.452,0.0869,0,0.306,0.397,155.826,283733,4
2011-02-19,6,Tonight (I'm Lovin' You),Enrique Iglesias Featuring Ludacris & DJ Frank E,70ATm56tH7OrQ1zurYssz0,False,5,4,11,0.666,0.877,0,-4.657,0,0.0446,0.0277,1.15e-05,0.142,0.272,125.989,231653,4
2011-02-19,7,Rocketeer,Far*East Movement Featuring Ryan Tedder,70ATm56tH7OrQ1zurYssz0,False,9,7,10,0.664,0.845,4,-6.115,0,0.0461,0.181,0,0.267,0.357,96.005,211253,4
2011-02-19,8,What's My Name?,Rihanna Featuring Drake,70ATm56tH7OrQ1zurYssz0,False,6,1,16,0.689,0.784,2,-2.972,1,0.074,0.182,0,0.0843,0.561,99.954,263173,4
2011-02-19,9,Hey Baby (Drop It To The Floor),Pitbull Featuring T-Pain,70ATm56tH7OrQ1zurYssz0,False,7,7,19,0.595,0.912,10,-3.428,0,0.0884,0.0434,0,0.259,0.762,128.024,234453,4
2011-02-19,10,Hold It Against Me,Britney Spears,70ATm56tH7OrQ1zurYssz0,False,8,1,4,0.648,0.722,0,-4.813,0,0.0427,0.0103,0,0.24,0.389,132.973,228827,4
2011-02-19,11,Look At Me Now,Chris Brown Featuring Lil Wayne & Busta Rhymes,3hsmbFKT5Cujb5GQjqEU39,True,0,11,1,0.767,0.677,11,-6.128,0,0.184,0.0339,5.51e-06,0.144,0.538,146.155,222587,4
2011-02-19,12,We R Who We R,Ke$ha,3hsmbFKT5Cujb5GQjqEU39,False,10,1,15,0.736,0.817,8,-4.9,1,0.0407,0.00987,0.00167,0.117,0.653,119.95,204760,4
2011-02-19,13,Raise Your Glass,P!nk,3hsmbFKT5Cujb5GQjqEU39,False,11,1,18,0.7,0.709,7,-5.006,1,0.0839,0.0048,0,0.0289,0.625,122.019,202960,4
2011-02-19,14,Coming Home,Diddy - Dirty Money Featuring Skylar Grey,3hsmbFKT5Cujb5GQjqEU39,False,12,12,11,0.392,0.839,7,-1.921,1,0.193,0.158,0,0.3,0.232,168.001,238693,4
2011-02-19,15,Just The Way You Are,Bruno Mars,3hsmbFKT5Cujb5GQjqEU39,False,13,1,29,0.641,0.188,5,-9.954,1,0.0339,0.918,0,0.0857,0.294,109.317,219178,4
2011-02-19,16,F**k You! (Forget You),CeeLo Green,3hsmbFKT5Cujb5GQjqEU39,False,19,9,24,0.689,0.836,0,-6.058,1,0.0559,0.187,0,0.162,0.749,127.411,223067,4
2011-02-19,17,Yeah 3X,Chris Brown,3hsmbFKT5Cujb5GQjqEU39,False,16,15,15,0.705,0.882,11,-3.201,0,0.0445,0.000369,1.16e-06,0.0934,0.7,130.0,241667,4
2011-02-19,18,6 Foot 7 Foot,Lil Wayne Featuring Cory Gunz,3hsmbFKT5Cujb5GQjqEU39,False,17,9,8,0.365,0.751,2,-5.429,1,0.304,0.000707,0,0.318,0.604,79.119,248587,4
2011-02-19,19,The Time (Dirty Bit),The Black Eyed Peas,3hsmbFKT5Cujb5GQjqEU39,False,14,4,13,0.816,0.813,6,-7.798,0,0.0664,0.0662,2.77e-06,0.602,0.436,127.979,307640,4
2011-02-19,20,Back To December,Taylor Swift,3hsmbFKT5Cujb5GQjqEU39,False,18,6,15,0.529,0.67,2,-4.663,1,0.0303,0.117,0,0.334,0.286,141.893,293027,4
2011-02-19,21,No Hands,Waka Flocka Flame Featuring Roscoe Dash & Wale,3hsmbFKT5Cujb5GQjqEU39,False,15,13,22,0.76,0.595,1,-6.366,1,0.0391,0.00544,0,0.241,0.361,131.497,263773,4
2011-02-19,22,Moment 4 Life,Nicki Minaj Featuring Drake,3hsmbFKT5Cujb5GQjqEU39,False,27,22,8,0.475,0.882,11,-3.883,1,0.351,0.406,0,0.241,0.369,98.001,279307,4
2011-02-19,23,What The Hell,Avril Lavigne,3hsmbFKT5Cujb5GQjqEU39,False,24,13,4,0.578,0.926,6,-3.689,0,0.0548,0.00472,0.0127,0.14,0.877,149.976,220707,4
2011-02-19,24,Higher,Taio Cruz Featuring Travie McCoy,3hsmbFKT5Cujb5GQjqEU39,False,26,24,8,0.528,0.9,8,-4.301,0,0.0759,0.0349,0,0.144,0.558,127.986,188133,4
2011-02-19,25,Jar Of Hearts,Christina Perri,3hsmbFKT5Cujb5GQjqEU39,False,22,22,19,0.349,0.348,3,-6.142,1,0.0316,0.726,0,0.12,0.0886,74.541,246587,4
2011-02-19,26,More,Usher,3hsmbFKT5Cujb5GQjqEU39,False,23,23,9,0.551,0.893,7,-2.628,1,0.0543,0.00166,0,0.348,0.794,125.083,219987,4
2011-02-19,27,Only Girl (In The World),Rihanna,3hsmbFKT5Cujb5GQjqEU39,False,21,1,22,0.789,0.706,11,-4.233,0,0.0429,0.112,1.71e-05,0.0586,0.638,125.911,235493,4
2011-02-19,28,Stereo Love,Edward Maya & Vika Jigulina,3hsmbFKT5Cujb5GQjqEU39,False,20,16,18,0.773,0.736,9,-5.589,1,0.0383,0.0335,0.0184,0.104,0.212,127.056,184000,4
2011-02-19,29,Down On Me,Jeremih Featuring 50 Cent,3hsmbFKT5Cujb5GQjqEU39,False,28,28,13,0.7,0.598,2,-7.783,1,0.114,0.0369,0,0.111,0.594,160.041,228453,4
2011-02-19,30,Dynamite,Taio Cruz,3hsmbFKT5Cujb5GQjqEU39,False,25,2,36,0.754,0.804,4,-3.177,1,0.0853,0.00332,0,0.0329,0.818,119.968,203867,4
2011-02-19,31,S&M,Rihanna Featuring Britney Spears,3hsmbFKT5Cujb5GQjqEU39,False,66,31,4,0.769,0.684,1,-5.019,1,0.0411,0.0105,0.000125,0.0887,0.835,127.972,243600,4
2011-02-19,32,Pretty Girl Rock,Keri Hilson,3hsmbFKT5Cujb5GQjqEU39,False,31,31,11,0.666,0.87,11,-5.004,0,0.246,0.203,0,0.0851,0.9,160.014,243920,4
2011-02-19,33,DJ Got Us Fallin' In Love,Usher Featuring Pitbull,3hsmbFKT5Cujb5GQjqEU39,False,30,4,30,0.663,0.861,7,-3.398,0,0.109,0.0338,0,0.082,0.654,119.963,220800,4
2011-02-19,34,Marry Me,Train,3hsmbFKT5Cujb5GQjqEU39,False,38,34,12,0.461,0.267,0,-8.514,1,0.0278,0.834,2.03e-05,0.107,0.481,87.918,205453,4
2011-02-19,35,Just A Dream,Nelly,3hsmbFKT5Cujb5GQjqEU39,False,29,3,25,0.531,0.752,1,-6.161,1,0.0305,0.0421,0,0.12,0.103,89.917,237800,4
2011-02-19,36,Don't You Wanna Stay,Jason Aldean With Kelly Clarkson,3hsmbFKT5Cujb5GQjqEU39,False,35,35,14,0.445,0.631,11,-4.798,1,0.0304,0.129,0,0.0911,0.152,143.846,256440,4
2011-02-19,37,Somewhere With You,Kenny Chesney,3hsmbFKT5Cujb5GQjqEU39,False,33,31,14,0.68,0.849,1,-6.475,0,0.0376,0.0862,0.00013,0.174,0.536,111.969,243520,4
2011-02-19,38,Rhythm of Love,Plain White T's,3hsmbFKT5Cujb5GQjqEU39,False,40,38,21,0.531,0.542,8,-7.721,1,0.0432,0.356,0,0.119,0.726,171.878,200200,4
2011-02-19,39,Bottoms Up,Trey Songz Featuring Nicki Minaj,3hsmbFKT5Cujb5GQjqEU39,False,32,6,26,0.844,0.601,1,-5.283,1,0.157,0.0205,0,0.385,0.331,73.989,242013,4
2011-02-19,40,Who Dat Girl,Flo Rida Featuring Akon,3hsmbFKT5Cujb5GQjqEU39,False,34,29,10,0.719,0.616,1,-3.951,1,0.0395,0.00683,3.11e-05,0.0742,0.625,124.963,200880,4
2011-02-19,41,Teenage Dream,Katy Perry,3hsmbFKT5Cujb5GQjqEU39,False,37,1,29,0.719,0.798,10,-4.582,1,0.0361,0.0162,2.34e-06,0.134,0.591,120.011,227741,4
2011-02-19,42,Waiting For The End,Linkin Park,3hsmbFKT5Cujb5GQjqEU39,False,49,42,18,0.487,0.961,4,-4.139,1,0.132,0.0415,1.15e-06,0.553,0.323,170.005,231680,4
2011-02-19,43,Like A G6,Far*East Movement Featuring Cataracs & Dev,3hsmbFKT5Cujb5GQjqEU39,False,36,1,26,0.435,0.837,3,-8.126,1,0.449,0.00676,0,0.117,0.778,124.913,216893,4
2011-02-19,44,Secrets,OneRepublic,3hsmbFKT5Cujb5GQjqEU39,False,39,21,33,0.516,0.764,2,-6.223,1,0.0366,0.0717,0,0.115,0.376,148.021,224693,4
2011-02-19,45,Are You Gonna Kiss Me Or Not,Thompson Square,3hsmbFKT5Cujb5GQjqEU39,False,42,42,8,0.485,0.701,8,-3.807,1,0.0288,0.039,0,0.0977,0.613,151.948,184920,4
2011-02-19,46,Who Are You When I'm Not Looking,Blake Shelton,3hsmbFKT5Cujb5GQjqEU39,False,46,46,14,0.412,0.457,4,-9.142,1,0.0288,0.409,0.0187,0.0978,0.202,74.824,187733,4
2011-02-19,47,Animal,Neon Trees,3hsmbFKT5Cujb5GQjqEU39,False,41,13,36,0.482,0.833,5,-5.611,1,0.0449,0.000346,0,0.365,0.74,148.039,212293,4
2011-02-19,48,Please Don't Go,Mike Posner,3hsmbFKT5Cujb5GQjqEU39,False,43,16,20,0.699,0.882,4,-3.896,0,0.0311,0.00296,0.0544,0.13,0.657,120.016,196813,4
2011-02-19,49,Never Say Never,Justin Bieber Featuring Jaden Smith,3hsmbFKT5Cujb5GQjqEU39,False,62,33,8,0.739,0.807,0,-5.063,1,0.0652,0.0181,0,0.295,0.632,97.048,227853,4
2011-02-19,50,Fall For Your Type,Jamie Foxx Featuring Drake,3hsmbFKT5Cujb5GQjqEU39,False,51,50,9,0.593,0.393,1,-11.736,1,0.0827,0.394,3.24e-06,0.11,0.193,136.866,269533,4
2011-02-19,51,The Show Goes On,Lupe Fiasco,3hsmbFKT5Cujb5GQjqEU39,False,57,51,6,0.591,0.889,7,-3.839,1,0.115,0.0189,0,0.155,0.65,143.067,239613,4
2011-02-19,52,Let Me Down Easy,Billy Currington,3hsmbFKT5Cujb5GQjqEU39,False,48,48,11,0.606,0.497,1,-5.005,1,0.0278,0.361,0,0.106,0.18,125.059,228493,4
2011-02-19,53,Felt Good On My Lips,Tim McGraw,3hsmbFKT5Cujb5GQjqEU39,False,45,26,14,0.56,0.869,3,-3.804,1,0.0387,0.024,2.94e-06,0.136,0.519,136.001,277400,4
2011-02-19,54,Aston Martin Music,Rick Ross Featuring Drake & Chrisette Michele,3hsmbFKT5Cujb5GQjqEU39,False,47,30,19,0.57,0.58,1,-5.547,1,0.21,0.0124,0,0.0498,0.404,171.812,270627,4
2011-02-19,55,Colder Weather,Zac Brown Band,3hsmbFKT5Cujb5GQjqEU39,False,58,55,3,0.667,0.381,3,-7.494,1,0.0294,0.455,0,0.116,0.199,135.975,273893,4
2011-02-19,56,For The First Time,The Script,3hsmbFKT5Cujb5GQjqEU39,False,52,45,6,0.396,0.629,9,-4.78,1,0.0287,0.0328,0,0.183,0.358,173.794,252853,4
2011-02-19,57,Voices,Chris Young,3hsmbFKT5Cujb5GQjqEU39,False,53,53,14,0.552,0.788,0,-4.112,1,0.0525,0.38,0,0.15,0.641,76.528,186107,4
2011-02-19,58,All Of The Lights,Kanye West,3hsmbFKT5Cujb5GQjqEU39,False,55,55,6,0.531,0.803,1,-3.284,1,0.0717,0.0796,1.71e-05,0.176,0.221,142.113,299613,4
2011-02-19,59,Someone Else Calling You Baby,Luke Bryan,3hsmbFKT5Cujb5GQjqEU39,False,56,56,15,0.498,0.915,8,-3.729,1,0.0662,0.0509,1.36e-06,0.0734,0.353,115.044,229253,4
2011-02-19,60,Wildflower,The JaneDear Girls,3hsmbFKT5Cujb5GQjqEU39,False,85,60,4,0.692,0.858,6,-4.354,0,0.03,0.00217,4.85e-05,0.358,0.69,125.944,163453,4
2011-02-19,61,Buzzin',Mann,3hsmbFKT5Cujb5GQjqEU39,False,65,61,4,0.724,0.951,7,-4.294,0,0.226,0.127,0,0.307,0.593,103.988,196147,4
2011-02-19,62,Bass Down Low,Dev Featuring The Cataracs,3hsmbFKT5Cujb5GQjqEU39,False,61,61,8,0.798,0.627,0,-8.086,1,0.0602,0.0778,0,0.0472,0.84,113.029,210600,4
2011-02-19,63,Put You In A Song,Keith Urban,3hsmbFKT5Cujb5GQjqEU39,False,54,53,19,0.621,0.78,2,-8.502,1,0.0333,0.0174,0,0.0681,0.822,134.022,220387,4
2011-02-19,64,Rolling In The Deep,Adele,3hsmbFKT5Cujb5GQjqEU39,False,69,64,5,0.73,0.769,8,-5.114,1,0.0298,0.138,0,0.0473,0.507,104.948,228093,4
2011-02-19,65,This Is Country Music,Brad Paisley,3hsmbFKT5Cujb5GQjqEU39,False,68,65,7,0.507,0.669,2,-5.104,1,0.0275,0.126,0.000263,0.111,0.484,88.525,311640,4
2011-02-19,66,Blow,Ke$ha,3hsmbFKT5Cujb5GQjqEU39,False,96,66,3,0.753,0.729,11,-3.862,0,0.0392,0.00334,5.66e-05,0.073,0.812,120.013,219973,4
2011-02-19,67,You Be Killin Em,Fabolous,3hsmbFKT5Cujb5GQjqEU39,False,64,64,6,0.664,0.909,6,-3.552,0,0.22,0.444,0,0.525,0.557,93.977,209693,4
2011-02-19,68,Maybe,Sick Puppies,3hsmbFKT5Cujb5GQjqEU39,False,59,56,11,0.437,0.913,7,-4.315,1,0.0972,0.0171,0,0.284,0.537,167.861,206120,4
2011-02-19,69,Who's That Chick?,David Guetta Featuring Rihanna,3hsmbFKT5Cujb5GQjqEU39,False,60,51,6,0.675,0.601,11,-4.733,0,0.116,0.00372,0,0.0458,0.931,127.938,201040,4
2011-02-19,70,No BS,Chris Brown,3hsmbFKT5Cujb5GQjqEU39,False,67,62,9,0.426,0.612,1,-6.359,0,0.0567,0.12,0,0.119,0.106,172.171,247933,4
2011-02-19,71,What Do You Want,Jerrod Niemann,3hsmbFKT5Cujb5GQjqEU39,False,70,69,7,0.555,0.496,4,-10.12,1,0.143,0.657,1.14e-06,0.106,0.543,153.301,214573,4
2011-02-19,72,Need You Now,Glee Cast,4kEzw2gtpxUBfgmhTEwIuE,True,0,72,1,0.55,0.674,4,-5.248,1,0.0277,0.0881,0,0.0873,0.248,108.037,217413,4
2011-02-19,73,Hello World,Lady Antebellum,4kEzw2gtpxUBfgmhTEwIuE,False,71,58,13,0.427,0.531,8,-6.985,1,0.0297,0.0555,0.00106,0.0835,0.145,111.079,326107,4
2011-02-19,74,A Little Bit Stronger,Sara Evans,4kEzw2gtpxUBfgmhTEwIuE,False,73,73,6,0.536,0.65,2,-5.603,1,0.0337,0.282,1.16e-06,0.0876,0.288,147.93,301987,4
2011-02-19,75,Thriller / Heads Will Roll,Glee Cast,6FCngfdkfRZ0CwL2eZAgnc,True,0,75,1,0.633,0.822,10,-5.011,0,0.0723,0.00846,0,0.141,0.633,122.994,216560,4
2011-02-19,76,Kush,Dr. Dre Featuring Snoop Dogg & Akon,6FCngfdkfRZ0CwL2eZAgnc,False,77,34,12,0.444,0.866,7,-6.217,1,0.111,0.000622,4.72e-05,0.105,0.375,94.968,235120,4
2011-02-19,77,This,Darius Rucker,6FCngfdkfRZ0CwL2eZAgnc,False,76,76,6,0.625,0.826,4,-5.037,1,0.0325,0.121,0,0.158,0.699,99.919,218867,4
2011-02-19,78,From A Table Away,Sunny Sweeney,6FCngfdkfRZ0CwL2eZAgnc,False,80,78,5,0.547,0.805,8,-4.34,1,0.0293,0.0393,1.75e-05,0.332,0.557,110.027,215333,4
2011-02-19,79,"Bills, Bills, Bills",Glee Cast,67QoEc0mR2OpqNKXgHGHDq,True,0,79,1,0.833,0.441,11,-6.172,0,0.152,0.392,0,0.149,0.762,127.659,180280,4
2011-02-19,80,I Just Had Sex,The Lonely Island Featuring Akon,67QoEc0mR2OpqNKXgHGHDq,False,74,30,7,0.615,0.811,6,-4.316,1,0.144,0.0188,0,0.196,0.808,167.995,166560,4
2011-02-19,81,When You're Young,3 Doors Down,6uMPJ3NmW8FfqqNwqjUHrB,True,0,81,1,0.462,0.778,9,-4.365,0,0.0313,0.0226,0,0.108,0.219,77.004,256013,4
2011-02-19,82,The Creep,The Lonely Island Featuring Nicki Minaj,0MDNAlh3uu0FidvvpvX0mc,True,0,82,1,0.761,0.871,1,-4.088,1,0.324,0.0459,0,0.0658,0.828,134.151,159000,4
2011-02-19,83,Bullets In The Gun,Toby Keith,0MDNAlh3uu0FidvvpvX0mc,False,87,83,14,0.61,0.761,9,-6.022,1,0.0627,0.339,1.88e-05,0.0839,0.433,120.017,256613,4
2011-02-19,84,Lay It Down,Lloyd,0MDNAlh3uu0FidvvpvX0mc,False,79,64,16,0.527,0.796,1,-5.111,0,0.062,0.017,0,0.0798,0.534,155.99,240107,4
2011-02-19,85,Make A Movie,Twista Featuring Chris Brown,0MDNAlh3uu0FidvvpvX0mc,False,83,71,13,0.846,0.774,1,-5.131,1,0.0509,0.00752,0,0.207,0.375,120.012,202000,4
2011-02-19,86,H*A*M,Kanye West Jay Z,0MDNAlh3uu0FidvvpvX0mc,False,81,23,4,0.657,0.524,8,-4.907,1,0.061,0.0462,0,0.322,0.0383,140.021,275733,4
2011-02-19,87,Whip My Hair,WILLOW,0MDNAlh3uu0FidvvpvX0mc,False,75,11,16,0.552,0.98,9,-4.676,0,0.254,0.00159,0.00552,0.438,0.668,162.961,195440,4
2011-02-19,88,Price Tag,Jessie J Featuring B.o.B,5mvKuE9Lf9ARVXVXA32kK9,True,0,88,1,0.638,0.831,5,-3.944,1,0.182,0.0281,3.06e-06,0.277,0.685,175.038,223053,4
2011-02-19,89,The Ballad Of Mona Lisa,Panic! At The Disco,5rLi8B8qgk6qThwRnKHW2P,True,0,89,1,0.436,0.893,9,-4.18,0,0.0556,0.000362,0,0.103,0.0794,124.113,226680,4
2011-02-19,90,Love Faces,Trey Songz,5rLi8B8qgk6qThwRnKHW2P,False,100,90,2,0.654,0.599,11,-6.699,1,0.0561,0.0599,0,0.161,0.333,119.782,243800,4
2011-02-19,91,Little Miss,Sugarland,5rLi8B8qgk6qThwRnKHW2P,False,91,80,4,0.351,0.797,11,-4.286,1,0.0379,0.0959,4.12e-05,0.157,0.243,129.14,271267,5
2011-02-19,92,Do The John Wall,Troop 41,5rLi8B8qgk6qThwRnKHW2P,False,86,76,7,0.66,0.925,7,-2.094,1,0.317,0.252,0,0.87,0.576,81.041,263880,4
2011-02-19,93,I Won't Let Go,Rascal Flatts,5rLi8B8qgk6qThwRnKHW2P,False,0,72,2,0.557,0.406,4,-7.083,1,0.0278,0.742,0,0.113,0.222,131.96,227760,4
2011-02-19,94,Make It Rain,Travis Porter,5rLi8B8qgk6qThwRnKHW2P,False,92,92,5,0.926,0.69,1,-4.327,0,0.175,0.078,0,0.228,0.387,128.952,239493,4
2011-02-19,95,Right Thru Me,Nicki Minaj,5rLi8B8qgk6qThwRnKHW2P,False,90,26,19,0.381,0.683,1,-4.724,1,0.162,0.0869,0.00164,0.168,0.168,162.246,235773,3
2011-02-19,96,Memories,David Guetta Featuring Kid Cudi,5rLi8B8qgk6qThwRnKHW2P,False,84,46,18,0.561,0.87,8,-6.103,1,0.343,0.0015,2.82e-06,0.246,0.498,129.98,210093,4
2011-02-19,97,Fire Flame,Birdman Featuring Lil Wayne,5rLi8B8qgk6qThwRnKHW2P,False,94,64,10,0.652,0.7,8,-2.908,0,0.139,0.000679,0,0.184,0.628,148.119,260413,4
2011-02-19,99,The Cave,Mumford & Sons,7IxVWmdabNVhfLBV3JD0nJ,True,0,99,1,0.595,0.506,4,-9.682,1,0.0388,0.0464,0.000138,0.107,0.346,141.981,217987,4
2011-02-19,100,Lo Mejor De Mi Vida Eres Tu,Ricky Martin Featuring Natalia Jimenez,7IxVWmdabNVhfLBV3JD0nJ,False,0,74,2,0.727,0.812,3,-4.148,1,0.0405,0.543,0,0.0796,0.812,128.811,216613,4
