date,position,title,artist,spotify_id,is_new,last_pos,peak_pos,weeks,danceability,energy,key,loudness,mode,speechiness,acousticness,instrumentalness,liveness,valence,tempo,duration_ms,time_signature
1992-12-26,1,I Will Always Love You,Whitney Houston,13cpOnmccZGVGFngLxYN4I,False,1,1,7,0.332,0.214,4,-12.518,1,0.0349,0.845,5.62e-06,0.0839,0.11,67.531,271093,4
1992-12-26,2,Rump Shaker,Wreckx-N-Effect,13cpOnmccZGVGFngLxYN4I,False,3,2,13,0.888,0.822,5,-6.843,0,0.219,0.0025,0.0197,0.303,0.233,102.753,312360,4
1992-12-26,3,If I Ever Fall In Love,Shai,13cpOnmccZGVGFngLxYN4I,False,2,2,11,0.402,0.205,6,-11.232,1,0.038,0.758,0,0.147,0.42,143.994,189027,4
1992-12-26,4,"In The Still Of The Nite (From ""The Jacksons"")",Boyz II Men,13cpOnmccZGVGFngLxYN4I,False,4,4,5,0.537,0.184,9,-15.886,1,0.0381,0.792,0,0.126,0.217,77.817,169840,4
1992-12-26,5,"I'd Die Without You (From ""Boomerang"")",P.M. Dawn,13cpOnmccZGVGFngLxYN4I,False,5,3,16,0.543,0.266,1,-18.813,1,0.0443,0.256,0.00093,0.0993,0.343,79.992,250693,4
1992-12-26,6,Rhythm Is A Dancer,Snap!,13cpOnmccZGVGFngLxYN4I,False,7,6,20,0.794,0.745,9,-11.367,0,0.037,0.273,0.000414,0.143,0.706,124.249,225882,4
1992-12-26,7,Good Enough,Bobby Brown,13cpOnmccZGVGFngLxYN4I,False,8,7,11,0.651,0.743,2,-9.254,1,0.0364,0.00526,0.000341,0.0406,0.533,90.2,302093,4
1992-12-26,8,"Saving Forever For You (From ""Beverly Hills, 90210"")",Shanice,13cpOnmccZGVGFngLxYN4I,False,12,8,10,0.655,0.545,9,-8.163,1,0.0342,0.494,0,0.0417,0.463,133.358,268733,4
1992-12-26,9,How Do You Talk To An Angel,The Heights,13cpOnmccZGVGFngLxYN4I,False,6,1,13,0.404,0.51,9,-11.353,1,0.0321,0.281,6.32e-06,0.0789,0.526,80.643,227267,4
1992-12-26,10,Real Love,Mary J. Blige,13cpOnmccZGVGFngLxYN4I,False,9,7,18,0.769,0.781,0,-5.472,1,0.0797,0.119,0.000371,0.0506,0.826,95.02,269973,4
1992-12-26,11,What About Your Friends,TLC,13cpOnmccZGVGFngLxYN4I,False,10,7,17,0.744,0.851,10,-10.108,0,0.049,0.0267,0.00738,0.0989,0.626,105.882,293600,4
1992-12-26,12,To Love Somebody,Michael Bolton,13cpOnmccZGVGFngLxYN4I,False,11,11,11,0.367,0.353,11,-11.786,1,0.0288,0.335,0,0.1,0.282,74.103,247973,4
1992-12-26,13,Deeper And Deeper,Madonna,13cpOnmccZGVGFngLxYN4I,False,16,13,4,0.659,0.818,7,-7.09,0,0.0265,0.00601,0.299,0.336,0.39,119.943,333467,4
1992-12-26,14,Love Is On The Way,Saigon Kick,13cpOnmccZGVGFngLxYN4I,False,15,12,17,0.576,0.449,1,-8.764,0,0.0287,0.085,0,0.119,0.0552,129.323,264173,4
1992-12-26,15,Do You Believe In Us,Jon Secada,13cpOnmccZGVGFngLxYN4I,False,13,13,14,0.662,0.891,3,-7.245,1,0.0349,0.0103,3.64e-06,0.634,0.743,107.75,239267,4
1992-12-26,16,Layla,Eric Clapton,13cpOnmccZGVGFngLxYN4I,False,14,12,13,0.558,0.524,2,-11.626,0,0.0459,0.321,0.000952,0.94,0.636,93.654,289027,4
1992-12-26,17,Little Miss Can't Be Wrong,Spin Doctors,13cpOnmccZGVGFngLxYN4I,False,18,17,11,0.515,0.903,0,-8.832,1,0.0443,0.014,0.0218,0.38,0.927,116.44,232720,4
1992-12-26,18,When She Cries,Restless Heart,13cpOnmccZGVGFngLxYN4I,False,21,18,7,0.666,0.521,9,-10.993,1,0.0292,0.114,0,0.0604,0.361,105.223,222187,4
1992-12-26,19,Faithful,Go West,13cpOnmccZGVGFngLxYN4I,False,22,19,8,0.615,0.912,10,-8.028,0,0.0416,0.0323,0,0.0966,0.753,105.538,265560,4
1992-12-26,20,Walking On Broken Glass,Annie Lennox,13cpOnmccZGVGFngLxYN4I,False,19,14,17,0.75,0.562,0,-8.45,1,0.0281,0.215,1.1e-06,0.105,0.807,115.008,253296,4
1992-12-26,21,"End Of The Road (From ""Boomerang"")",Boyz II Men,13cpOnmccZGVGFngLxYN4I,False,17,1,24,0.64,0.427,5,-9.29,0,0.0241,0.0664,0,0.0579,0.529,149.703,351467,3
1992-12-26,22,Flex,Mad Cobra,13cpOnmccZGVGFngLxYN4I,False,26,22,11,0.725,0.664,1,-5.596,1,0.107,0.617,0,0.347,0.738,154.16,230693,3
1992-12-26,23,Where You Goin' Now,Damn Yankees,13cpOnmccZGVGFngLxYN4I,False,20,20,12,0.48,0.72,7,-5.607,1,0.0283,0.0116,0,0.114,0.383,76.54,279847,4
1992-12-26,24,Back To The Hotel,N2Deep,13cpOnmccZGVGFngLxYN4I,False,27,23,25,0.69,0.38,9,-12.845,1,0.0609,0.000168,0.000533,0.136,0.305,201.697,304280,4
1992-12-26,25,Never A Time,Genesis,13cpOnmccZGVGFngLxYN4I,False,31,25,8,0.573,0.526,0,-8.273,1,0.0253,0.514,0.0148,0.35,0.291,76.977,230160,4
1992-12-26,26,The Last Song,Elton John,13cpOnmccZGVGFngLxYN4I,False,23,23,9,0.305,0.29,1,-12.623,1,0.0321,0.329,0,0.0896,0.088,124.664,213133,1
1992-12-26,27,Would I Lie To You?,Charles & Eddie,13cpOnmccZGVGFngLxYN4I,False,25,13,19,0.547,0.538,11,-11.39,0,0.0567,0.473,0,0.0369,0.718,202.409,279600,4
1992-12-26,28,Drive,R.E.M.,13cpOnmccZGVGFngLxYN4I,False,29,28,9,0.467,0.432,7,-11.753,1,0.0283,0.175,0.001,0.226,0.238,142.642,271333,4
1992-12-26,29,7,Prince And The New Power Generation,13cpOnmccZGVGFngLxYN4I,False,38,29,5,0.747,0.749,9,-6.255,1,0.0563,0.0917,0,0.0444,0.562,100.721,310467,4
1992-12-26,30,Sometimes Love Just Ain't Enough,Patty Smyth,13cpOnmccZGVGFngLxYN4I,False,24,2,20,0.561,0.442,10,-10.687,1,0.0243,0.329,0,0.24,0.267,82.996,267600,4
1992-12-26,31,Here We Go Again!,Portrait,13cpOnmccZGVGFngLxYN4I,False,37,31,7,0.771,0.745,11,-10.217,0,0.0904,0.0256,0.000374,0.107,0.599,106.709,235200,4
1992-12-26,32,Jump Around,House Of Pain,13cpOnmccZGVGFngLxYN4I,False,28,3,27,0.854,0.71,4,-6.32,0,0.0793,0.0113,8.72e-05,0.166,0.818,106.894,214947,4
1992-12-26,33,I Wish The Phone Would Ring,Expose,13cpOnmccZGVGFngLxYN4I,False,32,28,9,0.667,0.743,6,-9.651,1,0.0477,0.0765,0.00134,0.0229,0.874,94.985,249000,4
1992-12-26,34,Walk On The Ocean,Toad The Wet Sprocket,13cpOnmccZGVGFngLxYN4I,False,40,34,7,0.395,0.502,6,-8.328,1,0.0309,0.236,5.79e-06,0.332,0.323,183.237,178376,3
1992-12-26,35,Who's Gonna Ride Your Wild Horses,U2,13cpOnmccZGVGFngLxYN4I,False,35,35,8,0.432,0.679,7,-10.594,1,0.0366,0.0302,0.000435,0.053,0.414,132.678,316427,4
1992-12-26,36,People Everyday,Arrested Development,13cpOnmccZGVGFngLxYN4I,False,34,8,20,0.844,0.609,10,-10.675,1,0.217,0.0074,0,0.563,0.725,91.116,296333,4
1992-12-26,37,Keep The Faith,Bon Jovi,13cpOnmccZGVGFngLxYN4I,False,30,29,10,0.569,0.968,5,-3.72,0,0.0487,0.00108,0.00153,0.0814,0.568,117.783,346533,4
1992-12-26,38,"Give It Up, Turn It Loose",En Vogue,13cpOnmccZGVGFngLxYN4I,False,47,38,4,0.836,0.58,1,-8.778,1,0.0692,0.19,0.000271,0.0379,0.939,93.015,312040,4
1992-12-26,39,I Got A Thang 4 Ya!,Lo-Key?,13cpOnmccZGVGFngLxYN4I,False,46,39,7,0.756,0.65,6,-8.004,1,0.0457,0.307,0,0.0606,0.788,132.274,340867,4
1992-12-26,40,Free Your Mind,En Vogue,13cpOnmccZGVGFngLxYN4I,False,33,8,16,0.765,0.831,7,-6.522,1,0.0565,0.0894,0,0.393,0.809,100.026,293106,4
1992-12-26,41,Gangsta,Bell Biv DeVoe,13cpOnmccZGVGFngLxYN4I,False,36,30,7,0.724,0.778,1,-8.924,1,0.0618,0.00151,0.112,0.387,0.768,112.518,269067,4
1992-12-26,42,A Whole New World (Aladdin's Theme),Peabo Bryson & Regina Belle,13cpOnmccZGVGFngLxYN4I,False,54,42,2,0.516,0.32,2,-10.487,1,0.0303,0.627,0,0.144,0.131,107.894,243493,4
1992-12-26,43,It's Gonna Be A Lovely Day,The S.O.U.L. S.Y.S.T.E.M.,13cpOnmccZGVGFngLxYN4I,False,43,43,5,0.66,0.617,11,-12.425,0,0.0454,0.00138,0.265,0.625,0.486,98.613,290333,4
1992-12-26,44,Baby-Baby-Baby,TLC,13cpOnmccZGVGFngLxYN4I,False,42,2,30,0.679,0.597,11,-8.601,0,0.0439,0.0913,0.000673,0.0487,0.9,184.174,315040,4
1992-12-26,46,"Love Shoulda Brought You Home (From ""Boomerang"")",Toni Braxton,,False,49,46,7,0.556,0.798,2,-6.531,1,0.0367,0.0549,4.48e-06,0.37,0.591,175.651,298227,4
1992-12-26,47,Someone To Hold,Trey Lorenz,,False,39,19,13,0.594,0.543,4,-10.095,1,0.0382,0.448,0,0.0818,0.543,147.956,283293,4
1992-12-26,48,Just Another Day,Jon Secada,,False,45,5,37,0.717,0.642,1,-10.727,1,0.0287,0.0194,0.000249,0.043,0.732,105.894,327427,4
1992-12-26,49,No Ordinary Love,Sade,,False,51,49,8,0.629,0.364,11,-12.259,0,0.038,0.467,0.0204,0.0941,0.701,166.266,440467,4
1992-12-26,50,Love Can Move Mountains,Celine Dion,,False,52,50,6,0.732,0.874,8,-7.068,1,0.0484,0.00813,0.00124,0.0901,0.275,105.92,238973,4
1992-12-26,51,Have You Ever Needed Someone So Bad,Def Leppard,,False,50,12,19,0.497,0.726,4,-8.335,1,0.0272,0.0489,8.99e-06,0.049,0.735,136.792,324027,4
1992-12-26,52,I Love You Period,Dan Baird,,False,59,52,4,0.543,0.873,9,-8.951,1,0.0324,0.0194,0.000372,0.324,0.945,114.195,264000,4
1992-12-26,53,Mr. Wendal,Arrested Development,,False,53,53,2,0.884,0.37,8,-11.353,1,0.112,0.0188,0.00423,0.026,0.883,109.997,247507,4
1992-12-26,54,Heal The World,Michael Jackson,,False,62,54,3,0.545,0.485,9,-8.045,1,0.0485,0.537,1.8e-06,0.104,0.101,80.948,384307,4
1992-12-26,55,Baby I'm For Real/Natural High,After 7,,False,56,55,8,0.456,0.695,6,-9.279,1,0.0496,0.0844,0,0.499,0.395,157.068,308440,3
1992-12-26,56,Quality Time,Hi-Five,,False,57,56,4,0.644,0.674,6,-6.998,1,0.0345,0.0761,0,0.0659,0.656,155.907,283067,4
1992-12-26,57,Reminisce,Mary J. Blige,,False,63,57,2,0.647,0.699,9,-8.122,0,0.0668,0.0397,3.15e-05,0.154,0.53,91.435,323133,4
1992-12-26,58,I Don't Care,Shakespear's Sister,,False,58,58,5,0.471,0.868,7,-4.414,1,0.135,0.109,0.000703,0.168,0.492,205.666,256440,4
1992-12-26,59,Erotica,Madonna,,False,48,3,11,0.639,0.676,11,-11.168,0,0.061,0.000576,0.434,0.26,0.231,101.956,318573,4
1992-12-26,60,Stand Up (Kick Love Into Motion),Def Leppard,,False,65,60,3,0.603,0.779,4,-7.479,1,0.0273,0.0854,1.58e-05,0.0628,0.792,103.027,272871,4
1992-12-26,61,Everything's Gonna Be Alright,Father M.C.,,False,67,61,4,0.796,0.735,6,-6.998,0,0.205,0.221,0,0.685,0.806,108.234,223840,4
1992-12-26,62,Ditty,Paperboy,,False,77,62,2,0.838,0.452,11,-15.219,0,0.0547,0.0509,0,0.0666,0.708,99.075,245030,4
1992-12-26,63,I Will Be Here For You,Michael W. Smith,,False,55,27,15,0.425,0.519,9,-9.707,1,0.0279,0.185,0,0.102,0.208,143.887,273773,4
1992-12-26,64,"Forever Love (From ""Mo' Money"")",Color Me Badd,,False,61,15,14,0.61,0.363,9,-9.644,1,0.0333,0.586,0.111,0.0672,0.0658,135.886,319400,4
1992-12-26,65,Steam,Peter Gabriel,,False,80,65,2,0.7,0.889,6,-5.027,1,0.0764,0.127,0.000374,0.261,0.681,108.515,363093,4
1992-12-26,66,These Are Days,"10,000 Maniacs",,False,70,66,5,0.611,0.833,3,-7.554,1,0.0351,0.0218,0.000204,0.0923,0.793,108.498,219893,4
1992-12-26,67,Shamrocks And Shenanigans (Boom Shalock Lock Boom),House Of Pain,,False,79,67,3,0.904,0.606,1,-6.122,1,0.286,0.296,0.000197,0.236,0.211,100.195,219107,4
1992-12-26,68,Homies,Lighter Shade Of Brown,,False,74,68,3,0.779,0.386,7,-14.384,1,0.301,0.221,0.00071,0.115,0.376,193.574,211800,4
1992-12-26,69,Pleasure,The Soup Dragons,,False,73,69,3,0.608,0.876,7,-5.432,1,0.0491,0.0104,0,0.0906,0.946,121.037,234720,4
1992-12-26,70,Games,Chuckii Booker,,False,68,68,6,0.642,0.422,10,-13.782,0,0.046,0.0393,0.0101,0.107,0.642,185.834,325600,4
1992-12-26,71,When I Look Into Your Eyes,Firehouse,,False,66,8,20,0.396,0.612,6,-8.039,1,0.0277,0.00288,4.71e-05,0.233,0.241,146.759,239867,4
1992-12-26,72,I Got A Man,Positive K,,False,75,72,2,0.812,0.753,7,-13.252,1,0.118,0.0774,0,0.341,0.787,103.754,232773,4
1992-12-26,73,"Baby, I Believe In You",George LaMond,,False,69,66,4,0.56,0.492,8,-12.753,1,0.0343,0.0934,0.00858,0.104,0.667,170.034,235907,4
1992-12-26,74,Sexual,Goddess,,False,78,74,3,0.224,0.0307,9,-27.341,1,0.0916,0.996,0.925,0.091,0.0355,67.947,415016,4
1992-12-26,76,Don't Walk Away,Jade,,False,86,76,2,0.831,0.915,10,-7.501,0,0.128,0.147,0.00571,0.196,0.881,102.979,216373,4
1992-12-26,77,Chains Around My Heart,Richard Marx,,False,64,44,10,0.481,0.467,6,-10.442,0,0.0292,0.134,1.94e-05,0.13,0.115,81.054,344600,4
1992-12-26,78,Right Now,Al B. Sure!,,False,60,47,18,0.635,0.522,2,-10.498,1,0.0536,0.306,0,0.127,0.47,163.881,354960,4
1992-12-26,79,"The Right Kind Of Love (From ""Beverly Hills, 90210"")",Jeremy Jordan,,False,83,79,3,0.717,0.634,5,-7.736,0,0.036,0.115,0,0.0782,0.896,178.064,273933,4
1992-12-26,80,Forever In Love,Kenny G,,False,95,80,2,0.331,0.318,5,-14.901,1,0.0313,0.336,0.158,0.17,0.111,82.427,299493,4
1992-12-26,81,I Missed The Bus,Kris Kross,,False,84,63,13,0.811,0.634,4,-10.408,0,0.0714,0.00469,0.00943,0.224,0.273,107.915,179160,4
1992-12-26,82,Wicked,Ice Cube,,False,82,55,6,0.803,0.972,10,-4.848,0,0.156,0.192,0,0.102,0.627,106.938,235707,4
1992-12-26,83,Sesame's Treet,Smart E's,,False,71,60,12,0.751,0.908,7,-7.495,0,0.0897,0.000588,0.0599,0.0246,0.744,144.912,210663,4
1992-12-26,84,No One Else On Earth,Wynonna,,False,89,83,10,0.775,0.861,0,-7.113,1,0.0295,0.188,4.2e-06,0.199,0.964,98.649,255400,4
1992-12-26,85,Symphony Of Destruction,Megadeth,,False,87,71,11,0.61,0.891,4,-5.452,0,0.0587,0.000805,0.0928,0.0657,0.51,139.903,246733,4
1992-12-26,86,Yesterdays,Guns N' Roses,,False,85,72,6,0.363,0.849,6,-7.744,1,0.0554,0.0666,0.00517,0.306,0.429,170.627,196227,4
1992-12-26,87,This Could Be The One,Bad Company,,False,94,87,2,0.475,0.58,9,-10.395,1,0.0291,0.0177,1.86e-05,0.0587,0.419,169.929,317627,4
1992-12-26,89,Could've Been Me,Billy Ray Cyrus,,False,0,72,8,0.62,0.611,7,-10.531,1,0.0336,0.0743,0,0.101,0.506,120.468,224773,4
1992-12-26,90,Pick It Up,Home Team,4Va4w2wDvpAlRgBQSzDfUw,True,0,90,1,0.91,0.665,8,-8.374,1,0.0975,0.000132,0.515,0.0869,0.284,111.899,181827,4
1992-12-26,91,Irresistible,Cathy Dennis,3NTbqgdK5bo6Q9E4yBOzUp,True,0,91,1,0.656,0.773,10,-10.309,0,0.0328,0.00293,0.0651,0.316,0.473,118.01,208867,4
1992-12-26,92,Love's Taken Over,Chante Moore,7n7wvN50nYgYAsB7iPGz14,True,0,92,1,0.631,0.724,2,-7.964,1,0.0534,0.0255,0.000291,0.0632,0.718,172.38,399267,4
1992-12-26,93,No Mistakes,Patty Smyth,1Ak9nTnQiO4o6CdNWhk7gq,True,0,93,1,0.691,0.6,9,-9.015,1,0.026,0.0364,0,0.174,0.518,111.366,323427,4
1992-12-26,94,Sleeping With You,Firehouse,5M3ZwYKhBoAKgTqebp4BBi,True,0,94,1,0.584,0.815,3,-8.151,1,0.0325,6.45e-05,0.0367,0.214,0.705,120.799,230733,4
1992-12-26,95,Slow Dance (Hey Mr. DJ),R. Kelly & Public Announcement,5M3ZwYKhBoAKgTqebp4BBi,False,76,43,19,0.746,0.447,10,-10.126,0,0.0325,0.12,0,0.112,0.649,119.87,304600,4
1992-12-26,96,360 Degrees (What Goes Around),Grand Puba,5M3ZwYKhBoAKgTqebp4BBi,False,92,68,11,0.959,0.75,6,-7.732,1,0.171,0.0277,0,0.0713,0.766,102.418,240867,4
1992-12-26,97,Crazy Love,CeCe Peniston,36V3MeyjHoth9rc8x5o4ts,True,0,97,1,0.604,0.667,9,-12.126,0,0.0438,0.00288,2.54e-05,0.108,0.655,91.891,288600,4
1992-12-26,98,Get Up (Move Boy Move),AB Logic,4P8fCMPtAWSCNpUpx5h0Vn,True,0,98,1,0.723,0.604,9,-6.688,0,0.382,0.0781,0,0.233,0.807,89.837,308742,4
1992-12-26,99,"Revolution (From ""Malcolm X"")",Arrested Development,4P8fCMPtAWSCNpUpx5h0Vn,False,96,95,3,0.82,0.648,11,-6.694,0,0.327,0.0843,0.000215,0.247,0.845,97.247,288907,4
1992-12-26,100,Alone With You,Tevin Campbell,4P8fCMPtAWSCNpUpx5h0Vn,False,90,72,11,0.593,0.479,6,-13.138,0,0.051,0.17,9.72e-06,0.0732,0.652,155.913,307827,4
