date,position,title,artist,spotify_id,is_new,last_pos,peak_pos,weeks,danceability,energy,key,loudness,mode,speechiness,acousticness,instrumentalness,liveness,valence,tempo,duration_ms,time_signature
2017-06-17,1,Despacito,Luis Fonsi & Daddy Yankee Featuring Justin Bieber,7A8OfzqXBHYGk61FZTHoeo,False,1,1,20,0.653,0.816,2,-4.353,1,0.167,0.228,0,0.0967,0.816,178.085,228827,4
2017-06-17,2,That's What I Like,Bruno Mars,7A8OfzqXBHYGk61FZTHoeo,False,2,1,20,0.853,0.56,1,-4.961,1,0.0406,0.013,0,0.0944,0.86,134.066,206693,4
2017-06-17,3,I'm The One,"DJ Khaled Featuring Justin Bieber, Quavo, Chance The Rapper & Lil Wayne",7A8OfzqXBHYGk61FZTHoeo,False,3,1,5,0.599,0.667,7,-4.267,1,0.0367,0.0533,0,0.134,0.817,80.984,288877,4
2017-06-17,4,Humble.,Kendrick Lamar,7A8OfzqXBHYGk61FZTHoeo,False,4,1,9,0.908,0.621,1,-6.638,0,0.102,0.000282,5.39e-05,0.0958,0.421,150.011,177000,4
2017-06-17,5,Shape Of You,Ed Sheeran,7A8OfzqXBHYGk61FZTHoeo,False,5,1,21,0.825,0.652,1,-3.183,0,0.0802,0.581,0,0.0931,0.931,95.977,233713,4
2017-06-17,6,Mask Off,Future,7A8OfzqXBHYGk61FZTHoeo,False,6,5,15,0.833,0.434,2,-8.795,1,0.431,0.0102,0.0219,0.165,0.281,150.062,204600,4
2017-06-17,7,Stay,Zedd & Alessia Cara,7A8OfzqXBHYGk61FZTHoeo,False,7,7,14,0.69,0.622,5,-5.025,0,0.0622,0.253,0,0.116,0.544,102.04,210091,4
2017-06-17,8,Something Just Like This,The Chainsmokers & Coldplay,7A8OfzqXBHYGk61FZTHoeo,False,8,3,15,0.617,0.635,11,-6.769,0,0.0317,0.0498,1.44e-05,0.164,0.446,103.019,247160,4
2017-06-17,9,XO TOUR Llif3,Lil Uzi Vert,7A8OfzqXBHYGk61FZTHoeo,False,9,8,10,0.732,0.75,11,-6.366,0,0.231,0.00264,0,0.109,0.401,155.096,182707,4
2017-06-17,10,Congratulations,Post Malone Featuring Quavo,7A8OfzqXBHYGk61FZTHoeo,False,13,10,23,0.63,0.804,6,-4.183,1,0.0363,0.215,0,0.253,0.492,123.146,220293,4
2017-06-17,11,Issues,Julia Michaels,7A8OfzqXBHYGk61FZTHoeo,False,11,11,19,0.728,0.415,8,-6.852,1,0.0639,0.401,0,0.0616,0.455,114.145,176320,4
2017-06-17,12,Say You Won't Let Go,James Arthur,7A8OfzqXBHYGk61FZTHoeo,False,12,11,32,0.358,0.557,10,-7.398,1,0.059,0.695,0,0.0902,0.494,85.043,211467,4
2017-06-17,13,It Ain't Me,Kygo x Selena Gomez,7A8OfzqXBHYGk61FZTHoeo,False,10,10,16,0.713,0.658,0,-5.362,1,0.0748,0.0161,0.000138,0.0607,0.539,115.024,192000,4
2017-06-17,14,Body Like A Back Road,Sam Hunt,7A8OfzqXBHYGk61FZTHoeo,False,14,6,18,0.732,0.458,5,-7.225,1,0.0311,0.447,0,0.136,0.661,98.938,165387,4
2017-06-17,15,Believer,Imagine Dragons,7A8OfzqXBHYGk61FZTHoeo,False,15,15,17,0.776,0.78,10,-4.374,0,0.128,0.0622,0,0.081,0.666,124.949,204347,4
2017-06-17,16,iSpy,KYLE Featuring Lil Yachty,7A8OfzqXBHYGk61FZTHoeo,False,16,4,23,0.746,0.653,7,-6.745,1,0.289,0.378,0,0.229,0.672,75.016,253107,4
2017-06-17,17,Redbone,Childish Gambino,7A8OfzqXBHYGk61FZTHoeo,False,22,17,26,0.743,0.347,1,-11.174,1,0.121,0.167,0.00951,0.103,0.572,160.143,326933,4
2017-06-17,18,Unforgettable,French Montana Featuring Swae Lee,7A8OfzqXBHYGk61FZTHoeo,False,23,18,8,0.726,0.769,6,-5.043,1,0.123,0.0293,0.0101,0.104,0.733,97.985,233902,4
2017-06-17,19,In Case You Didn't Know,Brett Young,7A8OfzqXBHYGk61FZTHoeo,False,19,19,17,0.607,0.536,10,-7.306,1,0.0305,0.386,0,0.102,0.434,147.986,224853,4
2017-06-17,20,Rolex,Ayo & Teo,7A8OfzqXBHYGk61FZTHoeo,False,31,20,16,0.804,0.886,1,-2.512,1,0.04,0.0837,0,0.266,0.789,144.946,238587,4
2017-06-17,21,Malibu,Miley Cyrus,7A8OfzqXBHYGk61FZTHoeo,False,18,10,4,0.573,0.781,8,-6.406,1,0.0555,0.0767,2.64e-05,0.0813,0.343,139.934,231907,4
2017-06-17,22,There's Nothing Holdin' Me Back,Shawn Mendes,7A8OfzqXBHYGk61FZTHoeo,False,25,22,6,0.866,0.811,11,-4.063,0,0.0553,0.375,0,0.078,0.969,121.995,199440,4
2017-06-17,23,Location,Khalid,7A8OfzqXBHYGk61FZTHoeo,False,21,16,21,0.736,0.449,1,-11.462,0,0.425,0.33,0.000162,0.0898,0.326,80.126,219080,4
2017-06-17,24,Sign Of The Times,Harry Styles,7A8OfzqXBHYGk61FZTHoeo,False,17,4,8,0.516,0.595,5,-4.63,1,0.0313,0.0275,0,0.109,0.222,119.972,340707,4
2017-06-17,25,DNA.,Kendrick Lamar,7A8OfzqXBHYGk61FZTHoeo,False,20,4,7,0.638,0.523,1,-6.664,1,0.357,0.00454,0,0.0842,0.422,139.913,185947,4
2017-06-17,26,Now Or Never,Halsey,7A8OfzqXBHYGk61FZTHoeo,False,26,26,8,0.67,0.585,6,-4.861,0,0.0354,0.107,1.11e-06,0.131,0.447,110.03,214802,4
2017-06-17,27,Passionfruit,Drake,7A8OfzqXBHYGk61FZTHoeo,False,24,8,11,0.809,0.463,11,-11.377,1,0.0396,0.256,0.085,0.109,0.364,111.98,298941,4
2017-06-17,28,Castle On The Hill,Ed Sheeran,7A8OfzqXBHYGk61FZTHoeo,False,30,6,21,0.461,0.834,2,-4.868,1,0.0989,0.0232,1.14e-05,0.14,0.471,135.007,261154,4
2017-06-17,29,Bad And Boujee,Migos Featuring Lil Uzi Vert,7A8OfzqXBHYGk61FZTHoeo,False,28,1,29,0.927,0.665,11,-5.313,1,0.244,0.061,0,0.123,0.175,127.076,343150,4
2017-06-17,30,Slide,Calvin Harris Featuring Frank Ocean & Migos,7A8OfzqXBHYGk61FZTHoeo,False,29,25,14,0.736,0.795,1,-3.299,0,0.0545,0.498,1.21e-06,0.254,0.511,104.066,230813,4
2017-06-17,31,Swalla,Jason Derulo Featuring Nicki Minaj & Ty Dolla $ign,7A8OfzqXBHYGk61FZTHoeo,False,33,31,11,0.696,0.817,1,-3.862,1,0.109,0.075,0,0.187,0.782,98.064,216409,4
2017-06-17,32,Closer,The Chainsmokers Featuring Halsey,7A8OfzqXBHYGk61FZTHoeo,False,32,1,44,0.748,0.524,8,-5.599,1,0.0338,0.414,0,0.111,0.661,95.01,244960,4
2017-06-17,33,Slow Hands,Niall Horan,7A8OfzqXBHYGk61FZTHoeo,False,52,33,5,0.735,0.425,0,-6.648,1,0.0464,0.011,0,0.055,0.848,85.896,188174,4
2017-06-17,34,Tunnel Vision,Kodak Black,7A8OfzqXBHYGk61FZTHoeo,False,34,6,15,0.497,0.489,11,-7.724,0,0.294,0.0576,9.91e-05,0.122,0.231,171.853,268187,4
2017-06-17,35,Goosebumps,Travis Scott,7A8OfzqXBHYGk61FZTHoeo,False,36,32,29,0.841,0.593,1,-7.846,1,0.0379,0.418,0,0.124,0.808,124.917,162803,4
2017-06-17,36,T-Shirt,Migos,7A8OfzqXBHYGk61FZTHoeo,False,37,19,20,0.865,0.687,10,-3.744,0,0.217,0.242,0,0.158,0.486,139.023,242407,4
2017-06-17,37,Attention,Charlie Puth,7A8OfzqXBHYGk61FZTHoeo,False,35,35,6,0.775,0.613,3,-4.586,0,0.0542,0.109,2.33e-05,0.134,0.797,100.066,208787,4
2017-06-17,38,24K Magic,Bruno Mars,7A8OfzqXBHYGk61FZTHoeo,False,38,4,34,0.818,0.803,1,-4.282,1,0.0797,0.034,0,0.153,0.632,106.97,225983,4
2017-06-17,39,Hurricane,Luke Combs,7A8OfzqXBHYGk61FZTHoeo,False,40,31,16,0.464,0.813,10,-6.185,1,0.0416,0.0153,0,0.254,0.515,75.977,222533,4
2017-06-17,40,Swang,Rae Sremmurd,7A8OfzqXBHYGk61FZTHoeo,False,39,26,24,0.681,0.314,8,-9.319,1,0.0581,0.2,9.82e-06,0.1,0.166,139.992,208120,4
2017-06-17,41,Drowning,A Boogie Wit da Hoodie Featuring Kodak Black,7A8OfzqXBHYGk61FZTHoeo,False,48,41,9,0.839,0.81,5,-5.274,0,0.0568,0.501,0,0.117,0.814,129.014,209269,4
2017-06-17,42,Scars To Your Beautiful,Alessia Cara,7A8OfzqXBHYGk61FZTHoeo,False,45,8,40,0.573,0.739,0,-5.74,1,0.129,0.0285,0,0.111,0.451,97.085,230227,4
2017-06-17,43,Rockabye,Clean Bandit Featuring Sean Paul & Anne-Marie,7A8OfzqXBHYGk61FZTHoeo,False,41,9,26,0.72,0.763,9,-4.068,0,0.0523,0.406,0,0.18,0.742,101.965,251088,4
2017-06-17,44,Slippery,Migos Featuring Gucci Mane,7A8OfzqXBHYGk61FZTHoeo,False,51,44,10,0.92,0.674,1,-5.662,0,0.264,0.307,0,0.104,0.741,141.967,304041,4
2017-06-17,45,Bad Liar,Selena Gomez,7A8OfzqXBHYGk61FZTHoeo,False,27,27,3,0.965,0.414,1,-6.408,1,0.0713,0.189,0,0.0767,0.728,121.032,214648,4
2017-06-17,46,Paris,The Chainsmokers,7A8OfzqXBHYGk61FZTHoeo,False,53,6,20,0.646,0.644,2,-6.763,1,0.031,0.0243,0,0.0888,0.251,99.999,221520,4
2017-06-17,47,Everyday We Lit,YFN Lucci Featuring PnB Rock,7A8OfzqXBHYGk61FZTHoeo,False,59,47,8,0.712,0.383,2,-15.116,1,0.0966,0.12,0,0.0746,0.245,156.116,206211,4
2017-06-17,48,Cold,Maroon 5 Featuring Future,7A8OfzqXBHYGk61FZTHoeo,False,44,16,16,0.693,0.717,9,-6.346,0,0.107,0.14,0,0.0464,0.412,99.836,234308,4
2017-06-17,49,Magnolia,Playboi Carti,7A8OfzqXBHYGk61FZTHoeo,False,58,49,5,0.791,0.582,11,-7.323,0,0.286,0.0114,0,0.35,0.443,162.991,181812,4
2017-06-17,50,Look At Me!,XXXTENTACION,7A8OfzqXBHYGk61FZTHoeo,False,49,34,17,0.763,0.726,1,-6.405,1,0.282,0.259,0,0.0976,0.349,139.059,126346,4
2017-06-17,51,The Cure,Lady Gaga,7A8OfzqXBHYGk61FZTHoeo,False,57,39,7,0.696,0.506,8,-4.863,1,0.0325,0.0799,0,0.0893,0.516,100.003,211364,4
2017-06-17,52,"God, Your Mama, And Me",Florida Georgia Line Featuring Backstreet Boys,7A8OfzqXBHYGk61FZTHoeo,False,60,52,10,0.443,0.817,7,-3.729,1,0.0511,0.318,0,0.374,0.652,168.1,183413,4
2017-06-17,53,If I Told You,Darius Rucker,7A8OfzqXBHYGk61FZTHoeo,False,55,53,7,0.532,0.64,9,-6.684,1,0.0314,0.344,0,0.361,0.308,84.029,212320,4
2017-06-17,54,Love.,Kendrick Lamar Featuring Zacari,7A8OfzqXBHYGk61FZTHoeo,False,54,18,7,0.8,0.585,10,-7.343,1,0.0924,0.264,0,0.153,0.779,126.058,213400,4
2017-06-17,55,The Fighter,Keith Urban Featuring Carrie Underwood,7A8OfzqXBHYGk61FZTHoeo,False,62,38,17,0.681,0.845,11,-5.147,0,0.0525,0.0304,0,0.197,0.761,132.023,184040,4
2017-06-17,56,Black,Dierks Bentley,7A8OfzqXBHYGk61FZTHoeo,False,56,56,17,0.652,0.654,1,-6.69,1,0.0377,0.252,0.000553,0.117,0.605,120.019,211160,4
2017-06-17,57,First Day Out,Tee Grizzley,7A8OfzqXBHYGk61FZTHoeo,False,64,57,9,0.587,0.711,1,-6.33,1,0.42,0.171,0,0.125,0.381,98.008,254694,4
2017-06-17,58,Heavy,Linkin Park Featuring Kiiara,7A8OfzqXBHYGk61FZTHoeo,False,50,50,15,0.59,0.671,9,-6.098,1,0.0706,0.0484,0,0.0604,0.438,149.982,169801,4
2017-06-17,59,Craving You,Thomas Rhett Featuring Maren Morris,7A8OfzqXBHYGk61FZTHoeo,False,65,53,9,0.613,0.839,9,-3.799,0,0.0352,0.000854,0,0.341,0.526,104.975,223627,4
2017-06-17,60,Portland,Drake Featuring Quavo & Travis Scott,7A8OfzqXBHYGk61FZTHoeo,False,61,9,11,0.925,0.443,1,-8.216,1,0.264,0.0172,0,0.276,0.35,136.078,236615,4
2017-06-17,61,Crying In The Club,Camila Cabello,7A8OfzqXBHYGk61FZTHoeo,False,47,47,2,0.334,0.617,6,-5.834,0,0.383,0.334,0,0.163,0.603,85.227,216391,4
2017-06-17,62,1-800-273-8255,Logic Featuring Alessia Cara & Khalid,7A8OfzqXBHYGk61FZTHoeo,False,63,47,5,0.62,0.574,5,-7.788,0,0.0479,0.569,0,0.19,0.357,100.023,250173,4
2017-06-17,63,How Not To,Dan + Shay,7A8OfzqXBHYGk61FZTHoeo,False,68,63,9,0.501,0.836,11,-3.587,0,0.0491,0.208,0,0.152,0.618,159.863,192000,4
2017-06-17,64,My Girl,Dylan Scott,7A8OfzqXBHYGk61FZTHoeo,False,73,64,6,0.652,0.719,1,-7.251,1,0.033,0.0353,0,0.108,0.24,94.969,197640,4
2017-06-17,65,Strip That Down,Liam Payne Featuring Quavo,7A8OfzqXBHYGk61FZTHoeo,False,42,42,2,0.874,0.497,6,-5.484,1,0.0562,0.22,0,0.0761,0.542,106.023,204502,4
2017-06-17,66,Privacy,Chris Brown,7A8OfzqXBHYGk61FZTHoeo,False,72,66,5,0.741,0.58,0,-7.741,1,0.378,0.153,0,0.109,0.428,97.092,220964,4
2017-06-17,67,Every Time I Hear That Song,Blake Shelton,7A8OfzqXBHYGk61FZTHoeo,False,75,67,4,0.523,0.725,2,-5.448,1,0.0339,0.0558,6.96e-06,0.0937,0.528,155.855,214800,4
2017-06-17,68,You Look Good,Lady Antebellum,7A8OfzqXBHYGk61FZTHoeo,False,71,60,8,0.656,0.917,0,-4.652,1,0.0495,0.045,0.000732,0.0878,0.961,152.067,181000,4
2017-06-17,69,Losin Control,Russ,7A8OfzqXBHYGk61FZTHoeo,False,69,62,14,0.759,0.245,6,-6.545,1,0.138,0.515,0.000154,0.102,0.209,96.992,237507,4
2017-06-17,70,Felices Los 4,Maluma,7A8OfzqXBHYGk61FZTHoeo,False,90,70,3,0.766,0.756,5,-5.861,1,0.132,0.213,0,0.349,0.716,94.027,230000,4
2017-06-17,71,Drinkin' Problem,Midland,7A8OfzqXBHYGk61FZTHoeo,False,78,71,4,0.622,0.763,9,-6.4,1,0.0263,0.055,8.91e-06,0.313,0.621,102.0,220800,4
2017-06-17,72,Loyalty.,Kendrick Lamar Featuring Rihanna,7A8OfzqXBHYGk61FZTHoeo,False,70,14,7,0.658,0.535,9,-8.983,0,0.0573,0.0265,0,0.2,0.419,110.684,227360,4
2017-06-17,73,Flatliner,Cole Swindell,7A8OfzqXBHYGk61FZTHoeo,False,81,73,6,0.555,0.896,0,-3.295,1,0.0388,0.00434,0,0.145,0.578,114.995,177067,4
2017-06-17,74,Somethin Tells Me,Bryson Tiller,3Jrs7cC2OJNlNSy9VnDOMZ,True,0,74,1,0.735,0.588,5,-7.197,0,0.226,0.0356,0,0.107,0.435,90.002,194267,4
2017-06-17,75,Most Girls,Hailee Steinfeld,3Jrs7cC2OJNlNSy9VnDOMZ,False,77,75,2,0.756,0.572,9,-7.019,1,0.0763,0.0478,0,0.0853,0.417,102.986,204400,4
2017-06-17,76,Yours If You Want It,Rascal Flatts,3Jrs7cC2OJNlNSy9VnDOMZ,False,76,76,2,0.554,0.903,8,-3.152,1,0.0515,0.0103,0,0.107,0.419,112.998,206827,4
2017-06-17,77,No Promises,Cheat Codes Featuring Demi Lovato,3Jrs7cC2OJNlNSy9VnDOMZ,False,74,74,3,0.739,0.619,10,-6.669,1,0.162,0.0572,0,0.105,0.58,112.961,222787,4
2017-06-17,78,Swish Swish,Katy Perry Featuring Nicki Minaj,3Jrs7cC2OJNlNSy9VnDOMZ,False,46,46,2,0.838,0.705,5,-5.201,0,0.0449,0.0184,1.82e-05,0.102,0.583,119.953,242520,4
2017-06-17,79,Gyalchester,Drake,3Jrs7cC2OJNlNSy9VnDOMZ,False,84,29,9,0.877,0.391,1,-8.196,1,0.063,0.0317,0.000502,0.0945,0.122,131.018,189230,4
2017-06-17,80,Peek A Boo,Lil Yachty Featuring Migos,3Jrs7cC2OJNlNSy9VnDOMZ,False,0,78,3,0.957,0.593,1,-6.982,1,0.301,0.06,0,0.0908,0.284,127.027,247613,4
2017-06-17,81,Thunder,Imagine Dragons,3Jrs7cC2OJNlNSy9VnDOMZ,False,82,70,5,0.605,0.822,0,-4.833,1,0.0438,0.00671,0.134,0.147,0.288,167.997,187147,4
2017-06-17,82,Wokeuplikethis*,Playboi Carti Featuring Lil Uzi Vert,3Jrs7cC2OJNlNSy9VnDOMZ,False,79,76,5,0.785,0.62,8,-6.667,1,0.254,0.0138,0,0.15,0.478,78.477,235535,4
2017-06-17,83,Me Enamore,Shakira,3Jrs7cC2OJNlNSy9VnDOMZ,False,0,83,2,0.74,0.879,9,-2.251,0,0.105,0.193,8.25e-05,0.0928,0.948,103.71,226893,4
2017-06-17,84,Scared To Be Lonely,Martin Garrix & Dua Lipa,3Jrs7cC2OJNlNSy9VnDOMZ,False,80,76,13,0.584,0.54,1,-7.786,0,0.0576,0.0895,0,0.261,0.195,137.972,220883,4
2017-06-17,85,Self-Made,Bryson Tiller,2rUwQj4SWaP2anuGDtNpYR,True,0,85,1,0.932,0.702,7,-3.459,0,0.0904,0.00304,1.86e-05,0.267,0.533,143.001,167853,4
2017-06-17,86,Weak,AJR,2rUwQj4SWaP2anuGDtNpYR,False,96,86,4,0.67,0.643,5,-4.553,1,0.0465,0.118,0,0.192,0.703,123.979,201159,4
2017-06-17,87,Good Drank,2 Chainz x Gucci Mane x Quavo,2rUwQj4SWaP2anuGDtNpYR,False,88,82,12,0.836,0.776,4,-0.804,0,0.239,0.274,0,0.113,0.37,130.033,222707,4
2017-06-17,88,Met Gala,Gucci Mane Featuring Offset,2XaInsPPUkZRkY4uFJ3AHK,True,0,88,1,0.817,0.587,2,-6.502,1,0.108,0.052,0.00165,0.185,0.352,140.062,209143,4
2017-06-17,89,Don't Get Too High,Bryson Tiller,0OVhQZkNe7lh0fQeH96EFW,True,0,89,1,0.88,0.495,1,-3.476,1,0.0695,0.0148,1.47e-06,0.121,0.469,124.024,209040,4
2017-06-17,90,No Such Thing As A Broken Heart,Old Dominion,0OlS52TmtK2gPaEtdmr7DN,True,0,90,1,0.651,0.782,8,-4.295,1,0.0718,0.295,0,0.107,0.945,171.987,176893,4
2017-06-17,91,Run Me Dry,Bryson Tiller,5GG3knKdxKWrNboRijxeKF,True,0,91,1,0.646,0.756,9,-9.017,0,0.488,0.393,3e-05,0.202,0.602,193.88,169267,4
2017-06-17,92,Human,Rag'n'Bone Man,5GG3knKdxKWrNboRijxeKF,False,89,74,6,0.602,0.707,11,-4.097,1,0.302,0.393,0,0.165,0.554,75.09,200187,4
2017-06-17,93,Hometown Girl,Josh Turner,5GG3knKdxKWrNboRijxeKF,False,85,56,14,0.502,0.792,3,-5.473,0,0.0335,0.304,0.0385,0.143,0.44,155.902,215080,4
2017-06-17,94,There For You,Martin Garrix x Troye Sivan,6jA8HL9i4QGzsj6fjoxp8Y,True,0,94,1,0.611,0.644,6,-7.607,0,0.0553,0.124,0,0.124,0.13,105.969,221904,4
2017-06-17,95,Do Re Mi,blackbear,6jA8HL9i4QGzsj6fjoxp8Y,False,93,87,6,0.745,0.593,8,-6.35,1,0.0526,0.00522,5.25e-06,0.123,0.17,111.002,212027,3
2017-06-17,96,Bon Appetit,Katy Perry Featuring Migos,6jA8HL9i4QGzsj6fjoxp8Y,False,67,59,4,0.8,0.795,6,-5.835,1,0.0626,0.131,9.02e-05,0.221,0.528,106.031,227813,4
2017-06-17,97,Element.,Kendrick Lamar,6jA8HL9i4QGzsj6fjoxp8Y,False,83,16,7,0.748,0.705,4,-4.547,0,0.485,0.204,0,0.246,0.483,189.891,208733,4
2017-06-17,98,No Longer Friends,Bryson Tiller,4IdAIZRVkwuQQnHpi529cn,True,0,98,1,0.651,0.663,11,-7.78,1,0.327,0.205,0,0.105,0.377,114.137,134747,4
2017-06-17,99,Butterfly Effect,Travis Scott,2cYqizR4lgvp4Qu6IQ3qGN,True,0,99,1,0.763,0.628,11,-5.85,1,0.05,0.0531,0,0.114,0.193,140.958,190557,4
2017-06-17,100,Strangers,Halsey Featuring Lauren Jauregui,11EDhDAVDtGPoSar6ootYA,True,0,100,1,0.69,0.784,11,-4.724,1,0.056,0.01,4.08e-05,0.22,0.284,109.969,221206,4
