date,position,title,artist,spotify_id,is_new,last_pos,peak_pos,weeks,danceability,energy,key,loudness,mode,speechiness,acousticness,instrumentalness,liveness,valence,tempo,duration_ms,time_signature
1990-11-17,1,Love Takes Time,Mariah Carey,20nb0Wl1yqoEERbUSILuG1,False,1,1,10,0.403,0.338,8,-12.371,0,0.0322,0.727,0,0.0849,0.233,126.23,229227,4
1990-11-17,2,Pray,M.C. Hammer,20nb0Wl1yqoEERbUSILuG1,False,2,2,8,0.967,0.631,6,-12.426,0,0.137,0.000347,5.48e-05,0.488,0.898,121.437,313200,4
1990-11-17,3,More Than Words Can Say,Alias,20nb0Wl1yqoEERbUSILuG1,False,6,3,11,0.412,0.376,4,-11.789,1,0.0289,0.609,0.00223,0.11,0.153,69.064,234196,4
1990-11-17,4,Groove Is In The Heart,Deee-Lite,20nb0Wl1yqoEERbUSILuG1,False,8,4,10,0.694,0.881,1,-4.053,0,0.0701,0.0153,0.0196,0.0851,0.924,121.554,231787,4
1990-11-17,5,I'm Your Baby Tonight,Whitney Houston,20nb0Wl1yqoEERbUSILuG1,False,13,5,5,0.665,0.899,6,-7.75,1,0.0877,0.303,2.21e-06,0.445,0.873,165.16,299427,3
1990-11-17,6,Ice Ice Baby,Vanilla Ice,20nb0Wl1yqoEERbUSILuG1,False,3,1,11,0.979,0.792,2,-2.784,1,0.0388,0.0025,7.71e-06,0.102,0.583,116.012,254467,4
1990-11-17,7,Something To Believe In,Poison,20nb0Wl1yqoEERbUSILuG1,False,10,7,7,0.52,0.711,3,-5.009,1,0.0386,0.266,1.09e-05,0.148,0.226,133.947,328360,4
1990-11-17,8,Because I Love You (The Postman Song),Stevie B,20nb0Wl1yqoEERbUSILuG1,False,15,8,7,0.506,0.321,1,-11.796,1,0.0289,0.74,1.21e-06,0.125,0.0724,128.391,300107,4
1990-11-17,9,I Don't Have The Heart,James Ingram,20nb0Wl1yqoEERbUSILuG1,False,5,1,16,0.487,0.423,2,-8.181,1,0.0243,0.658,0,0.109,0.334,88.883,253507,4
1990-11-17,10,From A Distance,Bette Midler,20nb0Wl1yqoEERbUSILuG1,False,16,10,7,0.536,0.242,7,-11.716,1,0.0277,0.674,0,0.331,0.331,137.989,276346,4
1990-11-17,11,Knockin' Boots,Candyman,20nb0Wl1yqoEERbUSILuG1,False,9,9,12,0.94,0.662,7,-8.786,1,0.292,0.0954,0,0.376,0.657,101.403,233027,4
1990-11-17,12,Feels Good,Tony Toni Tone,20nb0Wl1yqoEERbUSILuG1,False,12,12,12,0.827,0.852,2,-12.052,1,0.0942,0.115,1.49e-05,0.299,0.635,117.17,298373,4
1990-11-17,13,Giving You The Benefit,Pebbles,20nb0Wl1yqoEERbUSILuG1,False,4,4,14,0.706,0.8,5,-10.496,0,0.0468,0.144,0.00137,0.0998,0.931,103.074,341960,4
1990-11-17,14,So Close,Daryl Hall John Oates,20nb0Wl1yqoEERbUSILuG1,False,18,14,8,0.556,0.565,0,-10.818,1,0.0332,0.0386,0,0.102,0.416,165.693,279800,4
1990-11-17,15,Black Cat,Janet Jackson,20nb0Wl1yqoEERbUSILuG1,False,7,1,10,0.705,0.913,4,-7.253,0,0.0484,0.103,0.00111,0.216,0.665,114.959,290573,4
1990-11-17,16,Hippychick,Soho,20nb0Wl1yqoEERbUSILuG1,False,20,16,11,0.735,0.758,6,-13.64,1,0.0534,0.098,0.00675,0.101,0.793,98.969,192360,4
1990-11-17,17,The Way You Do The Things You Do,UB40,20nb0Wl1yqoEERbUSILuG1,False,24,17,10,0.865,0.414,5,-13.256,0,0.168,0.225,0.00159,0.0425,0.937,80.852,182467,4
1990-11-17,18,Stranded,Heart,20nb0Wl1yqoEERbUSILuG1,False,23,18,9,0.388,0.55,6,-9.903,1,0.0311,0.157,0,0.0913,0.253,159.978,238827,3
1990-11-17,19,Impulsive,Wilson Phillips,20nb0Wl1yqoEERbUSILuG1,False,27,19,6,0.657,0.76,4,-8.613,1,0.0298,0.171,0.00551,0.224,0.71,107.872,274267,4
1990-11-17,20,Cherry Pie,Warrant,20nb0Wl1yqoEERbUSILuG1,False,11,10,11,0.472,0.946,2,-4.591,1,0.145,0.0372,0,0.352,0.486,177.489,201027,4
1990-11-17,21,Can't Stop,After 7,20nb0Wl1yqoEERbUSILuG1,False,14,6,17,0.727,0.811,0,-11.547,0,0.0385,0.245,1.22e-05,0.192,0.808,97.098,247907,4
1990-11-17,22,High Enough,Damn Yankees,20nb0Wl1yqoEERbUSILuG1,False,28,22,9,0.273,0.537,2,-9.612,1,0.0306,0.0241,0,0.0922,0.232,81.814,287320,4
1990-11-17,23,Close To You,Maxi Priest,20nb0Wl1yqoEERbUSILuG1,False,17,1,21,0.781,0.478,6,-15.427,1,0.0561,0.0849,3.93e-06,0.0877,0.962,95.992,325800,4
1990-11-17,24,Tom's Diner,DNA Featuring Suzanne Vega,20nb0Wl1yqoEERbUSILuG1,False,31,24,7,0.86,0.439,6,-12.264,0,0.0495,0.0204,0.0147,0.0465,0.725,99.144,228307,4
1990-11-17,25,Wiggle It,2 In A Room,20nb0Wl1yqoEERbUSILuG1,False,30,25,7,0.781,0.838,2,-13.943,1,0.0494,0.0718,5.42e-06,0.0381,0.849,122.819,244133,4
1990-11-17,26,Freedom,George Michael,20nb0Wl1yqoEERbUSILuG1,False,33,26,4,0.677,0.852,5,-10.856,1,0.045,0.225,3.95e-05,0.0595,0.93,91.691,390862,4
1990-11-17,27,Lyin' To Myself,David Cassidy,20nb0Wl1yqoEERbUSILuG1,False,29,27,9,0.858,0.482,7,-6.81,1,0.0308,0.295,7.65e-05,0.085,0.374,100.032,227160,4
1990-11-17,28,Unchained Melody,The Righteous Brothers,20nb0Wl1yqoEERbUSILuG1,False,22,19,7,0.339,0.208,0,-16.725,1,0.0308,0.396,0.000519,0.18,0.288,98.54,218013,3
1990-11-17,29,Joey,Concrete Blonde,20nb0Wl1yqoEERbUSILuG1,False,19,19,14,0.607,0.788,7,-5.326,1,0.0293,0.0151,0.0136,0.173,0.334,118.696,248960,4
1990-11-17,30,"Miracle (From ""Young Guns II"")",Jon Bon Jovi,20nb0Wl1yqoEERbUSILuG1,False,35,30,4,0.577,0.677,3,-10.327,1,0.0245,0.367,0,0.493,0.683,92.007,319427,4
1990-11-17,31,My Love Is A Fire,Donny Osmond,20nb0Wl1yqoEERbUSILuG1,False,38,31,6,0.726,0.929,0,-11.121,1,0.0622,0.059,7.34e-05,0.687,0.43,115.393,334973,4
1990-11-17,32,B.B.D. (I Thought It Was Me)?,Bell Biv DeVoe,20nb0Wl1yqoEERbUSILuG1,False,37,32,6,0.745,0.754,7,-9.52,1,0.0423,0.0035,5.14e-05,0.0547,0.714,105.569,275293,4
1990-11-17,33,Think,Information Society,20nb0Wl1yqoEERbUSILuG1,False,40,33,7,0.622,0.72,0,-13.475,1,0.0464,3.46e-05,0.00308,0.323,0.904,120.942,234880,4
1990-11-17,34,Sensitivity,Ralph Tresvant,20nb0Wl1yqoEERbUSILuG1,False,48,34,3,0.683,0.661,1,-12.823,1,0.0459,0.137,0.557,0.0772,0.707,96.956,281333,4
1990-11-17,35,Heart Like A Wheel,The Human League,20nb0Wl1yqoEERbUSILuG1,False,32,32,9,0.587,0.888,7,-10.847,0,0.0328,0.392,0.000911,0.285,0.635,119.987,270173,4
1990-11-17,36,Unchained Melody,The Righteous Brothers,20nb0Wl1yqoEERbUSILuG1,False,25,4,13,0.339,0.208,0,-16.725,1,0.0308,0.396,0.000519,0.18,0.288,98.54,218013,3
1990-11-17,37,Suicide Blonde,INXS,20nb0Wl1yqoEERbUSILuG1,False,21,9,11,0.644,0.97,2,-3.166,1,0.111,0.00274,0.000234,0.295,0.634,120.328,232010,4
1990-11-17,38,Miles Away,Winger,20nb0Wl1yqoEERbUSILuG1,False,43,38,6,0.363,0.528,5,-10.08,1,0.0305,0.0661,0,0.334,0.317,182.21,252867,4
1990-11-17,39,One And Only Man,Steve Winwood,20nb0Wl1yqoEERbUSILuG1,False,44,39,3,0.606,0.87,2,-9.012,0,0.0282,0.0119,0.00386,0.127,0.855,104.99,302733,4
1990-11-17,40,Everybody Everybody,Black Box,20nb0Wl1yqoEERbUSILuG1,False,26,8,16,0.712,0.785,5,-6.418,0,0.0386,0.00363,6.95e-06,0.0878,0.975,117.643,247002,4
1990-11-17,41,(Can't Live Without Your) Love And Affection,Nelson,20nb0Wl1yqoEERbUSILuG1,False,34,1,20,0.305,0.363,2,-17.456,1,0.0425,0.992,0.918,0.12,0.965,127.773,161533,4
1990-11-17,42,Missunderstanding,Al B. Sure!,20nb0Wl1yqoEERbUSILuG1,False,47,42,6,0.736,0.72,1,-9.25,1,0.0396,0.0238,0.00176,0.0642,0.871,112.91,267240,4
1990-11-17,43,Fly To the Angels,Slaughter,20nb0Wl1yqoEERbUSILuG1,False,39,19,14,0.496,0.576,0,-12.26,1,0.0352,0.073,0.000277,0.101,0.371,119.953,272240,4
1990-11-17,44,Fairweather Friend,Johnny Gill,20nb0Wl1yqoEERbUSILuG1,False,52,44,5,0.721,0.803,11,-8.579,1,0.0521,0.0101,6.64e-06,0.0637,0.786,105.12,276427,4
1990-11-17,45,And So It Goes,Billy Joel,20nb0Wl1yqoEERbUSILuG1,False,51,45,5,0.433,0.0871,0,-14.532,1,0.0341,0.91,1.98e-05,0.113,0.336,135.498,217573,4
1990-11-17,46,Justify My Love,Madonna,6BWRvw630R8z2vNMok6quI,True,0,46,1,0.705,0.821,1,-7.085,1,0.128,0.00244,0.684,0.0572,0.456,99.642,294267,4
1990-11-17,48,After The Rain,Nelson,,False,56,48,3,0.461,0.867,3,-5.879,1,0.0684,0.0109,0.000164,0.33,0.611,125.441,245862,4
1990-11-17,49,The First Time,Surface,,False,63,49,3,0.639,0.375,10,-11.148,1,0.0277,0.264,0.000546,0.0872,0.116,126.421,255427,4
1990-11-17,50,For You,The Outfield,,False,57,50,3,0.623,0.675,10,-9.196,1,0.0309,0.226,8.37e-05,0.156,0.633,118.9,267280,4
1990-11-17,51,Praying For Time,George Michael,,False,36,1,12,0.581,0.622,10,-14.878,1,0.0354,0.0471,0.0162,0.0915,0.257,127.814,280981,4
1990-11-17,52,Romeo,Dino,,False,41,6,15,0.668,0.892,7,-6.767,0,0.0775,0.0766,1e-05,0.135,0.899,108.237,256733,4
1990-11-17,53,Hang In Long Enough,Phil Collins,,False,69,53,2,0.764,0.82,10,-5.153,0,0.0349,0.321,0.0219,0.917,0.56,119.985,285000,4
1990-11-17,54,Livin' In The Light,Caron Wheeler,,False,53,53,8,0.674,0.855,2,-8.373,1,0.0697,0.0072,0.00335,0.0545,0.567,102.94,275027,4
1990-11-17,55,Something Happened On The Way To Heaven,Phil Collins,,False,42,4,16,0.656,0.88,5,-4.137,0,0.0287,0.184,0.00609,0.272,0.88,114.613,291587,4
1990-11-17,56,Just Another Dream,Cathy Dennis,,False,60,56,4,0.666,0.696,0,-13.459,0,0.0367,0.03,0.114,0.0659,0.844,118.791,235613,4
1990-11-17,57,Wherever Would I Be,Cheap Trick,,False,61,57,4,0.49,0.516,7,-12.549,1,0.0265,0.208,0,0.101,0.22,73.922,246187,4
1990-11-17,58,Do Me!,Bell Biv DeVoe,,False,46,3,21,0.716,0.772,10,-6.816,0,0.037,0.134,2.15e-06,0.35,0.671,107.823,272440,4
1990-11-17,59,I Wanna Get With U,Guy,,False,73,59,2,0.26,0.645,9,-8.716,1,0.301,0.0134,0.000228,0.109,0.292,95.078,384987,3
1990-11-17,60,Oh Girl,Paul Young,,False,54,8,19,0.57,0.575,9,-7.032,1,0.0318,0.267,0,0.0823,0.421,135.903,216373,4
1990-11-17,61,I'm Not In Love,Will To Power,5Wiin0U2QVAUSz4ChP9lXk,True,0,61,1,0.553,0.611,4,-8.199,1,0.0279,0.00462,0.0567,0.104,0.335,75.02,223840,4
1990-11-17,62,Each And Every Time,Sweet Sensation,5Wiin0U2QVAUSz4ChP9lXk,False,59,59,5,0.629,0.691,4,-8.93,0,0.0543,0.0223,0.000404,0.19,0.699,105.194,246827,4
1990-11-17,63,Tic-Tac-Toe,Kyper,5Wiin0U2QVAUSz4ChP9lXk,False,55,14,21,0.808,0.912,7,-5.277,1,0.149,0.00427,0.0853,0.315,0.402,125.812,383427,4
1990-11-17,64,New Power Generation,Prince,5Wiin0U2QVAUSz4ChP9lXk,False,67,64,3,0.717,0.809,0,-9.358,1,0.0636,0.0486,1.08e-06,0.0297,0.679,111.279,219507,4
1990-11-17,65,Say A Prayer,Breathe,5Wiin0U2QVAUSz4ChP9lXk,False,45,21,13,0.7,0.693,6,-12.293,1,0.0368,0.312,0,0.0613,0.926,114.881,231533,4
1990-11-17,66,Tick Tock,Vaughan Brothers,5Wiin0U2QVAUSz4ChP9lXk,False,70,66,5,0.846,0.32,9,-13.541,1,0.0348,0.0281,3.28e-05,0.0734,0.673,89.069,296987,4
1990-11-17,67,Hard To Handle,The Black Crowes,5Wiin0U2QVAUSz4ChP9lXk,False,75,67,4,0.599,0.79,4,-3.58,1,0.043,0.00257,0.00181,0.312,0.961,103.783,188067,4
1990-11-17,68,"Blaze Of Glory (From ""Young Guns II"")",Jon Bon Jovi,5Wiin0U2QVAUSz4ChP9lXk,False,50,1,18,0.55,0.618,7,-9.822,1,0.0307,0.0564,2.62e-05,0.0937,0.429,78.61,335240,4
1990-11-17,69,The Boomin' System,LL Cool J,5Wiin0U2QVAUSz4ChP9lXk,False,64,48,8,0.794,0.536,0,-14.347,1,0.307,0.0121,2.48e-06,0.35,0.528,96.043,223640,4
1990-11-17,70,Gentle,Dino,5Wiin0U2QVAUSz4ChP9lXk,False,81,70,2,0.584,0.57,1,-7.761,0,0.458,0.489,1.35e-05,0.199,0.463,189.95,226627,4
1990-11-17,71,So Hard,Pet Shop Boys,5Wiin0U2QVAUSz4ChP9lXk,False,72,71,5,0.561,0.893,0,-7.663,1,0.038,0.00123,0.408,0.176,0.674,119.863,238387,4
1990-11-17,72,Never Enough,The Cure,5Wiin0U2QVAUSz4ChP9lXk,False,77,72,3,0.507,0.988,7,-3.877,1,0.133,0.0658,0.006,0.333,0.482,100.747,268200,4
1990-11-17,73,New York Minute,Don Henley,5Wiin0U2QVAUSz4ChP9lXk,False,82,73,2,0.551,0.289,8,-12.214,0,0.0262,0.334,0,0.0379,0.117,132.133,395400,4
1990-11-17,74,Gonna Make You Sweat (Everybody Dance Now),C+C Music Factory,7eheoW4hxrH51ww2QePVwF,True,0,74,1,0.557,0.798,6,-7.405,1,0.0935,0.000851,0.675,0.183,0.794,112.187,244093,4
1990-11-17,75,Anything Is Possible,Debbie Gibson,4nXdQLllzLUtCva8kL9Z5O,True,0,75,1,0.696,0.861,8,-7.298,0,0.0342,0.255,0,0.287,0.904,110.066,223453,4
1990-11-17,76,Dream Boy/Dream Girl,Cynthia & Johnny O,4nXdQLllzLUtCva8kL9Z5O,False,66,53,12,0.681,0.78,1,-6.958,1,0.116,0.0201,0.000876,0.148,0.635,122.973,268960,4
1990-11-17,77,Crazy,The Boys,4nXdQLllzLUtCva8kL9Z5O,False,68,29,13,0.694,0.89,11,-6.387,0,0.0476,0.0272,2.15e-05,0.0406,0.898,111.861,244253,4
1990-11-17,78,Let's Try It Again,New Kids On The Block,4nXdQLllzLUtCva8kL9Z5O,False,58,53,7,0.554,0.361,8,-14.35,1,0.0257,0.142,0,0.123,0.278,136.625,231320,4
1990-11-17,79,Release Me,Wilson Phillips,4nXdQLllzLUtCva8kL9Z5O,False,65,1,21,0.724,0.471,0,-11.143,1,0.0358,0.448,2.5e-06,0.218,0.442,97.211,295693,4
1990-11-17,80,Does She Love That Man?,Breathe Featuring David Glasper,7Cbz21BW7tzfNtUmaUnEfj,True,0,80,1,0.55,0.339,5,-14.157,1,0.0295,0.531,0,0.0873,0.301,149.662,287267,3
1990-11-17,82,You're Amazing,Robert Palmer,4EUeXHCXYYyzF52hnEgIjZ,True,0,82,1,0.511,0.864,7,-11.973,1,0.0569,0.00824,3.89e-06,0.291,0.5,144.952,230427,4
1990-11-17,83,I Found Love,The Party,4EUeXHCXYYyzF52hnEgIjZ,False,85,83,3,0.681,0.954,7,-10.068,1,0.0521,0.326,0.00628,0.116,0.778,113.719,214571,4
1990-11-17,84,Love Is A Killer,Vixen,4EUeXHCXYYyzF52hnEgIjZ,False,84,84,2,0.417,0.681,7,-9.796,0,0.0359,0.224,1.24e-05,0.128,0.257,186.233,283307,4
1990-11-17,85,Policy Of Truth,Depeche Mode,4EUeXHCXYYyzF52hnEgIjZ,False,62,15,15,0.678,0.658,8,-7.3,1,0.028,0.0093,0.239,0.118,0.359,114.209,294040,4
1990-11-17,86,Dirty Cash (Money Talks),The Adventures Of Stevie V,4EUeXHCXYYyzF52hnEgIjZ,False,74,25,18,0.757,0.83,5,-13.169,0,0.0413,0.00129,0.00741,0.0877,0.925,120.883,243133,4
1990-11-17,87,If You Needed Somebody,Bad Company,4EUeXHCXYYyzF52hnEgIjZ,False,88,87,2,0.496,0.514,7,-13.394,1,0.0274,0.0044,0.000106,0.0429,0.388,168.324,261000,4
1990-11-17,88,Love Is The Ritual,Styx,4EUeXHCXYYyzF52hnEgIjZ,False,80,80,5,0.583,0.913,8,-7.567,1,0.0635,0.0222,1.03e-06,0.365,0.652,103.729,229227,4
1990-11-17,89,Love Will Never Do (Without You),Janet Jackson,1SkJ8HjZUZRPYT3R2rh5sA,True,0,89,1,0.739,0.951,1,-8.863,1,0.0496,0.139,0.0062,0.462,0.551,103.17,350000,4
1990-11-17,90,Love Is A Rock,REO Speedwagon,1SkJ8HjZUZRPYT3R2rh5sA,False,71,65,6,0.562,0.832,0,-9.279,1,0.0368,0.217,1.32e-06,0.0505,0.443,106.033,336467,4
1990-11-17,91,Doin' The Do,Betty Boo,1SkJ8HjZUZRPYT3R2rh5sA,False,90,90,3,0.801,0.961,10,-7.027,0,0.0604,0.00765,7.7e-05,0.0639,0.909,120.378,222253,4
1990-11-17,92,I'm Free,The Soup Dragons,1K97Cp6YcpSRz1VxR1JKVC,True,0,92,1,0.645,0.931,7,-6.041,1,0.0752,0.0973,2.49e-05,0.0739,0.876,103.273,211693,4
1990-11-17,93,Falling To Pieces,Faith No More,1K97Cp6YcpSRz1VxR1JKVC,False,92,92,2,0.545,0.919,2,-7.679,1,0.0484,0.00272,0.00511,0.0977,0.387,104.366,313573,4
1990-11-17,94,The Ghetto,Too $hort,3B6WDceNe6lUQnczntRIuf,True,0,94,1,0.947,0.354,6,-12.844,0,0.27,0.0455,5.71e-05,0.212,0.36,100.087,302133,4
1990-11-17,95,Rockin' Over The Beat,Technotronic,5xuktWMVGM0OcOOO39zILo,True,0,95,1,0.734,0.904,8,-10.604,1,0.0345,0.0437,0.0631,0.154,0.969,120.75,346627,4
1990-11-17,96,Heart Of Stone,Taylor Dayne,5xuktWMVGM0OcOOO39zILo,False,78,12,16,0.461,0.82,7,-5.324,0,0.0346,0.162,0,0.106,0.602,186.045,257160,4
1990-11-17,97,Ooops Up,Snap!,5xuktWMVGM0OcOOO39zILo,False,79,35,11,0.862,0.493,4,-14.19,0,0.102,0.00845,0,0.26,0.533,102.887,402215,4
1990-11-17,98,"My, My, My",Johnny Gill,5xuktWMVGM0OcOOO39zILo,False,76,10,16,0.58,0.596,0,-10.31,1,0.0626,0.093,0,0.109,0.653,74.033,321907,4
1990-11-17,99,I Don't Love You Anymore,The London Quireboys,5xuktWMVGM0OcOOO39zILo,False,89,76,9,0.353,0.656,4,-8.818,1,0.0512,0.146,3.85e-05,0.159,0.139,124.672,363067,4
