date,position,title,artist,spotify_id,is_new,last_pos,peak_pos,weeks,danceability,energy,key,loudness,mode,speechiness,acousticness,instrumentalness,liveness,valence,tempo,duration_ms,time_signature
2016-10-08,1,Closer,The Chainsmokers Featuring Halsey,6fwdbPMwP1zVStm8FybmkO,False,1,1,8,0.748,0.524,8,-5.599,1,0.0338,0.414,0,0.111,0.661,95.01,244960,4
2016-10-08,2,Heathens,twenty one pilots,6fwdbPMwP1zVStm8FybmkO,False,2,2,14,0.732,0.396,4,-9.348,0,0.0286,0.0841,3.58e-05,0.105,0.548,90.024,195920,4
2016-10-08,3,Cold Water,Major Lazer Featuring Justin Bieber & MO,6fwdbPMwP1zVStm8FybmkO,False,3,2,9,0.608,0.798,6,-5.092,0,0.0432,0.0736,0,0.156,0.501,92.943,185360,4
2016-10-08,4,Let Me Love You,DJ Snake Featuring Justin Bieber,6fwdbPMwP1zVStm8FybmkO,False,6,4,7,0.649,0.716,8,-5.371,1,0.0349,0.0863,2.63e-05,0.135,0.163,99.988,205947,4
2016-10-08,5,Cheap Thrills,Sia Featuring Sean Paul,6fwdbPMwP1zVStm8FybmkO,False,4,1,32,0.628,0.698,6,-5.608,0,0.105,0.0472,0.00143,0.0907,0.732,89.976,211667,4
2016-10-08,6,Treat You Better,Shawn Mendes,6fwdbPMwP1zVStm8FybmkO,False,8,6,16,0.443,0.82,10,-4.091,0,0.34,0.107,0,0.107,0.771,82.697,187973,4
2016-10-08,7,Don't Let Me Down,The Chainsmokers Featuring Daya,6fwdbPMwP1zVStm8FybmkO,False,5,3,32,0.532,0.869,11,-5.094,1,0.172,0.157,0.00508,0.136,0.422,159.803,208373,4
2016-10-08,8,Broccoli,D.R.A.M. Featuring Lil Yachty,6fwdbPMwP1zVStm8FybmkO,False,12,8,15,0.825,0.485,8,-11.479,1,0.395,0.187,0,0.0904,0.792,145.976,233278,4
2016-10-08,9,We Don't Talk Anymore,Charlie Puth Featuring Selena Gomez,6fwdbPMwP1zVStm8FybmkO,False,13,9,16,0.728,0.563,1,-8.053,0,0.134,0.621,0,0.179,0.352,100.017,217707,4
2016-10-08,10,This Is What You Came For,Calvin Harris Featuring Rihanna,6fwdbPMwP1zVStm8FybmkO,False,7,3,21,0.63,0.928,9,-2.787,0,0.0331,0.199,0.124,0.148,0.465,123.963,222160,4
2016-10-08,11,Ride,twenty one pilots,6fwdbPMwP1zVStm8FybmkO,False,9,5,28,0.645,0.713,6,-5.355,1,0.0393,0.00835,0,0.113,0.566,74.989,214507,4
2016-10-08,12,Needed Me,Rihanna,6fwdbPMwP1zVStm8FybmkO,False,11,7,34,0.671,0.314,5,-8.091,0,0.244,0.11,0,0.0825,0.296,110.898,191600,4
2016-10-08,13,Send My Love (To Your New Lover),Adele,6fwdbPMwP1zVStm8FybmkO,False,10,8,19,0.688,0.533,6,-8.363,0,0.0865,0.0355,3.48e-06,0.172,0.567,164.069,223079,4
2016-10-08,14,One Dance,Drake Featuring WizKid & Kyla,6fwdbPMwP1zVStm8FybmkO,False,14,1,25,0.792,0.625,1,-5.609,1,0.0536,0.00776,0.0018,0.329,0.37,103.967,173987,4
2016-10-08,15,Too Good,Drake Featuring Rihanna,6fwdbPMwP1zVStm8FybmkO,False,16,14,21,0.794,0.653,7,-7.839,1,0.104,0.0489,4.88e-05,0.1,0.397,117.996,263373,4
2016-10-08,16,Gold,Kiiara,6fwdbPMwP1zVStm8FybmkO,False,20,16,18,0.6,0.412,8,-9.343,1,0.344,0.615,0.0025,0.134,0.408,113.049,225882,5
2016-10-08,17,Can't Stop The Feeling!,Justin Timberlake,6fwdbPMwP1zVStm8FybmkO,False,18,1,20,0.669,0.832,0,-5.72,1,0.0682,0.0106,0,0.0968,0.7,113.035,237547,4
2016-10-08,18,Side To Side,Ariana Grande Featuring Nicki Minaj,6fwdbPMwP1zVStm8FybmkO,False,19,18,4,0.65,0.736,6,-5.84,0,0.229,0.0528,0,0.235,0.613,159.173,226160,4
2016-10-08,19,I Hate U I Love U,gnash Featuring Olivia O'Brien,6fwdbPMwP1zVStm8FybmkO,False,23,19,23,0.492,0.275,6,-13.4,0,0.3,0.687,0,0.101,0.18,92.6,251034,4
2016-10-08,20,Into You,Ariana Grande,6fwdbPMwP1zVStm8FybmkO,False,17,13,19,0.623,0.734,9,-5.948,1,0.107,0.0162,1.75e-06,0.145,0.37,107.853,244453,4
2016-10-08,21,Forever Country,"Artists Of Then, Now & Forever",3WWVDPjihd1VITBLF10nha,True,0,21,1,0.201,0.684,7,-5.931,1,0.0389,0.401,1.46e-05,0.0954,0.131,90.056,242480,4
2016-10-08,22,Luv,Tory Lanez,3WWVDPjihd1VITBLF10nha,False,21,19,13,0.539,0.528,11,-8.113,0,0.252,0.0108,0,0.117,0.252,190.169,228640,4
2016-10-08,23,Sucker For Pain,"Lil Wayne, Wiz Khalifa & Imagine Dragons With Logic & Ty Dolla $ign Feat. X Ambassadors",3WWVDPjihd1VITBLF10nha,False,22,15,13,0.502,0.786,9,-4.378,0,0.317,0.255,0,0.65,0.739,169.021,243491,4
2016-10-08,24,My Way,Calvin Harris,1vvNmPOiUuyCbgWmtc6yfm,True,0,24,1,0.819,0.913,4,-3.059,0,0.0427,0.0935,3.72e-05,0.161,0.536,119.989,219160,4
2016-10-08,25,Hymn For The Weekend,Coldplay,1vvNmPOiUuyCbgWmtc6yfm,False,26,25,17,0.491,0.693,0,-6.487,0,0.0377,0.211,6.92e-06,0.325,0.412,90.027,258267,4
2016-10-08,26,This Girl,Kungs vs Cookin' On 3 Burners,1vvNmPOiUuyCbgWmtc6yfm,False,31,26,9,0.792,0.717,0,-4.759,0,0.0393,0.0927,3.59e-05,0.226,0.466,121.985,195547,4
2016-10-08,27,Unsteady,X Ambassadors,1vvNmPOiUuyCbgWmtc6yfm,False,29,27,19,0.389,0.665,0,-6.169,1,0.0644,0.178,0.000732,0.116,0.199,117.055,193547,4
2016-10-08,28,Panda,Desiigner,1vvNmPOiUuyCbgWmtc6yfm,False,25,1,31,0.685,0.731,10,-5.503,0,0.414,0.0292,0,0.369,0.266,145.245,247867,4
2016-10-08,29,"Sit Still, Look Pretty",Daya,1vvNmPOiUuyCbgWmtc6yfm,False,32,28,17,0.655,0.74,2,-4.081,1,0.274,0.14,0,0.106,0.543,182.105,202221,4
2016-10-08,30,For Free,DJ Khaled Featuring Drake,1vvNmPOiUuyCbgWmtc6yfm,False,27,13,16,0.916,0.571,10,-8.241,0,0.2,0.0173,1.11e-06,0.153,0.498,103.521,183695,4
2016-10-08,31,Starving,Hailee Steinfeld & Grey Featuring Zedd,1vvNmPOiUuyCbgWmtc6yfm,False,33,31,8,0.728,0.616,4,-4.238,1,0.0645,0.378,0,0.105,0.508,99.962,181880,4
2016-10-08,32,No Limit,Usher Featuring Young Thug,1vvNmPOiUuyCbgWmtc6yfm,False,37,32,13,0.717,0.523,10,-6.506,0,0.0611,0.0799,0,0.206,0.282,127.047,228613,4
2016-10-08,33,Controlla,Drake,1vvNmPOiUuyCbgWmtc6yfm,False,30,16,21,0.59,0.468,10,-11.083,0,0.185,0.0789,0,0.101,0.349,92.287,245227,4
2016-10-08,34,The Greatest,Sia Featuring Kendrick Lamar,1vvNmPOiUuyCbgWmtc6yfm,False,24,24,3,0.668,0.725,1,-6.127,1,0.266,0.0102,0.000479,0.0561,0.729,191.944,210227,4
2016-10-08,35,Tiimmy Turner,Desiigner,1vvNmPOiUuyCbgWmtc6yfm,False,34,34,9,0.603,0.725,6,-3.054,1,0.0393,0.174,0,0.0786,0.304,122.803,239853,4
2016-10-08,36,Never Be Like You,Flume Featuring Kai,1vvNmPOiUuyCbgWmtc6yfm,False,28,20,25,0.444,0.557,0,-5.476,1,0.0602,0.453,0,0.152,0.296,115.058,234910,4
2016-10-08,37,Setting The World On Fire,Kenny Chesney Featuring P!nk,1vvNmPOiUuyCbgWmtc6yfm,False,40,29,8,0.61,0.822,0,-4.422,1,0.0355,0.0171,1.88e-06,0.093,0.437,93.993,217467,4
2016-10-08,38,Just Like Fire,P!nk,1vvNmPOiUuyCbgWmtc6yfm,False,36,10,23,0.632,0.701,7,-5.921,1,0.146,0.0114,0,0.108,0.497,162.958,215414,4
2016-10-08,39,Work From Home,Fifth Harmony Featuring Ty Dolla $ign,1vvNmPOiUuyCbgWmtc6yfm,False,35,4,30,0.803,0.585,8,-5.861,1,0.0432,0.103,3.94e-06,0.0644,0.593,105.017,214480,4
2016-10-08,40,Starboy,The Weeknd Featuring Daft Punk,38JOdzBE9kPj5UhKtqIIqQ,True,0,40,1,0.676,0.588,7,-7.025,1,0.275,0.137,8.47e-06,0.137,0.484,186.012,230461,4
2016-10-08,41,Work,Rihanna Featuring Drake,38JOdzBE9kPj5UhKtqIIqQ,False,41,1,35,0.725,0.534,11,-6.238,1,0.0946,0.0752,0,0.0919,0.558,91.974,219320,4
2016-10-08,42,Perfect Illusion,Lady Gaga,38JOdzBE9kPj5UhKtqIIqQ,False,15,15,2,0.613,0.857,1,-5.492,0,0.0365,0.0012,0,0.358,0.656,124.989,182000,4
2016-10-08,43,Chill Bill,Rob $tone Featuring J. Davi$ & Spooks,38JOdzBE9kPj5UhKtqIIqQ,False,50,43,8,0.886,0.427,6,-10.028,1,0.145,0.0312,0.00099,0.0906,0.23,108.034,177184,4
2016-10-08,44,Low Life,Future Featuring The Weeknd,38JOdzBE9kPj5UhKtqIIqQ,False,44,18,33,0.722,0.331,8,-7.789,1,0.0725,0.337,0.283,0.146,0.102,143.974,313547,4
2016-10-08,45,I Took A Pill In Ibiza,Mike Posner,38JOdzBE9kPj5UhKtqIIqQ,False,43,4,36,0.664,0.714,7,-6.645,0,0.111,0.0353,8.42e-06,0.0843,0.71,101.969,197933,4
2016-10-08,46,7 Years,Lukas Graham,38JOdzBE9kPj5UhKtqIIqQ,False,45,2,36,0.765,0.473,10,-5.829,1,0.0514,0.287,0,0.391,0.34,119.992,237300,4
2016-10-08,47,H.O.L.Y.,Florida Georgia Line,38JOdzBE9kPj5UhKtqIIqQ,False,49,14,21,0.523,0.666,7,-4.081,0,0.0327,0.401,0,0.0728,0.564,78.077,194187,4
2016-10-08,48,Different For Girls,Dierks Bentley Featuring Elle King,38JOdzBE9kPj5UhKtqIIqQ,False,42,42,16,0.655,0.768,4,-5.616,1,0.0365,0.385,0.000257,0.0733,0.431,92.021,180360,4
2016-10-08,49,In The Name Of Love,Martin Garrix & Bebe Rexha,38JOdzBE9kPj5UhKtqIIqQ,False,51,49,6,0.501,0.519,4,-5.88,0,0.0409,0.109,0,0.454,0.168,133.99,195707,4
2016-10-08,50,Pick Up The Phone,Young Thug And Travis Scott Featuring Quavo,38JOdzBE9kPj5UhKtqIIqQ,False,48,43,6,0.711,0.739,7,-3.804,0,0.129,0.114,0,0.226,0.43,136.919,252256,4
2016-10-08,51,Mama Said,Lukas Graham,38JOdzBE9kPj5UhKtqIIqQ,False,46,36,10,0.712,0.799,7,-4.564,0,0.0703,0.0447,6.4e-05,0.37,0.591,83.996,206903,4
2016-10-08,52,OOOUUU,Young M.A,38JOdzBE9kPj5UhKtqIIqQ,False,67,52,4,0.635,0.847,7,-3.152,1,0.447,0.533,0,0.154,0.568,166.072,234650,4
2016-10-08,53,It Don't Hurt Like It Used To,Billy Currington,38JOdzBE9kPj5UhKtqIIqQ,False,55,53,9,0.558,0.818,8,-4.07,1,0.0403,0.071,0,0.21,0.453,81.034,184507,4
2016-10-08,54,Peter Pan,Kelsea Ballerini,38JOdzBE9kPj5UhKtqIIqQ,False,39,35,17,0.514,0.659,1,-6.142,1,0.0309,0.0284,0,0.266,0.463,76.483,200040,4
2016-10-08,55,No Problem,Chance The Rapper Featuring Lil Wayne & 2 Chainz,38JOdzBE9kPj5UhKtqIIqQ,False,63,55,18,0.652,0.795,11,-5.192,0,0.174,0.156,0,0.123,0.788,135.018,304607,4
2016-10-08,56,Father Stretch My Hands Pt. 1,Kanye West,38JOdzBE9kPj5UhKtqIIqQ,False,56,37,20,0.724,0.573,7,-4.113,1,0.0549,0.118,0,0.538,0.438,113.088,135920,4
2016-10-08,57,Juju On That Beat (TZ Anthem),Zay Hilfigerrr & Zayion McCall,1lItf5ZXJc1by9SbPeljFd,True,0,57,1,0.807,0.887,1,-3.892,1,0.275,0.00381,0,0.391,0.78,160.517,144244,4
2016-10-08,58,Scars To Your Beautiful,Alessia Cara,1lItf5ZXJc1by9SbPeljFd,False,62,58,4,0.573,0.739,0,-5.74,1,0.129,0.0285,0,0.111,0.451,97.085,230227,4
2016-10-08,59,Middle Of A Memory,Cole Swindell,1lItf5ZXJc1by9SbPeljFd,False,64,59,9,0.531,0.746,11,-4.228,1,0.0329,0.0972,0,0.102,0.304,139.788,226307,4
2016-10-08,60,Blue Ain't Your Color,Keith Urban,1lItf5ZXJc1by9SbPeljFd,False,73,60,2,0.69,0.416,7,-7.865,1,0.0335,0.617,1.37e-06,0.102,0.479,82.45,230600,3
2016-10-08,61,Money Longer,Lil Uzi Vert,1lItf5ZXJc1by9SbPeljFd,False,54,54,15,0.795,0.568,5,-7.817,0,0.142,0.0541,0,0.108,0.478,136.173,198944,4
2016-10-08,62,Fade,Kanye West,1lItf5ZXJc1by9SbPeljFd,False,47,47,3,0.752,0.765,9,-5.805,0,0.0908,0.118,0,0.31,0.309,105.998,193748,4
2016-10-08,63,All In My Head (Flex),Fifth Harmony Featuring Fetty Wap,1lItf5ZXJc1by9SbPeljFd,False,52,24,14,0.689,0.791,0,-5.194,0,0.053,0.023,0,0.0526,0.755,95.04,210573,4
2016-10-08,64,Rock On,Tucker Beathard,1lItf5ZXJc1by9SbPeljFd,False,65,64,6,0.629,0.465,2,-8.58,1,0.0306,0.000159,0.427,0.0809,0.513,156.035,214533,4
2016-10-08,65,Caroline,Amine,1lItf5ZXJc1by9SbPeljFd,False,70,65,3,0.94,0.335,5,-10.179,0,0.505,0.17,0,0.262,0.707,120.04,209640,4
2016-10-08,66,Me Too,Meghan Trainor,1lItf5ZXJc1by9SbPeljFd,False,53,13,19,0.934,0.694,11,-5.849,0,0.101,0.0971,1.2e-06,0.477,0.833,123.831,181240,4
2016-10-08,67,I Met A Girl,William Michael Morgan,1lItf5ZXJc1by9SbPeljFd,False,71,67,5,0.512,0.545,2,-10.154,1,0.0294,0.111,0.00177,0.135,0.346,83.94,201533,4
2016-10-08,68,You & Me,Marc E. Bassy Featuring G-Eazy,1lItf5ZXJc1by9SbPeljFd,False,61,58,11,0.449,0.635,1,-8.301,1,0.275,0.0413,0,0.188,0.608,84.414,218493,4
2016-10-08,69,Vice,Miranda Lambert,1lItf5ZXJc1by9SbPeljFd,False,60,47,10,0.568,0.562,9,-7.775,1,0.0418,0.101,6.16e-05,0.363,0.247,133.647,240280,4
2016-10-08,70,1 Night,Lil Yachty,1lItf5ZXJc1by9SbPeljFd,False,83,70,7,0.764,0.475,0,-12.618,1,0.114,0.345,0,0.14,0.34,129.974,243270,4
2016-10-08,71,Move,Luke Bryan,1lItf5ZXJc1by9SbPeljFd,False,80,71,5,0.57,0.939,5,-0.716,0,0.0789,0.00719,1.08e-06,0.0462,0.801,103.983,227413,4
2016-10-08,72,Make You Miss Me,Sam Hunt,1lItf5ZXJc1by9SbPeljFd,False,57,45,17,0.614,0.472,7,-6.626,1,0.0297,0.158,0,0.111,0.168,146.005,225693,4
2016-10-08,73,I Got The Keys,DJ Khaled Featuring Jay Z & Future,1lItf5ZXJc1by9SbPeljFd,False,59,30,13,0.686,0.623,1,-3.425,1,0.13,0.00287,0.00145,0.219,0.176,140.171,219759,4
2016-10-08,74,May We All,Florida Georgia Line Featuring Tim McGraw,1lItf5ZXJc1by9SbPeljFd,False,86,56,4,0.514,0.918,7,-4.306,1,0.0365,0.0409,0,0.342,0.64,150.033,226173,4
2016-10-08,75,A Little More Summertime,Jason Aldean,1lItf5ZXJc1by9SbPeljFd,False,69,69,3,0.482,0.823,9,-4.446,1,0.0661,0.0386,3.69e-05,0.0948,0.451,167.665,219547,4
2016-10-08,76,Come And See Me,PARTYNEXTDOOR Featuring Drake,1lItf5ZXJc1by9SbPeljFd,False,82,65,12,0.717,0.347,11,-10.265,0,0.0636,0.0511,2.43e-06,0.087,0.0589,84.987,235477,4
2016-10-08,77,Black Beatles,Rae Sremmurd Featuring Gucci Mane,1lItf5ZXJc1by9SbPeljFd,False,96,77,2,0.794,0.632,0,-6.163,1,0.0649,0.142,0,0.128,0.355,145.926,291893,4
2016-10-08,78,THat Part,ScHoolboy Q Featuring Kanye West,1lItf5ZXJc1by9SbPeljFd,False,66,40,16,0.927,0.535,6,-7.59,0,0.0911,0.0855,0,0.136,0.336,112.96,313573,4
2016-10-08,79,I Know Somebody,LOCASH,1lItf5ZXJc1by9SbPeljFd,False,85,79,4,0.505,0.903,1,-3.699,1,0.037,0.0356,0,0.127,0.491,88.986,197830,4
2016-10-08,80,You Look Like I Need A Drink,Justin Moore,1lItf5ZXJc1by9SbPeljFd,False,91,79,7,0.608,0.841,11,-3.626,1,0.028,0.0028,0,0.0834,0.917,106.004,187480,4
2016-10-08,81,Sleep Without You,Brett Young,1lItf5ZXJc1by9SbPeljFd,False,89,81,2,0.626,0.707,5,-5.755,0,0.0425,0.0169,0,0.0772,0.653,88.543,187813,4
2016-10-08,82,Gangsta,Kehlani,1lItf5ZXJc1by9SbPeljFd,False,74,41,7,0.439,0.447,10,-8.318,0,0.0436,0.111,0,0.303,0.11,121.48,177029,4
2016-10-08,83,"Wat U Mean (Aye, Aye, Aye)",Dae Dae,1lItf5ZXJc1by9SbPeljFd,False,68,66,10,0.923,0.599,6,-4.888,1,0.238,0.07,1.23e-06,0.0951,0.667,138.024,181739,4
2016-10-08,84,X,21 Savage & Metro Boomin Featuring Future,1lItf5ZXJc1by9SbPeljFd,False,98,84,2,0.835,0.413,1,-9.81,1,0.396,0.373,0.00133,0.101,0.111,149.004,258880,4
2016-10-08,85,Too Much Sauce,DJ ESCO Featuring Future & Lil Uzi Vert,1lItf5ZXJc1by9SbPeljFd,False,81,81,5,0.96,0.547,6,-6.992,0,0.0786,0.0496,0,0.216,0.186,121.01,223093,4
2016-10-08,86,Why You Always Hatin?,YG Featuring Drake & Kamaiyah,1lItf5ZXJc1by9SbPeljFd,False,77,62,14,0.926,0.336,0,-9.326,0,0.594,0.0392,0,0.138,0.38,92.995,196600,4
2016-10-08,87,Key To The Streets,YFN Lucci Featuring Migos & Trouble,5ZcgtIzjjlNiPflHkuodRv,True,0,87,1,0.773,0.696,6,-5.448,0,0.121,0.119,0,0.122,0.264,140.022,281994,4
2016-10-08,88,Do You Mind,"DJ Khaled Featuring Nicki Minaj, Chris Brown, August Alsina, Jeremih, Future & Rick Ross",5ZcgtIzjjlNiPflHkuodRv,False,95,88,7,0.412,0.548,10,-6.981,1,0.243,0.0173,0,0.181,0.176,81.293,325615,4
2016-10-08,89,Hold Up,Beyonce,5ZcgtIzjjlNiPflHkuodRv,False,88,13,8,0.524,0.397,0,-11.936,1,0.405,0.745,0,0.521,0.552,80.744,221093,4
2016-10-08,90,Purple Lamborghini,Skrillex & Rick Ross,5ZcgtIzjjlNiPflHkuodRv,False,78,33,9,0.457,0.899,10,-2.591,0,0.132,0.0019,0,0.831,0.298,147.268,215510,4
2016-10-08,91,Cancer,twenty one pilots,19W5OTEcQI3ZoRW1HERMyy,True,0,91,1,0.652,0.295,2,-11.045,1,0.0477,0.281,1.03e-05,0.0809,0.196,75.065,236827,4
2016-10-08,92,My PYT,Wale,19W5OTEcQI3ZoRW1HERMyy,False,84,54,15,0.554,0.481,0,-9.823,1,0.329,0.0139,0,0.0787,0.456,191.991,236867,4
2016-10-08,93,You Was Right,Lil Uzi Vert,19W5OTEcQI3ZoRW1HERMyy,False,99,89,11,0.843,0.359,0,-7.417,1,0.461,0.069,0,0.12,0.156,81.987,163944,4
2016-10-08,94,With You Tonight / Hasta El Amanecer,Nicky Jam,19W5OTEcQI3ZoRW1HERMyy,False,92,73,18,0.786,0.577,6,-6.675,0,0.0466,0.285,0,0.262,0.651,94.019,195893,4
2016-10-08,95,Wishing,"DJ Drama Featuring Chris Brown, Skeme & Lyquin",19W5OTEcQI3ZoRW1HERMyy,False,93,91,6,0.563,0.691,3,-4.464,0,0.382,0.197,0,0.0886,0.567,108.406,330387,4
2016-10-08,96,Grass Ain't Greener,Chris Brown,19W5OTEcQI3ZoRW1HERMyy,False,94,71,4,0.651,0.601,10,-5.097,0,0.0497,0.39,0,0.0882,0.512,133.954,201422,4
2016-10-08,97,Goosebumps,Travis Scott,19W5OTEcQI3ZoRW1HERMyy,False,0,92,2,0.841,0.593,1,-7.846,1,0.0379,0.418,0,0.124,0.808,124.917,162803,4
2016-10-08,98,No Shopping,French Montana Featuring Drake,19W5OTEcQI3ZoRW1HERMyy,False,97,36,10,0.895,0.491,10,-10.261,0,0.246,0.0144,0.000988,0.143,0.249,83.505,227727,4
2016-10-08,99,You Don't Own Me,Grace Featuring G-Eazy,19W5OTEcQI3ZoRW1HERMyy,False,100,57,18,0.332,0.635,7,-5.653,1,0.0898,0.159,2.79e-06,0.0599,0.261,186.249,201493,3
2016-10-08,100,Lockjaw,French Montana Featuring Kodak Black,19W5OTEcQI3ZoRW1HERMyy,False,0,73,11,0.615,0.648,5,-3.792,0,0.22,0.0411,0,0.277,0.26,169.912,223147,4
