date,position,title,artist,spotify_id,is_new,last_pos,peak_pos,weeks,danceability,energy,key,loudness,mode,speechiness,acousticness,instrumentalness,liveness,valence,tempo,duration_ms,time_signature
2001-02-10,1,It Wasn't Me,"Shaggy Feat. Ricardo ""RikRok"" Ducent",5Vyw16U5k4bpGaRqfzyyMo,False,1,1,15,0.853,0.606,0,-4.596,1,0.0713,0.0561,0,0.313,0.654,94.759,227600,4
2001-02-10,2,Ms. Jackson,OutKast,5Vyw16U5k4bpGaRqfzyyMo,False,3,2,14,0.843,0.806,4,-5.946,0,0.269,0.143,0,0.0771,0.613,94.948,270507,4
2001-02-10,3,Independent Women Part I,Destiny's Child,5Vyw16U5k4bpGaRqfzyyMo,False,2,1,21,0.747,0.638,6,-6.137,0,0.245,0.107,6.44e-06,0.126,0.947,97.99,217680,4
2001-02-10,4,Don't Tell Me,Madonna,5Vyw16U5k4bpGaRqfzyyMo,False,4,4,10,0.699,0.618,7,-7.338,1,0.0594,0.0502,0.000925,0.0914,0.679,99.965,280973,4
2001-02-10,5,Again,Lenny Kravitz,5Vyw16U5k4bpGaRqfzyyMo,False,6,5,13,0.55,0.804,2,-5.218,1,0.0271,0.0148,4.33e-05,0.105,0.789,79.166,231667,4
2001-02-10,6,Love Don't Cost A Thing,Jennifer Lopez,5Vyw16U5k4bpGaRqfzyyMo,False,5,4,10,0.786,0.842,4,-5.115,0,0.0707,0.00305,3.54e-06,0.473,0.685,97.577,221227,4
2001-02-10,7,Stutter,Joe Featuring Mystikal,5Vyw16U5k4bpGaRqfzyyMo,False,9,7,6,0.767,0.759,6,-6.516,1,0.117,0.0513,0,0.31,0.677,89.989,213027,4
2001-02-10,8,If You're Gone,matchbox twenty,5Vyw16U5k4bpGaRqfzyyMo,False,8,5,17,0.544,0.659,9,-7.191,1,0.0298,0.427,1.33e-06,0.126,0.361,109.933,274933,4
2001-02-10,9,He Loves U Not,Dream,5Vyw16U5k4bpGaRqfzyyMo,False,7,2,20,0.595,0.877,1,-11.787,1,0.0579,0.026,2.85e-06,0.419,0.394,156.972,225813,4
2001-02-10,10,The Way You Love Me,Faith Hill,5Vyw16U5k4bpGaRqfzyyMo,False,10,6,41,0.627,0.716,2,-7.175,1,0.0352,0.127,0,0.0344,0.734,101.99,186067,4
2001-02-10,11,Put It On Me,Ja Rule Featuring Lil' Mo & Vita,5Vyw16U5k4bpGaRqfzyyMo,False,13,11,8,0.831,0.79,1,-4.714,0,0.165,0.0024,0,0.0515,0.791,93.14,262827,4
2001-02-10,12,Angel,Shaggy Featuring Rayvon,5Vyw16U5k4bpGaRqfzyyMo,False,19,12,7,0.74,0.766,6,-2.939,1,0.178,0.116,0,0.0406,0.807,170.531,235133,4
2001-02-10,13,With Arms Wide Open,Creed,5Vyw16U5k4bpGaRqfzyyMo,False,12,1,40,0.41,0.539,0,-8.412,1,0.0302,0.00425,0.00089,0.117,0.141,138.852,274800,4
2001-02-10,14,Danger (Been So Long),Mystikal Featuring Nivea,5Vyw16U5k4bpGaRqfzyyMo,False,17,14,9,0.92,0.861,7,-5.435,1,0.218,0.211,2.59e-05,0.0288,0.718,97.969,211400,4
2001-02-10,15,Case Of The Ex (Whatcha Gonna Do),Mya,5Vyw16U5k4bpGaRqfzyyMo,False,11,2,26,0.774,0.684,1,-4.721,0,0.0408,0.0687,9.34e-05,0.0765,0.354,98.001,236827,4
2001-02-10,16,I Hope You Dance,Lee Ann Womack,5Vyw16U5k4bpGaRqfzyyMo,False,22,16,23,0.385,0.443,7,-9.627,0,0.0295,0.0632,0,0.0898,0.275,151.278,294533,4
2001-02-10,17,Kryptonite,3 Doors Down,5Vyw16U5k4bpGaRqfzyyMo,False,16,3,45,0.545,0.865,11,-5.708,0,0.0286,0.00664,1.1e-05,0.168,0.543,99.009,233933,4
2001-02-10,18,Crazy For This Girl,Evan And Jaron,5Vyw16U5k4bpGaRqfzyyMo,False,18,18,15,0.457,0.926,0,-5.461,1,0.038,0.000487,5.69e-05,0.0949,0.41,93.964,202027,4
2001-02-10,19,I Just Wanna Love U (Give It 2 Me),JAY-Z,5Vyw16U5k4bpGaRqfzyyMo,False,15,11,16,0.8,0.922,4,-5.125,0,0.24,0.301,9.31e-06,0.0352,0.801,98.631,227867,4
2001-02-10,20,Crazy,K-Ci & JoJo,5Vyw16U5k4bpGaRqfzyyMo,False,23,20,10,0.677,0.648,0,-4.4,1,0.0259,0.0987,0,0.554,0.448,116.128,260267,4
2001-02-10,21,Beautiful Day,U2,5Vyw16U5k4bpGaRqfzyyMo,False,21,21,19,0.539,0.926,2,-6.495,1,0.0499,0.014,0.00136,0.36,0.454,136.279,246400,4
2001-02-10,22,This I Promise You,'N Sync,5Vyw16U5k4bpGaRqfzyyMo,False,20,5,20,0.55,0.587,2,-6.279,1,0.0329,0.354,0,0.128,0.466,165.975,284760,4
2001-02-10,23,Liquid Dreams,O-Town,5Vyw16U5k4bpGaRqfzyyMo,False,24,10,8,0.823,0.7,0,-5.042,0,0.035,0.0264,0,0.0531,0.75,108.019,210400,4
2001-02-10,24,Promise,Jagged Edge,5Vyw16U5k4bpGaRqfzyyMo,False,26,24,8,0.751,0.568,5,-5.431,0,0.0872,0.136,0,0.0288,0.646,128.002,246720,4
2001-02-10,25,Butterfly,Crazy Town,5Vyw16U5k4bpGaRqfzyyMo,False,27,25,6,0.736,0.811,9,-4.17,0,0.081,0.00132,0.000142,0.107,0.609,103.502,216733,4
2001-02-10,26,Nobody Wants To Be Lonely,Ricky Martin Duet With Christina Aguilera,5Vyw16U5k4bpGaRqfzyyMo,False,34,26,3,0.597,0.612,10,-13.63,0,0.0351,0.00131,0.00589,0.0851,0.925,102.003,273187,4
2001-02-10,27,Stronger,Britney Spears,5Vyw16U5k4bpGaRqfzyyMo,False,14,11,11,0.707,0.923,11,-3.957,1,0.0521,0.128,0.000437,0.273,0.842,108.049,203000,4
2001-02-10,28,Jaded,Aerosmith,5Vyw16U5k4bpGaRqfzyyMo,False,37,28,3,0.517,0.89,9,-4.033,1,0.0539,0.005,1.47e-05,0.0824,0.632,118.009,214333,4
2001-02-10,29,No More (Baby I'ma Do Right),3LW,5Vyw16U5k4bpGaRqfzyyMo,False,29,29,15,0.721,0.723,2,-7.08,0,0.0631,0.102,4.4e-06,0.0651,0.761,88.933,263440,4
2001-02-10,30,South Side,Moby Featuring Gwen Stefani,5Vyw16U5k4bpGaRqfzyyMo,False,31,30,11,0.61,0.723,4,-7.572,1,0.0422,0.0103,0.0447,0.0748,0.45,97.147,229733,4
2001-02-10,31,Hemorrhage (In My Hands),Fuel,5Vyw16U5k4bpGaRqfzyyMo,False,30,30,16,0.301,0.823,1,-4.072,1,0.0433,0.000144,0.000309,0.0833,0.372,152.017,236867,4
2001-02-10,32,Thank You,Dido,5Vyw16U5k4bpGaRqfzyyMo,False,44,32,5,0.722,0.595,1,-9.928,0,0.0415,0.284,0.000538,0.0694,0.738,79.98,217827,4
2001-02-10,33,I Wish,R. Kelly,5Vyw16U5k4bpGaRqfzyyMo,False,25,14,20,0.42,0.463,6,-9.056,1,0.12,0.068,0,0.119,0.659,78.83,334000,4
2001-02-10,34,My Everything,98 Degrees,5Vyw16U5k4bpGaRqfzyyMo,False,35,34,10,0.637,0.523,4,-7.802,1,0.0326,0.296,0,0.101,0.238,125.979,231200,4
2001-02-10,35,What's Your Fantasy,Ludacris Featuring Shawnna,5Vyw16U5k4bpGaRqfzyyMo,False,32,21,20,0.915,0.79,6,-3.186,0,0.207,0.16,0,0.112,0.967,140.093,275907,4
2001-02-10,36,You Make Me Sick,P!nk,5Vyw16U5k4bpGaRqfzyyMo,False,41,36,6,0.77,0.686,11,-6.596,0,0.168,0.00223,2.03e-06,0.347,0.657,100.53,247533,4
2001-02-10,37,E.I.,Nelly,5Vyw16U5k4bpGaRqfzyyMo,False,28,15,19,0.834,0.481,2,-7.824,0,0.188,0.0732,0,0.0934,0.406,89.849,285907,4
2001-02-10,38,Southern Hospitality,Ludacris,5Vyw16U5k4bpGaRqfzyyMo,False,56,38,4,0.623,0.896,0,-4.719,1,0.247,0.035,0,0.0941,0.613,95.158,300933,4
2001-02-10,39,Tell Her,Lonestar,5Vyw16U5k4bpGaRqfzyyMo,False,42,39,13,0.58,0.487,7,-9.809,1,0.0318,0.437,0,0.0968,0.317,126.972,207560,4
2001-02-10,40,There Is No Arizona,Jamie O'Neal,5Vyw16U5k4bpGaRqfzyyMo,False,46,40,8,0.467,0.619,8,-6.046,0,0.0345,0.216,0,0.0886,0.346,167.907,236107,4
2001-02-10,41,It's Over Now,112,5Vyw16U5k4bpGaRqfzyyMo,False,49,41,10,0.66,0.71,1,-4.541,1,0.0409,0.0106,7.01e-06,0.0736,0.233,97.988,264933,4
2001-02-10,42,You Shouldn't Kiss Me Like This,Toby Keith,5Vyw16U5k4bpGaRqfzyyMo,False,50,42,7,0.421,0.79,7,-4.457,1,0.0417,0.319,3.41e-06,0.257,0.303,168.643,221067,4
2001-02-10,43,Could It Be,Jaheim,5Vyw16U5k4bpGaRqfzyyMo,False,57,43,9,0.655,0.553,9,-6.854,0,0.0891,0.0636,1.73e-05,0.126,0.531,70.033,224667,4
2001-02-10,44,One Woman Man,Dave Hollister,5Vyw16U5k4bpGaRqfzyyMo,False,45,44,10,0.627,0.647,11,-6.818,1,0.0294,0.0457,0,0.0655,0.521,91.015,272053,4
2001-02-10,45,Burn,Jo Dee Messina,5Vyw16U5k4bpGaRqfzyyMo,False,51,45,11,0.43,0.708,7,-6.804,1,0.0351,0.133,0,0.238,0.356,173.706,281427,4
2001-02-10,46,Most Girls,P!nk,5Vyw16U5k4bpGaRqfzyyMo,False,39,4,27,0.742,0.732,2,-6.046,0,0.0311,0.0424,0.00444,0.101,0.695,97.923,298960,4
2001-02-10,47,But For The Grace Of God,Keith Urban,5Vyw16U5k4bpGaRqfzyyMo,False,54,47,8,0.666,0.7,0,-6.083,1,0.0267,0.131,0,0.254,0.644,104.021,224107,4
2001-02-10,48,My Next Thirty Years,Tim McGraw,5Vyw16U5k4bpGaRqfzyyMo,False,40,27,17,0.605,0.804,5,-7.521,1,0.0363,0.265,4.93e-06,0.345,0.601,98.866,217733,4
2001-02-10,49,Dance With Me,Debelah Morgan,5Vyw16U5k4bpGaRqfzyyMo,False,33,8,29,0.85,0.674,7,-7.981,0,0.0373,0.309,0.000645,0.0356,0.74,115.005,220107,4
2001-02-10,50,Ashes By Now,Lee Ann Womack,5Vyw16U5k4bpGaRqfzyyMo,False,47,47,10,0.66,0.74,1,-7.175,1,0.0258,0.051,1.45e-05,0.0894,0.502,107.999,251173,4
2001-02-10,51,Without You,Dixie Chicks,5Vyw16U5k4bpGaRqfzyyMo,False,43,31,19,0.626,0.424,2,-8.952,1,0.0253,0.313,1.26e-05,0.134,0.173,91.812,210533,4
2001-02-10,52,My First Love,Avant Featuring KeKe Wyatt,5Vyw16U5k4bpGaRqfzyyMo,False,38,26,15,0.643,0.368,11,-8.379,0,0.033,0.0237,1.35e-06,0.157,0.414,125.95,268516,4
2001-02-10,53,Around The World (La La La La La),ATC,0C8PBBobLj0eeUQMWbwpSj,True,0,53,1,0.782,0.93,9,-11.164,0,0.0358,0.0852,0.171,0.146,0.894,132.015,312355,4
2001-02-10,54,Just Friends (Sunny),Musiq,0C8PBBobLj0eeUQMWbwpSj,False,48,31,18,0.754,0.376,0,-7.561,1,0.204,0.404,0,0.358,0.554,95.018,251427,4
2001-02-10,55,Stranger In My House,Tamia,0C8PBBobLj0eeUQMWbwpSj,False,61,55,5,0.676,0.601,0,-4.905,1,0.0297,0.103,0,0.147,0.206,119.94,285387,4
2001-02-10,56,Wild Horses,Garth Brooks,0C8PBBobLj0eeUQMWbwpSj,False,63,56,8,0.711,0.565,4,-4.213,1,0.027,0.589,4.58e-05,0.116,0.447,120.048,196093,4
2001-02-10,57,Babylon,David Gray,0C8PBBobLj0eeUQMWbwpSj,False,59,57,11,0.737,0.543,8,-10.403,1,0.0374,0.0598,0.01,0.103,0.256,112.016,265667,4
2001-02-10,58,Born To Fly,Sara Evans,0C8PBBobLj0eeUQMWbwpSj,False,53,34,17,0.612,0.663,1,-9.314,1,0.035,0.00931,0.0152,0.0637,0.558,100.178,336360,4
2001-02-10,59,One More Day,Diamond Rio,0C8PBBobLj0eeUQMWbwpSj,False,66,59,4,0.668,0.405,4,-7.629,1,0.0277,0.592,0,0.115,0.234,131.064,216173,4
2001-02-10,60,So In Love With Two,Mikaila,0C8PBBobLj0eeUQMWbwpSj,False,62,25,12,0.779,0.788,2,-4.63,0,0.0362,0.278,2.5e-06,0.0708,0.791,119.999,206933,4
2001-02-10,61,Who I Am,Jessica Andrews,0C8PBBobLj0eeUQMWbwpSj,False,67,61,3,0.463,0.674,7,-5.422,1,0.0319,0.0115,0,0.123,0.259,84.039,255234,4
2001-02-10,62,Emotional,Carl Thomas,0C8PBBobLj0eeUQMWbwpSj,False,60,47,12,0.548,0.542,1,-8.435,0,0.0409,0.544,0,0.148,0.389,83.106,271868,4
2001-02-10,63,Shape Of My Heart,Backstreet Boys,0C8PBBobLj0eeUQMWbwpSj,False,52,9,18,0.575,0.786,9,-4.353,1,0.0296,0.252,0,0.159,0.518,96.102,230093,4
2001-02-10,64,This Everyday Love,Rascal Flatts,0C8PBBobLj0eeUQMWbwpSj,False,65,64,8,0.673,0.812,0,-3.436,1,0.0468,0.348,0,0.106,0.96,95.024,184107,4
2001-02-10,66,Breathless,The Corrs,,False,78,66,3,0.607,0.82,11,-7.754,1,0.0597,0.0541,6.8e-05,0.269,0.768,126.988,207507,4
2001-02-10,67,Still On Your Side,BBMak,,False,58,54,7,0.517,0.808,10,-4.519,1,0.0262,0.0769,0,0.298,0.52,85.052,230960,4
2001-02-10,68,Is That Your Chick,Memphis Bleek Featuring Jay-Z & Missy Elliott,,False,68,68,9,0.841,0.835,8,-6.191,0,0.308,0.263,0,0.108,0.702,133.024,294040,4
2001-02-10,70,Bow Wow (That's My Name),Lil Bow Wow,,False,55,29,12,0.762,0.67,8,-6.2,0,0.257,0.0217,0,0.0786,0.591,93.066,213493,4
2001-02-10,71,I Did It,Dave Matthews Band,,False,71,71,3,0.578,0.86,2,-6.011,1,0.0366,0.00582,0,0.246,0.512,108.051,216293,4
2001-02-10,72,After Party,Koffee Brown,,False,73,72,5,0.802,0.552,5,-4.796,0,0.0503,0.0492,1.7e-06,0.0224,0.601,105.481,214560,4
2001-02-10,73,If My Heart Had Wings,Faith Hill,,False,80,73,2,0.569,0.767,8,-6.37,1,0.0331,0.0292,0,0.0822,0.548,123.734,215733,4
2001-02-10,74,Free,Mya,,False,75,74,2,0.785,0.784,11,-6.208,0,0.0578,0.0135,3.18e-05,0.07,0.653,108.013,318733,4
2001-02-10,75,Loser,3 Doors Down,,False,76,55,17,0.493,0.88,6,-6.424,0,0.0693,0.0108,2.66e-05,0.226,0.389,147.913,264800,4
2001-02-10,76,Hanging By A Moment,Lifehouse,0wqOReZDnrefefEsrIGeR4,True,0,76,1,0.541,0.864,1,-4.915,1,0.0357,0.00118,0,0.0896,0.435,124.557,216067,4
2001-02-10,77,Snoop Dogg,Snoop Dogg,0wqOReZDnrefefEsrIGeR4,False,77,77,2,0.855,0.812,1,-6.334,1,0.242,0.314,0,0.311,0.811,107.373,243560,4
2001-02-10,78,A Long Walk,Jill Scott,1CeizRCGEYPWooEeVfmyFL,True,0,78,1,0.713,0.541,6,-9.295,0,0.248,0.0617,0.000137,0.112,0.28,75.714,280973,4
2001-02-10,79,Just Another Day In Paradise,Phil Vassar,1CeizRCGEYPWooEeVfmyFL,False,74,35,20,0.596,0.706,2,-5.562,1,0.0262,0.351,0,0.36,0.704,146.088,233880,4
2001-02-10,80,A Good Day To Run,Darryl Worley,1CeizRCGEYPWooEeVfmyFL,False,79,76,4,0.566,0.794,6,-5.537,1,0.0298,0.395,1.09e-05,0.145,0.725,147.106,188333,4
2001-02-10,81,One Step Closer,Linkin Park,3K4HG9evC7dg3N0R9cYqk4,True,0,81,1,0.492,0.969,9,-4.419,1,0.0491,0.0014,1.32e-06,0.0787,0.538,95.136,157333,4
2001-02-10,82,I Lost It,Kenny Chesney,3K4HG9evC7dg3N0R9cYqk4,False,70,34,17,0.584,0.429,3,-9.289,1,0.028,0.23,0,0.0708,0.355,138.884,234160,4
2001-02-10,83,Cha-Cha Slide,Mr. C The Slide Man,3K4HG9evC7dg3N0R9cYqk4,False,83,83,6,0.88,0.439,6,-11.922,1,0.0601,0.000451,0.893,0.113,0.162,119.973,248785,4
2001-02-10,84,We Danced,Brad Paisley,3K4HG9evC7dg3N0R9cYqk4,False,72,29,18,0.596,0.465,9,-8.511,1,0.0253,0.385,0,0.106,0.141,73.013,225680,4
2001-02-10,85,Soul Sista,Bilal,3K4HG9evC7dg3N0R9cYqk4,False,90,85,3,0.598,0.412,11,-9.838,1,0.14,0.815,0.000352,0.114,0.431,146.039,339847,4
2001-02-10,86,By Your Side,Sade,3K4HG9evC7dg3N0R9cYqk4,False,84,75,4,0.653,0.429,11,-10.473,1,0.0297,0.0849,0.00371,0.0693,0.627,146.073,274933,4
2001-02-10,87,Lady (Hear Me Tonight),Modjo,3K4HG9evC7dg3N0R9cYqk4,False,87,87,6,0.72,0.808,6,-5.627,1,0.0379,0.00793,0.0293,0.0634,0.869,126.041,307154,4
2001-02-10,88,X,Xzibit,3K4HG9evC7dg3N0R9cYqk4,False,81,76,7,0.936,0.678,4,-3.012,0,0.21,0.0795,0,0.0838,0.822,96.911,255640,4
2001-02-10,89,One More Time,Daft Punk,0DiWol3AO6WpXZgp0goxAV,True,0,89,1,0.611,0.697,2,-8.618,1,0.133,0.0193,0,0.332,0.476,122.752,320357,4
2001-02-10,90,Mamacita,Public Announcement,0DiWol3AO6WpXZgp0goxAV,False,82,39,8,0.712,0.771,1,-4.069,0,0.351,0.0566,0,0.063,0.746,94.937,226267,4
2001-02-10,91,Rollin',Limp Bizkit,0DiWol3AO6WpXZgp0goxAV,False,86,65,14,0.603,0.933,1,-3.358,1,0.171,0.00591,0,0.206,0.709,96.306,213760,4
2001-02-10,92,Missing You,Case,0CmXXEwul09Kf8X68lPA5l,True,0,92,1,0.612,0.579,1,-6.417,0,0.0553,0.285,0,0.0556,0.716,86.31,284667,4
2001-02-10,93,Oh No,Mos Def & Pharoahe Monch Featuring Nate Dogg,0CmXXEwul09Kf8X68lPA5l,False,88,83,8,0.719,0.863,5,-4.148,0,0.435,0.414,5.19e-06,0.147,0.765,87.579,239933,1
2001-02-10,95,Pour Me,Trick Pony,,False,95,95,2,0.484,0.905,10,-3.993,1,0.135,0.0936,0,0.286,0.767,182.058,172000,4
2001-02-10,96,911,Wyclef Jean Featuring Mary J. Blige,,False,85,38,19,0.747,0.646,7,-9.185,1,0.191,0.273,3.7e-06,0.0931,0.73,87.011,259333,4
2001-02-10,97,Change The Game,"Jay-Z, Beanie Sigel And Memphis Bleek",,False,99,97,2,0.93,0.425,1,-6.242,1,0.28,0.0286,0,0.15,0.482,94.582,187840,4
2001-02-10,98,Georgia,Carolyn Dawn Johnson,,False,98,98,3,0.533,0.621,0,-6.285,1,0.032,0.0549,0,0.219,0.279,81.594,293160,4
2001-02-10,99,www.memory,Alan Jackson,,False,89,45,15,0.701,0.503,5,-7.535,1,0.026,0.572,0,0.333,0.726,94.073,154200,4
2001-02-10,100,Stan,Eminem Featuring Dido,,False,93,51,15,0.78,0.768,6,-4.325,0,0.238,0.0371,2.34e-06,0.518,0.507,80.063,404107,4
