date,position,title,artist,spotify_id,is_new,last_pos,peak_pos,weeks,danceability,energy,key,loudness,mode,speechiness,acousticness,instrumentalness,liveness,valence,tempo,duration_ms,time_signature
2000-08-05,1,It's Gonna Be Me,'N Sync,1C2Q3AymKS17bw7T5gfq6p,False,1,1,14,0.636,0.873,0,-4.672,0,0.071,0.0407,1.27e-06,0.0372,0.908,165.071,192427,4
2000-08-05,2,Incomplete,Sisqo,1C2Q3AymKS17bw7T5gfq6p,False,55,2,7,0.746,0.443,1,-7.693,0,0.0771,0.282,0,0.14,0.272,119.311,274227,4
2000-08-05,3,Bent,matchbox twenty,1C2Q3AymKS17bw7T5gfq6p,False,2,1,15,0.518,0.83,6,-6.814,0,0.0386,0.0404,3.85e-06,0.375,0.527,95.468,256133,4
2000-08-05,4,Everything You Want,Vertical Horizon,1C2Q3AymKS17bw7T5gfq6p,False,3,1,29,0.637,0.759,3,-6.389,0,0.0305,0.0504,0,0.0642,0.741,93.898,257067,4
2000-08-05,5,Try Again,Aaliyah,1C2Q3AymKS17bw7T5gfq6p,False,4,1,21,0.852,0.333,0,-8.559,1,0.117,0.173,0.0545,0.0374,0.928,95.484,254750,4
2000-08-05,6,"Jumpin', Jumpin'",Destiny's Child,1C2Q3AymKS17bw7T5gfq6p,False,8,6,13,0.771,0.685,1,-4.639,1,0.0567,0.00543,0.00157,0.0537,0.683,88.997,230200,4
2000-08-05,7,I Wanna Know,Joe,1C2Q3AymKS17bw7T5gfq6p,False,5,4,32,0.725,0.487,8,-5.959,0,0.0368,0.26,1.09e-05,0.431,0.599,136.086,296693,4
2000-08-05,8,Absolutely (Story Of A Girl),Nine Days,1C2Q3AymKS17bw7T5gfq6p,False,6,6,14,0.481,0.94,7,-5.204,1,0.066,0.000891,0,0.0939,0.66,96.493,189333,4
2000-08-05,9,Higher,Creed,1C2Q3AymKS17bw7T5gfq6p,False,7,7,40,0.459,0.83,2,-6.254,1,0.0364,5.15e-05,0.00014,0.206,0.431,155.827,316733,4
2000-08-05,10,Doesn't Really Matter,Janet,1C2Q3AymKS17bw7T5gfq6p,False,15,10,8,0.771,0.796,5,-3.081,0,0.076,0.0993,0.00278,0.0981,0.801,99.316,265027,4
2000-08-05,11,He Wasn't Man Enough,Toni Braxton,1C2Q3AymKS17bw7T5gfq6p,False,10,2,21,0.739,0.947,11,-1.915,0,0.0412,0.00947,2.99e-05,0.326,0.763,88.009,261933,4
2000-08-05,12,There You Go,P!nk,1C2Q3AymKS17bw7T5gfq6p,False,9,7,23,0.822,0.847,10,-6.729,0,0.0916,0.0862,0,0.0452,0.667,107.906,202800,4
2000-08-05,13,I Need You,LeAnn Rimes,1C2Q3AymKS17bw7T5gfq6p,False,50,13,11,0.478,0.736,7,-7.124,1,0.0367,0.02,9.58e-05,0.118,0.564,144.705,229827,4
2000-08-05,14,Let's Get Married,Jagged Edge,1C2Q3AymKS17bw7T5gfq6p,False,11,11,14,0.852,0.694,1,-6.765,1,0.0653,0.0121,0,0.126,0.789,109.906,249040,4
2000-08-05,15,No More,Ruff Endz,1C2Q3AymKS17bw7T5gfq6p,False,12,12,6,0.839,0.641,10,-5.669,0,0.0858,0.0324,4.56e-06,0.0602,0.927,97.004,242560,4
2000-08-05,16,Back Here,BBMak,1C2Q3AymKS17bw7T5gfq6p,False,13,13,15,0.624,0.945,7,-3.109,1,0.0343,0.0698,4.57e-06,0.0867,0.914,104.77,218200,4
2000-08-05,17,(Hot S**t) Country Grammar,Nelly,1C2Q3AymKS17bw7T5gfq6p,False,21,17,15,0.85,0.7,7,-6.49,1,0.0478,0.0616,1.8e-06,0.244,0.722,101.875,291782,4
2000-08-05,18,Kryptonite,3 Doors Down,1C2Q3AymKS17bw7T5gfq6p,False,22,18,18,0.545,0.865,11,-5.708,0,0.0286,0.00664,1.1e-05,0.168,0.543,99.009,233933,4
2000-08-05,19,Desert Rose,Sting Featuring Cheb Mami,1C2Q3AymKS17bw7T5gfq6p,False,19,19,13,0.577,0.654,0,-7.9,0,0.0321,0.0143,0,0.114,0.13,111.993,285893,4
2000-08-05,20,You Sang To Me,Marc Anthony,1C2Q3AymKS17bw7T5gfq6p,False,20,2,24,0.578,0.894,10,-5.42,1,0.0296,0.0103,2.66e-06,0.216,0.741,165.98,347107,4
2000-08-05,21,Wifey,Next,1C2Q3AymKS17bw7T5gfq6p,False,24,21,11,0.831,0.713,7,-6.967,0,0.104,0.0678,0,0.0659,0.683,99.584,243467,4
2000-08-05,22,Breathe,Faith Hill,1C2Q3AymKS17bw7T5gfq6p,False,18,2,40,0.529,0.496,7,-9.007,1,0.029,0.173,0,0.251,0.278,136.859,250547,4
2000-08-05,23,I Think I'm In Love With You,Jessica Simpson,1C2Q3AymKS17bw7T5gfq6p,False,25,23,6,0.715,0.815,9,-5.867,1,0.0576,0.0689,0,0.233,0.804,106.001,197693,4
2000-08-05,24,Be With You,Enrique Iglesias,1C2Q3AymKS17bw7T5gfq6p,False,14,1,19,0.69,0.871,1,-5.484,0,0.0329,0.0359,0.000843,0.0347,0.561,121.984,220160,4
2000-08-05,25,I Turn To You,Christina Aguilera,1C2Q3AymKS17bw7T5gfq6p,False,17,3,17,0.599,0.47,1,-8.356,1,0.0376,0.38,0,0.111,0.298,127.177,273707,4
2000-08-05,26,The Next Episode,Dr. Dre Featuring Snoop Dogg,1C2Q3AymKS17bw7T5gfq6p,False,23,23,11,0.922,0.909,10,-2.429,0,0.27,0.0281,0,0.0856,0.309,95.295,161507,4
2000-08-05,27,Separated,Avant,1C2Q3AymKS17bw7T5gfq6p,False,29,23,15,0.798,0.48,0,-5.564,1,0.0276,0.247,0,0.237,0.643,108.241,255600,4
2000-08-05,28,I Wanna Be With You,Mandy Moore,1C2Q3AymKS17bw7T5gfq6p,False,31,28,8,0.515,0.908,8,-4.632,1,0.0368,0.0158,1.88e-05,0.412,0.637,150.031,252600,4
2000-08-05,29,Big Pimpin',Jay-Z Featuring UGK,1C2Q3AymKS17bw7T5gfq6p,False,26,18,16,0.88,0.814,11,-6.307,0,0.14,0.168,0.00672,0.0584,0.942,138.083,283067,4
2000-08-05,30,The Real Slim Shady,Eminem,1C2Q3AymKS17bw7T5gfq6p,False,16,4,14,0.949,0.661,5,-4.244,0,0.0572,0.0302,0,0.0454,0.76,104.504,284200,4
2000-08-05,31,What'Chu Like,Da Brat Featuring Tyrese,1C2Q3AymKS17bw7T5gfq6p,False,28,28,10,0.879,0.681,10,-8.951,0,0.24,0.017,0,0.0669,0.817,99.974,221160,4
2000-08-05,32,Purest Of Pain (A Puro Dolor),Son By Four,1C2Q3AymKS17bw7T5gfq6p,False,30,30,18,0.565,0.547,0,-7.722,1,0.0347,0.579,0,0.194,0.252,75.018,209320,4
2000-08-05,33,Wonderful,Everclear,1C2Q3AymKS17bw7T5gfq6p,False,37,33,5,0.514,0.817,7,-6.489,1,0.05,0.0118,8.25e-06,0.346,0.734,186.765,280813,4
2000-08-05,34,I Try,Macy Gray,1C2Q3AymKS17bw7T5gfq6p,False,27,5,25,0.593,0.642,2,-7.284,1,0.0299,0.313,0.000582,0.0804,0.736,76.403,239440,4
2000-08-05,35,I Hope You Dance,Lee Ann Womack,1C2Q3AymKS17bw7T5gfq6p,False,32,32,13,0.385,0.443,7,-9.627,0,0.0295,0.0632,0,0.0898,0.275,151.278,294533,4
2000-08-05,36,I Will Love Again,Lara Fabian,1C2Q3AymKS17bw7T5gfq6p,False,40,36,9,0.643,0.757,9,-8.031,0,0.0347,0.0435,1.35e-06,0.0883,0.471,126.975,223040,4
2000-08-05,37,What About Now,Lonestar,1C2Q3AymKS17bw7T5gfq6p,False,39,37,9,0.739,0.688,4,-5.581,1,0.0349,0.498,0,0.17,0.769,126.998,211253,4
2000-08-05,38,That's The Way,Jo Dee Messina,1C2Q3AymKS17bw7T5gfq6p,False,44,38,7,0.488,0.923,2,-3.697,1,0.103,0.129,0,0.158,0.818,183.891,202253,4
2000-08-05,39,Smooth,Santana Featuring Rob Thomas,1C2Q3AymKS17bw7T5gfq6p,False,41,1,54,0.609,0.923,9,-3.908,1,0.0338,0.16,4.73e-06,0.295,0.961,115.996,294987,4
2000-08-05,40,Where I Wanna Be,Donell Jones,1C2Q3AymKS17bw7T5gfq6p,False,34,29,16,0.664,0.396,5,-9.131,0,0.0298,0.52,0,0.268,0.453,102.053,253627,4
2000-08-05,41,Prayin' For Daylight,Rascal Flatts,1C2Q3AymKS17bw7T5gfq6p,False,46,41,14,0.64,0.781,7,-3.155,1,0.0398,0.578,0,0.272,0.646,91.02,215600,4
2000-08-05,42,Amazed,Lonestar,1C2Q3AymKS17bw7T5gfq6p,False,42,1,53,0.561,0.543,1,-8.498,1,0.0324,0.26,0,0.124,0.243,139.803,240867,4
2000-08-05,43,Dance Tonight,Lucy Pearl,1C2Q3AymKS17bw7T5gfq6p,False,36,36,12,0.787,0.425,10,-5.692,0,0.0641,0.00637,0.00169,0.196,0.711,99.225,221280,4
2000-08-05,44,It Must Be Love,Alan Jackson,1C2Q3AymKS17bw7T5gfq6p,False,49,44,7,0.816,0.669,6,-7.925,1,0.0295,0.284,0,0.0563,0.967,112.132,171813,4
2000-08-05,45,Swear It Again,Westlife,1C2Q3AymKS17bw7T5gfq6p,False,33,20,19,0.626,0.532,9,-7.205,1,0.0276,0.296,0,0.123,0.33,130.076,247933,4
2000-08-05,46,Thong Song,Sisqo,1C2Q3AymKS17bw7T5gfq6p,False,43,3,28,0.706,0.888,2,-6.959,1,0.0654,0.119,9.64e-05,0.07,0.714,121.549,253733,4
2000-08-05,47,Maria Maria,Santana Featuring The Product G&B,1C2Q3AymKS17bw7T5gfq6p,False,48,1,26,0.777,0.601,2,-5.931,1,0.126,0.0406,0.00201,0.0348,0.68,97.911,261973,4
2000-08-05,48,Simple Kind Of Life,No Doubt,1C2Q3AymKS17bw7T5gfq6p,False,38,38,6,0.576,0.849,0,-5.199,1,0.0355,0.0678,0,0.278,0.482,119.999,256933,4
2000-08-05,49,Oops!...I Did It Again,Britney Spears,1C2Q3AymKS17bw7T5gfq6p,False,35,9,16,0.751,0.834,1,-5.444,0,0.0437,0.3,1.77e-05,0.355,0.894,95.053,211160,4
2000-08-05,50,Yes!,Chad Brock,1C2Q3AymKS17bw7T5gfq6p,False,45,22,18,0.674,0.623,2,-5.97,1,0.0283,0.00408,5.61e-05,0.0488,0.452,126.547,206733,4
2000-08-05,51,Flowers On The Wall,Eric Heatherly,1C2Q3AymKS17bw7T5gfq6p,False,53,51,15,0.76,0.644,1,-8.971,1,0.0431,0.07,1.91e-05,0.155,0.779,99.954,209440,4
2000-08-05,52,Could I Have This Kiss Forever,Whitney Houston & Enrique Iglesias,1C2Q3AymKS17bw7T5gfq6p,False,60,52,8,0.505,0.876,10,-6.107,0,0.0772,0.00375,6.06e-06,0.138,0.443,93.841,235107,4
2000-08-05,53,I'll Be,Reba McEntire,1C2Q3AymKS17bw7T5gfq6p,False,51,51,13,0.586,0.423,0,-9.951,1,0.0267,0.643,0,0.129,0.268,122.625,268867,4
2000-08-05,54,Whatever,Ideal Featuring Lil' Mo,1C2Q3AymKS17bw7T5gfq6p,False,54,54,9,0.824,0.708,10,-6.037,0,0.0712,0.00223,0,0.0902,0.767,101.854,228159,4
2000-08-05,55,One Voice,Billy Gilman,1C2Q3AymKS17bw7T5gfq6p,False,56,55,8,0.442,0.447,0,-8.838,1,0.0252,0.101,0,0.0962,0.16,149.652,249840,4
2000-08-05,56,Faded,SoulDecision Featuring Thrust,1C2Q3AymKS17bw7T5gfq6p,False,64,56,5,0.859,0.585,6,-9.779,0,0.0986,0.153,0,0.0597,0.908,107.998,209123,4
2000-08-05,57,Come On Over Baby (All I Want Is You),Christina Aguilera,7A0apkTSTvMbSI7yplcmlh,True,0,57,1,0.829,0.915,8,-3.205,1,0.106,0.226,1.25e-05,0.246,0.779,118.903,203333,4
2000-08-05,58,Taking You Home,Don Henley,7A0apkTSTvMbSI7yplcmlh,False,62,58,7,0.569,0.498,4,-6.63,0,0.0269,0.341,2.35e-05,0.134,0.0891,72.344,331667,4
2000-08-05,59,Change Your Mind,Sister Hazel,7A0apkTSTvMbSI7yplcmlh,False,66,59,4,0.428,0.785,0,-4.853,1,0.0569,0.0104,0,0.102,0.68,182.352,259667,4
2000-08-05,60,No Matter What They Say,Lil' Kim,7A0apkTSTvMbSI7yplcmlh,False,67,60,4,0.744,0.775,1,-7.697,1,0.325,0.0267,0,0.137,0.649,106.093,251200,4
2000-08-05,61,I Will...But,SHeDAISY,7A0apkTSTvMbSI7yplcmlh,False,70,61,4,0.675,0.837,2,-5.105,1,0.0354,0.103,0,0.123,0.888,112.53,219973,4
2000-08-05,62,Broadway,Goo Goo Dolls,7A0apkTSTvMbSI7yplcmlh,False,57,24,16,0.527,0.878,11,-5.704,1,0.0424,0.000555,0,0.0852,0.757,132.791,238533,4
2000-08-05,63,Crash And Burn,Savage Garden,7A0apkTSTvMbSI7yplcmlh,False,58,24,18,0.581,0.607,4,-8.458,1,0.028,0.189,1.6e-06,0.0882,0.213,102.03,281467,4
2000-08-05,64,As We Lay,Kelly Price,7A0apkTSTvMbSI7yplcmlh,False,69,64,4,0.46,0.359,8,-7.812,1,0.0341,0.435,0,0.113,0.137,123.536,381853,4
2000-08-05,65,Cold Day In July,Dixie Chicks,7A0apkTSTvMbSI7yplcmlh,False,68,65,7,0.574,0.368,7,-10.644,1,0.0271,0.0163,2.12e-05,0.0746,0.296,129.457,312693,4
2000-08-05,66,Don't Think I'm Not,Kandi,487Dyzs7Xbbk4hIWYyYT80,True,0,66,1,0.859,0.622,11,-8.196,1,0.0445,0.0661,0,0.0394,0.433,134.007,243533,4
2000-08-05,67,I Wish,Carl Thomas,487Dyzs7Xbbk4hIWYyYT80,False,52,20,20,0.736,0.666,1,-4.929,1,0.0337,0.0593,3.82e-05,0.107,0.224,89.824,226760,4
2000-08-05,68,Better Off Alone,Alice Deejay,487Dyzs7Xbbk4hIWYyYT80,False,65,27,18,0.666,0.854,8,-8.442,0,0.0565,0.0044,0.769,0.313,0.748,136.954,215246,4
2000-08-05,69,Just Be A Man About It,Toni Braxton,487Dyzs7Xbbk4hIWYyYT80,False,76,69,2,0.753,0.45,9,-6.909,1,0.0924,0.274,2e-06,0.321,0.56,109.405,288933,4
2000-08-05,70,Some Things Never Change,Tim McGraw,487Dyzs7Xbbk4hIWYyYT80,False,59,58,13,0.545,0.61,4,-6.396,1,0.027,0.355,1.21e-06,0.18,0.415,89.924,236267,4
2000-08-05,71,Last Resort,Papa Roach,487Dyzs7Xbbk4hIWYyYT80,False,75,71,2,0.589,0.89,4,-3.719,0,0.0603,0.000481,0.00082,0.201,0.692,90.598,199907,4
2000-08-05,72,Californication,Red Hot Chili Peppers,487Dyzs7Xbbk4hIWYyYT80,False,72,72,2,0.592,0.767,9,-2.788,0,0.027,0.0021,0.00165,0.127,0.328,96.483,329733,4
2000-08-05,73,Your Everything,Keith Urban,487Dyzs7Xbbk4hIWYyYT80,False,73,73,4,0.549,0.54,9,-5.76,1,0.027,0.0399,0,0.0688,0.361,139.714,239360,4
2000-08-05,74,You'll Always Be Loved By Me,Brooks & Dunn,487Dyzs7Xbbk4hIWYyYT80,False,74,74,9,0.672,0.658,2,-6.563,1,0.0258,0.2,2.49e-05,0.294,0.569,103.12,181840,4
2000-08-05,75,The Light,Common,5fybLNY2eBRnEGg8SUW6yk,True,0,75,1,0.934,0.649,7,-6.465,1,0.266,0.114,1.71e-06,0.0807,0.685,97.026,243587,4
2000-08-05,76,The One,Backstreet Boys,5fybLNY2eBRnEGg8SUW6yk,False,61,30,11,0.663,0.934,5,-4.227,0,0.0348,0.0646,0,0.164,0.621,110.031,226933,4
2000-08-05,77,Treat Her Like A Lady,Joe,2dw34jPD8ihGrP6z1LE6eQ,True,0,77,1,0.75,0.463,5,-6.99,0,0.0415,0.0581,0,0.0889,0.568,126.072,257773,4
2000-08-05,78,Sour Girl,Stone Temple Pilots,2dw34jPD8ihGrP6z1LE6eQ,False,78,78,5,0.394,0.663,0,-6.619,1,0.0295,0.0769,0.00644,0.239,0.737,207.575,256253,4
2000-08-05,79,What You Want,DMX Featuring Sisqo,2dw34jPD8ihGrP6z1LE6eQ,False,86,79,6,0.644,0.841,1,-5.794,1,0.324,0.0631,0,0.325,0.752,166.999,248653,4
2000-08-05,80,When You Need My Love,Darryl Worley,2dw34jPD8ihGrP6z1LE6eQ,False,80,80,9,0.587,0.641,4,-5.843,1,0.0224,0.0843,0,0.31,0.412,86.008,219800,4
2000-08-05,81,I Think God Can Explain,Splender,2dw34jPD8ihGrP6z1LE6eQ,False,71,62,9,0.48,0.729,10,-4.398,1,0.028,0.0129,0,0.0862,0.509,137.232,236760,4
2000-08-05,82,Country Comes To Town,Toby Keith,7qkUw81edqOdtGnTR5stiR,True,0,82,1,0.697,0.928,9,-4.173,1,0.0423,0.102,0,0.066,0.722,123.785,218000,4
2000-08-05,83,Unconditional,Clay Davidson,7qkUw81edqOdtGnTR5stiR,False,63,49,20,0.562,0.451,7,-7.799,1,0.0266,0.419,0,0.104,0.277,132.949,240960,4
2000-08-05,84,With Arms Wide Open,Creed,7qkUw81edqOdtGnTR5stiR,False,79,68,13,0.41,0.539,0,-8.412,1,0.0302,0.00425,0.00089,0.117,0.141,138.852,274800,4
2000-08-05,85,Who Let The Dogs Out,Baha Men,7qkUw81edqOdtGnTR5stiR,False,92,85,3,0.596,0.954,0,-4.745,1,0.0657,0.00038,0.0171,0.227,0.628,128.913,150581,4
2000-08-05,86,Dance With Me,Debelah Morgan,7qkUw81edqOdtGnTR5stiR,False,91,86,2,0.85,0.674,7,-7.981,0,0.0373,0.309,0.000645,0.0356,0.74,115.005,220107,4
2000-08-05,87,I Disappear,Metallica,7qkUw81edqOdtGnTR5stiR,False,82,76,13,0.534,0.929,1,-3.609,1,0.047,0.000206,5.58e-05,0.036,0.447,122.733,266240,4
2000-08-05,88,"Same Script, Different Cast",Whitney Houston & Deborah Cox,7qkUw81edqOdtGnTR5stiR,False,77,70,8,0.671,0.59,1,-6.062,0,0.0346,0.528,0,0.119,0.241,117.979,295893,4
2000-08-05,89,Callin' Me,Lil' Zane Featuring 112,7qkUw81edqOdtGnTR5stiR,False,83,83,2,0.782,0.675,8,-5.096,0,0.0706,0.00814,0,0.0978,0.663,106.956,257307,4
2000-08-05,90,The Chain Of Love,Clay Walker,7qkUw81edqOdtGnTR5stiR,False,81,40,17,0.533,0.315,2,-14.349,1,0.0308,0.235,1.19e-05,0.0939,0.316,140.918,304507,4
2000-08-05,91,Got It All,Eve & Jadakiss,7qkUw81edqOdtGnTR5stiR,False,88,88,4,0.79,0.755,1,-5.992,1,0.459,0.0152,3.75e-05,0.411,0.627,95.048,227227,4
2000-08-05,92,Wobble Wobble,504 Boyz,7qkUw81edqOdtGnTR5stiR,False,85,17,17,0.851,0.702,7,-5.618,1,0.283,0.00296,0,0.36,0.331,170.014,214534,4
2000-08-05,93,Don't Call Me Baby,Madison Avenue,7qkUw81edqOdtGnTR5stiR,False,93,93,5,0.808,0.982,3,-6.588,0,0.0311,0.0585,0.00689,0.35,0.961,124.999,228140,4
2000-08-05,94,Shackles (Praise You),Mary Mary,7qkUw81edqOdtGnTR5stiR,False,84,28,20,0.779,0.834,7,-2.773,1,0.162,0.0343,0,0.0886,0.8,100.46,198347,4
2000-08-05,95,Crybaby,Mariah Carey Featuring Snoop Dogg,7qkUw81edqOdtGnTR5stiR,False,90,28,7,0.586,0.578,2,-5.183,0,0.0481,0.216,0,0.106,0.626,79.08,319107,4
2000-08-05,96,West Side Story,LFO,4KJKJUetg7Gs3e0MAoSIzX,True,0,96,1,0.691,0.792,9,-3.884,1,0.0509,0.0961,0,0.392,0.302,100.057,208160,4
2000-08-05,97,Best Of Me,Mya Featuring Jadakiss,4KJKJUetg7Gs3e0MAoSIzX,False,94,50,17,0.74,0.576,8,-7.486,0,0.367,0.114,0,0.0963,0.763,96.355,221400,4
2000-08-05,98,Cherchez LaGhost,Ghostface Killah,5vKPSbwck6yojUAZIHTsFj,True,0,98,1,0.866,0.554,11,-7.782,1,0.045,0.0322,3.52e-06,0.0946,0.536,103.537,183160,4
2000-08-05,99,Take That,"Torrey Carter Featuring Missy ""Misdemeanor"" Elliott",5vKPSbwck6yojUAZIHTsFj,False,87,86,7,0.737,0.737,6,-6.223,0,0.117,0.00904,0.000323,0.242,0.704,92.917,223843,4
2000-08-05,100,Dancing Queen,A*Teens,5vKPSbwck6yojUAZIHTsFj,False,95,95,5,0.65,0.902,9,-2.823,1,0.0437,0.107,0.000194,0.0793,0.531,104.871,228573,4
