date,position,title,artist,spotify_id,is_new,last_pos,peak_pos,weeks,danceability,energy,key,loudness,mode,speechiness,acousticness,instrumentalness,liveness,valence,tempo,duration_ms,time_signature
2019-12-21,1,All I Want For Christmas Is You,Mariah Carey,6ztvsy3C6hPjVg9j4x1XKJ,False,3,1,35,0.695,0.652,11,-7.828,0,0.0751,0.000441,5.66e-06,0.0667,0.744,128.024,401680,4
2019-12-21,2,Circles,Post Malone,6ztvsy3C6hPjVg9j4x1XKJ,False,2,1,15,0.695,0.762,0,-3.497,1,0.0395,0.192,0.00244,0.0863,0.553,120.042,215280,4
2019-12-21,3,Rockin' Around The Christmas Tree,Brenda Lee,6ztvsy3C6hPjVg9j4x1XKJ,False,8,3,30,0.589,0.472,8,-8.749,1,0.0502,0.614,0,0.505,0.898,67.196,126267,4
2019-12-21,4,Someone You Loved,Lewis Capaldi,6ztvsy3C6hPjVg9j4x1XKJ,False,4,1,31,0.501,0.405,1,-5.679,1,0.0319,0.751,0,0.105,0.446,109.891,182161,4
2019-12-21,5,Good As Hell,Lizzo,6ztvsy3C6hPjVg9j4x1XKJ,False,6,3,16,0.682,0.919,0,-3.18,0,0.0875,0.256,0,0.442,0.535,95.982,159736,4
2019-12-21,6,Roxanne,Arizona Zervas,6ztvsy3C6hPjVg9j4x1XKJ,False,7,5,6,0.621,0.601,6,-5.616,0,0.148,0.0522,0,0.46,0.457,116.735,163636,5
2019-12-21,7,Memories,Maroon 5,6ztvsy3C6hPjVg9j4x1XKJ,False,5,4,12,0.764,0.32,11,-7.209,1,0.0546,0.837,0,0.0822,0.575,91.019,189486,4
2019-12-21,8,Lucid Dreams,Juice WRLD,6ztvsy3C6hPjVg9j4x1XKJ,False,0,2,47,0.511,0.566,6,-7.23,0,0.2,0.349,0,0.34,0.218,83.903,239836,4
2019-12-21,9,Dance Monkey,Tones And I,6ztvsy3C6hPjVg9j4x1XKJ,False,13,9,10,0.824,0.588,6,-6.4,0,0.0924,0.692,0.000104,0.149,0.513,98.027,209438,4
2019-12-21,10,A Holly Jolly Christmas,Burl Ives,6ztvsy3C6hPjVg9j4x1XKJ,False,18,10,13,0.683,0.375,0,-13.056,1,0.0303,0.579,0,0.076,0.888,140.467,135533,4
2019-12-21,11,BOP,DaBaby,6ztvsy3C6hPjVg9j4x1XKJ,False,12,11,11,0.769,0.787,11,-3.909,1,0.367,0.189,0,0.129,0.836,126.77,159715,4
2019-12-21,12,Bandit,Juice WRLD & YoungBoy Never Broke Again,6ztvsy3C6hPjVg9j4x1XKJ,False,40,10,10,0.474,0.631,5,-5.884,0,0.343,0.0687,0,0.132,0.425,180.051,189323,4
2019-12-21,13,Lose You To Love Me,Selena Gomez,6ztvsy3C6hPjVg9j4x1XKJ,False,9,1,8,0.488,0.343,4,-8.985,1,0.0436,0.556,0,0.21,0.0978,102.819,206459,4
2019-12-21,14,"10,000 Hours",Dan + Shay & Justin Bieber,6ztvsy3C6hPjVg9j4x1XKJ,False,10,4,10,0.654,0.63,10,-4.644,1,0.0259,0.153,0,0.111,0.43,89.991,167693,4
2019-12-21,15,Jingle Bell Rock,Bobby Helms,6ztvsy3C6hPjVg9j4x1XKJ,False,23,8,28,0.754,0.424,2,-8.463,1,0.0363,0.643,0,0.0652,0.806,119.705,130973,4
2019-12-21,16,Senorita,Shawn Mendes & Camila Cabello,6ztvsy3C6hPjVg9j4x1XKJ,False,15,1,25,0.759,0.54,9,-6.039,0,0.0287,0.037,0,0.0945,0.75,116.947,190960,4
2019-12-21,17,Heartless,The Weeknd,6ztvsy3C6hPjVg9j4x1XKJ,False,1,1,3,0.538,0.751,10,-5.487,0,0.128,0.0194,1.42e-06,0.145,0.244,169.985,198267,4
2019-12-21,18,Ballin',Mustard & Roddy Ricch,6ztvsy3C6hPjVg9j4x1XKJ,False,16,16,21,0.809,0.545,7,-6.678,1,0.0735,0.392,0,0.151,0.244,97.008,180435,4
2019-12-21,19,No Guidance,Chris Brown Featuring Drake,6ztvsy3C6hPjVg9j4x1XKJ,False,14,5,27,0.696,0.454,1,-6.756,0,0.153,0.123,0,0.155,0.136,92.928,260640,4
2019-12-21,20,It's The Most Wonderful Time Of The Year,Andy Williams,6ztvsy3C6hPjVg9j4x1XKJ,False,24,10,13,0.24,0.598,7,-8.435,1,0.0369,0.766,0,0.117,0.776,201.629,151933,3
2019-12-21,21,Bad Guy,Billie Eilish,6ztvsy3C6hPjVg9j4x1XKJ,False,21,1,37,0.701,0.425,7,-10.965,1,0.375,0.328,0.13,0.1,0.562,135.128,194088,4
2019-12-21,22,Panini,Lil Nas X,6ztvsy3C6hPjVg9j4x1XKJ,False,17,5,25,0.717,0.598,5,-5.613,0,0.0809,0.22,0,0.122,0.496,153.905,151040,4
2019-12-21,23,Truth Hurts,Lizzo,6ztvsy3C6hPjVg9j4x1XKJ,False,22,1,32,0.715,0.624,4,-3.046,0,0.114,0.11,0,0.123,0.412,158.087,173325,4
2019-12-21,24,"Let It Snow, Let It Snow, Let It Snow",Dean Martin,6ztvsy3C6hPjVg9j4x1XKJ,False,28,20,6,0.451,0.24,1,-14.014,1,0.0351,0.912,2.45e-06,0.175,0.701,134.009,117147,4
2019-12-21,25,HIGHEST IN THE ROOM,Travis Scott,6ztvsy3C6hPjVg9j4x1XKJ,False,20,1,10,0.598,0.427,7,-8.764,0,0.0317,0.0546,5.83e-06,0.21,0.0605,76.469,175721,4
2019-12-21,26,Last Christmas,Wham!,6ztvsy3C6hPjVg9j4x1XKJ,False,27,25,12,0.735,0.478,2,-12.472,1,0.0293,0.189,2.48e-06,0.355,0.947,107.682,262960,4
2019-12-21,27,Trampoline,SHAED,6ztvsy3C6hPjVg9j4x1XKJ,False,19,13,28,0.689,0.412,7,-7.523,0,0.0301,0.488,0.00016,0.0659,0.537,126.754,184060,4
2019-12-21,28,Woah,Lil Baby,6ztvsy3C6hPjVg9j4x1XKJ,False,29,16,5,0.884,0.617,11,-5.598,1,0.233,0.0153,0,0.19,0.402,142.952,183011,4
2019-12-21,29,Legends,Juice WRLD,6ztvsy3C6hPjVg9j4x1XKJ,False,0,29,3,0.594,0.798,4,-5.244,1,0.0844,0.115,0,0.143,0.381,142.049,191840,4
2019-12-21,30,Everything I Wanted,Billie Eilish,6ztvsy3C6hPjVg9j4x1XKJ,False,25,8,5,0.704,0.225,6,-14.454,0,0.0994,0.902,0.657,0.106,0.243,120.006,245426,4
2019-12-21,31,Ran$om,Lil Tecca,6ztvsy3C6hPjVg9j4x1XKJ,False,37,4,28,0.536,0.715,7,-6.577,1,0.287,0.571,0.000418,0.471,0.391,179.631,60070,4
2019-12-21,32,The Christmas Song (Merry Christmas To You),Nat King Cole,6ztvsy3C6hPjVg9j4x1XKJ,False,33,11,19,0.319,0.21,1,-15.231,1,0.0341,0.92,8.06e-05,0.138,0.209,78.696,192160,4
2019-12-21,33,Hot,Young Thug Featuring Gunna,6ztvsy3C6hPjVg9j4x1XKJ,False,26,11,17,0.855,0.651,0,-8.044,0,0.235,0.063,0,0.0772,0.559,111.997,193027,4
2019-12-21,34,Feliz Navidad,Jose Feliciano,6ztvsy3C6hPjVg9j4x1XKJ,False,39,29,7,0.513,0.831,2,-9.004,1,0.0383,0.55,0,0.336,0.963,148.837,182067,4
2019-12-21,35,Adore You,Harry Styles,3jjujdWJ72nww5eGnfs2E7,True,0,35,1,0.676,0.771,8,-3.675,1,0.0483,0.0237,7e-06,0.102,0.569,99.048,207133,4
2019-12-21,36,Falling,Trevor Daniel,3jjujdWJ72nww5eGnfs2E7,False,41,36,4,0.785,0.431,10,-8.756,0,0.0364,0.123,0,0.0887,0.236,127.085,159382,4
2019-12-21,37,Sleigh Ride,The Ronettes,3jjujdWJ72nww5eGnfs2E7,False,43,26,5,0.529,0.772,2,-7.013,1,0.0287,0.403,2.21e-06,0.316,0.853,91.751,181267,4
2019-12-21,38,Rudolph The Red-Nosed Reindeer,Gene Autry,3jjujdWJ72nww5eGnfs2E7,False,44,16,6,0.834,0.371,1,-11.99,1,0.0358,0.799,0,0.275,0.976,96.628,150267,4
2019-12-21,39,Old Town Road,Lil Nas X Featuring Billy Ray Cyrus,3jjujdWJ72nww5eGnfs2E7,False,31,1,41,0.878,0.619,6,-5.56,1,0.102,0.0533,0,0.113,0.639,136.041,157067,4
2019-12-21,40,Lover,Taylor Swift,3jjujdWJ72nww5eGnfs2E7,False,32,10,17,0.359,0.543,7,-7.582,1,0.0919,0.492,1.58e-05,0.118,0.453,68.534,221307,4
2019-12-21,41,One Man Band,Old Dominion,3jjujdWJ72nww5eGnfs2E7,False,30,20,16,0.706,0.358,6,-8.331,1,0.0347,0.677,0,0.107,0.478,75.991,186240,4
2019-12-21,42,Don't Start Now,Dua Lipa,3jjujdWJ72nww5eGnfs2E7,False,42,30,6,0.794,0.793,11,-4.521,0,0.0842,0.0125,0,0.0952,0.677,123.941,183290,4
2019-12-21,43,Happy Holiday / The Holiday Season,Andy Williams,3jjujdWJ72nww5eGnfs2E7,False,47,43,2,0.505,0.451,9,-10.193,0,0.0329,0.727,0,0.233,0.744,74.347,156867,4
2019-12-21,44,Only Human,Jonas Brothers,3jjujdWJ72nww5eGnfs2E7,False,34,18,26,0.795,0.496,0,-5.883,1,0.0722,0.108,0,0.0645,0.874,94.01,183000,4
2019-12-21,45,On Chill,Wale Featuring Jeremih,3jjujdWJ72nww5eGnfs2E7,False,35,22,18,0.597,0.733,1,-6.017,1,0.41,0.134,0,0.159,0.639,171.016,214035,4
2019-12-21,46,Even Though I'm Leaving,Luke Combs,3jjujdWJ72nww5eGnfs2E7,False,38,11,15,0.554,0.755,2,-6.04,1,0.0319,0.225,0,0.301,0.624,77.962,225253,4
2019-12-21,47,The Box,Roddy Ricch,0nbXyq5TXYPCO7pr3N8S4I,True,0,47,1,0.896,0.586,10,-6.687,0,0.0559,0.104,0,0.79,0.642,116.971,196653,4
2019-12-21,48,Graveyard,Halsey,0nbXyq5TXYPCO7pr3N8S4I,False,45,34,13,0.667,0.583,11,-5.127,0,0.0747,0.231,4.48e-05,0.181,0.187,92.043,181806,4
2019-12-21,49,Robbery,Juice WRLD,0nbXyq5TXYPCO7pr3N8S4I,False,0,27,19,0.685,0.692,2,-5.122,1,0.0457,0.328,0,0.153,0.578,159.966,240051,5
2019-12-21,50,Beautiful People,Ed Sheeran Featuring Khalid,0nbXyq5TXYPCO7pr3N8S4I,False,36,13,24,0.64,0.648,5,-8.113,0,0.187,0.124,0,0.0802,0.548,92.977,197867,4
2019-12-21,51,Hot Girl Bummer,blackbear,0nbXyq5TXYPCO7pr3N8S4I,False,53,41,13,0.782,0.559,6,-7.106,0,0.0767,0.125,0,0.385,0.685,129.992,188344,1
2019-12-21,52,Blinding Lights,The Weeknd,0nbXyq5TXYPCO7pr3N8S4I,False,11,11,2,0.514,0.73,1,-5.934,1,0.0598,0.00146,9.54e-05,0.0897,0.334,171.005,200040,4
2019-12-21,53,Playing Games,Summer Walker,0nbXyq5TXYPCO7pr3N8S4I,False,52,16,15,0.726,0.408,11,-6.606,0,0.0614,0.603,0,0.225,0.459,115.918,143227,4
2019-12-21,54,The Bones,Maren Morris,0nbXyq5TXYPCO7pr3N8S4I,False,57,48,12,0.612,0.57,11,-6.642,0,0.0347,0.278,0,0.0963,0.334,77.002,197293,4
2019-12-21,55,Into The Unknown,Idina Menzel & AURORA,0nbXyq5TXYPCO7pr3N8S4I,False,46,46,3,0.323,0.405,10,-8.533,0,0.0413,0.849,0.000544,0.138,0.274,145.104,194848,5
2019-12-21,56,Heat,Chris Brown Featuring Gunna,0nbXyq5TXYPCO7pr3N8S4I,False,55,36,15,0.619,0.613,0,-5.83,1,0.0796,0.0614,0,0.117,0.483,82.419,232733,4
2019-12-21,57,Juicy,Doja Cat & Tyga,0nbXyq5TXYPCO7pr3N8S4I,False,56,47,7,0.786,0.652,0,-2.607,1,0.0669,0.102,0,0.0697,0.483,170.031,203093,4
2019-12-21,58,Start Wit Me,Roddy Ricch & Gunna,0nbXyq5TXYPCO7pr3N8S4I,False,0,58,4,0.886,0.479,4,-8.054,0,0.334,0.077,0,0.135,0.408,130.029,158692,4
2019-12-21,59,Christmas Tree Farm,Taylor Swift,2mvabkN1i2gLnGAPUVdwek,True,0,59,1,0.598,0.68,7,-4.505,1,0.0331,0.06,0,0.324,0.437,134.002,228027,4
2019-12-21,60,Hate Me,Ellie Goulding & Juice WRLD,2mvabkN1i2gLnGAPUVdwek,False,89,56,18,0.657,0.768,8,-4.628,1,0.0507,0.108,0,0.144,0.759,75.025,186223,4
2019-12-21,61,Like It's Christmas,Jonas Brothers,2mvabkN1i2gLnGAPUVdwek,False,72,61,2,0.725,0.571,1,-6.007,1,0.102,0.0183,0,0.0519,0.61,146.035,200880,4
2019-12-21,62,VIBEZ,DaBaby,2mvabkN1i2gLnGAPUVdwek,False,61,21,11,0.768,0.652,1,-2.708,0,0.307,0.113,0,0.107,0.777,154.187,144935,4
2019-12-21,63,Remember You Young,Thomas Rhett,2mvabkN1i2gLnGAPUVdwek,False,62,53,13,0.396,0.51,6,-6.274,1,0.0327,0.355,0,0.113,0.299,113.994,180467,4
2019-12-21,64,Death,Trippie Redd Featuring DaBaby,2mvabkN1i2gLnGAPUVdwek,False,64,59,4,0.802,0.82,10,-5.969,0,0.146,0.0579,0,0.149,0.613,164.005,172196,4
2019-12-21,65,Heart On Ice,Rod Wave,2mvabkN1i2gLnGAPUVdwek,False,59,54,5,0.733,0.389,10,-8.468,0,0.0738,0.0513,0,0.141,0.244,157.878,159670,3
2019-12-21,66,Camelot,NLE Choppa,2mvabkN1i2gLnGAPUVdwek,False,73,37,13,0.787,0.713,7,-5.252,1,0.401,0.0849,0,0.717,0.761,175.046,148759,4
2019-12-21,67,Take What You Want,Post Malone Featuring Ozzy Osbourne & Travis Scott,2mvabkN1i2gLnGAPUVdwek,False,60,8,14,0.499,0.8,1,-2.665,0,0.0502,0.0906,0,0.147,0.272,139.919,229573,4
2019-12-21,68,Ridin' Roads,Dustin Lynch,2mvabkN1i2gLnGAPUVdwek,False,69,68,6,0.547,0.817,9,-4.255,1,0.0448,0.0986,0,0.136,0.592,142.118,205427,4
2019-12-21,69,Leave Em Alone,"Layton Greene, Lil Baby, City Girls & PnB Rock",2mvabkN1i2gLnGAPUVdwek,False,65,60,10,0.76,0.755,6,-4.735,0,0.19,0.0163,2.95e-06,0.0909,0.517,101.993,171647,4
2019-12-21,70,What If I Never Get Over You,Lady Antebellum,2mvabkN1i2gLnGAPUVdwek,False,67,47,16,0.576,0.724,0,-5.147,1,0.0274,0.016,0,0.107,0.34,93.029,206598,4
2019-12-21,71,Heartache Medication,Jon Pardi,2mvabkN1i2gLnGAPUVdwek,False,71,67,11,0.621,0.791,9,-3.343,1,0.0265,0.0361,0,0.143,0.734,95.075,209110,4
2019-12-21,72,Peta,Roddy Ricch Featuring Meek Mill,4bl1HBZliBuYpFZjWgefE4,True,0,72,1,0.778,0.573,10,-7.339,0,0.251,0.015,0,0.464,0.269,140.114,198849,4
2019-12-21,73,Tip Toe,Roddy Ricch Featuring A Boogie Wit da Hoodie,4bl1HBZliBuYpFZjWgefE4,False,83,73,2,0.757,0.673,1,-8.513,1,0.141,0.095,0,0.338,0.574,92.958,185806,3
2019-12-21,74,Suicidal,YNW Melly & Juice WRLD,4bl1HBZliBuYpFZjWgefE4,False,86,64,3,0.655,0.441,9,-5.245,0,0.0629,0.474,0,0.099,0.273,139.957,225857,4
2019-12-21,75,Vete,Bad Bunny,4bl1HBZliBuYpFZjWgefE4,False,63,33,3,0.886,0.672,1,-4.394,1,0.188,0.0363,8.78e-06,0.101,0.526,91.976,192024,4
2019-12-21,76,No Idea,Don Toliver,4bl1HBZliBuYpFZjWgefE4,False,68,68,2,0.652,0.631,6,-5.718,0,0.0893,0.524,0.000579,0.165,0.35,127.998,154424,4
2019-12-21,77,Kinfolks,Sam Hunt,4bl1HBZliBuYpFZjWgefE4,False,77,62,9,0.569,0.807,0,-4.584,1,0.0464,0.0876,0,0.164,0.883,76.011,181933,4
2019-12-21,78,6 Kiss,Trippie Redd Featuring Juice WRLD & YNW Melly,4bl1HBZliBuYpFZjWgefE4,False,80,60,3,0.687,0.449,2,-10.061,1,0.154,0.109,0,0.282,0.229,142.051,199437,4
2019-12-21,79,Prayed For You,Matt Stell,4bl1HBZliBuYpFZjWgefE4,False,75,36,19,0.6,0.698,9,-5.86,1,0.0355,0.0724,1.64e-06,0.113,0.57,140.032,210373,4
2019-12-21,80,223's,YNW Melly & 9lokknine,4bl1HBZliBuYpFZjWgefE4,False,74,34,14,0.932,0.547,0,-7.787,0,0.333,0.0388,0,0.0924,0.695,94.998,176640,4
2019-12-21,81,Slow Dancing In The Dark,Joji,4bl1HBZliBuYpFZjWgefE4,False,87,69,10,0.515,0.479,3,-7.458,1,0.0261,0.544,0.00598,0.191,0.284,88.964,209274,4
2019-12-21,82,My Oh My,Camila Cabello Featuring DaBaby,3yOlyBJuViE2YSGn3nVE1K,True,0,82,1,0.724,0.491,8,-6.024,1,0.0296,0.018,1.29e-05,0.0887,0.383,105.046,170746,4
2019-12-21,83,Enemies,Post Malone Featuring DaBaby,3yOlyBJuViE2YSGn3nVE1K,False,76,16,14,0.542,0.674,6,-4.169,1,0.21,0.0588,0,0.0955,0.667,76.388,196760,4
2019-12-21,84,Baby Sitter,DaBaby Featuring Offset,3yOlyBJuViE2YSGn3nVE1K,False,78,59,18,0.852,0.73,1,-5.803,1,0.0579,0.0219,0,0.336,0.394,92.506,157693,4
2019-12-21,85,Bad Vibes Forever,XXXTENTACION Featuring PnB Rock & Trippie Redd,03eJ2DclFWXYU8GWgANdmZ,True,0,85,1,0.8,0.526,8,-5.153,1,0.0716,0.334,0.00174,0.0571,0.746,129.874,150475,4
2019-12-21,86,Candy,Doja Cat,03eJ2DclFWXYU8GWgANdmZ,False,94,86,3,0.689,0.516,8,-5.857,1,0.0444,0.513,0,0.163,0.209,124.876,190920,4
2019-12-21,87,Empty,Juice WRLD,03eJ2DclFWXYU8GWgANdmZ,False,0,41,4,0.745,0.561,0,-4.869,1,0.0807,0.0758,0,0.133,0.449,77.557,248431,4
2019-12-21,88,We Back,Jason Aldean,03eJ2DclFWXYU8GWgANdmZ,False,81,78,4,0.433,0.928,4,-5.117,0,0.0512,0.0135,2.01e-06,0.32,0.552,155.938,197160,4
2019-12-21,89,Easy,DaniLeigh Featuring Chris Brown,03eJ2DclFWXYU8GWgANdmZ,False,90,88,6,0.799,0.301,7,-11.361,1,0.185,0.195,0,0.0816,0.511,100.026,186587,4
2019-12-21,90,Homesick,Kane Brown,03eJ2DclFWXYU8GWgANdmZ,False,88,88,4,0.701,0.5,8,-8.82,1,0.0303,0.46,0,0.234,0.409,97.028,205400,4
2019-12-21,91,Nice To Meet Ya,Niall Horan,03eJ2DclFWXYU8GWgANdmZ,False,85,63,9,0.591,0.841,4,-4.351,0,0.0304,0.0119,0,0.395,0.392,109.034,158805,4
2019-12-21,92,Watermelon Sugar,Harry Styles,03eJ2DclFWXYU8GWgANdmZ,False,0,60,3,0.548,0.816,0,-4.209,1,0.0465,0.122,0,0.335,0.557,95.39,174000,4
2019-12-21,93,Show Yourself,Idina Menzel & Evan Rachel Wood,03eJ2DclFWXYU8GWgANdmZ,False,70,70,3,0.321,0.429,6,-7.073,1,0.0302,0.724,9.1e-05,0.0606,0.174,123.419,260907,4
2019-12-21,94,We Were,Keith Urban,03eJ2DclFWXYU8GWgANdmZ,False,66,65,15,0.44,0.803,5,-6.162,1,0.0512,0.127,0,0.128,0.633,79.312,189104,4
2019-12-21,95,Yellow Hearts,Ant Saunders,03eJ2DclFWXYU8GWgANdmZ,False,84,81,5,0.866,0.438,7,-8.943,1,0.0719,0.177,0,0.0743,0.695,129.039,223258,4
2019-12-21,96,RITMO (Bad Boys For Life),Black Eyed Peas X J Balvin,03eJ2DclFWXYU8GWgANdmZ,False,98,96,3,0.721,0.716,10,-7.037,0,0.0657,0.0334,0.00084,0.237,0.667,104.994,221714,4
2019-12-21,97,Lord Above,Fat Joe & Dre Featuring Eminem & Mary J. Blige,7q0VdsXafFQIYfk3eZpwTq,True,0,97,1,0.511,0.719,5,-6.261,1,0.117,0.198,0,0.545,0.61,77.481,294775,4
2019-12-21,98,Big Stepper,Roddy Ricch,6x0QNM6f0C2JEjK0hFF8Ca,True,0,98,1,0.753,0.597,8,-8.469,1,0.292,0.0477,0,0.197,0.616,76.997,175170,4
2019-12-21,99,Cuban Links,Rod Wave & Kevin Gates,6x0QNM6f0C2JEjK0hFF8Ca,False,92,92,3,0.693,0.652,5,-8.766,1,0.299,0.25,0,0.0294,0.77,87.986,192183,4
2019-12-21,100,BEST ON EARTH,Russ & BIA,0xKBkLcF71uUQeTA7FSu4A,True,0,100,1,0.846,0.748,5,-3.512,0,0.078,0.188,0,0.093,0.597,90.006,160720,4
