date,position,title,artist,spotify_id,is_new,last_pos,peak_pos,weeks,danceability,energy,key,loudness,mode,speechiness,acousticness,instrumentalness,liveness,valence,tempo,duration_ms,time_signature
2019-10-19,1,HIGHEST IN THE ROOM,Travis Scott,3eekarcy7kvN4yt5ZFzltW,True,0,1,1,0.598,0.427,7,-8.764,0,0.0317,0.0546,5.83e-06,0.21,0.0605,76.469,175721,4
2019-10-19,2,Truth Hurts,Lizzo,3eekarcy7kvN4yt5ZFzltW,False,1,1,23,0.715,0.624,4,-3.046,0,0.114,0.11,0,0.123,0.412,158.087,173325,4
2019-10-19,3,Senorita,Shawn Mendes & Camila Cabello,3eekarcy7kvN4yt5ZFzltW,False,2,1,16,0.759,0.54,9,-6.039,0,0.0287,0.037,0,0.0945,0.75,116.947,190960,4
2019-10-19,4,"10,000 Hours",Dan + Shay & Justin Bieber,2wrJq5XKLnmhRXHIAf9xBa,True,0,4,1,0.654,0.63,10,-4.644,1,0.0259,0.153,0,0.111,0.43,89.991,167693,4
2019-10-19,5,Someone You Loved,Lewis Capaldi,2wrJq5XKLnmhRXHIAf9xBa,False,3,3,22,0.501,0.405,1,-5.679,1,0.0319,0.751,0,0.105,0.446,109.891,182161,4
2019-10-19,6,Circles,Post Malone,2wrJq5XKLnmhRXHIAf9xBa,False,7,4,6,0.695,0.762,0,-3.497,1,0.0395,0.192,0.00244,0.0863,0.553,120.042,215280,4
2019-10-19,7,No Guidance,Chris Brown Featuring Drake,2wrJq5XKLnmhRXHIAf9xBa,False,5,5,18,0.696,0.454,1,-6.756,0,0.153,0.123,0,0.155,0.136,92.928,260640,4
2019-10-19,8,Ran$om,Lil Tecca,2wrJq5XKLnmhRXHIAf9xBa,False,4,4,19,0.536,0.715,7,-6.577,1,0.287,0.571,0.000418,0.471,0.391,179.631,60070,4
2019-10-19,9,Bad Guy,Billie Eilish,2wrJq5XKLnmhRXHIAf9xBa,False,6,1,28,0.701,0.425,7,-10.965,1,0.375,0.328,0.13,0.1,0.562,135.128,194088,4
2019-10-19,10,Panini,Lil Nas X,2wrJq5XKLnmhRXHIAf9xBa,False,8,5,16,0.717,0.598,5,-5.613,0,0.0809,0.22,0,0.122,0.496,153.905,151040,4
2019-10-19,11,Bandit,Juice WRLD & YoungBoy Never Broke Again,6Gg1gjgKi2AK4e0qzsR7sd,True,0,11,1,0.474,0.631,5,-5.884,0,0.343,0.0687,0,0.132,0.425,180.051,189323,4
2019-10-19,12,Goodbyes,Post Malone Featuring Young Thug,6Gg1gjgKi2AK4e0qzsR7sd,False,9,3,14,0.548,0.653,5,-3.875,1,0.081,0.456,0,0.103,0.163,150.068,174853,4
2019-10-19,13,I Don't Care,Ed Sheeran & Justin Bieber,6Gg1gjgKi2AK4e0qzsR7sd,False,11,2,22,0.798,0.675,6,-5.041,1,0.0442,0.0912,0,0.0894,0.842,101.956,219947,4
2019-10-19,14,Old Town Road,Lil Nas X Featuring Billy Ray Cyrus,6Gg1gjgKi2AK4e0qzsR7sd,False,10,1,32,0.878,0.619,6,-5.56,1,0.102,0.0533,0,0.113,0.639,136.041,157067,4
2019-10-19,15,Beautiful People,Ed Sheeran Featuring Khalid,6Gg1gjgKi2AK4e0qzsR7sd,False,14,14,15,0.64,0.648,5,-8.113,0,0.187,0.124,0,0.0802,0.548,92.977,197867,4
2019-10-19,16,Playing Games,Summer Walker,6Gg1gjgKi2AK4e0qzsR7sd,False,75,16,6,0.726,0.408,11,-6.606,0,0.0614,0.603,0,0.225,0.459,115.918,143227,4
2019-10-19,17,Talk,Khalid,6Gg1gjgKi2AK4e0qzsR7sd,False,12,3,35,0.901,0.4,0,-8.575,1,0.126,0.051,0,0.0599,0.346,135.984,197573,4
2019-10-19,18,Sunflower (Spider-Man: Into The Spider-Verse),Post Malone & Swae Lee,6Gg1gjgKi2AK4e0qzsR7sd,False,15,1,51,0.76,0.479,2,-5.574,1,0.0466,0.556,0,0.0703,0.913,89.911,158040,4
2019-10-19,19,Sucker,Jonas Brothers,6Gg1gjgKi2AK4e0qzsR7sd,False,16,1,32,0.842,0.734,1,-5.065,0,0.0588,0.0427,0,0.106,0.952,137.958,181027,4
2019-10-19,20,Memories,Maroon 5,6Gg1gjgKi2AK4e0qzsR7sd,False,29,20,3,0.764,0.32,11,-7.209,1,0.0546,0.837,0,0.0822,0.575,91.019,189486,4
2019-10-19,21,Money In The Grave,Drake Featuring Rick Ross,6Gg1gjgKi2AK4e0qzsR7sd,False,17,7,17,0.831,0.502,10,-4.045,0,0.046,0.101,0,0.122,0.101,100.541,205427,4
2019-10-19,22,Trampoline,SHAED,6Gg1gjgKi2AK4e0qzsR7sd,False,18,18,19,0.689,0.412,7,-7.523,0,0.0301,0.488,0.00016,0.0659,0.537,126.754,184060,4
2019-10-19,23,Only Human,Jonas Brothers,6Gg1gjgKi2AK4e0qzsR7sd,False,22,22,17,0.795,0.496,0,-5.883,1,0.0722,0.108,0,0.0645,0.874,94.01,183000,4
2019-10-19,24,Good As Hell,Lizzo,6Gg1gjgKi2AK4e0qzsR7sd,False,30,24,7,0.682,0.919,0,-3.18,0,0.0875,0.256,0,0.442,0.535,95.982,159736,4
2019-10-19,25,Suge,DaBaby,6Gg1gjgKi2AK4e0qzsR7sd,False,20,7,28,0.876,0.662,2,-6.482,0,0.426,0.0608,0,0.127,0.844,75.445,163320,4
2019-10-19,26,How Do You Sleep?,Sam Smith,6Gg1gjgKi2AK4e0qzsR7sd,False,24,24,12,0.477,0.682,1,-4.931,0,0.0925,0.153,0,0.0763,0.345,110.567,202205,5
2019-10-19,27,On Chill,Wale Featuring Jeremih,6Gg1gjgKi2AK4e0qzsR7sd,False,23,23,9,0.597,0.733,1,-6.017,1,0.41,0.134,0,0.159,0.639,171.016,214035,4
2019-10-19,28,You Need To Calm Down,Taylor Swift,6Gg1gjgKi2AK4e0qzsR7sd,False,27,2,17,0.771,0.671,2,-5.617,1,0.0553,0.00929,0,0.0637,0.714,85.026,171360,4
2019-10-19,29,Baby,Lil Baby & DaBaby,6Gg1gjgKi2AK4e0qzsR7sd,False,26,21,12,0.97,0.463,10,-7.259,1,0.366,0.0957,0,0.151,0.46,108.003,142417,4
2019-10-19,30,Ballin',Mustard & Roddy Ricch,6Gg1gjgKi2AK4e0qzsR7sd,False,53,30,12,0.809,0.545,7,-6.678,1,0.0735,0.392,0,0.151,0.244,97.008,180435,4
2019-10-19,31,Hot Girl Summer,"Megan Thee Stallion, Nicki Minaj & Ty Dolla $ign",6Gg1gjgKi2AK4e0qzsR7sd,False,25,11,9,0.872,0.814,0,-4.568,1,0.155,0.00485,1.96e-06,0.214,0.57,98.985,199427,4
2019-10-19,32,INTRO,DaBaby,6Gg1gjgKi2AK4e0qzsR7sd,False,13,13,3,0.862,0.685,0,-7.699,0,0.242,0.0342,0,0.204,0.672,100.024,172800,4
2019-10-19,33,Dancing With A Stranger,Sam Smith & Normani,6Gg1gjgKi2AK4e0qzsR7sd,False,31,7,39,0.741,0.52,8,-7.513,1,0.0656,0.45,1.97e-06,0.222,0.347,102.998,171030,4
2019-10-19,34,Lover,Taylor Swift,6Gg1gjgKi2AK4e0qzsR7sd,False,45,10,8,0.359,0.543,7,-7.582,1,0.0919,0.492,1.58e-05,0.118,0.453,68.534,221307,4
2019-10-19,35,My Type,Saweetie,6Gg1gjgKi2AK4e0qzsR7sd,False,32,21,15,0.899,0.811,2,-6.294,1,0.258,0.000677,0,0.0672,0.587,105.038,126446,4
2019-10-19,36,Prayed For You,Matt Stell,6Gg1gjgKi2AK4e0qzsR7sd,False,46,36,10,0.6,0.698,9,-5.86,1,0.0355,0.0724,1.64e-06,0.113,0.57,140.032,210373,4
2019-10-19,37,223's,YNW Melly & 9lokknine,6Gg1gjgKi2AK4e0qzsR7sd,False,34,34,5,0.932,0.547,0,-7.787,0,0.333,0.0388,0,0.0924,0.695,94.998,176640,4
2019-10-19,38,Hot,Young Thug Featuring Gunna,6Gg1gjgKi2AK4e0qzsR7sd,False,37,26,8,0.855,0.651,0,-8.044,0,0.235,0.063,0,0.0772,0.559,111.997,193027,4
2019-10-19,39,Wow.,Post Malone,6Gg1gjgKi2AK4e0qzsR7sd,False,35,2,42,0.829,0.539,11,-7.359,0,0.208,0.136,1.78e-06,0.103,0.388,99.96,149547,4
2019-10-19,40,Camelot,NLE Choppa,6Gg1gjgKi2AK4e0qzsR7sd,False,42,37,4,0.787,0.713,7,-5.252,1,0.401,0.0849,0,0.717,0.761,175.046,148759,4
2019-10-19,41,BOP,DaBaby,6Gg1gjgKi2AK4e0qzsR7sd,False,19,19,2,0.769,0.787,11,-3.909,1,0.367,0.189,0,0.129,0.836,126.77,159715,4
2019-10-19,42,Come Thru,Summer Walker & Usher,3TTMUI5dFcbeNSDTTDY9M8,True,0,42,1,0.679,0.728,5,-3.092,0,0.154,0.159,0,0.107,0.46,152.001,181013,4
2019-10-19,43,One Thing Right,Marshmello & Kane Brown,3TTMUI5dFcbeNSDTTDY9M8,False,38,38,16,0.659,0.623,4,-2.253,1,0.0451,0.0667,0,0.582,0.439,88.042,181824,4
2019-10-19,44,Graveyard,Halsey,3TTMUI5dFcbeNSDTTDY9M8,False,60,44,4,0.667,0.583,11,-5.127,0,0.0747,0.231,4.48e-05,0.181,0.187,92.043,181806,4
2019-10-19,45,The Git Up,Blanco Brown,3TTMUI5dFcbeNSDTTDY9M8,False,39,14,18,0.847,0.678,9,-8.635,1,0.109,0.0669,0,0.274,0.811,97.984,200594,4
2019-10-19,46,VIBEZ,DaBaby,3TTMUI5dFcbeNSDTTDY9M8,False,21,21,2,0.768,0.652,1,-2.708,0,0.307,0.113,0,0.107,0.777,154.187,144935,4
2019-10-19,47,Heat,Chris Brown Featuring Gunna,3TTMUI5dFcbeNSDTTDY9M8,False,57,47,6,0.619,0.613,0,-5.83,1,0.0796,0.0614,0,0.117,0.483,82.419,232733,4
2019-10-19,48,If I Can't Have You,Shawn Mendes,3TTMUI5dFcbeNSDTTDY9M8,False,41,2,23,0.69,0.809,2,-4.198,1,0.0603,0.524,0,0.147,0.864,123.912,190800,4
2019-10-19,49,Even Though I'm Leaving,Luke Combs,3TTMUI5dFcbeNSDTTDY9M8,False,58,49,6,0.554,0.755,2,-6.04,1,0.0319,0.225,0,0.301,0.624,77.962,225253,4
2019-10-19,50,Take What You Want,Post Malone Featuring Ozzy Osbourne & Travis Scott,3TTMUI5dFcbeNSDTTDY9M8,False,40,8,5,0.499,0.8,1,-2.665,0,0.0502,0.0906,0,0.147,0.272,139.919,229573,4
2019-10-19,51,I Don't Know About You,Chris Lane,3TTMUI5dFcbeNSDTTDY9M8,False,48,39,14,0.593,0.81,1,-5.733,1,0.0625,0.602,0,0.119,0.712,144.011,207933,4
2019-10-19,52,Time,NF,3TTMUI5dFcbeNSDTTDY9M8,False,54,49,12,0.677,0.688,0,-4.058,0,0.0633,0.138,0,0.114,0.198,98.049,240429,4
2019-10-19,53,The Bones,Maren Morris,3TTMUI5dFcbeNSDTTDY9M8,False,0,53,3,0.612,0.57,11,-6.642,0,0.0347,0.278,0,0.0963,0.334,77.002,197293,4
2019-10-19,54,One Man Band,Old Dominion,3TTMUI5dFcbeNSDTTDY9M8,False,62,54,7,0.706,0.358,6,-8.331,1,0.0347,0.677,0,0.107,0.478,75.991,186240,4
2019-10-19,55,Cash Shit,Megan Thee Stallion Featuring DaBaby,3TTMUI5dFcbeNSDTTDY9M8,False,44,36,16,0.921,0.635,1,-4.904,1,0.416,0.0218,0,0.0946,0.549,130.028,192540,4
2019-10-19,56,Good Vibes,Chris Janson,3TTMUI5dFcbeNSDTTDY9M8,False,66,56,6,0.582,0.846,0,-2.771,1,0.0451,0.022,0,0.133,0.736,92.004,165587,4
2019-10-19,57,The London,"Young Thug, J. Cole & Travis Scott",3TTMUI5dFcbeNSDTTDY9M8,False,50,12,20,0.796,0.586,4,-6.946,0,0.147,0.0247,0,0.132,0.179,97.981,200107,4
2019-10-19,58,Liar,Camila Cabello,3TTMUI5dFcbeNSDTTDY9M8,False,61,54,5,0.74,0.498,11,-6.684,0,0.0456,0.0169,0.00282,0.319,0.652,98.016,207039,4
2019-10-19,59,Boyfriend,Ariana Grande & Social House,3TTMUI5dFcbeNSDTTDY9M8,False,36,8,10,0.4,0.795,10,-3.731,0,0.461,0.119,0,0.159,0.702,190.097,186107,4
2019-10-19,60,Living,Dierks Bentley,3TTMUI5dFcbeNSDTTDY9M8,False,59,51,11,0.517,0.813,1,-6.325,1,0.0558,0.0153,0,0.106,0.444,83.005,222147,4
2019-10-19,61,I'll Kill You,Summer Walker Featuring Jhene Aiko,7EkiMl81fUHVwpItgtzI4r,True,0,61,1,0.679,0.443,10,-8.528,0,0.153,0.427,0,0.106,0.363,104.049,179973,4
2019-10-19,62,Enemies,Post Malone Featuring DaBaby,7EkiMl81fUHVwpItgtzI4r,False,52,16,5,0.542,0.674,6,-4.169,1,0.21,0.0588,0,0.0955,0.667,76.388,196760,4
2019-10-19,63,Love You Too Late,Cole Swindell,7EkiMl81fUHVwpItgtzI4r,False,65,63,10,0.542,0.797,9,-4.45,0,0.0379,0.00111,0,0.0906,0.593,113.95,204720,4
2019-10-19,64,What Happens In A Small Town,Brantley Gilbert + Lindsay Ell,7EkiMl81fUHVwpItgtzI4r,False,85,64,9,0.496,0.775,11,-5.304,1,0.0411,0.000927,0,0.14,0.478,138.165,202587,4
2019-10-19,65,Motivation,Normani,7EkiMl81fUHVwpItgtzI4r,False,67,33,8,0.599,0.887,4,-3.967,1,0.0984,0.0192,1.21e-06,0.3,0.881,170.918,193837,4
2019-10-19,66,Hot Girl Bummer,blackbear,7EkiMl81fUHVwpItgtzI4r,False,76,66,4,0.782,0.559,6,-7.106,0,0.0767,0.125,0,0.385,0.685,129.992,188344,1
2019-10-19,67,TOES,DaBaby Featuring Lil Baby & Moneybagg Yo,7EkiMl81fUHVwpItgtzI4r,False,28,28,2,0.816,0.582,8,-4.141,1,0.341,0.0794,5.84e-06,0.0916,0.542,160.004,136366,4
2019-10-19,68,Stretch You Out,Summer Walker Featuring A Boogie Wit da Hoodie,4Qxn47gWPSucovKrMyRf1z,True,0,68,1,0.64,0.519,1,-6.757,0,0.188,0.25,0,0.0883,0.252,103.359,143493,4
2019-10-19,69,Every Little Thing,Russell Dickerson,4Qxn47gWPSucovKrMyRf1z,False,77,69,6,0.637,0.853,1,-4.664,1,0.109,0.216,0,0.0357,0.861,93.87,190640,4
2019-10-19,70,China,"Anuel AA, Daddy Yankee, Karol G, Ozuna & J Balvin",4Qxn47gWPSucovKrMyRf1z,False,70,43,12,0.786,0.808,7,-3.702,1,0.0882,0.0846,0.000289,0.0822,0.609,105.027,301714,4
2019-10-19,71,Baby Sitter,DaBaby Featuring Offset,4Qxn47gWPSucovKrMyRf1z,False,79,71,9,0.852,0.73,1,-5.803,1,0.0579,0.0219,0,0.336,0.394,92.506,157693,4
2019-10-19,72,Lalala,Y2K & bbno$,4Qxn47gWPSucovKrMyRf1z,False,72,55,15,0.843,0.391,2,-7.899,1,0.0845,0.181,0,0.137,0.496,129.972,160627,4
2019-10-19,73,Body,Summer Walker,7clxiNeDHS9rlmkjvpczMm,True,0,73,1,0.554,0.507,11,-6.099,0,0.166,0.246,0,0.283,0.34,137.876,193840,4
2019-10-19,74,Writing On The Wall,"French Montana Featuring Post Malone, Cardi B & Rvssian",7clxiNeDHS9rlmkjvpczMm,False,56,56,2,0.773,0.836,9,-2.326,0,0.153,0.283,2.1e-05,0.0828,0.497,112.01,201271,4
2019-10-19,75,Don't Call Me Angel (Charlie's Angels),"Ariana Grande, Miley Cyrus & Lana Del Rey",7clxiNeDHS9rlmkjvpczMm,False,71,13,4,0.644,0.755,1,-5.325,1,0.0448,0.00237,7.64e-06,0.0859,0.334,102.861,190067,4
2019-10-19,76,Saint-Tropez,Post Malone,7clxiNeDHS9rlmkjvpczMm,False,68,18,5,0.617,0.684,0,-3.618,1,0.0439,0.0545,0,0.104,0.295,132.113,150867,4
2019-10-19,77,Tip Of My Tongue,Kenny Chesney,7clxiNeDHS9rlmkjvpczMm,False,83,76,13,0.669,0.56,5,-5.003,1,0.0251,0.0821,0,0.0703,0.49,95.0,199413,4
2019-10-19,78,Otro Trago,"Sech, Darell, Nicky Jam, Ozuna & Anuel AA",7clxiNeDHS9rlmkjvpczMm,False,78,34,18,0.725,0.79,0,-2.331,1,0.197,0.0711,1.14e-06,0.0602,0.763,175.988,287773,4
2019-10-19,79,Drunk Dialing...LODT,Summer Walker,0pzWCDSuVRX7m95EFOxVa0,True,0,79,1,0.556,0.437,9,-7.194,1,0.178,0.604,0,0.201,0.112,125.662,134440,3
2019-10-19,80,Over It,Summer Walker,0csmcZqM3uTKfjxehw0Lw2,True,0,80,1,0.63,0.437,4,-8.113,0,0.125,0.231,0,0.0885,0.455,131.996,131107,4
2019-10-19,81,Hollywood's Bleeding,Post Malone,0csmcZqM3uTKfjxehw0Lw2,False,74,15,5,0.405,0.646,4,-3.206,0,0.0476,0.331,0,0.103,0.17,130.218,156267,4
2019-10-19,82,Remember You Young,Thomas Rhett,0csmcZqM3uTKfjxehw0Lw2,False,91,82,4,0.396,0.51,6,-6.274,1,0.0327,0.355,0,0.113,0.299,113.994,180467,4
2019-10-19,83,Nice To Meet Ya,Niall Horan,3cphb8kdsjElYR7r5icK3H,True,0,83,1,0.591,0.841,4,-4.351,0,0.0304,0.0119,0,0.395,0.392,109.034,158805,4
2019-10-19,84,F.N,Lil Tjay,3cphb8kdsjElYR7r5icK3H,False,90,68,9,0.567,0.515,6,-10.265,0,0.247,0.354,0,0.078,0.321,120.1,224000,1
2019-10-19,85,Higher Love,Kygo X Whitney Houston,3cphb8kdsjElYR7r5icK3H,False,95,63,5,0.693,0.678,8,-7.159,1,0.0324,0.0154,6.05e-06,0.101,0.404,103.952,228267,4
2019-10-19,86,Wish Wish,DJ Khaled Featuring Cardi B & 21 Savage,3cphb8kdsjElYR7r5icK3H,False,94,19,13,0.861,0.666,8,-5.18,0,0.343,0.00218,0,0.272,0.853,145.041,202625,4
2019-10-19,87,Callaita,Bad Bunny & Tainy,3cphb8kdsjElYR7r5icK3H,False,82,52,18,0.61,0.624,2,-4.773,1,0.309,0.6,2.12e-06,0.243,0.244,176.169,250534,4
2019-10-19,88,Southbound,Carrie Underwood,3cphb8kdsjElYR7r5icK3H,False,64,64,13,0.614,0.884,0,-4.019,1,0.0402,0.00122,0,0.077,0.721,100.531,202853,4
2019-10-19,89,Bad Bad Bad,Young Thug Featuring Lil Baby,3cphb8kdsjElYR7r5icK3H,False,93,32,8,0.974,0.596,6,-8.888,1,0.184,0.0976,0,0.151,0.892,111.959,149040,4
2019-10-19,90,RAW SHIT,DaBaby Featuring Migos,3cphb8kdsjElYR7r5icK3H,False,51,51,2,0.874,0.714,5,-4.946,1,0.233,0.0273,0,0.356,0.85,130.046,216678,4
2019-10-19,91,Leave Em Alone,"Layton Greene, Lil Baby, City Girls & PnB Rock",6Vdyu21iT8qScU1haSjWUU,True,0,91,1,0.76,0.755,6,-4.735,0,0.19,0.0163,2.95e-06,0.0909,0.517,101.993,171647,4
2019-10-19,92,Potential,Summer Walker,4YNrBVo8fv6qiTNwHLVDai,True,0,92,1,0.53,0.37,1,-7.416,1,0.041,0.572,0,0.0765,0.291,72.732,173120,4
2019-10-19,93,Right Back,Khalid Featuring A Boogie Wit da Hoodie,4YNrBVo8fv6qiTNwHLVDai,False,88,73,11,0.786,0.428,5,-10.011,0,0.31,0.0933,1.1e-06,0.156,0.556,97.001,255000,4
2019-10-19,94,Die For Me,Post Malone Featuring Future & Halsey,4YNrBVo8fv6qiTNwHLVDai,False,80,20,5,0.614,0.66,0,-2.848,1,0.0441,0.19,0,0.211,0.452,145.01,245267,4
2019-10-19,95,Heartache Medication,Jon Pardi,4YNrBVo8fv6qiTNwHLVDai,False,84,84,2,0.621,0.791,9,-3.343,1,0.0265,0.0361,0,0.143,0.734,95.075,209110,4
2019-10-19,96,Dance Monkey,Tones And I,2XU0oxnq2qxCpomAAuJY8K,True,0,96,1,0.824,0.588,6,-6.4,0,0.0924,0.692,0.000104,0.149,0.513,98.027,209438,4
2019-10-19,97,POP STAR,DaBaby Featuring Kevin Gates,2XU0oxnq2qxCpomAAuJY8K,False,49,49,2,0.815,0.76,6,-4.632,1,0.331,0.0242,0,0.203,0.729,81.537,183145,4
2019-10-19,98,Self Control,YoungBoy Never Broke Again,2XU0oxnq2qxCpomAAuJY8K,False,96,68,5,0.82,0.697,6,-7.296,0,0.378,0.0349,0,0.197,0.629,154.992,185866,4
2019-10-19,99,No Me Conoce,"Jhay Cortez, J Balvin & Bad Bunny",2XU0oxnq2qxCpomAAuJY8K,False,97,71,14,0.804,0.786,10,-3.837,0,0.0735,0.144,0,0.0928,0.575,91.992,309120,4
2019-10-19,100,Slow Dancing In The Dark,Joji,2XU0oxnq2qxCpomAAuJY8K,False,0,96,2,0.515,0.479,3,-7.458,1,0.0261,0.544,0.00598,0.191,0.284,88.964,209274,4
