date,position,title,artist,spotify_id,is_new,last_pos,peak_pos,weeks,danceability,energy,key,loudness,mode,speechiness,acousticness,instrumentalness,liveness,valence,tempo,duration_ms,time_signature
1998-06-06,1,The Boy Is Mine,Brandy & Monica,,False,23,1,2,0.704,0.707,1,-6.537,0,0.0391,0.539,0.00106,0.318,0.761,93.145,294787,4
1998-06-06,2,Too Close,Next,,False,1,1,17,0.847,0.402,7,-9.952,1,0.0641,0.0118,0,0.283,0.752,99.693,259440,4
1998-06-06,3,You're Still The One,Shania Twain,,False,3,2,17,0.585,0.494,3,-8.751,1,0.0353,0.363,0,0.0886,0.634,133.822,212200,4
1998-06-06,4,My All,Mariah Carey,,False,2,1,5,0.607,0.317,7,-10.244,0,0.029,0.732,4.53e-05,0.086,0.111,108.122,230933,4
1998-06-06,5,I Get Lonely,Janet Featuring BLACKstreet,,False,4,3,3,0.799,0.514,7,-6.794,0,0.0478,0.291,0,0.518,0.455,125.104,317560,4
1998-06-06,6,Everybody [Backstreet's Back],Backstreet Boys,,False,5,4,8,0.735,0.873,10,-3.493,0,0.0402,0.025,3.27e-06,0.265,0.586,108.021,224960,4
1998-06-06,7,The Arms Of The One Who Loves You,Xscape,,False,7,7,6,0.657,0.456,0,-8.917,1,0.0345,0.311,0,0.0922,0.182,115.4,260427,4
1998-06-06,8,All My Life,K-Ci & JoJo,,False,9,1,11,0.629,0.511,1,-8.651,1,0.0326,0.114,3.91e-06,0.0588,0.181,128.038,331240,4
1998-06-06,9,Truly Madly Deeply,Savage Garden,,False,8,1,27,0.555,0.698,0,-8.874,1,0.0287,0.403,0,0.0851,0.816,168.12,277267,4
1998-06-06,10,It's All About Me,Mya & Sisqo,,False,6,6,13,0.812,0.5,2,-6.842,1,0.084,0.209,0,0.174,0.521,137.041,264933,4
1998-06-06,11,Sex And Candy,Marcy Playground,,False,11,8,9,0.55,0.702,11,-5.693,0,0.0281,0.046,1.4e-06,0.119,0.515,159.968,172486,4
1998-06-06,12,Body Bumpin' Yippie-Yi-Yo,Public Announcement,,False,10,5,16,0.782,0.363,2,-7.744,1,0.0441,0.0472,0,0.149,0.27,121.986,273667,4
1998-06-06,13,Let's Ride,Montell Jordan Feat. Master P & Silkk The Shocker,,False,12,2,14,0.59,0.538,1,-5.949,1,0.247,0.0272,0,0.17,0.578,121.929,294600,4
1998-06-06,14,Adia,Sarah McLachlan,,False,28,14,2,0.526,0.37,3,-10.535,1,0.025,0.722,0,0.157,0.251,76.002,244667,4
1998-06-06,15,I Want You Back,'N Sync,,False,13,13,14,0.758,0.93,8,-3.22,0,0.0425,0.0503,0.000226,0.325,0.853,112.042,202107,4
1998-06-06,16,Frozen,Madonna,,False,15,2,12,0.602,0.616,1,-10.917,1,0.0353,0.662,0.0153,0.149,0.31,108.017,367333,4
1998-06-06,17,Turn It Up [Remix]/Fire It Up,Busta Rhymes,,False,14,10,5,0.817,0.84,2,-8.598,1,0.0922,0.00506,0.00034,0.288,0.89,104.295,237907,4
1998-06-06,18,Gettin' Jiggy Wit It,Will Smith,,False,17,1,15,0.881,0.874,6,-4.505,1,0.139,0.0175,1.14e-06,0.154,0.858,107.891,227933,4
1998-06-06,19,"No, No, No",Destiny's Child,,False,21,3,28,0.67,0.582,1,-3.574,1,0.224,0.3,0,0.0845,0.675,181.841,207467,4
1998-06-06,20,I Got The Hook Up!,Master P Featuring Sons Of Funk,,False,20,20,9,0.706,0.632,1,-7.017,1,0.192,0.026,0,0.362,0.277,148.015,182938,4
1998-06-06,21,Say It,Voices Of Theory,,False,30,21,10,0.381,0.415,0,-10.298,1,0.0691,0.675,0,0.0795,0.257,61.908,269467,3
1998-06-06,22,They Don't Know,Jon B,,False,37,22,19,0.699,0.388,6,-10.722,1,0.0531,0.588,1.98e-06,0.0658,0.566,125.858,274667,4
1998-06-06,23,Together Again,Janet,,False,24,1,25,0.873,0.593,7,-8.942,1,0.103,0.078,0.00697,0.104,0.495,123.091,301200,4
1998-06-06,24,Looking Through Your Eyes,LeAnn Rimes,,False,18,18,8,0.487,0.271,10,-11.566,1,0.0283,0.618,0,0.16,0.194,80.126,245467,4
1998-06-06,25,Make Em' Say Uhh!,"Master P Feat. Fiend, Silkk The Shocker, Mia X & Mystikal",,False,16,16,19,0.711,0.729,6,-5.432,0,0.49,0.00513,0,0.0615,0.488,169.845,302507,4
1998-06-06,26,Raise The Roof,Luke Featuring No Good But So Good,,False,26,26,11,0.737,0.892,2,-5.607,1,0.358,0.0436,0,0.0798,0.662,173.786,310827,4
1998-06-06,28,How's It Going To Be,Third Eye Blind,,False,25,9,27,0.562,0.593,5,-9.362,1,0.0263,0.00327,0.00139,0.0967,0.574,80.289,253413,4
1998-06-06,29,Heaven's What I Feel,Gloria Estefan,,False,29,29,3,0.62,0.903,5,-5.045,1,0.0383,0.18,0,0.12,0.427,130.992,301600,4
1998-06-06,30,I Don't Want To Wait,Paula Cole,,False,32,11,32,0.41,0.468,11,-8.177,1,0.0553,0.298,1.19e-05,0.0426,0.475,177.508,320027,4
1998-06-06,31,This Kiss,Faith Hill,,False,31,31,12,0.398,0.804,11,-5.559,1,0.0451,0.175,0,0.181,0.709,186.752,194307,4
1998-06-06,32,Victory,Puff Daddy & The Family Featuring The Notorious B.I.G. & Busta Rh,,False,22,19,12,0.609,0.731,9,-6.846,1,0.322,0.397,0,0.664,0.685,91.778,296267,4
1998-06-06,33,How Do I Live,LeAnn Rimes,,False,27,2,51,0.577,0.462,2,-7.989,1,0.0279,0.128,0,0.0822,0.258,128.303,266973,4
1998-06-06,34,Nice & Slow,Usher,,False,36,1,20,0.819,0.299,5,-11.964,0,0.122,0.153,0,0.3,0.515,121.913,227907,4
1998-06-06,35,What You Want,Mase Featuring Total,,False,35,6,19,0.838,0.72,10,-6.593,0,0.384,0.0312,1.11e-05,0.422,0.845,93.76,242947,4
1998-06-06,36,My Heart Will Go On,Celine Dion,,False,33,1,15,0.428,0.276,4,-11.729,1,0.0312,0.732,5.33e-06,0.117,0.0382,99.195,280000,1
1998-06-06,37,Romeo And Juliet,Sylk-E. Fyne Featuring Chill,,False,34,6,17,0.801,0.424,10,-8.153,1,0.051,0.218,2.78e-05,0.127,0.91,75.967,310750,4
1998-06-06,38,Cheers 2 U,Playa,,False,43,38,11,0.728,0.334,0,-11.11,1,0.0725,0.177,1.31e-06,0.103,0.478,127.053,311427,4
1998-06-06,39,Deja Vu [Uptown Baby],Lord Tariq & Peter Gunz,,False,38,9,26,0.861,0.622,1,-7.493,1,0.379,0.0816,0,0.123,0.664,96.911,284800,4
1998-06-06,40,Gone Till November,Wyclef Jean,,False,39,7,18,0.677,0.503,4,-9.027,1,0.0867,0.0888,1.48e-05,0.182,0.417,85.926,207467,4
1998-06-06,41,You Make Me Wanna...,Usher,,False,44,2,42,0.761,0.639,5,-7.577,0,0.0539,0.0359,0,0.0945,0.922,164.088,219120,4
1998-06-06,42,Imagination,Tamia,,False,41,37,12,0.895,0.495,9,-7.186,0,0.178,0.0998,6.28e-05,0.0583,0.593,99.233,213973,4
1998-06-06,43,Shorty (You Keep Playin' With My Mind),Imajin Featuring Keith Murray,,False,56,43,2,0.848,0.698,11,-4.885,0,0.241,0.0181,4.07e-06,0.203,0.895,101.074,294960,4
1998-06-06,44,Who Am I,Beenie Man,,False,40,40,13,0.628,0.753,11,-8.778,1,0.468,0.211,0,0.12,0.559,86.194,196000,4
1998-06-06,45,Whatcha Gone Do?,Link,1oPKnJv14YIAbEw4Xw1sAN,True,0,45,1,0.765,0.613,11,-7.935,1,0.0319,0.171,2.19e-05,0.163,0.937,93.811,259162,4
1998-06-06,46,Kiss The Rain,Billie Myers,1oPKnJv14YIAbEw4Xw1sAN,False,45,15,31,0.455,0.682,9,-6.996,1,0.041,0.00142,4.96e-05,0.162,0.283,177.997,270160,4
1998-06-06,47,Candle In The Wind 1997/Something About The Way You Look Tonight,Elton John,1oPKnJv14YIAbEw4Xw1sAN,False,48,1,35,0.48,0.628,6,-7.643,1,0.0262,0.174,3.28e-05,0.0753,0.541,143.412,240547,4
1998-06-06,48,Get At Me Dog,DMX Featuring Sheek Of The Lox,1oPKnJv14YIAbEw4Xw1sAN,False,46,39,15,0.596,0.623,1,-8.444,1,0.496,0.0399,0,0.729,0.476,97.002,243240,4
1998-06-06,49,Second Round K.O.,Canibus,1oPKnJv14YIAbEw4Xw1sAN,False,42,28,9,0.74,0.537,7,-11.337,1,0.457,0.0159,0,0.564,0.686,94.025,277533,4
1998-06-06,50,Wishlist,Pearl Jam,1oPKnJv14YIAbEw4Xw1sAN,False,47,47,3,0.623,0.342,0,-8.694,1,0.038,0.0134,0.00412,0.106,0.101,115.032,206587,4
1998-06-06,51,Bitter Sweet Symphony,The Verve,1oPKnJv14YIAbEw4Xw1sAN,False,52,12,11,0.356,0.917,9,-6.006,1,0.0479,0.0335,0,0.406,0.518,171.176,357267,4
1998-06-06,52,Clock Strikes,Timbaland & Magoo,1oPKnJv14YIAbEw4Xw1sAN,False,49,37,6,0.787,0.714,6,-8.63,0,0.131,0.0641,0.436,0.273,0.81,165.465,291120,4
1998-06-06,53,This Is How We Party,S.O.A.P.,1oPKnJv14YIAbEw4Xw1sAN,False,51,51,8,0.758,0.911,6,-4.192,0,0.0409,0.0467,0.00252,0.687,0.911,109.974,198067,4
1998-06-06,54,Push It,Garbage,1oPKnJv14YIAbEw4Xw1sAN,False,54,52,5,0.564,0.909,0,-6.471,1,0.0311,0.00034,0.11,0.0746,0.892,123.895,242533,4
1998-06-06,55,A Rose Is Still A Rose,Aretha Franklin,1oPKnJv14YIAbEw4Xw1sAN,False,50,26,13,0.631,0.793,8,-7.551,0,0.251,0.212,0,0.0441,0.826,175.814,266667,4
1998-06-06,56,You Won't Forget Me,La Bouche,5XeQ0rudxvqNA2mJmZBjBK,True,0,56,1,0.722,0.91,1,-4.135,1,0.032,0.0182,1.17e-06,0.0872,0.687,133.045,196347,4
1998-06-06,57,Do For Love,2Pac Featuring Eric Williams,5XeQ0rudxvqNA2mJmZBjBK,False,53,21,12,0.874,0.63,1,-3.585,1,0.298,0.0578,0.00479,0.0582,0.717,95.0,281600,4
1998-06-06,58,Recover Your Soul,Elton John,5XeQ0rudxvqNA2mJmZBjBK,False,59,55,8,0.725,0.653,7,-9.365,1,0.0238,0.134,0.00675,0.272,0.582,103.003,318040,4
1998-06-06,60,The Mummers' Dance,Loreena McKennitt,,False,55,18,14,0.548,0.456,0,-11.53,0,0.0289,0.425,0.116,0.0892,0.294,120.274,367440,4
1998-06-06,61,I'm Alright,Jo Dee Messina,,False,57,43,13,0.676,0.733,0,-7.745,1,0.0294,0.191,0,0.192,0.591,98.234,199040,3
1998-06-06,63,One Heart At A Time,Various Artists,,False,93,63,2,0.669,0.487,10,-9.823,1,0.0264,0.0975,0.191,0.292,0.475,104.688,242655,4
1998-06-06,64,When The Lights Go Out,Five,37giHQffMdB94OqVy4ZBd8,True,0,64,1,0.854,0.827,5,-6.424,1,0.0335,0.0636,0,0.123,0.961,104.001,249600,4
1998-06-06,65,I Just Want To Dance With You,George Strait,37giHQffMdB94OqVy4ZBd8,False,61,61,7,0.715,0.469,0,-8.674,1,0.0279,0.439,8.69e-05,0.104,0.502,113.991,210867,4
1998-06-06,66,Gitty Up,Salt-N-Pepa,37giHQffMdB94OqVy4ZBd8,False,60,50,11,0.884,0.553,11,-6.514,1,0.071,0.0284,6.3e-06,0.0859,0.884,104.931,240600,4
1998-06-06,67,There's Your Trouble,Dixie Chicks,37giHQffMdB94OqVy4ZBd8,False,64,64,4,0.737,0.869,2,-5.433,1,0.0267,0.481,0,0.308,0.898,126.628,193065,4
1998-06-06,68,Ninety Nine [Flash The Message],John Forte,37giHQffMdB94OqVy4ZBd8,False,74,68,2,0.882,0.52,4,-10.899,0,0.315,0.0589,0,0.313,0.447,96.846,223533,4
1998-06-06,69,I Honestly Love You (David Foster Vers.),Olivia Newton-John,37giHQffMdB94OqVy4ZBd8,False,71,69,2,0.637,0.329,10,-11.362,1,0.0272,0.613,2.36e-06,0.14,0.152,112.075,246147,4
1998-06-06,70,Do Your Thing,7 Mile,37giHQffMdB94OqVy4ZBd8,False,65,65,7,0.7,0.216,3,-8.921,0,0.0402,0.0193,0.836,0.0577,0.416,59.994,291107,4
1998-06-06,71,Hooked On A Feeling (Ooga-Chaka),Baby Talk,37giHQffMdB94OqVy4ZBd8,False,85,71,2,0.613,0.678,8,-7.85,1,0.106,0.542,0,0.0391,0.911,118.629,181107,4
1998-06-06,72,In A Dream,Rockell,37giHQffMdB94OqVy4ZBd8,False,73,72,20,0.785,0.688,9,-7.348,0,0.0385,0.019,0.3,0.136,0.835,132.279,241693,4
1998-06-06,73,I'm From The Country,Tracy Byrd,37giHQffMdB94OqVy4ZBd8,False,63,63,10,0.687,0.898,2,-3.93,1,0.042,0.206,0,0.284,0.952,129.542,213973,4
1998-06-06,74,The Unforgiven II,Metallica,37giHQffMdB94OqVy4ZBd8,False,68,59,10,0.49,0.884,8,-4.533,0,0.0428,0.000514,0.00177,0.27,0.254,132.978,396440,4
1998-06-06,75,Just Be Straight With Me,"Silkk The Shocker Featuring Master P, Destiny's Child, O'Dell, Mo",37giHQffMdB94OqVy4ZBd8,False,67,57,12,0.77,0.513,2,-10.7,1,0.099,0.193,0,0.315,0.48,92.89,261933,4
1998-06-06,76,My Heart Will Go On,Deja Vu,37giHQffMdB94OqVy4ZBd8,False,69,58,13,0.588,0.941,0,-5.254,0,0.0459,0.0573,0.002,0.0301,0.918,131.995,442851,4
1998-06-06,78,Are You Jimmy Ray?,Jimmy Ray,,False,66,13,16,0.75,0.914,10,-5.707,0,0.0704,0.13,2.33e-05,0.392,0.672,99.083,201200,4
1998-06-06,79,Now That I Found You,Terri Clark,,False,86,79,3,0.593,0.461,2,-7.549,1,0.0236,0.356,0,0.183,0.27,90.399,217360,4
1998-06-06,80,I Do [Cherish You],Mark Wills,,False,75,75,5,0.586,0.477,6,-8.136,1,0.0243,0.593,0,0.0935,0.308,82.991,199707,4
1998-06-06,81,Still Po' Pimpin',Do Or Die Featuring Johnny P & Twista,,False,78,62,11,0.748,0.526,8,-10.896,0,0.065,0.292,0,0.0471,0.771,136.028,240000,4
1998-06-06,83,Out Of My Bones,Randy Travis,,False,70,64,7,0.522,0.732,3,-5.773,1,0.0277,0.427,0,0.134,0.587,144.962,164773,4
1998-06-06,84,The City Is Mine,Jay-Z Featuring BLACKstreet,,False,77,52,19,0.888,0.702,0,-4.059,0,0.209,0.00358,0,0.0358,0.754,97.954,242573,4
1998-06-06,85,Too Much,Spice Girls,,False,72,9,17,0.333,0.631,2,-4.992,1,0.0461,0.484,0,0.332,0.342,80.14,271933,4
1998-06-06,86,I Wanna Get Next To You,Christion,0Kc5XevE8Fny76J4kAIGHs,True,0,86,1,0.652,0.485,0,-9.199,1,0.0275,0.198,0.000171,0.11,0.575,131.876,230133,4
1998-06-06,87,One Of These Days,Tim McGraw,0Kc5XevE8Fny76J4kAIGHs,False,89,74,6,0.478,0.267,3,-12.184,1,0.0305,0.88,0.00017,0.197,0.289,71.334,281960,4
1998-06-06,88,Rain,SWV,0Kc5XevE8Fny76J4kAIGHs,False,76,25,11,0.643,0.486,4,-10.443,0,0.0278,0.337,3.86e-06,0.702,0.146,138.151,264507,3
1998-06-06,89,A Promise I Make,Dakota Moon,0Kc5XevE8Fny76J4kAIGHs,False,80,69,12,0.711,0.481,0,-8.135,0,0.0242,0.273,0,0.0952,0.392,90.118,267280,4
1998-06-06,90,That's Why I'm Here,Kenny Chesney,0Kc5XevE8Fny76J4kAIGHs,False,79,79,5,0.648,0.285,4,-11.986,1,0.0343,0.498,3.59e-06,0.222,0.212,137.033,243440,4
1998-06-06,91,Blue On Black,The Kenny Wayne Shepherd Band,0Kc5XevE8Fny76J4kAIGHs,False,87,78,6,0.472,0.525,7,-16.084,1,0.0407,0.00117,0.0027,0.304,0.524,156.059,325279,4
1998-06-06,92,A Man Holdin' On (To A Woman Lettin' Go),Ty Herndon,7Mdyk9k3tkXTecNg56RxbU,True,0,92,1,0.606,0.403,9,-7.95,1,0.0288,0.555,1.23e-06,0.0954,0.202,128.122,217160,4
1998-06-06,93,"Have Fun, Go Mad",Blair,7Mdyk9k3tkXTecNg56RxbU,False,92,86,3,0.81,0.429,0,-14.779,1,0.0371,0.0373,2.18e-05,0.102,0.778,96.988,211268,4
1998-06-06,94,Light In Your Eyes,Blessid Union Of Souls,7Mdyk9k3tkXTecNg56RxbU,False,91,48,17,0.471,0.454,11,-9.118,1,0.0309,0.546,0,0.114,0.36,170.995,256200,3
1998-06-06,95,Let's Forget About It,Lisa Loeb,7Mdyk9k3tkXTecNg56RxbU,False,84,71,6,0.687,0.789,0,-5.038,1,0.0308,0.488,5.9e-05,0.115,0.634,100.092,165867,4
1998-06-06,96,Come Over To My Place,Davina,7Mdyk9k3tkXTecNg56RxbU,False,90,81,8,0.764,0.314,2,-8.568,1,0.053,0.0522,0.000551,0.0818,0.332,83.969,236076,4
1998-06-06,98,Strawberries,Smooth,,False,82,49,16,0.717,0.41,7,-6.332,1,0.0638,0.193,0.000142,0.167,0.609,81.254,339800,4
1998-06-06,99,Superhero,Daze,,False,96,88,3,0.567,0.983,5,-5.01,0,0.0427,0.0081,1.21e-05,0.107,0.717,135.041,204733,4
1998-06-06,100,Then What?,Clay Walker,,False,81,65,18,0.564,0.806,4,-8.227,1,0.063,0.169,0,0.0663,0.633,176.405,183707,4
