date,position,title,artist,spotify_id,is_new,last_pos,peak_pos,weeks,danceability,energy,key,loudness,mode,speechiness,acousticness,instrumentalness,liveness,valence,tempo,duration_ms,time_signature
1997-03-22,2,Wannabe,Spice Girls,,False,1,1,9,0.768,0.864,11,-6.145,1,0.0324,0.101,0,0.162,0.891,110.008,173027,4
1997-03-22,4,Un-Break My Heart,Toni Braxton,,False,3,1,22,0.625,0.426,2,-8.392,0,0.0271,0.413,0,0.116,0.112,110.018,270333,4
1997-03-22,5,In My Bed,Dru Hill,,False,5,5,11,0.828,0.654,10,-7.674,0,0.226,0.106,0,0.0689,0.817,95.254,242360,4
1997-03-22,6,Every Time I Close My Eyes,Babyface,,False,7,6,8,0.654,0.417,5,-7.699,1,0.025,0.0624,0,0.0963,0.279,143.676,296267,4
1997-03-22,7,"I Believe I Can Fly (From ""Space Jam"")",R. Kelly,,False,6,2,15,0.572,0.538,7,-5.241,1,0.0279,0.151,0,0.0754,0.0584,120.455,284800,4
1997-03-22,8,Don't Let Go (Love),En Vogue,,False,8,2,20,0.618,0.688,5,-5.867,0,0.0477,0.409,6.32e-06,0.3,0.561,78.311,291880,4
1997-03-22,9,"For You I Will (From ""Space Jam"")",Monica,,False,9,9,2,0.652,0.473,0,-7.981,0,0.0313,0.243,0,0.134,0.368,123.208,294867,4
1997-03-22,10,Get It Together,702,,False,12,10,6,0.791,0.186,10,-11.367,1,0.0333,0.625,2.67e-06,0.0574,0.317,114.061,291400,4
1997-03-22,11,Nobody,Keith Sweat Featuring Athena Cage,,False,11,3,25,0.699,0.492,9,-9.449,0,0.0318,0.484,0,0.0482,0.388,117.907,264773,4
1997-03-22,12,Hard To Say I'm Sorry,Az Yet Featuring Peter Cetera,,False,14,12,5,0.537,0.413,5,-9.949,0,0.0366,0.604,0,0.16,0.22,127.77,195693,4
1997-03-22,13,"Don't Cry For Me Argentina (From ""Evita"")",Madonna,,False,10,8,5,0.217,0.146,11,-13.9,1,0.0373,0.901,4.49e-06,0.222,0.0847,75.922,331467,4
1997-03-22,14,I Want You,Savage Garden,,False,16,14,4,0.628,0.871,7,-6.44,1,0.0363,0.0077,1.64e-06,0.392,0.615,106.101,232067,4
1997-03-22,15,"Step By Step (From ""The Preacher's Wife"")",Whitney Houston,,False,22,15,2,0.752,0.79,2,-8.648,1,0.0507,0.0797,5.78e-05,0.284,0.202,115.976,252533,4
1997-03-22,16,I'll Be,Foxy Brown Featuring Jay-Z,,False,77,16,6,0.855,0.614,11,-8.984,0,0.41,0.015,0,0.307,0.495,105.986,178600,4
1997-03-22,17,Ooh Aah... Just A Little Bit,Gina G,,False,13,12,17,0.647,0.942,1,-7.101,1,0.0341,0.626,0.168,0.0411,0.937,130.978,203120,4
1997-03-22,18,Barely Breathing,Duncan Sheik,,False,18,18,17,0.482,0.807,0,-6.976,1,0.0457,0.0281,0,0.177,0.516,187.918,254547,4
1997-03-22,19,Da' Dip,Freak Nasty,,False,19,19,12,0.953,0.428,8,-17.199,1,0.298,0.0079,0.0302,0.224,0.723,131.737,237000,4
1997-03-22,21,Please Don't Go,No Mercy,,False,21,21,7,0.715,0.838,7,-10.541,0,0.0341,0.169,3.67e-05,0.395,0.962,124.625,240093,4
1997-03-22,22,Ghetto Love,Da Brat Featuring T-Boz,5iJkSPVhITJvlYW3U3BxtS,True,0,22,1,0.778,0.611,4,-8.796,0,0.111,0.00451,0,0.336,0.247,93.926,204000,4
1997-03-22,23,What's On Tonight,Montell Jordan,5iJkSPVhITJvlYW3U3BxtS,False,25,23,6,0.826,0.447,5,-11.535,1,0.0442,0.33,3.2e-06,0.126,0.434,111.806,276653,4
1997-03-22,24,Return Of The Mack,Mark Morrison,5iJkSPVhITJvlYW3U3BxtS,False,26,24,4,0.715,0.833,2,-5.379,1,0.108,0.00631,0,0.164,0.612,95.487,213093,4
1997-03-22,25,"Let It Go (From ""Set It Off"")",Ray J,5iJkSPVhITJvlYW3U3BxtS,False,34,25,3,0.626,0.922,9,-2.037,1,0.0714,0.00789,0.000598,0.277,0.554,139.987,184811,4
1997-03-22,26,"I Believe In You And Me (From ""The Preacher's Wife"")",Whitney Houston,5iJkSPVhITJvlYW3U3BxtS,False,15,4,13,0.434,0.268,1,-11.52,0,0.0355,0.785,0,0.0881,0.121,119.804,241960,4
1997-03-22,27,On & On,Erykah Badu,5iJkSPVhITJvlYW3U3BxtS,False,24,12,9,0.762,0.403,11,-10.423,0,0.158,0.0396,0.0113,0.256,0.346,80.476,226133,4
1997-03-22,28,Cold Rock A Party,MC Lyte,5iJkSPVhITJvlYW3U3BxtS,False,17,11,17,0.896,0.744,11,-5.239,0,0.246,0.192,1.19e-06,0.108,0.744,92.91,247307,4
1997-03-22,29,No Diggity,BLACKstreet (Featuring Dr. Dre),5iJkSPVhITJvlYW3U3BxtS,False,23,1,24,0.849,0.379,1,-10.546,0,0.0614,0.139,0.0917,0.0448,0.44,89.007,267053,4
1997-03-22,30,Firestarter,The Prodigy,5iJkSPVhITJvlYW3U3BxtS,False,32,30,10,0.545,0.948,11,-5.098,1,0.0779,0.00335,0.364,0.226,0.355,141.507,279800,4
1997-03-22,31,I Like It,The Blackout Allstars,5iJkSPVhITJvlYW3U3BxtS,False,28,25,16,0.71,0.927,5,-6.433,0,0.0447,3.69e-05,0.203,0.651,0.616,128.069,291027,4
1997-03-22,32,Cupid,112,5iJkSPVhITJvlYW3U3BxtS,False,43,32,4,0.685,0.38,8,-11.219,1,0.112,0.373,0,0.0371,0.87,175.562,252267,4
1997-03-22,33,Let Me Clear My Throat,DJ Kool,5iJkSPVhITJvlYW3U3BxtS,False,38,33,8,0.697,0.901,7,-7.154,1,0.259,0.169,0,0.356,0.535,103.145,290160,4
1997-03-22,34,I Shot The Sheriff,Warren G,5uC1sC1OmVKfU0m5opiY25,True,0,34,1,0.859,0.68,10,-9.213,0,0.159,0.0289,1.09e-05,0.261,0.753,91.444,250240,4
1997-03-22,35,Head Over Heels,Allure Featuring NAS,5uC1sC1OmVKfU0m5opiY25,False,35,35,2,0.848,0.577,10,-10.07,0,0.103,0.08,0,0.369,0.674,96.045,251707,4
1997-03-22,37,Change The World,Eric Clapton,,False,30,5,36,0.721,0.558,9,-8.8,1,0.0246,0.492,0.00563,0.113,0.542,96.887,234867,4
1997-03-22,38,Naked Eye,Luscious Jackson,,False,42,38,14,0.737,0.657,4,-10.962,0,0.0284,0.0863,0.0339,0.0953,0.76,131.022,280693,4
1997-03-22,39,Request Line,Zhane,,False,51,39,2,0.852,0.494,9,-9.48,0,0.0457,0.0151,0.00436,0.141,0.789,99.935,236000,4
1997-03-22,40,Where Do You Go,No Mercy,,False,29,5,38,0.734,0.828,10,-11.018,0,0.0318,0.0346,0.118,0.071,0.964,127.06,272093,4
1997-03-22,41,Say... If You Feel Alright,Crystal Waters,,False,41,41,5,0.757,0.843,1,-7.222,1,0.0332,0.0424,0.377,0.0742,0.717,113.21,236133,4
1997-03-22,42,I Love You Always Forever,Donna Lewis,,False,39,2,40,0.744,0.453,5,-11.977,1,0.0348,0.627,0.421,0.0898,0.122,103.773,239960,4
1997-03-22,43,Falling In Love (Is Hard On The Knees),Aerosmith,,False,53,43,4,0.612,0.861,7,-4.571,0,0.0293,0.0144,0,0.119,0.888,116.663,205800,4
1997-03-22,44,I'm Not Feeling You,Yvette Michele,,False,44,44,5,0.796,0.638,7,-3.923,1,0.11,0.00356,0.000209,0.0811,0.583,96.507,205600,4
1997-03-22,45,If It Makes You Happy,Sheryl Crow,,False,37,10,27,0.543,0.681,7,-7.091,1,0.0289,0.0482,8.43e-05,0.104,0.292,95.415,323400,4
1997-03-22,46,Just Another Day,John Mellencamp,,False,46,46,5,0.715,0.738,0,-5.674,1,0.0325,0.096,0.000136,0.0978,0.896,144.145,207893,4
1997-03-22,47,When You Love A Woman,Journey,,False,36,12,22,0.513,0.514,1,-5.819,1,0.0274,0.255,0,0.258,0.216,132.157,246987,4
1997-03-22,48,Mouth,Merril Bainbridge,,False,40,4,29,0.695,0.499,1,-9.201,1,0.218,0.702,5.85e-05,0.154,0.78,175.896,205733,4
1997-03-22,49,I'm Still In Love With You,New Edition,,False,27,7,20,0.741,0.519,8,-4.683,0,0.0351,0.426,0,0.318,0.418,134.294,279667,4
1997-03-22,50,Secret Garden,Bruce Springsteen,,False,0,50,8,0.52,0.329,0,-14.224,1,0.0266,0.576,0.0418,0.12,0.118,86.857,266613,4
1997-03-22,52,Discotheque,U2,,False,33,10,5,0.581,0.825,4,-9.689,0,0.0373,0.000859,0.095,0.11,0.663,120.362,318667,4
1997-03-22,53,Luchini aka (This Is It),Camp Lo,,False,50,50,12,0.721,0.949,6,-5.685,1,0.278,0.0495,0,0.327,0.835,83.028,240093,4
1997-03-22,54,Whateva Man,Redman,,False,48,42,8,0.581,0.712,6,-7.803,0,0.476,0.27,0,0.895,0.709,172.573,188547,4
1997-03-22,55,The Theme (It's Party Time),Tracey Lee,,False,56,55,6,0.75,0.658,6,-8.658,0,0.305,0.0108,0,0.125,0.427,99.113,272800,4
1997-03-22,56,Talk To Me,Wild Orchid,,False,62,56,4,0.726,0.829,8,-5.042,1,0.04,0.0389,4.49e-05,0.33,0.778,119.634,288800,4
1997-03-22,57,"It's Alright, It's Ok",Leah Andreone,,False,61,57,9,0.734,0.67,0,-5.838,0,0.0321,0.0113,1.25e-06,0.224,0.656,110.022,265133,4
1997-03-22,58,The Freshmen,The Verve Pipe,,False,63,58,5,0.571,0.505,1,-9.312,0,0.0238,0.0757,1.04e-05,0.109,0.276,99.562,269467,4
1997-03-22,59,Do G's Get To Go To Heaven?,Richie Rich,,False,57,57,4,0.673,0.427,2,-10.131,1,0.248,0.602,0.000663,0.096,0.444,84.127,359493,4
1997-03-22,60,No Time,Lil' Kim Featuring Puff Daddy,,False,55,18,20,0.627,0.814,5,-5.863,0,0.304,0.256,1.15e-06,0.285,0.799,90.42,300667,4
1997-03-22,61,I Belong To You (Every Time I See Your Face),Rome,,False,79,61,2,0.759,0.337,0,-11.034,0,0.035,0.026,0,0.0753,0.335,117.845,273267,4
1997-03-22,62,"Watch Me Do My Thing (From ""All That"")",Immature Featuring Smooth And Ed From Good Burger,,False,52,32,8,0.697,0.853,8,-6.264,1,0.0528,0.00189,1.37e-06,0.243,0.765,93.799,231533,4
1997-03-22,63,Desperately Wanting,Better Than Ezra,,False,60,48,14,0.494,0.913,0,-5.289,1,0.0378,0.000165,0.00898,0.247,0.478,99.92,277493,4
1997-03-22,64,"I Finally Found Someone (From ""The Mirror Has Two Faces"")",Barbra Streisand & Bryan Adams,,False,58,8,18,0.562,0.224,6,-15.069,1,0.0289,0.674,0,0.127,0.0707,139.009,221973,4
1997-03-22,65,"Nothin' But The Cavi Hit (From ""Rhyme & Reason"")",Mack 10 & Tha Dogg Pound,,False,64,38,15,0.852,0.741,1,-5.435,0,0.134,0.0247,0.00106,0.0974,0.535,97.894,241360,4
1997-03-22,66,"Too Late, Too Soon",Jon Secada,,False,76,66,2,0.642,0.45,8,-9.53,1,0.0382,0.452,0.00152,0.107,0.187,160.651,255267,4
1997-03-22,67,Don't Stop Movin',Livin' Joy,,False,67,67,9,0.703,0.723,2,-10.816,0,0.0445,0.0287,0.00337,0.297,0.867,129.992,215227,4
1997-03-22,68,"Space Jam (From ""Space Jam"")",Quad City DJ's,,False,69,37,14,0.798,0.952,11,-4.78,0,0.0401,0.064,0.000513,0.287,0.843,132.031,304960,4
1997-03-22,69,Gangstas Make The World Go Round,Westside Connection,,False,72,69,3,0.754,0.575,9,-8.22,1,0.366,0.0977,0,0.474,0.561,180.389,272834,4
1997-03-22,70,What They Do,The Roots,,False,54,34,11,0.885,0.414,0,-10.539,1,0.168,0.341,0.000289,0.0891,0.683,92.727,357200,4
1997-03-22,71,Silent All These Years,Tori Amos,3IZXUxoL1Q7yUj5mh3Tmqp,True,0,71,1,0.484,0.158,4,-14.687,1,0.0374,0.94,1.64e-05,0.109,0.296,128.06,251226,4
1997-03-22,72,It's Your Body,Johnny Gill Featuring Roger Troutman,3IZXUxoL1Q7yUj5mh3Tmqp,False,65,43,15,0.647,0.536,0,-10.733,1,0.045,0.524,0,0.0798,0.316,125.222,333867,4
1997-03-22,73,Thirty-Three,The Smashing Pumpkins,3IZXUxoL1Q7yUj5mh3Tmqp,False,66,39,17,0.607,0.333,6,-12.717,1,0.0324,0.000968,0.4,0.151,0.0802,126.619,250293,4
1997-03-22,74,Here's Your Sign (Get The Picture),Bill Engvall With Special Guest Travis Tritt,3IZXUxoL1Q7yUj5mh3Tmqp,False,82,74,5,0.586,0.936,7,-6.605,1,0.549,0.337,0,0.928,0.732,178.068,220173,4
1997-03-22,75,If We Fall In Love Tonight,Rod Stewart,3IZXUxoL1Q7yUj5mh3Tmqp,False,73,54,19,0.51,0.44,2,-11.015,1,0.0293,0.125,0,0.0994,0.135,74.8,281200,4
1997-03-22,76,"You Must Love Me (From ""Evita"")",Madonna,3IZXUxoL1Q7yUj5mh3Tmqp,False,68,18,19,0.357,0.161,10,-14.789,1,0.0436,0.926,3.47e-05,0.146,0.267,88.746,170840,4
1997-03-22,77,Take Your Time,Tre,3IZXUxoL1Q7yUj5mh3Tmqp,False,86,77,6,0.774,0.415,6,-9.97,0,0.0341,0.0298,0.432,0.137,0.0579,111.99,191262,4
1997-03-22,78,Call Me,Le Click,3IZXUxoL1Q7yUj5mh3Tmqp,False,83,78,3,0.674,0.849,1,-11.271,0,0.029,0.0126,1.37e-05,0.357,0.791,136.033,225400,4
1997-03-22,79,I Always Feel Like (Somebody's Watching Me),Tru Featuring Ice Cream Man (Master P),3IZXUxoL1Q7yUj5mh3Tmqp,False,71,71,7,0.832,0.456,6,-10.108,0,0.193,0.00201,0.00351,0.366,0.285,93.585,306480,4
1997-03-22,80,Havana,Kenny G,3IZXUxoL1Q7yUj5mh3Tmqp,False,89,80,3,0.403,0.328,0,-12.372,0,0.033,0.807,0.785,0.228,0.291,113.075,440400,4
1997-03-22,81,"Fly Like An Eagle (From ""Space Jam"")",Seal,3IZXUxoL1Q7yUj5mh3Tmqp,False,75,10,14,0.623,0.836,7,-4.729,1,0.0595,0.00697,3.41e-06,0.0687,0.631,97.14,254773,4
1997-03-22,82,Get Up,Lost Boyz,3IZXUxoL1Q7yUj5mh3Tmqp,False,74,60,12,0.813,0.572,9,-6.469,1,0.162,0.0266,0,0.0372,0.655,94.825,243760,4
1997-03-22,83,Fired Up!,Funky Green Dogs,3IZXUxoL1Q7yUj5mh3Tmqp,False,84,83,7,0.878,0.912,0,-7.716,1,0.0458,0.0601,0.00268,0.0707,0.966,122.953,485160,4
1997-03-22,84,If Tomorrow Never Comes,Joose,4SmfxtBxMq590FY72D7ofY,True,0,84,1,0.6,0.223,6,-13.81,1,0.027,0.649,0.297,0.0832,0.218,141.001,244846,4
1997-03-22,85,I'm Not Giving You Up,Gloria Estefan,4SmfxtBxMq590FY72D7ofY,False,70,40,16,0.753,0.488,10,-8.259,0,0.0247,0.769,0,0.0851,0.607,97.943,258893,4
1997-03-22,86,It's All About U,SWV,4SmfxtBxMq590FY72D7ofY,False,88,61,10,0.838,0.401,0,-9.808,1,0.0506,0.111,0.00811,0.0478,0.74,93.49,224800,4
1997-03-22,87,Tears,The Isley Brothers,4SmfxtBxMq590FY72D7ofY,False,78,55,11,0.532,0.516,1,-9.847,1,0.103,0.755,0.00019,0.328,0.545,150.372,285600,4
1997-03-22,88,ATLiens,OutKast,4SmfxtBxMq590FY72D7ofY,False,87,35,17,0.918,0.734,11,-2.832,0,0.269,0.0296,8.01e-06,0.191,0.608,97.044,230693,4
1997-03-22,89,Without Your Love,Angelina,4SmfxtBxMq590FY72D7ofY,False,99,89,6,0.732,0.891,3,-7.476,0,0.0298,0.0678,0.446,0.089,0.943,134.034,231760,4
1997-03-22,90,Barrel Of A Gun,Depeche Mode,4SmfxtBxMq590FY72D7ofY,False,80,47,5,0.522,0.949,4,-5.216,1,0.073,0.0221,0.00286,0.0615,0.707,165.872,336293,4
1997-03-22,91,Weekend Thang,Alfonzo Hunter,4SmfxtBxMq590FY72D7ofY,False,91,91,2,0.785,0.295,8,-9.163,0,0.0569,0.0677,0,0.125,0.584,81.115,203760,4
1997-03-22,93,We Danced Anyway,Deana Carter,,False,85,72,7,0.629,0.721,6,-3.722,1,0.0277,0.502,0,0.307,0.651,94.054,202533,4
1997-03-22,94,It's In Your Eyes,Phil Collins,,False,90,79,6,0.707,0.741,5,-6.423,1,0.0261,0.0837,8.46e-05,0.229,0.658,121.774,182960,4
1997-03-22,95,Come See Me,112,,False,92,33,20,0.701,0.378,5,-9.259,0,0.0664,0.0263,0,0.0649,0.604,83.796,265760,4
1997-03-22,96,Without Love,Donna Lewis,,False,94,41,15,0.66,0.604,5,-8.318,1,0.0323,0.00646,0.0104,0.0907,0.779,91.671,222440,4
1997-03-22,97,Under The Water,Merril Bainbridge,2YEgbPleCGhJ3rQoCSWZRB,True,0,97,1,0.625,0.641,6,-9.244,1,0.0249,0.611,3.83e-05,0.121,0.608,103.92,253267,4
1997-03-22,98,King Nothing,Metallica,2YEgbPleCGhJ3rQoCSWZRB,False,97,90,4,0.528,0.909,8,-5.712,1,0.0381,7.77e-05,0.00959,0.0891,0.349,112.083,328133,4
1997-03-22,99,Between You And Me,dc Talk,2YEgbPleCGhJ3rQoCSWZRB,False,95,29,19,0.554,0.912,9,-4.315,0,0.0376,0.14,0.0421,0.064,0.515,99.712,298760,4
1997-03-22,100,Colour Of Love,Amber,2YEgbPleCGhJ3rQoCSWZRB,False,96,74,10,0.642,0.754,1,-7.649,1,0.0272,0.116,0.0375,0.0601,0.736,127.025,212693,4
