date,position,title,artist,spotify_id,is_new,last_pos,peak_pos,weeks,danceability,energy,key,loudness,mode,speechiness,acousticness,instrumentalness,liveness,valence,tempo,duration_ms,time_signature
2000-11-25,1,Independent Women Part I,Destiny's Child,49LlHOtT2SOfUQXCa24fkJ,False,1,1,10,0.747,0.638,6,-6.137,0,0.245,0.107,6.44e-06,0.126,0.947,97.99,217680,4
2000-11-25,2,With Arms Wide Open,Creed,49LlHOtT2SOfUQXCa24fkJ,False,2,1,29,0.41,0.539,0,-8.412,1,0.0302,0.00425,0.00089,0.117,0.141,138.852,274800,4
2000-11-25,3,Kryptonite,3 Doors Down,49LlHOtT2SOfUQXCa24fkJ,False,3,3,34,0.545,0.865,11,-5.708,0,0.0286,0.00664,1.1e-05,0.168,0.543,99.009,233933,4
2000-11-25,4,Most Girls,P!nk,49LlHOtT2SOfUQXCa24fkJ,False,5,4,16,0.742,0.732,2,-6.046,0,0.0311,0.0424,0.00444,0.101,0.695,97.923,298960,4
2000-11-25,5,Gotta Tell You,Samantha Mumba,49LlHOtT2SOfUQXCa24fkJ,False,6,5,12,0.729,0.752,0,-4.478,0,0.028,0.229,0,0.19,0.792,110.007,201067,4
2000-11-25,6,This I Promise You,'N Sync,49LlHOtT2SOfUQXCa24fkJ,False,7,6,9,0.55,0.587,2,-6.279,1,0.0329,0.354,0,0.128,0.466,165.975,284760,4
2000-11-25,7,Case Of The Ex (Whatcha Gonna Do),Mya,49LlHOtT2SOfUQXCa24fkJ,False,9,7,15,0.774,0.684,1,-4.721,0,0.0408,0.0687,9.34e-05,0.0765,0.354,98.001,236827,4
2000-11-25,8,Music,Madonna,49LlHOtT2SOfUQXCa24fkJ,False,4,1,16,0.736,0.802,7,-8.527,1,0.0663,0.00149,0.0876,0.14,0.871,119.854,225973,4
2000-11-25,9,The Way You Love Me,Faith Hill,49LlHOtT2SOfUQXCa24fkJ,False,10,9,30,0.627,0.716,2,-7.175,1,0.0352,0.127,0,0.0344,0.734,101.99,186067,4
2000-11-25,10,Shape Of My Heart,Backstreet Boys,49LlHOtT2SOfUQXCa24fkJ,False,12,10,7,0.575,0.786,9,-4.353,1,0.0296,0.252,0,0.159,0.518,96.102,230093,4
2000-11-25,11,Between Me And You,Ja Rule Featuring Christina Milian,49LlHOtT2SOfUQXCa24fkJ,False,11,11,11,0.818,0.883,0,-4.547,1,0.0695,0.0202,0.000767,0.243,0.405,93.67,250173,4
2000-11-25,12,Come On Over Baby (All I Want Is You),Christina Aguilera,49LlHOtT2SOfUQXCa24fkJ,False,8,1,17,0.829,0.915,8,-3.205,1,0.106,0.226,1.25e-05,0.246,0.779,118.903,203333,4
2000-11-25,13,She Bangs,Ricky Martin,49LlHOtT2SOfUQXCa24fkJ,False,13,13,8,0.63,0.95,1,-4.012,1,0.0806,0.000915,6.51e-06,0.373,0.858,143.866,280627,4
2000-11-25,14,Dance With Me,Debelah Morgan,49LlHOtT2SOfUQXCa24fkJ,False,14,14,18,0.85,0.674,7,-7.981,0,0.0373,0.309,0.000645,0.0356,0.74,115.005,220107,4
2000-11-25,15,Pinch Me,Barenaked Ladies,49LlHOtT2SOfUQXCa24fkJ,False,16,15,12,0.68,0.857,7,-4.132,1,0.0373,0.0151,2.88e-05,0.056,0.794,95.349,285160,4
2000-11-25,16,It Wasn't Me,"Shaggy Feat. Ricardo ""RikRok"" Ducent",49LlHOtT2SOfUQXCa24fkJ,False,30,16,4,0.853,0.606,0,-4.596,1,0.0713,0.0561,0,0.313,0.654,94.759,227600,4
2000-11-25,17,E.I.,Nelly,49LlHOtT2SOfUQXCa24fkJ,False,22,17,8,0.834,0.481,2,-7.824,0,0.188,0.0732,0,0.0934,0.406,89.849,285907,4
2000-11-25,18,He Loves U Not,Dream,49LlHOtT2SOfUQXCa24fkJ,False,27,18,9,0.595,0.877,1,-11.787,1,0.0579,0.026,2.85e-06,0.419,0.394,156.972,225813,4
2000-11-25,19,Shake Ya Ass,Mystikal,49LlHOtT2SOfUQXCa24fkJ,False,17,13,16,0.914,0.607,7,-5.658,1,0.32,0.0626,0,0.0515,0.666,98.054,256973,4
2000-11-25,20,I Wish,R. Kelly,49LlHOtT2SOfUQXCa24fkJ,False,18,18,9,0.42,0.463,6,-9.056,1,0.12,0.068,0,0.119,0.659,78.83,334000,4
2000-11-25,21,If You're Gone,matchbox twenty,49LlHOtT2SOfUQXCa24fkJ,False,29,21,6,0.544,0.659,9,-7.191,1,0.0298,0.427,1.33e-06,0.126,0.361,109.933,274933,4
2000-11-25,22,No More,Ruff Endz,49LlHOtT2SOfUQXCa24fkJ,False,19,5,22,0.839,0.641,10,-5.669,0,0.0858,0.0324,4.56e-06,0.0602,0.927,97.004,242560,4
2000-11-25,23,I Just Wanna Love U (Give It 2 Me),JAY-Z,49LlHOtT2SOfUQXCa24fkJ,False,26,23,5,0.8,0.922,4,-5.125,0,0.24,0.301,9.31e-06,0.0352,0.801,98.631,227867,4
2000-11-25,24,"Jumpin', Jumpin'",Destiny's Child,49LlHOtT2SOfUQXCa24fkJ,False,15,3,29,0.771,0.685,1,-4.639,1,0.0567,0.00543,0.00157,0.0537,0.683,88.997,230200,4
2000-11-25,25,Incomplete,Sisqo,49LlHOtT2SOfUQXCa24fkJ,False,20,1,23,0.746,0.443,1,-7.693,0,0.0771,0.282,0,0.14,0.272,119.311,274227,4
2000-11-25,26,Bag Lady,Erykah Badu,49LlHOtT2SOfUQXCa24fkJ,False,21,6,15,0.724,0.416,5,-8.964,0,0.0841,0.365,0,0.0969,0.578,151.181,348893,4
2000-11-25,27,Ms. Jackson,OutKast,49LlHOtT2SOfUQXCa24fkJ,False,35,27,3,0.843,0.806,4,-5.946,0,0.269,0.143,0,0.0771,0.613,94.948,270507,4
2000-11-25,28,Best Of Intentions,Travis Tritt,49LlHOtT2SOfUQXCa24fkJ,False,28,28,15,0.659,0.468,8,-7.439,1,0.0232,0.363,0,0.0964,0.37,99.066,257400,4
2000-11-25,29,Bent,matchbox twenty,49LlHOtT2SOfUQXCa24fkJ,False,24,1,31,0.518,0.83,6,-6.814,0,0.0386,0.0404,3.85e-06,0.375,0.527,95.468,256133,4
2000-11-25,30,What's Your Fantasy,Ludacris Featuring Shawnna,49LlHOtT2SOfUQXCa24fkJ,False,32,30,9,0.915,0.79,6,-3.186,0,0.207,0.16,0,0.112,0.967,140.093,275907,4
2000-11-25,31,Don't Think I'm Not,Kandi,49LlHOtT2SOfUQXCa24fkJ,False,31,24,17,0.859,0.622,11,-8.196,1,0.0445,0.0661,0,0.0394,0.433,134.007,243533,4
2000-11-25,32,You're A God,Vertical Horizon,49LlHOtT2SOfUQXCa24fkJ,False,25,23,14,0.65,0.851,5,-6.519,0,0.0303,0.00117,3.39e-05,0.0937,0.294,96.651,218760,4
2000-11-25,33,(Hot S**t) Country Grammar,Nelly,49LlHOtT2SOfUQXCa24fkJ,False,23,7,31,0.85,0.7,7,-6.49,1,0.0478,0.0616,1.8e-06,0.244,0.722,101.875,291782,4
2000-11-25,34,Faded,SoulDecision Featuring Thrust,49LlHOtT2SOfUQXCa24fkJ,False,34,22,21,0.859,0.585,6,-9.779,0,0.0986,0.153,0,0.0597,0.908,107.998,209123,4
2000-11-25,35,Liar,Profyle,49LlHOtT2SOfUQXCa24fkJ,False,33,14,11,0.694,0.617,10,-3.559,0,0.049,0.226,0,0.247,0.305,114.064,297893,4
2000-11-25,36,Just Another Day In Paradise,Phil Vassar,49LlHOtT2SOfUQXCa24fkJ,False,38,36,9,0.596,0.706,2,-5.562,1,0.0262,0.351,0,0.36,0.704,146.088,233880,4
2000-11-25,37,Crazy For This Girl,Evan And Jaron,49LlHOtT2SOfUQXCa24fkJ,False,44,37,4,0.457,0.926,0,-5.461,1,0.038,0.000487,5.69e-05,0.0949,0.41,93.964,202027,4
2000-11-25,38,911,Wyclef Jean Featuring Mary J. Blige,49LlHOtT2SOfUQXCa24fkJ,False,43,38,8,0.747,0.646,7,-9.185,1,0.191,0.273,3.7e-06,0.0931,0.73,87.011,259333,4
2000-11-25,39,We Danced,Brad Paisley,49LlHOtT2SOfUQXCa24fkJ,False,42,39,7,0.596,0.465,9,-8.511,1,0.0253,0.385,0,0.106,0.141,73.013,225680,4
2000-11-25,40,My Next Thirty Years,Tim McGraw,49LlHOtT2SOfUQXCa24fkJ,False,46,40,6,0.605,0.804,5,-7.521,1,0.0363,0.265,4.93e-06,0.345,0.601,98.866,217733,4
2000-11-25,41,Doesn't Really Matter,Janet,49LlHOtT2SOfUQXCa24fkJ,False,40,1,24,0.771,0.796,5,-3.081,0,0.076,0.0993,0.00278,0.0981,0.801,99.316,265027,4
2000-11-25,42,The Little Girl,John Michael Montgomery,49LlHOtT2SOfUQXCa24fkJ,False,37,35,12,0.658,0.434,1,-8.527,1,0.025,0.354,1.75e-05,0.112,0.218,83.921,232640,4
2000-11-25,43,My First Love,Avant Featuring KeKe Wyatt,49LlHOtT2SOfUQXCa24fkJ,False,56,43,4,0.643,0.368,11,-8.379,0,0.033,0.0237,1.35e-06,0.157,0.414,125.95,268516,4
2000-11-25,44,Beautiful Day,U2,49LlHOtT2SOfUQXCa24fkJ,False,47,44,8,0.539,0.926,2,-6.495,1,0.0499,0.014,0.00136,0.36,0.454,136.279,246400,4
2000-11-25,45,Wonderful,Everclear,49LlHOtT2SOfUQXCa24fkJ,False,39,11,21,0.514,0.817,7,-6.489,1,0.05,0.0118,8.25e-06,0.346,0.734,186.765,280813,4
2000-11-25,46,Without You,Dixie Chicks,49LlHOtT2SOfUQXCa24fkJ,False,48,46,8,0.626,0.424,2,-8.952,1,0.0253,0.313,1.26e-05,0.134,0.173,91.812,210533,4
2000-11-25,47,Give Me Just One Night (Una Noche),98 Degrees,49LlHOtT2SOfUQXCa24fkJ,False,36,2,15,0.543,0.79,0,-6.145,1,0.0491,0.0513,3.55e-06,0.0981,0.655,123.631,205160,4
2000-11-25,48,He Wasn't Man Enough,Toni Braxton,49LlHOtT2SOfUQXCa24fkJ,False,41,2,37,0.739,0.947,11,-1.915,0,0.0412,0.00947,2.99e-05,0.326,0.763,88.009,261933,4
2000-11-25,49,Back Here,BBMak,49LlHOtT2SOfUQXCa24fkJ,False,45,13,31,0.624,0.945,7,-3.109,1,0.0343,0.0698,4.57e-06,0.0867,0.914,104.77,218200,4
2000-11-25,50,Higher,Creed,49LlHOtT2SOfUQXCa24fkJ,False,50,7,56,0.459,0.83,2,-6.254,1,0.0364,5.15e-05,0.00014,0.206,0.431,155.827,316733,4
2000-11-25,51,Born To Fly,Sara Evans,49LlHOtT2SOfUQXCa24fkJ,False,55,51,6,0.612,0.663,1,-9.314,1,0.035,0.00931,0.0152,0.0637,0.558,100.178,336360,4
2000-11-25,52,Just Friends (Sunny),Musiq,49LlHOtT2SOfUQXCa24fkJ,False,54,52,7,0.754,0.376,0,-7.561,1,0.204,0.404,0,0.358,0.554,95.018,251427,4
2000-11-25,53,I Lost It,Kenny Chesney,49LlHOtT2SOfUQXCa24fkJ,False,58,53,6,0.584,0.429,3,-9.289,1,0.028,0.23,0,0.0708,0.355,138.884,234160,4
2000-11-25,54,www.memory,Alan Jackson,49LlHOtT2SOfUQXCa24fkJ,False,59,54,4,0.701,0.503,5,-7.535,1,0.026,0.572,0,0.333,0.726,94.073,154200,4
2000-11-25,55,Feels Like Love,Vince Gill,49LlHOtT2SOfUQXCa24fkJ,False,52,52,13,0.55,0.832,10,-7.773,1,0.0296,0.133,3.96e-05,0.189,0.627,99.917,255773,4
2000-11-25,56,Go On,George Strait,49LlHOtT2SOfUQXCa24fkJ,False,49,40,14,0.705,0.555,8,-8.488,1,0.0238,0.449,0.0149,0.254,0.487,104.501,201760,4
2000-11-25,57,Stan,Eminem Featuring Dido,49LlHOtT2SOfUQXCa24fkJ,False,57,57,4,0.78,0.768,6,-4.325,0,0.238,0.0371,2.34e-06,0.518,0.507,80.063,404107,4
2000-11-25,58,It's My Life,Bon Jovi,49LlHOtT2SOfUQXCa24fkJ,False,51,33,16,0.551,0.913,0,-4.063,0,0.0466,0.0263,1.35e-05,0.347,0.544,119.992,224493,4
2000-11-25,59,Again,Lenny Kravitz,49LlHOtT2SOfUQXCa24fkJ,False,72,59,2,0.55,0.804,2,-5.218,1,0.0271,0.0148,4.33e-05,0.105,0.789,79.166,231667,4
2000-11-25,60,Pop Ya Collar,Usher,49LlHOtT2SOfUQXCa24fkJ,False,60,60,4,0.88,0.819,5,-4.918,0,0.187,0.244,0,0.098,0.923,107.001,212280,4
2000-11-25,61,Bounce With Me,Lil Bow Wow Featuring Xscape,49LlHOtT2SOfUQXCa24fkJ,False,53,20,15,0.852,0.75,8,-5.153,1,0.168,0.434,0,0.265,0.934,72.016,175893,4
2000-11-25,62,Hemorrhage (In My Hands),Fuel,49LlHOtT2SOfUQXCa24fkJ,False,69,62,5,0.301,0.823,1,-4.072,1,0.0433,0.000144,0.000309,0.0833,0.372,152.017,236867,4
2000-11-25,63,Girls Dem Sugar,Beenie Man Featuring Mya,49LlHOtT2SOfUQXCa24fkJ,False,62,56,6,0.603,0.782,2,-4.832,1,0.162,0.118,0,0.363,0.731,124.303,257893,5
2000-11-25,64,Last Resort,Papa Roach,49LlHOtT2SOfUQXCa24fkJ,False,64,60,18,0.589,0.89,4,-3.719,0,0.0603,0.000481,0.00082,0.201,0.692,90.598,199907,4
2000-11-25,65,Loser,3 Doors Down,49LlHOtT2SOfUQXCa24fkJ,False,67,65,6,0.493,0.88,6,-6.424,0,0.0693,0.0108,2.66e-05,0.226,0.389,147.913,264800,4
2000-11-25,66,Tell Her,Lonestar,49LlHOtT2SOfUQXCa24fkJ,False,75,66,2,0.58,0.487,7,-9.809,1,0.0318,0.437,0,0.0968,0.317,126.972,207560,4
2000-11-25,67,Open My Heart,Yolanda Adams,49LlHOtT2SOfUQXCa24fkJ,False,61,57,14,0.414,0.402,10,-8.911,0,0.0427,0.7,0,0.363,0.171,105.368,340040,4
2000-11-25,68,You Should've Told Me,Kelly Price,49LlHOtT2SOfUQXCa24fkJ,False,70,68,10,0.732,0.467,1,-4.951,1,0.07,0.235,0,0.0528,0.553,120.136,195080,4
2000-11-25,69,Kiss This,Aaron Tippin,49LlHOtT2SOfUQXCa24fkJ,False,68,42,14,0.765,0.706,6,-5.477,0,0.026,0.047,4.25e-06,0.36,0.669,116.02,173760,4
2000-11-25,70,No More (Baby I'ma Do Right),3LW,49LlHOtT2SOfUQXCa24fkJ,False,81,70,4,0.721,0.723,2,-7.08,0,0.0631,0.102,4.4e-06,0.0651,0.761,88.933,263440,4
2000-11-25,71,That's The Kind Of Mood I'm In,Patty Loveless,49LlHOtT2SOfUQXCa24fkJ,False,71,71,11,0.698,0.628,11,-6.359,1,0.0336,0.182,0,0.0736,0.669,126.394,212200,4
2000-11-25,72,Rollin',Limp Bizkit,49LlHOtT2SOfUQXCa24fkJ,False,73,72,3,0.603,0.933,1,-3.358,1,0.171,0.00591,0,0.206,0.709,96.306,213760,4
2000-11-25,73,My Baby You,Marc Anthony,49LlHOtT2SOfUQXCa24fkJ,False,76,70,11,0.443,0.596,0,-5.366,0,0.0294,0.688,0,0.167,0.186,115.597,236960,4
2000-11-25,74,Original Prankster,The Offspring,6gfDXAX85YWdVwxpbz0npv,True,0,74,1,0.664,0.877,2,-4.251,1,0.0334,0.000542,2.95e-05,0.284,0.961,146.804,220947,4
2000-11-25,75,That Other Woman,Changing Faces,6gfDXAX85YWdVwxpbz0npv,False,66,64,9,0.677,0.481,7,-5.613,0,0.0522,0.15,0,0.0747,0.246,134.01,280200,4
2000-11-25,76,Can't Fight The Moonlight,LeAnn Rimes,6gfDXAX85YWdVwxpbz0npv,False,77,71,12,0.628,0.834,6,-6.341,0,0.0497,0.403,0,0.051,0.626,97.865,215507,4
2000-11-25,77,Emotional,Carl Thomas,2qYIdNaktgtpaPHxDVMXbE,True,0,77,1,0.548,0.542,1,-8.435,0,0.0409,0.544,0,0.148,0.389,83.106,271868,4
2000-11-25,78,Who Let The Dogs Out,Baha Men,2qYIdNaktgtpaPHxDVMXbE,False,65,40,19,0.596,0.954,0,-4.745,1,0.0657,0.00038,0.0171,0.227,0.628,128.913,150581,4
2000-11-25,79,How Many Licks?,Lil' Kim Featuring Sisqo,5jv3QxL0MFswzM1UJ2qQJM,True,0,79,1,0.777,0.846,10,-3.11,0,0.194,0.0508,0,0.309,0.646,105.45,232800,4
2000-11-25,80,You Won't Be Lonely Now,Billy Ray Cyrus,5jv3QxL0MFswzM1UJ2qQJM,False,82,80,10,0.369,0.528,1,-6.648,1,0.0285,0.307,0,0.229,0.336,153.898,232507,3
2000-11-25,81,Bad Boyz,Shyne Featuring Barrington Levy,5jv3QxL0MFswzM1UJ2qQJM,False,74,57,12,0.788,0.594,6,-4.864,0,0.336,0.0249,1.65e-05,0.0534,0.691,83.84,228907,4
2000-11-25,82,There You Are,Martina McBride,5jv3QxL0MFswzM1UJ2qQJM,False,63,60,12,0.343,0.434,7,-7.072,1,0.0298,0.648,0,0.126,0.14,144.479,204627,4
2000-11-25,83,My Love Goes On And On,Chris Cagle,5jv3QxL0MFswzM1UJ2qQJM,False,84,83,6,0.577,0.932,6,-6.137,1,0.0593,0.352,0,0.0609,0.92,161.949,182867,4
2000-11-25,84,Just Be A Man About It,Toni Braxton,5jv3QxL0MFswzM1UJ2qQJM,False,79,32,18,0.753,0.45,9,-6.909,1,0.0924,0.274,2e-06,0.321,0.56,109.405,288933,4
2000-11-25,85,Straight Up,Chante Moore,5jv3QxL0MFswzM1UJ2qQJM,False,90,85,5,0.864,0.869,1,-3.602,1,0.129,0.255,0.000134,0.0469,0.93,100.011,220200,4
2000-11-25,86,Meanwhile Back At The Ranch,The Clark Family Experience,5jv3QxL0MFswzM1UJ2qQJM,False,87,86,2,0.585,0.84,7,-6.109,1,0.0324,0.0649,0,0.367,0.534,94.944,179467,4
2000-11-25,87,I Will...But,SHeDAISY,5jv3QxL0MFswzM1UJ2qQJM,False,85,43,20,0.675,0.837,2,-5.105,1,0.0354,0.103,0,0.123,0.888,112.53,219973,4
2000-11-25,88,What Means The World To You,Cam'ron,5jv3QxL0MFswzM1UJ2qQJM,False,83,83,7,0.857,0.851,0,-7.851,1,0.293,0.0849,0,0.316,0.899,143.737,267640,4
2000-11-25,89,Californication,Red Hot Chili Peppers,5jv3QxL0MFswzM1UJ2qQJM,False,78,69,18,0.592,0.767,9,-2.788,0,0.027,0.0021,0.00165,0.127,0.328,96.483,329733,4
2000-11-25,90,Sleepwalker,The Wallflowers,5jv3QxL0MFswzM1UJ2qQJM,False,80,73,5,0.534,0.892,4,-5.04,0,0.028,0.000697,0,0.109,0.749,128.834,211027,4
2000-11-25,91,Oklahoma,Billy Gilman,5jv3QxL0MFswzM1UJ2qQJM,False,91,91,3,0.42,0.268,1,-10.217,1,0.0332,0.484,0,0.0892,0.27,138.595,244000,4
2000-11-25,92,Aaron's Party (Come Get It),Aaron Carter,5jv3QxL0MFswzM1UJ2qQJM,False,86,35,14,0.944,0.886,1,-4.121,1,0.135,0.0462,0,0.0429,0.912,117.03,204733,4
2000-11-25,93,The Light,Common,5jv3QxL0MFswzM1UJ2qQJM,False,89,44,17,0.934,0.649,7,-6.465,1,0.266,0.114,1.71e-06,0.0807,0.685,97.026,243587,4
2000-11-25,94,Summer Rain,Carl Thomas,5jv3QxL0MFswzM1UJ2qQJM,False,88,80,10,0.667,0.627,6,-10.488,0,0.0654,0.0972,5.19e-05,0.111,0.784,186.081,232560,4
2000-11-25,95,Do You,Funkmaster Flex Featuring DMX,5jv3QxL0MFswzM1UJ2qQJM,False,92,92,3,0.798,0.931,3,-11.089,0,0.0821,0.000617,0.817,0.339,0.0981,107.95,106181,4
2000-11-25,96,So In Love With Two,Mikaila,0h9mUYPhZd2aQK2JmrHPD2,True,0,96,1,0.779,0.788,2,-4.63,0,0.0362,0.278,2.5e-06,0.0708,0.791,119.999,206933,4
2000-11-25,97,Bow Wow (That's My Name),Lil Bow Wow,0t8xunV9PKCZl7R6fIg9Ub,True,0,97,1,0.762,0.67,8,-6.2,0,0.257,0.0217,0,0.0786,0.591,93.066,213493,4
2000-11-25,98,Change Your Mind,Sister Hazel,0t8xunV9PKCZl7R6fIg9Ub,False,96,59,20,0.428,0.785,0,-4.853,1,0.0569,0.0104,0,0.102,0.68,182.352,259667,4
2000-11-25,100,Treat Her Like A Lady,Joe,,False,99,63,17,0.75,0.463,5,-6.99,0,0.0415,0.0581,0,0.0889,0.568,126.072,257773,4
