date,position,title,artist,spotify_id,is_new,last_pos,peak_pos,weeks,danceability,energy,key,loudness,mode,speechiness,acousticness,instrumentalness,liveness,valence,tempo,duration_ms,time_signature
1999-02-13,1,Angel Of Mine,Monica,0HgpiaXip83f5BARVLfvu2,False,2,1,11,0.592,0.562,10,-6.869,0,0.0239,0.00373,3.23e-05,0.223,0.208,90.16,250173,4
1999-02-13,2,...Baby One More Time,Britney Spears,0HgpiaXip83f5BARVLfvu2,False,1,1,13,0.759,0.699,0,-5.745,0,0.0307,0.202,0.000131,0.443,0.907,92.96,211067,4
1999-02-13,3,Nobody's Supposed To Be Here,Deborah Cox,0HgpiaXip83f5BARVLfvu2,False,4,2,20,0.662,0.531,8,-5.3,1,0.0361,0.202,1.16e-05,0.595,0.399,119.957,262333,4
1999-02-13,4,Believe,Cher,0HgpiaXip83f5BARVLfvu2,False,13,4,9,0.652,0.917,6,-6.72,1,0.0548,0.0082,0,0.0509,0.459,132.975,239027,4
1999-02-13,5,Have You Ever?,Brandy,0HgpiaXip83f5BARVLfvu2,False,3,1,11,0.698,0.533,2,-6.246,1,0.0437,0.542,0,0.333,0.275,134.001,273440,4
1999-02-13,6,All I Have To Give,Backstreet Boys,0HgpiaXip83f5BARVLfvu2,False,5,5,3,0.731,0.574,1,-7.114,1,0.029,0.0644,0,0.0675,0.392,95.995,276573,4
1999-02-13,7,Heartbreak Hotel,Whitney Houston Feat. Faith Evans & Kelly Price,0HgpiaXip83f5BARVLfvu2,False,29,7,8,0.724,0.535,3,-7.616,0,0.0588,0.0477,0,0.0314,0.664,133.816,281493,4
1999-02-13,8,Slide,Goo Goo Dolls,0HgpiaXip83f5BARVLfvu2,False,11,8,11,0.395,0.843,8,-4.476,1,0.0374,0.00483,0,0.0404,0.481,112.423,212067,4
1999-02-13,9,Angel,Sarah McLachlan,0HgpiaXip83f5BARVLfvu2,False,8,8,11,0.532,0.0744,1,-16.092,1,0.0355,0.949,1.22e-05,0.106,0.125,117.131,270400,3
1999-02-13,10,Jumper,Third Eye Blind,0HgpiaXip83f5BARVLfvu2,False,7,5,11,0.599,0.543,0,-9.226,1,0.0302,0.0129,0.00193,0.291,0.624,91.105,272973,4
1999-02-13,11,I'm Your Angel,R. Kelly & Celine Dion,0HgpiaXip83f5BARVLfvu2,False,6,1,11,0.62,0.504,0,-7.26,1,0.0301,0.669,0,0.11,0.266,112.681,332067,4
1999-02-13,12,Save Tonight,Eagle-Eye Cherry,0HgpiaXip83f5BARVLfvu2,False,9,5,11,0.547,0.693,0,-8.786,1,0.0353,9.24e-05,5.46e-05,0.113,0.583,119.567,239227,4
1999-02-13,13,Hands,Jewel,0HgpiaXip83f5BARVLfvu2,False,10,6,11,0.644,0.495,5,-10.175,0,0.0292,0.423,0.00128,0.082,0.321,127.221,235000,4
1999-02-13,14,Lullaby,Shawn Mullins,0HgpiaXip83f5BARVLfvu2,False,12,7,11,0.509,0.833,7,-5.337,1,0.0597,0.0398,0.00257,0.207,0.569,79.935,330667,4
1999-02-13,15,Faded Pictures,Case & Joe,0HgpiaXip83f5BARVLfvu2,False,73,15,8,0.705,0.511,6,-7.422,0,0.202,0.125,1.72e-06,0.153,0.581,82.011,229773,4
1999-02-13,16,Taking Everything,Gerald Levert,0HgpiaXip83f5BARVLfvu2,False,14,14,3,0.689,0.71,3,-5.395,0,0.0413,0.0886,0,0.107,0.306,113.722,325667,4
1999-02-13,17,I Don't Want To Miss A Thing,Mark Chesnutt,0HgpiaXip83f5BARVLfvu2,False,20,17,9,0.496,0.47,10,-10.415,1,0.0333,0.0268,0,0.134,0.151,122.094,246227,4
1999-02-13,18,When You Believe,Whitney Houston & Mariah Carey,0HgpiaXip83f5BARVLfvu2,False,15,15,11,0.436,0.39,1,-9.62,0,0.0326,0.557,0,0.12,0.119,125.313,272893,4
1999-02-13,19,Miami,Will Smith,0HgpiaXip83f5BARVLfvu2,False,17,17,11,0.877,0.534,1,-6.178,1,0.15,0.0339,1.67e-05,0.0441,0.89,108.17,197560,4
1999-02-13,20,Every Morning,Sugar Ray,0HgpiaXip83f5BARVLfvu2,False,27,20,6,0.833,0.679,8,-4.496,1,0.0365,0.0834,0.00258,0.0769,0.975,109.916,219867,4
1999-02-13,21,(God Must Have Spent) A Little More Time On You,'N Sync,0HgpiaXip83f5BARVLfvu2,False,28,21,11,0.61,0.926,8,-4.843,0,0.0479,0.031,0.0012,0.0821,0.861,172.638,200400,4
1999-02-13,22,Lately,Divine,0HgpiaXip83f5BARVLfvu2,False,18,1,23,0.686,0.48,9,-9.592,1,0.0312,0.206,1.16e-06,0.156,0.494,121.039,269533,4
1999-02-13,23,These Are The Times,Dru Hill,0HgpiaXip83f5BARVLfvu2,False,24,21,11,0.718,0.473,9,-9.278,0,0.0267,0.106,0,0.0964,0.384,109.992,248400,4
1999-02-13,24,Take Me There,BLACKstreet & Mya Featuring Mase & Blinky Blink,0HgpiaXip83f5BARVLfvu2,False,19,14,11,0.401,0.872,0,-4.91,1,0.117,0.215,0.00104,0.292,0.642,78.443,243000,3
1999-02-13,25,Trippin',Total Featuring Missy Elliott,0HgpiaXip83f5BARVLfvu2,False,16,7,15,0.753,0.831,11,-6.431,0,0.0958,0.173,1.23e-05,0.0927,0.505,124.151,267328,4
1999-02-13,26,Can I Get A...,Jay-Z Featuring Amil (Of Major Coinz) & Ja,0HgpiaXip83f5BARVLfvu2,False,23,19,20,0.792,0.694,8,-8.496,0,0.33,0.0619,2.32e-05,0.25,0.804,177.094,309773,4
1999-02-13,27,When A Woman's Fed Up,R. Kelly,0HgpiaXip83f5BARVLfvu2,False,31,27,8,0.684,0.587,2,-6.271,0,0.0814,0.428,5.58e-06,0.0932,0.693,77.009,275293,4
1999-02-13,28,Doo Wop (That Thing),Lauryn Hill,0HgpiaXip83f5BARVLfvu2,False,21,1,14,0.535,0.505,2,-8.926,0,0.245,0.0393,0,0.0923,0.495,99.935,320267,4
1999-02-13,29,Ghetto Cowboy,Mo Thugs Family Featuring Bone Thugs-N-Harmony,0HgpiaXip83f5BARVLfvu2,False,26,15,13,0.693,0.637,0,-5.487,1,0.158,0.00096,0.00498,0.0908,0.204,170.26,324493,4
1999-02-13,30,From This Moment On,Shania Twain,0HgpiaXip83f5BARVLfvu2,False,25,4,11,0.459,0.505,9,-5.487,1,0.0266,0.42,0,0.134,0.22,135.752,235107,4
1999-02-13,31,Love Like This,Faith Evans,0HgpiaXip83f5BARVLfvu2,False,30,7,14,0.767,0.551,0,-7.328,1,0.0616,0.00364,0,0.0451,0.796,100.904,275707,4
1999-02-13,32,I Will Get There,Boyz II Men,0HgpiaXip83f5BARVLfvu2,False,33,32,5,0.551,0.284,1,-13.704,1,0.0287,0.805,0,0.113,0.527,109.831,260840,4
1999-02-13,33,Inside Out,Eve 6,0HgpiaXip83f5BARVLfvu2,False,35,28,11,0.483,0.818,11,-7.666,1,0.0444,0.114,0,0.367,0.691,175.668,219467,4
1999-02-13,34,Stand Beside Me,Jo Dee Messina,0HgpiaXip83f5BARVLfvu2,False,34,34,10,0.587,0.72,0,-7.746,1,0.0278,0.179,0,0.0878,0.33,99.916,224640,4
1999-02-13,35,Ex-Factor,Lauryn Hill,0HgpiaXip83f5BARVLfvu2,False,49,35,6,0.593,0.619,3,-9.003,0,0.0976,0.118,0,0.484,0.668,80.02,326533,4
1999-02-13,36,Iris,Goo Goo Dolls,0HgpiaXip83f5BARVLfvu2,False,32,9,11,0.315,0.715,11,-8.072,0,0.0362,0.00125,7.97e-06,0.0942,0.497,155.925,289533,3
1999-02-13,37,For A Little While,Tim McGraw,0HgpiaXip83f5BARVLfvu2,False,39,37,11,0.554,0.815,7,-7.954,1,0.0256,0.133,0,0.0778,0.618,99.333,213893,4
1999-02-13,38,Changes,2Pac,0HgpiaXip83f5BARVLfvu2,False,36,32,11,0.865,0.665,7,-6.289,1,0.073,0.0453,0,0.224,0.331,111.113,268827,4
1999-02-13,39,Unbelievable,Diamond Rio,0HgpiaXip83f5BARVLfvu2,False,42,39,9,0.765,0.596,11,-7.586,1,0.0518,0.5,0,0.289,0.941,158.112,141533,3
1999-02-13,40,I'll Be,Edwin McCain,0HgpiaXip83f5BARVLfvu2,False,37,5,21,0.371,0.609,11,-5.524,1,0.0295,0.386,0,0.104,0.426,136.526,266533,3
1999-02-13,41,Fly Away,Lenny Kravitz,0HgpiaXip83f5BARVLfvu2,False,40,39,11,0.587,0.872,7,-5.066,1,0.0484,0.018,0,0.622,0.735,159.925,221333,4
1999-02-13,42,Because Of You,98 Degrees,0HgpiaXip83f5BARVLfvu2,False,22,3,20,0.732,0.603,0,-7.624,1,0.0271,0.341,0,0.113,0.514,104.498,297893,4
1999-02-13,43,You Get What You Give,New Radicals,0HgpiaXip83f5BARVLfvu2,False,38,36,11,0.621,0.901,2,-5.396,1,0.0302,0.17,0,0.0875,0.744,113.967,300773,4
1999-02-13,44,No Place That Far,Sara Evans,0HgpiaXip83f5BARVLfvu2,False,44,44,10,0.547,0.373,0,-7.336,1,0.0273,0.504,0,0.176,0.182,132.741,217400,4
1999-02-13,45,Hold On To Me,John Michael Montgomery,0HgpiaXip83f5BARVLfvu2,False,43,43,11,0.488,0.425,10,-9.407,1,0.0262,0.333,0,0.104,0.233,165.06,251200,3
1999-02-13,46,Back 2 Good,matchbox 20,0HgpiaXip83f5BARVLfvu2,False,50,46,8,0.559,0.504,7,-9.455,1,0.0246,0.106,0,0.13,0.479,89.051,340173,4
1999-02-13,47,This Kiss,Faith Hill,0HgpiaXip83f5BARVLfvu2,False,41,7,48,0.398,0.804,11,-5.559,1,0.0451,0.175,0,0.181,0.709,186.752,194307,4
1999-02-13,48,Sweet Lady,Tyrese,0HgpiaXip83f5BARVLfvu2,False,53,48,4,0.588,0.522,9,-6.254,0,0.0383,0.233,0,0.24,0.584,66.024,290600,4
1999-02-13,49,It's All Been Done,Barenaked Ladies,0HgpiaXip83f5BARVLfvu2,False,47,44,8,0.521,0.919,2,-3.146,1,0.0475,0.000173,0.00218,0.301,0.746,131.726,206000,4
1999-02-13,50,Too Close,Next,0HgpiaXip83f5BARVLfvu2,False,48,1,53,0.847,0.402,7,-9.952,1,0.0641,0.0118,0,0.283,0.752,99.693,259440,4
1999-02-13,51,You Were Mine,Dixie Chicks,0HgpiaXip83f5BARVLfvu2,False,58,51,4,0.542,0.346,9,-6.598,1,0.0296,0.342,0,0.283,0.173,139.856,217807,4
1999-02-13,52,Wrong Night,Reba,0HgpiaXip83f5BARVLfvu2,False,52,52,10,0.532,0.95,9,-4.123,1,0.106,0.103,0,0.315,0.898,156.815,171027,4
1999-02-13,53,Meanwhile,George Strait,0HgpiaXip83f5BARVLfvu2,False,62,53,4,0.518,0.459,7,-6.289,1,0.0283,0.0396,0.00116,0.145,0.165,124.126,210440,3
1999-02-13,54,Fly (The Angel Song),The Wilkinsons,0HgpiaXip83f5BARVLfvu2,False,54,54,10,0.531,0.47,6,-8.004,1,0.0331,0.571,0,0.0688,0.246,170.395,222667,4
1999-02-13,55,What It's Like,Everlast,0HgpiaXip83f5BARVLfvu2,False,56,55,9,0.678,0.556,0,-7.423,1,0.0281,0.0904,0.0334,0.0866,0.405,85.158,303133,4
1999-02-13,56,I Still Believe,Mariah Carey,0HgpiaXip83f5BARVLfvu2,False,69,56,2,0.612,0.521,7,-7.647,1,0.0304,0.174,0,0.103,0.175,118.016,236467,4
1999-02-13,57,All Night Long,Faith Evans Featuring Puff Daddy,0HgpiaXip83f5BARVLfvu2,False,71,57,2,0.712,0.773,11,-4.595,0,0.271,0.0243,0,0.13,0.699,100.409,234253,4
1999-02-13,58,How Deep Is Your Love,Dru Hill Featuring Redman,0HgpiaXip83f5BARVLfvu2,False,46,3,19,0.729,0.434,3,-9.111,0,0.079,0.0473,1.23e-05,0.314,0.743,94.411,243360,4
1999-02-13,59,Pretty Fly (For A White Guy),The Offspring,0HgpiaXip83f5BARVLfvu2,False,57,53,11,0.723,0.895,11,-3.707,0,0.102,0.088,0,0.0717,0.963,143.373,188667,4
1999-02-13,60,"Spirit Of A Boy, Wisdom Of A Man",Randy Travis,0HgpiaXip83f5BARVLfvu2,False,51,42,11,0.519,0.398,3,-10.968,1,0.0273,0.608,1.79e-05,0.11,0.247,71.932,230040,3
1999-02-13,61,Powerful Thing,Trisha Yearwood,0HgpiaXip83f5BARVLfvu2,False,68,61,4,0.642,0.846,2,-3.842,1,0.0464,0.42,0,0.0402,0.944,147.938,176920,4
1999-02-13,62,Busy Man,Billy Ray Cyrus,0HgpiaXip83f5BARVLfvu2,False,67,62,4,0.6,0.568,7,-9.867,1,0.0388,0.106,0,0.238,0.475,163.887,197267,4
1999-02-13,63,That Don't Impress Me Much,Shania Twain,0HgpiaXip83f5BARVLfvu2,False,66,63,4,0.743,0.873,10,-4.943,0,0.0507,0.14,0,0.142,0.965,125.005,238707,5
1999-02-13,64,Silly Ho,TLC,0HgpiaXip83f5BARVLfvu2,False,59,59,6,0.837,0.784,9,-3.874,1,0.0866,0.0387,0.471,0.32,0.836,145.578,255160,3
1999-02-13,65,How Do I Deal,Jennifer Love Hewitt,0HgpiaXip83f5BARVLfvu2,False,65,65,2,0.596,0.831,5,-6.319,1,0.112,0.017,0,0.0766,0.322,94.846,203827,4
1999-02-13,66,Unsent,Alanis Morissette,0HgpiaXip83f5BARVLfvu2,False,75,66,2,0.392,0.375,2,-8.933,1,0.034,0.389,0,0.075,0.103,177.484,250067,4
1999-02-13,67,Rosa Parks,OutKast,0HgpiaXip83f5BARVLfvu2,False,60,55,11,0.792,0.701,6,-7.198,0,0.283,0.105,0,0.761,0.251,103.89,324373,4
1999-02-13,68,How Forever Feels,Kenny Chesney,0HgpiaXip83f5BARVLfvu2,False,80,68,2,0.723,0.674,7,-7.427,1,0.0297,0.0986,1.83e-05,0.279,0.61,124.9,188200,4
1999-02-13,69,One Week,Barenaked Ladies,0HgpiaXip83f5BARVLfvu2,False,63,1,20,0.702,0.898,9,-6.003,1,0.0373,0.00854,0.000154,0.0917,0.731,112.845,169760,4
1999-02-13,70,There You Have It,BlackHawk,0HgpiaXip83f5BARVLfvu2,False,55,41,11,0.711,0.667,4,-5.75,1,0.0258,0.218,0,0.354,0.777,113.655,192267,4
1999-02-13,71,Father Of Mine,Everclear,0HgpiaXip83f5BARVLfvu2,False,76,71,11,0.568,0.94,1,-5.401,1,0.0411,0.000431,4.96e-05,0.0779,0.738,97.096,231400,4
1999-02-13,72,Ha,Juvenile,0HgpiaXip83f5BARVLfvu2,False,77,72,2,0.865,0.841,7,-5.381,1,0.225,0.022,0,0.0714,0.674,91.982,292333,4
1999-02-13,73,Somebody's Out There Watching,The Kinleys,0HgpiaXip83f5BARVLfvu2,False,83,73,4,0.606,0.805,7,-5.451,1,0.0318,0.125,0,0.351,0.44,81.488,215640,4
1999-02-13,74,You Got Me,The Roots Featuring Erykah Badu,4pdLZsxq0y5oJDb6Cxlokw,True,0,74,1,0.729,0.442,11,-8.106,0,0.285,0.151,0,0.189,0.757,81.029,259307,4
1999-02-13,75,Angel In Disguise,Brandy,4pdLZsxq0y5oJDb6Cxlokw,False,78,72,11,0.625,0.643,1,-6.773,0,0.0307,0.0301,0.00233,0.347,0.593,140.135,288267,4
1999-02-13,76,Home Alone,R. Kelly Featuring Keith Murray,4pdLZsxq0y5oJDb6Cxlokw,False,86,65,11,0.887,0.643,4,-2.578,0,0.214,0.0447,0,0.132,0.513,99.533,299560,4
1999-02-13,77,Sweetest Thing,U2,4pdLZsxq0y5oJDb6Cxlokw,False,72,63,11,0.524,0.641,0,-8.967,1,0.0497,0.0437,2.78e-05,0.159,0.482,141.65,184543,4
1999-02-13,78,I Can't Get Over You,Brooks & Dunn,1dRKK30xdrr7oQD8GxCavL,True,0,78,1,0.618,0.75,0,-3.523,1,0.0241,0.0228,0.00101,0.0634,0.338,98.206,246560,4
1999-02-13,79,Goodbye,Spice Girls,1dRKK30xdrr7oQD8GxCavL,False,61,11,8,0.552,0.694,4,-4.489,1,0.026,0.0846,0,0.117,0.359,136.019,275427,4
1999-02-13,80,Never There,Cake,1dRKK30xdrr7oQD8GxCavL,False,79,78,11,0.761,0.735,9,-8.171,0,0.043,0.0426,0.0838,0.0917,0.592,125.815,164267,4
1999-02-13,81,Keepin' Up,Alabama,1dRKK30xdrr7oQD8GxCavL,False,85,81,2,0.677,0.756,4,-7.063,1,0.0245,0.0272,0,0.0981,0.805,133.921,185373,4
1999-02-13,82,"Luv Me, Luv Me",Shaggy Featuring Janet,1dRKK30xdrr7oQD8GxCavL,False,87,76,9,0.869,0.776,1,-6.918,0,0.225,0.175,1.08e-06,0.165,0.771,96.905,356840,4
1999-02-13,83,Pushin' Weight,Ice Cube Featuring Mr. Short Khop,1dRKK30xdrr7oQD8GxCavL,False,70,26,16,0.826,0.836,10,-4.252,0,0.221,0.00398,0,0.108,0.556,91.788,274600,4
1999-02-13,84,Woof,Snoop Dogg Featuring Mystikal And Fiend,1dRKK30xdrr7oQD8GxCavL,False,84,84,3,0.889,0.879,6,-4.475,0,0.294,0.172,0,0.792,0.752,96.016,172360,4
1999-02-13,85,Crush,Dave Matthews Band,6AKSrodq9kU9hmTLEeWFFr,True,0,85,1,0.564,0.745,0,-6.933,1,0.0411,0.262,2.78e-05,0.108,0.672,94.044,488734,4
1999-02-13,86,For You I Will,Aaron Tippin,6AKSrodq9kU9hmTLEeWFFr,False,74,49,19,0.652,0.561,1,-7.271,1,0.0247,0.137,0.00309,0.12,0.385,107.747,211733,4
1999-02-13,87,Hard Knock Life (Ghetto Anthem),JAY-Z,6AKSrodq9kU9hmTLEeWFFr,False,82,32,15,0.884,0.679,10,-5.857,0,0.282,0.0957,0.00209,0.0289,0.591,76.993,238467,4
1999-02-13,88,The Power Of Good-Bye,Madonna,6AKSrodq9kU9hmTLEeWFFr,False,81,11,18,0.534,0.561,5,-11.089,0,0.0409,0.0442,0.678,0.189,0.219,84.978,250560,4
1999-02-13,89,Watch For The Hook,"Cool Breeze Featuring OutKast, Goodie Mob & Witchdoctor",6AKSrodq9kU9hmTLEeWFFr,False,99,89,3,0.561,0.72,1,-4.854,1,0.355,0.0211,0,0.353,0.518,86.953,271600,4
1999-02-13,90,Right On The Money,Alan Jackson,6AKSrodq9kU9hmTLEeWFFr,False,64,43,11,0.762,0.415,3,-11.262,1,0.0302,0.423,0,0.316,0.567,113.975,229827,4
1999-02-13,91,Kiss Me,Sixpence None The Richer,6AKSrodq9kU9hmTLEeWFFr,False,0,90,2,0.526,0.749,3,-6.964,1,0.0283,0.023,1.76e-06,0.0692,0.421,99.982,208680,4
1999-02-13,92,Hot Spot,Foxy Brown,6AKSrodq9kU9hmTLEeWFFr,False,97,91,4,0.895,0.768,10,-6.798,0,0.308,0.000687,4.58e-05,0.0413,0.622,92.943,230000,4
1999-02-13,93,You're Beginning To Get To Me,Clay Walker,6AKSrodq9kU9hmTLEeWFFr,False,88,39,11,0.536,0.582,4,-6.589,1,0.0397,0.184,0,0.109,0.491,83.238,161533,4
1999-02-13,94,Talk Show Shhh!,Shae Jones,6AKSrodq9kU9hmTLEeWFFr,False,96,94,7,0.884,0.26,10,-7.458,0,0.0558,0.0244,0,0.0688,0.516,121.937,252819,4
1999-02-13,95,Someone You Used To Know,Collin Raye,6AKSrodq9kU9hmTLEeWFFr,False,93,37,13,0.589,0.369,9,-11.477,1,0.0242,0.123,2.21e-06,0.114,0.295,98.997,225440,4
1999-02-13,96,You're Easy On The Eyes,Terri Clark,6AKSrodq9kU9hmTLEeWFFr,False,90,40,11,0.724,0.793,0,-5.837,1,0.0271,0.127,0,0.0713,0.898,126.486,213160,4
1999-02-13,97,We Like To Party!,Vengaboys,77j9HOrxUpWcjwra9jgvio,True,0,97,1,0.785,0.931,8,-4.813,1,0.0465,0.0148,0.637,0.0459,0.969,135.986,222459,4
1999-02-13,98,Hold Me,Brian McKnight Featuring Tone & Kobe Bryant,77j9HOrxUpWcjwra9jgvio,False,91,35,11,0.866,0.476,0,-8.121,1,0.0522,0.0414,0.000149,0.0523,0.631,96.932,229000,4
1999-02-13,99,Thank U,Alanis Morissette,77j9HOrxUpWcjwra9jgvio,False,92,17,11,0.672,0.616,0,-5.764,1,0.0258,0.379,2.73e-05,0.0887,0.566,92.094,258773,4
1999-02-13,100,A Bitter End,Deryl Dodd,77j9HOrxUpWcjwra9jgvio,False,94,88,7,0.595,0.418,9,-8.092,1,0.0308,0.568,1.27e-05,0.116,0.25,138.069,218980,4
