date,position,title,artist,spotify_id,is_new,last_pos,peak_pos,weeks,danceability,energy,key,loudness,mode,speechiness,acousticness,instrumentalness,liveness,valence,tempo,duration_ms,time_signature
2012-12-01,1,Diamonds,Rihanna,3HvNzmI0hX2dXcE41lBMxi,False,2,1,8,0.564,0.71,11,-4.92,0,0.0461,0.00125,0,0.109,0.393,91.972,225147,4
2012-12-01,2,One More Night,Maroon 5,3HvNzmI0hX2dXcE41lBMxi,False,1,1,22,0.718,0.82,5,-3.453,0,0.0323,0.0444,0,0.0846,0.613,92.998,219467,4
2012-12-01,3,Die Young,Ke$ha,3HvNzmI0hX2dXcE41lBMxi,False,3,3,8,0.711,0.7,1,-4.805,0,0.046,0.00498,0.000125,0.215,0.801,128.001,211920,4
2012-12-01,4,Locked Out Of Heaven,Bruno Mars,3HvNzmI0hX2dXcE41lBMxi,False,6,4,7,0.726,0.698,5,-4.165,1,0.0431,0.049,0,0.309,0.867,143.994,233478,4
2012-12-01,5,Some Nights,fun.,3HvNzmI0hX2dXcE41lBMxi,False,4,3,39,0.672,0.738,0,-7.045,1,0.0506,0.0178,6.75e-05,0.0927,0.392,107.938,277040,4
2012-12-01,6,Let Me Love You (Until You Learn To Love Yourself),Ne-Yo,3HvNzmI0hX2dXcE41lBMxi,False,8,6,16,0.669,0.723,5,-5.2,1,0.0346,0.213,0,0.523,0.269,124.925,252227,4
2012-12-01,7,Gangnam Style,PSY,3HvNzmI0hX2dXcE41lBMxi,False,5,2,11,0.727,0.937,11,-2.871,0,0.286,0.00417,0,0.091,0.749,132.067,219493,4
2012-12-01,8,Ho Hey,The Lumineers,3HvNzmI0hX2dXcE41lBMxi,False,13,8,24,0.685,0.466,0,-9.074,1,0.0304,0.794,2.06e-06,0.0915,0.353,79.936,163133,4
2012-12-01,9,We Are Never Ever Getting Back Together,Taylor Swift,3HvNzmI0hX2dXcE41lBMxi,False,7,1,15,0.628,0.676,7,-5.911,1,0.0916,0.00957,2.65e-05,0.121,0.75,85.984,193147,4
2012-12-01,10,I Cry,Flo Rida,3HvNzmI0hX2dXcE41lBMxi,False,10,10,8,0.693,0.822,4,-5.441,0,0.0439,0.00616,1.79e-06,0.315,0.763,126.035,223800,4
2012-12-01,11,Too Close,Alex Clare,3HvNzmI0hX2dXcE41lBMxi,False,9,7,34,0.584,0.712,11,-4.311,0,0.0395,0.0112,1.05e-06,0.114,0.286,126.043,256560,4
2012-12-01,12,Home,Phillip Phillips,3HvNzmI0hX2dXcE41lBMxi,False,14,9,21,0.606,0.826,0,-6.04,1,0.0307,0.0256,1.56e-05,0.117,0.322,121.04,210173,4
2012-12-01,13,Don't Wake Me Up,Chris Brown,3HvNzmI0hX2dXcE41lBMxi,False,11,10,21,0.602,0.691,7,-5.197,0,0.051,0.0548,0,0.144,0.206,127.967,222307,4
2012-12-01,14,As Long As You Love Me,Justin Bieber Featuring Big Sean,3HvNzmI0hX2dXcE41lBMxi,False,12,6,22,0.571,0.873,0,-3.382,0,0.1,0.0811,0,0.361,0.613,139.691,229467,4
2012-12-01,15,Clique,"Kanye West, Jay-Z, Big Sean",3HvNzmI0hX2dXcE41lBMxi,False,15,12,11,0.704,0.569,7,-4.998,0,0.247,0.0488,0,0.191,0.313,109.314,293533,5
2012-12-01,16,Cruise,Florida Georgia Line Featuring Nelly,3HvNzmI0hX2dXcE41lBMxi,False,18,16,14,0.457,0.948,10,-3.364,1,0.0354,0.0191,0,0.0536,0.878,148.0,208960,4
2012-12-01,17,Adorn,Miguel,3HvNzmI0hX2dXcE41lBMxi,False,17,17,16,0.625,0.576,11,-5.693,0,0.175,0.0543,4.07e-05,0.187,0.235,179.063,193147,4
2012-12-01,18,Blow Me (One Last Kiss),P!nk,3HvNzmI0hX2dXcE41lBMxi,False,16,5,20,0.597,0.919,7,-2.954,1,0.044,0.000145,0,0.282,0.73,113.987,255587,4
2012-12-01,19,Swimming Pools (Drank),Kendrick Lamar,3HvNzmI0hX2dXcE41lBMxi,False,20,19,14,0.577,0.447,8,-5.892,1,0.277,0.00627,0.00022,0.0899,0.189,74.236,247800,4
2012-12-01,20,Beauty And A Beat,Justin Bieber Featuring Nicki Minaj,3HvNzmI0hX2dXcE41lBMxi,False,38,20,6,0.602,0.843,0,-4.831,1,0.0593,0.000688,5.27e-05,0.0682,0.526,128.003,227987,4
2012-12-01,21,Skyfall,Adele,3HvNzmI0hX2dXcE41lBMxi,False,33,8,7,0.346,0.552,0,-6.864,0,0.0282,0.417,0,0.114,0.0789,75.881,286480,4
2012-12-01,22,It's Time,Imagine Dragons,3HvNzmI0hX2dXcE41lBMxi,False,23,22,24,0.656,0.884,2,-4.748,1,0.0372,0.0162,0,0.145,0.86,105.009,237987,4
2012-12-01,23,Good Time,Owl City & Carly Rae Jepsen,3HvNzmI0hX2dXcE41lBMxi,False,19,8,21,0.56,0.872,3,-4.269,1,0.14,0.0239,6.98e-06,0.371,0.682,126.05,205933,4
2012-12-01,24,Everybody Talks,Neon Trees,3HvNzmI0hX2dXcE41lBMxi,False,22,6,36,0.471,0.924,8,-3.906,1,0.0586,0.00301,0,0.313,0.725,154.961,177280,4
2012-12-01,25,The A Team,Ed Sheeran,3HvNzmI0hX2dXcE41lBMxi,False,26,25,19,0.642,0.289,9,-9.918,1,0.0367,0.669,0,0.18,0.407,84.996,258373,4
2012-12-01,26,Va Va Voom,Nicki Minaj,3HvNzmI0hX2dXcE41lBMxi,False,46,26,5,0.648,0.836,8,-3.394,1,0.0316,0.0625,0.00995,0.202,0.705,126.889,183560,4
2012-12-01,27,Lights,Ellie Goulding,3HvNzmI0hX2dXcE41lBMxi,False,21,2,48,0.681,0.802,8,-5.836,0,0.0347,0.0271,0.0496,0.127,0.791,120.053,212707,4
2012-12-01,28,50 Ways To Say Goodbye,Train,3HvNzmI0hX2dXcE41lBMxi,False,24,20,19,0.591,0.935,6,-2.664,1,0.0478,0.000284,0.000278,0.142,0.736,140.043,247947,4
2012-12-01,29,Girl On Fire,Alicia Keys Featuring Nicki Minaj,3HvNzmI0hX2dXcE41lBMxi,False,28,22,11,0.482,0.706,9,-5.762,1,0.0609,0.135,0.00106,0.105,0.144,92.494,224920,4
2012-12-01,30,I Will Wait,Mumford & Sons,3HvNzmI0hX2dXcE41lBMxi,False,36,23,15,0.48,0.756,1,-5.399,1,0.0333,0.00993,0.00704,0.312,0.447,131.127,276720,4
2012-12-01,31,Call Me Maybe,Carly Rae Jepsen,3HvNzmI0hX2dXcE41lBMxi,False,27,1,39,0.783,0.58,7,-6.548,1,0.0408,0.0114,2.28e-06,0.108,0.66,120.021,193400,4
2012-12-01,32,Bandz A Make Her Dance,Juicy J Featuring Lil Wayne & 2 Chainz,3HvNzmI0hX2dXcE41lBMxi,False,35,32,10,0.871,0.743,2,-5.442,1,0.277,0.00212,0,0.141,0.576,130.977,278827,4
2012-12-01,33,Don't You Worry Child,Swedish House Mafia Featuring John Martin,3HvNzmI0hX2dXcE41lBMxi,False,48,33,9,0.612,0.84,11,-3.145,0,0.0509,0.112,0,0.116,0.438,129.042,212862,4
2012-12-01,34,Kiss Tomorrow Goodbye,Luke Bryan,3HvNzmI0hX2dXcE41lBMxi,False,31,29,13,0.571,0.937,5,-3.467,0,0.0365,0.0064,0,0.316,0.584,115.013,203133,4
2012-12-01,35,Thinkin Bout You,Frank Ocean,3HvNzmI0hX2dXcE41lBMxi,False,43,35,19,0.721,0.339,0,-11.195,1,0.0532,0.409,0.00153,0.0973,0.2,129.83,200747,4
2012-12-01,36,Somebody That I Used To Know,Gotye Featuring Kimbra,3HvNzmI0hX2dXcE41lBMxi,False,29,1,46,0.864,0.495,0,-7.036,1,0.037,0.591,0.000133,0.0992,0.72,129.062,244973,4
2012-12-01,37,Wanted,Hunter Hayes,3HvNzmI0hX2dXcE41lBMxi,False,32,16,30,0.421,0.476,0,-7.692,1,0.0298,0.268,0,0.0816,0.3,169.784,228840,4
2012-12-01,38,Whistle,Flo Rida,3HvNzmI0hX2dXcE41lBMxi,False,30,1,27,0.747,0.937,0,-5.746,1,0.0453,0.0208,0,0.29,0.739,103.976,224653,4
2012-12-01,39,Blown Away,Carrie Underwood,3HvNzmI0hX2dXcE41lBMxi,False,25,20,20,0.531,0.843,9,-2.569,0,0.0429,0.0909,0,0.0283,0.392,136.991,240133,4
2012-12-01,40,Feel Again,OneRepublic,3HvNzmI0hX2dXcE41lBMxi,False,45,40,12,0.467,0.815,7,-7.929,0,0.0524,0.0198,1.23e-06,0.118,0.335,140.047,185080,4
2012-12-01,41,Little Things,One Direction,0TAmnCzOtqRfvA38DDLTjj,True,0,41,1,0.709,0.22,7,-11.856,1,0.0327,0.811,0,0.175,0.53,110.076,219040,4
2012-12-01,42,Thrift Shop,Macklemore & Ryan Lewis Featuring Wanz,0TAmnCzOtqRfvA38DDLTjj,False,55,42,7,0.781,0.526,6,-6.986,0,0.293,0.0633,0,0.0457,0.665,94.993,235613,4
2012-12-01,43,Finally Found You,Enrique Iglesias Featuring Sammy Adams,0TAmnCzOtqRfvA38DDLTjj,False,37,24,10,0.622,0.881,6,-4.871,0,0.0956,0.0109,0,0.348,0.664,127.958,220813,4
2012-12-01,44,Pop That,"French Montana Featuring Rick Ross, Drake, Lil Wayne",0TAmnCzOtqRfvA38DDLTjj,False,40,36,19,0.734,0.892,2,-1.856,1,0.125,0.0648,0,0.58,0.605,138.031,303533,4
2012-12-01,45,Hard To Love,Lee Brice,0TAmnCzOtqRfvA38DDLTjj,False,34,27,23,0.638,0.722,9,-6.177,1,0.0332,0.0119,0.00808,0.189,0.469,103.017,224293,4
2012-12-01,46,Payphone,Maroon 5 Featuring Wiz Khalifa,0TAmnCzOtqRfvA38DDLTjj,False,39,2,31,0.739,0.756,4,-4.828,1,0.0394,0.0136,0,0.37,0.523,110.028,231387,4
2012-12-01,47,Titanium,David Guetta Featuring Sia,0TAmnCzOtqRfvA38DDLTjj,False,44,7,32,0.604,0.788,0,-3.673,0,0.103,0.0678,0.153,0.127,0.301,126.06,245040,4
2012-12-01,48,Wide Awake,Katy Perry,0TAmnCzOtqRfvA38DDLTjj,False,41,2,26,0.514,0.683,5,-5.099,1,0.0367,0.0749,2.64e-06,0.392,0.575,159.814,220947,4
2012-12-01,49,Hall Of Fame,The Script Featuring will.i.am,0TAmnCzOtqRfvA38DDLTjj,False,50,46,8,0.421,0.873,10,-4.343,1,0.0565,0.0653,0,0.123,0.63,84.803,202533,4
2012-12-01,50,Try,P!nk,0TAmnCzOtqRfvA38DDLTjj,False,69,50,4,0.673,0.629,2,-7.072,1,0.0299,0.00141,0,0.0944,0.551,103.998,247907,4
2012-12-01,51,The One That Got Away,Jake Owen,0TAmnCzOtqRfvA38DDLTjj,False,51,51,15,0.576,0.865,0,-3.288,1,0.0407,0.0343,5.32e-05,0.252,0.535,119.913,194173,4
2012-12-01,52,No Worries,Lil Wayne Featuring Detail,0TAmnCzOtqRfvA38DDLTjj,False,54,52,11,0.844,0.592,5,-5.486,1,0.199,0.085,0,0.0817,0.819,128.033,221000,4
2012-12-01,53,Come Wake Me Up,Rascal Flatts,0TAmnCzOtqRfvA38DDLTjj,False,57,53,17,0.454,0.605,4,-6.816,1,0.0314,0.255,0,0.109,0.18,155.861,263253,3
2012-12-01,54,Fastest Girl In Town,Miranda Lambert,0TAmnCzOtqRfvA38DDLTjj,False,52,47,17,0.541,0.911,1,-3.6,0,0.0631,0.0205,0.00155,0.275,0.563,145.057,197600,4
2012-12-01,55,Birthday Song,2 Chainz Featuring Kanye West,0TAmnCzOtqRfvA38DDLTjj,False,53,47,15,0.753,0.59,1,-2.623,1,0.0485,0.0591,0,0.15,0.161,140.002,306600,4
2012-12-01,56,Til My Last Day,Justin Moore,0TAmnCzOtqRfvA38DDLTjj,False,60,56,10,0.577,0.761,9,-5.34,1,0.0358,0.0377,0,0.116,0.599,104.991,234027,4
2012-12-01,57,Anything Could Happen,Ellie Goulding,0TAmnCzOtqRfvA38DDLTjj,False,58,57,6,0.702,0.781,0,-4.081,1,0.03,0.433,0,0.135,0.382,102.997,286322,4
2012-12-01,58,Beer Money,Kip Moore,0TAmnCzOtqRfvA38DDLTjj,False,62,58,9,0.745,0.805,2,-5.549,1,0.0307,0.0223,1.06e-06,0.13,0.765,126.065,218147,4
2012-12-01,59,Every Storm (Runs Out Of Rain),Gary Allan,0TAmnCzOtqRfvA38DDLTjj,False,65,59,7,0.525,0.693,0,-6.972,1,0.0327,0.046,9.55e-06,0.247,0.363,107.012,225640,4
2012-12-01,60,Better Dig Two,The Band Perry,0TAmnCzOtqRfvA38DDLTjj,False,64,53,3,0.64,0.669,7,-5.17,1,0.0519,0.413,0,0.0779,0.646,155.844,194680,4
2012-12-01,61,Don't Stop The Party,Pitbull Featuring TJR,0TAmnCzOtqRfvA38DDLTjj,False,81,61,5,0.722,0.958,4,-3.617,1,0.0912,0.00726,0,0.375,0.952,127.008,206120,4
2012-12-01,62,2 Reasons,Trey Songz Featuring T.I.,0TAmnCzOtqRfvA38DDLTjj,False,56,43,20,0.734,0.746,11,-5.088,1,0.0762,0.00135,0,0.178,0.539,94.033,197627,4
2012-12-01,63,Goodbye In Her Eyes,Zac Brown Band,0TAmnCzOtqRfvA38DDLTjj,False,61,61,6,0.4,0.558,3,-7.393,1,0.038,0.163,3.76e-06,0.0879,0.376,81.271,324267,4
2012-12-01,64,Madness,Muse,0TAmnCzOtqRfvA38DDLTjj,False,63,60,13,0.502,0.417,10,-7.665,1,0.0718,0.127,0.00419,0.106,0.218,180.301,281040,4
2012-12-01,65,Turn On The Lights,Future,0TAmnCzOtqRfvA38DDLTjj,False,59,50,15,0.596,0.574,6,-9.373,0,0.212,0.0409,0,0.147,0.439,131.075,248360,4
2012-12-01,66,Creepin',Eric Church,0TAmnCzOtqRfvA38DDLTjj,False,67,66,13,0.464,0.889,5,-5.042,1,0.0497,0.0389,0.0272,0.31,0.539,87.858,232720,4
2012-12-01,67,A Thousand Years (Part 2),Christina Perri Featuring Steve Kazee,6lanRgr6wXibZr8KgzXxBl,True,0,67,1,0.421,0.407,10,-7.445,1,0.0267,0.309,0.000961,0.11,0.161,139.028,285120,3
2012-12-01,68,Live While We're Young,One Direction,6lanRgr6wXibZr8KgzXxBl,False,42,3,7,0.663,0.857,2,-2.16,1,0.0544,0.0542,0,0.144,0.931,126.039,200213,4
2012-12-01,69,How Country Feels,Randy Houser,6lanRgr6wXibZr8KgzXxBl,False,75,69,7,0.678,0.839,7,-3.617,1,0.0394,0.0379,0,0.0742,0.772,104.952,185907,4
2012-12-01,70,F**kin Problems,"A$AP Rocky Featuring Drake, 2 Chainz & Kendrick Lamar",6lanRgr6wXibZr8KgzXxBl,False,79,70,3,0.853,0.693,1,-6.87,1,0.275,0.0239,0,0.11,0.662,95.967,233787,4
2012-12-01,71,Radioactive,Imagine Dragons,6lanRgr6wXibZr8KgzXxBl,False,83,71,12,0.448,0.784,9,-3.686,1,0.0627,0.106,0.000108,0.668,0.236,136.245,186813,4
2012-12-01,72,Southern Comfort Zone,Brad Paisley,6lanRgr6wXibZr8KgzXxBl,False,68,68,7,0.431,0.876,4,-6.109,1,0.0658,0.0771,1.81e-05,0.0998,0.519,160.0,316987,4
2012-12-01,73,Begin Again,Taylor Swift,6lanRgr6wXibZr8KgzXxBl,False,71,7,7,0.53,0.526,7,-8.349,1,0.0263,0.199,3.52e-06,0.232,0.323,79.025,237613,4
2012-12-01,74,Catch My Breath,Kelly Clarkson,6lanRgr6wXibZr8KgzXxBl,False,96,54,4,0.692,0.908,9,-5.364,1,0.0677,0.0251,0,0.0933,0.513,124.042,250387,4
2012-12-01,75,Did It For The Girl,Greg Bates,6lanRgr6wXibZr8KgzXxBl,False,78,75,9,0.658,0.728,5,-4.916,1,0.0237,0.0183,6.26e-06,0.306,0.682,101.969,191293,4
2012-12-01,76,Take A Little Ride,Jason Aldean,6lanRgr6wXibZr8KgzXxBl,False,66,12,18,0.472,0.866,2,-3.771,1,0.0413,0.044,0,0.213,0.775,163.867,187613,4
2012-12-01,77,I Knew You Were Trouble.,Taylor Swift,6lanRgr6wXibZr8KgzXxBl,False,73,3,5,0.622,0.469,3,-6.798,0,0.0363,0.00454,2.25e-06,0.0398,0.679,77.019,217973,4
2012-12-01,78,The Only Way I Know,Jason Aldean With Luke Bryan & Eric Church,6lanRgr6wXibZr8KgzXxBl,False,93,78,2,0.511,0.798,7,-4.314,1,0.0498,0.227,6.51e-06,0.184,0.607,183.303,193187,4
2012-12-01,79,Diced Pineapples,Rick Ross Featuring Wale & Drake,6lanRgr6wXibZr8KgzXxBl,False,74,74,7,0.511,0.735,2,-6.026,1,0.239,0.352,0,0.196,0.379,110.965,276160,5
2012-12-01,80,Ball,T.I. Featuring Lil Wayne,6lanRgr6wXibZr8KgzXxBl,False,85,50,5,0.772,0.885,1,-4.736,1,0.0847,0.193,9.48e-06,0.0953,0.512,94.98,205360,4
2012-12-01,81,Wicked Games,The Weeknd,6lanRgr6wXibZr8KgzXxBl,False,91,81,3,0.658,0.575,9,-6.062,1,0.0313,0.00963,5.29e-06,0.191,0.335,114.081,325234,4
2012-12-01,82,El Cerrito Place,Kenny Chesney,6lanRgr6wXibZr8KgzXxBl,False,82,82,6,0.596,0.503,4,-7.606,1,0.0272,0.13,0,0.0754,0.262,134.032,351613,4
2012-12-01,83,Pound The Alarm,Nicki Minaj,6lanRgr6wXibZr8KgzXxBl,False,76,15,17,0.728,0.858,9,-3.686,1,0.0609,0.0403,4.26e-06,0.0241,0.591,125.054,205640,4
2012-12-01,84,Your Body,Christina Aguilera,6lanRgr6wXibZr8KgzXxBl,False,84,34,9,0.593,0.781,8,-5.291,0,0.0545,0.000724,0,0.225,0.565,103.025,239853,4
2012-12-01,85,Put It Down,Brandy Featuring Chris Brown,6lanRgr6wXibZr8KgzXxBl,False,77,65,14,0.761,0.413,0,-8.104,1,0.195,0.019,0,0.0829,0.595,141.056,246213,4
2012-12-01,86,Lovin' You Is Fun,Easton Corbin,6lanRgr6wXibZr8KgzXxBl,False,70,57,20,0.703,0.83,8,-3.028,1,0.0327,0.32,0,0.364,0.597,109.958,199013,4
2012-12-01,87,Dance For You,Beyonce,6lanRgr6wXibZr8KgzXxBl,False,80,78,11,0.616,0.78,2,-6.062,1,0.0623,0.0322,0,0.173,0.471,110.005,377467,4
2012-12-01,88,Tornado,Little Big Town,6lanRgr6wXibZr8KgzXxBl,False,97,88,2,0.739,0.696,3,-5.149,0,0.0247,0.0459,9.61e-05,0.107,0.492,97.004,223573,4
2012-12-01,89,Don't Judge Me,Chris Brown,6lanRgr6wXibZr8KgzXxBl,False,88,88,3,0.328,0.498,4,-10.898,0,0.126,0.532,7.94e-05,0.117,0.36,175.918,240173,4
2012-12-01,90,Ready Or Not,Bridgit Mendler,6lanRgr6wXibZr8KgzXxBl,False,98,78,5,0.715,0.872,2,-3.835,1,0.0509,0.00351,3.84e-05,0.107,0.748,93.043,200947,4
2012-12-01,91,Ice,Kelly Rowland Featuring Lil Wayne,6lanRgr6wXibZr8KgzXxBl,False,99,91,5,0.621,0.511,11,-8.523,1,0.265,0.015,0,0.0963,0.317,158.896,248933,4
2012-12-01,92,Just A Fool,Christina Aguilera With Blake Shelton,0GhCxUorHaip0NxGCtfz1V,True,0,92,1,0.465,0.876,4,-5.188,0,0.0563,0.128,0,0.259,0.337,83.04,248675,3
2012-12-01,93,Take A Walk,Passion Pit,0GhCxUorHaip0NxGCtfz1V,False,90,85,12,0.566,0.755,11,-5.526,1,0.0368,0.0338,0,0.315,0.445,101.006,264493,4
2012-12-01,94,Poetic Justice,Kendrick Lamar Featuring Drake,0GhCxUorHaip0NxGCtfz1V,False,94,76,4,0.779,0.572,6,-9.985,0,0.378,0.157,0,0.246,0.647,135.956,300160,4
2012-12-01,95,Kiss You,One Direction,4My8w8AA1JpG6E5SiAPvJL,True,0,95,1,0.637,0.93,4,-2.632,1,0.0511,0.0177,0,0.452,0.886,90.014,182867,4
2012-12-01,96,Young & Gettin' It,Meek Mill Featuring Kirko Bangz,4My8w8AA1JpG6E5SiAPvJL,False,92,92,3,0.624,0.752,4,-5.43,1,0.121,0.244,0,0.131,0.858,134.021,205973,4
2012-12-01,97,Sweet Nothing,Calvin Harris Featuring Florence Welch,4My8w8AA1JpG6E5SiAPvJL,False,0,96,2,0.573,0.929,8,-3.942,0,0.109,0.197,0.000112,0.0567,0.582,127.934,212560,4
2012-12-01,98,I'm Different,2 Chainz,6J5sxraPPZ4b0CVOGAgpXj,True,0,98,1,0.936,0.702,10,-5.305,1,0.0615,0.0473,0,0.0838,0.704,97.524,207040,4
2012-12-01,99,Dive In,Trey Songz,6J5sxraPPZ4b0CVOGAgpXj,False,87,77,12,0.587,0.648,0,-6.954,1,0.089,0.0279,0,0.962,0.37,119.888,252453,4
2012-12-01,100,Celebration,"Game Featuring Chris Brown, Tyga, Wiz Khalifa & Lil Wayne",6J5sxraPPZ4b0CVOGAgpXj,False,0,82,2,0.703,0.68,3,-7.706,1,0.234,0.0203,0,0.151,0.596,147.929,288640,4
