date,position,title,artist,spotify_id,is_new,last_pos,peak_pos,weeks,danceability,energy,key,loudness,mode,speechiness,acousticness,instrumentalness,liveness,valence,tempo,duration_ms,time_signature
1993-05-01,1,Freak Me,Silk,,False,2,1,11,0.697,0.608,4,-10.976,0,0.0463,0.0295,0,0.276,0.725,133.879,274533,4
1993-05-01,2,Informer,Snow,,False,1,1,17,0.763,0.742,6,-10.975,0,0.188,0.0984,0,0.38,0.483,98.145,268910,4
1993-05-01,3,"Nuthin' But A ""G"" Thang",Dr. Dre,,False,3,2,14,0.801,0.699,11,-8.18,0,0.279,0.00575,0,0.146,0.655,94.605,238467,4
1993-05-01,4,I Have Nothing,Whitney Houston,,False,4,4,10,0.541,0.401,0,-10.499,1,0.0365,0.576,0,0.164,0.24,152.943,289160,3
1993-05-01,5,"Love Is (From ""Beverly Hills, 90210"")",Vanessa Williams/Brian McKnight,,False,6,5,15,0.487,0.361,1,-9.97,1,0.0236,0.379,2.88e-05,0.12,0.177,79.857,284960,4
1993-05-01,6,Don't Walk Away,Jade,,False,5,4,20,0.831,0.915,10,-7.501,0,0.128,0.147,0.00571,0.196,0.881,102.979,216373,4
1993-05-01,7,I'm So Into You,SWV,,False,7,7,13,0.85,0.513,7,-10.663,1,0.0513,0.0624,0.00249,0.0689,0.623,99.01,278333,4
1993-05-01,8,Two Princes,Spin Doctors,,False,8,7,14,0.543,0.912,7,-10.71,1,0.0601,0.00162,2.1e-06,0.0565,0.836,103.731,256733,4
1993-05-01,9,Looking Through Patient Eyes,P.M. Dawn,,False,11,9,7,0.786,0.372,8,-17.765,1,0.0536,0.19,5.9e-06,0.129,0.685,102.237,249667,4
1993-05-01,10,Ditty,Paperboy,,False,10,10,20,0.838,0.452,11,-15.219,0,0.0547,0.0509,0,0.0666,0.708,99.075,245030,4
1993-05-01,11,Cat's In The Cradle,Ugly Kid Joe,,False,9,6,12,0.511,0.517,8,-9.653,1,0.0328,0.13,0,0.074,0.433,75.67,241893,4
1993-05-01,12,Comforter,Shai,,False,12,10,15,0.725,0.384,7,-12.64,1,0.0317,0.00569,0.00022,0.158,0.497,121.9,250600,4
1993-05-01,13,Hip Hop Hooray,Naughty By Nature,,False,13,8,14,0.862,0.642,6,-13.652,0,0.101,0.102,0,0.272,0.765,99.201,267267,4
1993-05-01,14,That's The Way Love Goes,Janet Jackson,29rQJydAlO0uMyWvRIZxQg,True,0,14,1,0.703,0.7,5,-6.789,1,0.0693,0.302,0.471,0.0718,0.582,97.675,265107,4
1993-05-01,15,It Was A Good Day,Ice Cube,29rQJydAlO0uMyWvRIZxQg,False,15,15,9,0.798,0.744,7,-5.328,0,0.136,0.33,0.000106,0.292,0.794,82.356,260000,4
1993-05-01,16,"The Crying Game (From ""The Crying Game"")",Boy George,29rQJydAlO0uMyWvRIZxQg,False,19,16,8,0.593,0.54,4,-13.302,0,0.0299,0.076,0.00108,0.111,0.577,99.995,202973,4
1993-05-01,17,If I Ever Lose My Faith In You,Sting,29rQJydAlO0uMyWvRIZxQg,False,21,17,11,0.575,0.727,2,-9.539,1,0.0281,0.00952,0.00754,0.054,0.504,97.995,270533,4
1993-05-01,18,Who Is It,Michael Jackson,29rQJydAlO0uMyWvRIZxQg,False,25,18,4,0.861,0.594,5,-4.658,1,0.121,0.0153,0.000326,0.104,0.506,103.159,393307,4
1993-05-01,19,Angel,Jon Secada,29rQJydAlO0uMyWvRIZxQg,False,18,18,14,0.485,0.477,0,-8.948,1,0.0262,0.295,3.35e-05,0.202,0.134,151.704,275040,4
1993-05-01,20,Nothin' My Love Can't Fix,Joey Lawrence,29rQJydAlO0uMyWvRIZxQg,False,28,20,9,0.657,0.909,7,-6.322,1,0.0918,0.0131,0.000623,0.211,0.606,106.122,243267,4
1993-05-01,21,Down With The King,Run-D.M.C.,29rQJydAlO0uMyWvRIZxQg,False,26,21,7,0.786,0.637,1,-12.149,1,0.205,0.07,1.31e-05,0.415,0.762,96.023,302627,4
1993-05-01,22,Bed Of Roses,Bon Jovi,29rQJydAlO0uMyWvRIZxQg,False,14,10,15,0.31,0.596,5,-5.599,1,0.0293,0.101,0,0.21,0.16,164.613,394400,3
1993-05-01,23,"I'm Every Woman (From ""The Bodyguard"")",Whitney Houston,29rQJydAlO0uMyWvRIZxQg,False,22,4,17,0.665,0.847,5,-8.314,0,0.0535,0.0178,0.00288,0.126,0.4,119.555,285107,4
1993-05-01,24,Mr. Wendal,Arrested Development,29rQJydAlO0uMyWvRIZxQg,False,20,6,20,0.884,0.37,8,-11.353,1,0.112,0.0188,0.00423,0.026,0.883,109.997,247507,4
1993-05-01,25,I Got A Man,Positive K,29rQJydAlO0uMyWvRIZxQg,False,16,14,20,0.812,0.753,7,-13.252,1,0.118,0.0774,0,0.341,0.787,103.754,232773,4
1993-05-01,26,Ordinary World,Duran Duran,29rQJydAlO0uMyWvRIZxQg,False,17,3,17,0.472,0.652,1,-10.171,0,0.0305,0.0131,1.12e-05,0.14,0.401,140.124,340200,4
1993-05-01,27,That's What Love Can Do,Boy Krazy,29rQJydAlO0uMyWvRIZxQg,False,24,18,15,0.783,0.773,5,-7.541,0,0.0493,0.0103,0.000162,0.0349,0.744,117.471,202000,4
1993-05-01,28,Knockin' Da Boots,H-Town,29rQJydAlO0uMyWvRIZxQg,False,43,28,4,0.726,0.501,1,-13.884,0,0.154,0.155,0,0.0893,0.582,128.099,330945,4
1993-05-01,29,Livin' On The Edge,Aerosmith,29rQJydAlO0uMyWvRIZxQg,False,34,29,4,0.399,0.881,2,-4.341,1,0.0347,0.0019,0.00429,0.39,0.272,84.58,380893,4
1993-05-01,30,"The Right Kind Of Love (From ""Beverly Hills, 90210"")",Jeremy Jordan,29rQJydAlO0uMyWvRIZxQg,False,27,14,21,0.717,0.634,5,-7.736,0,0.036,0.115,0,0.0782,0.896,178.064,273933,4
1993-05-01,31,Connected,Stereo MC's,29rQJydAlO0uMyWvRIZxQg,False,35,31,6,0.647,0.798,1,-12.142,0,0.0366,0.0497,0.00235,0.0723,0.709,100.631,314133,4
1993-05-01,32,A Whole New World (Aladdin's Theme),Peabo Bryson & Regina Belle,29rQJydAlO0uMyWvRIZxQg,False,23,1,20,0.516,0.32,2,-10.487,1,0.0303,0.627,0,0.144,0.131,107.894,243493,4
1993-05-01,33,Forever In Love,Kenny G,29rQJydAlO0uMyWvRIZxQg,False,29,18,20,0.331,0.318,5,-14.901,1,0.0313,0.336,0.158,0.17,0.111,82.427,299493,4
1993-05-01,34,Simple Life,Elton John,29rQJydAlO0uMyWvRIZxQg,False,32,30,10,0.663,0.788,5,-7.484,1,0.0314,0.00838,0.143,0.19,0.476,101.779,386000,4
1993-05-01,35,Three Little Pigs,Green Jelly,29rQJydAlO0uMyWvRIZxQg,False,33,33,6,0.449,0.95,7,-4.978,1,0.225,0.0115,3.66e-05,0.514,0.339,144.469,353640,4
1993-05-01,36,Love U More,Sunscreem,29rQJydAlO0uMyWvRIZxQg,False,36,36,10,0.602,0.821,2,-8.844,1,0.0332,0.191,0,0.265,0.493,126.085,251693,4
1993-05-01,37,Dedicated,R. Kelly & Public Announcement,29rQJydAlO0uMyWvRIZxQg,False,40,37,10,0.677,0.495,8,-10.482,1,0.0263,0.139,8.21e-06,0.0351,0.45,136.136,277907,4
1993-05-01,38,So Alone,Men At Large,29rQJydAlO0uMyWvRIZxQg,False,31,31,11,0.629,0.364,9,-12.721,0,0.0286,0.0754,0,0.0258,0.471,122.083,447547,4
1993-05-01,39,Dazzey Duks,Duice,29rQJydAlO0uMyWvRIZxQg,False,38,38,17,0.884,0.464,1,-12.876,1,0.222,0.000925,4.36e-06,0.0366,0.868,132.172,244867,4
1993-05-01,40,Show Me Love,Robin S.,29rQJydAlO0uMyWvRIZxQg,False,50,40,5,0.811,0.833,5,-4.259,1,0.153,0.014,2.06e-05,0.0769,0.567,120.258,252107,4
1993-05-01,41,I Will Always Love You,Whitney Houston,29rQJydAlO0uMyWvRIZxQg,False,30,1,25,0.332,0.214,4,-12.518,1,0.0349,0.845,5.62e-06,0.0839,0.11,67.531,271093,4
1993-05-01,42,Come Undone,Duran Duran,29rQJydAlO0uMyWvRIZxQg,False,59,42,3,0.542,0.793,8,-8.203,1,0.053,0.0423,3.95e-06,0.0814,0.708,173.931,256520,4
1993-05-01,43,Buddy X,Neneh Cherry,29rQJydAlO0uMyWvRIZxQg,False,45,43,6,0.782,0.804,10,-6.895,0,0.0791,9.01e-05,0.298,0.0455,0.573,124.004,392517,4
1993-05-01,44,Love Don't Love You,En Vogue,29rQJydAlO0uMyWvRIZxQg,False,44,44,6,0.832,0.643,5,-6.754,0,0.0302,0.138,7.68e-05,0.246,0.779,107.964,238173,4
1993-05-01,45,The Morning Papers,Prince And The New Power Generation,29rQJydAlO0uMyWvRIZxQg,False,48,45,5,0.514,0.719,0,-5.381,0,0.0443,0.175,4.09e-05,0.197,0.438,131.635,237373,4
1993-05-01,46,Weak,SWV,29rQJydAlO0uMyWvRIZxQg,False,58,46,2,0.693,0.533,2,-10.954,0,0.0402,0.107,0,0.0695,0.568,127.661,291907,4
1993-05-01,47,7,Prince And The New Power Generation,29rQJydAlO0uMyWvRIZxQg,False,39,7,23,0.747,0.749,9,-6.255,1,0.0563,0.0917,0,0.0444,0.562,100.721,310467,4
1993-05-01,48,Sweet Thing,Mary J. Blige,29rQJydAlO0uMyWvRIZxQg,False,41,28,12,0.69,0.651,9,-7.86,1,0.101,0.343,9.56e-05,0.178,0.691,79.305,225333,4
1993-05-01,49,Tell Me What You Dream,Restless Heart Featuring Warren Hill,29rQJydAlO0uMyWvRIZxQg,False,54,49,6,0.666,0.464,0,-10.131,0,0.0257,0.117,0.00182,0.328,0.439,94.151,284173,4
1993-05-01,50,Rhythm Is A Dancer,Snap!,29rQJydAlO0uMyWvRIZxQg,False,46,5,38,0.794,0.745,9,-11.367,0,0.037,0.273,0.000414,0.143,0.706,124.249,225882,4
1993-05-01,51,I'm Gonna Get You,Bizarre Inc,29rQJydAlO0uMyWvRIZxQg,False,49,47,15,0.742,0.734,1,-11.393,1,0.04,0.0153,0.728,0.0493,0.723,126.988,319493,4
1993-05-01,52,Rebirth Of Slick (Cool Like Dat),Digable Planets,29rQJydAlO0uMyWvRIZxQg,False,37,15,16,0.884,0.334,1,-18.943,0,0.228,0.0476,0.0588,0.107,0.571,98.315,261267,4
1993-05-01,53,Supermodel (You Better Work),RuPaul,29rQJydAlO0uMyWvRIZxQg,False,52,45,12,0.792,0.562,7,-11.379,1,0.0929,0.0152,7.48e-05,0.428,0.592,126.222,239933,4
1993-05-01,54,I'll Never Get Over You (Getting Over Me),Expose,29rQJydAlO0uMyWvRIZxQg,False,61,54,6,0.323,0.311,8,-12.671,1,0.0312,0.643,0,0.349,0.146,166.943,230933,4
1993-05-01,55,"Tarzan Boy (From ""Teenage Mutant Ninja Turtles III"")",Baltimora,29rQJydAlO0uMyWvRIZxQg,False,51,13,32,0.684,0.573,5,-12.3,1,0.0261,0.318,0.028,0.306,0.716,107.363,378947,4
1993-05-01,56,I Feel You,Depeche Mode,29rQJydAlO0uMyWvRIZxQg,False,56,37,9,0.454,0.933,2,-6.539,1,0.0912,0.024,0.0421,0.493,0.141,122.913,276080,3
1993-05-01,57,Man On The Moon,R.E.M.,29rQJydAlO0uMyWvRIZxQg,False,47,30,13,0.667,0.699,7,-7.574,1,0.026,0.42,0.000442,0.201,0.655,118.567,314173,4
1993-05-01,58,Tap The Bottle,Young Black Teenagers,29rQJydAlO0uMyWvRIZxQg,False,55,55,9,0.889,0.608,11,-9.396,1,0.287,0.00134,0,0.0852,0.569,104.005,240107,4
1993-05-01,59,Romeo,Dolly Parton & Friends,29rQJydAlO0uMyWvRIZxQg,False,53,50,8,0.685,0.661,7,-11.741,1,0.0528,0.241,0,0.0683,0.745,115.862,214027,4
1993-05-01,60,What You Won't Do For Love,Go West,29rQJydAlO0uMyWvRIZxQg,False,57,55,8,0.59,0.803,4,-7.088,0,0.0485,0.293,1.49e-05,0.0691,0.809,169.127,266800,4
1993-05-01,61,Come In Out Of The Rain,Wendy Moten,29rQJydAlO0uMyWvRIZxQg,False,60,59,11,0.59,0.559,5,-8.916,1,0.0269,0.158,3.96e-06,0.361,0.311,114.327,257800,4
1993-05-01,62,Tonight,Def Leppard,29rQJydAlO0uMyWvRIZxQg,False,68,62,5,0.477,0.607,2,-8.768,1,0.0262,0.0816,5.21e-06,0.113,0.534,176.09,243321,4
1993-05-01,63,Touch My Light,Big Mountain,29rQJydAlO0uMyWvRIZxQg,False,69,63,4,0.711,0.805,2,-5.329,1,0.0862,0.285,3.21e-05,0.214,0.576,77.995,256923,4
1993-05-01,64,I See Your Smile,Gloria Estefan,29rQJydAlO0uMyWvRIZxQg,False,64,48,11,0.403,0.457,9,-8.984,1,0.0272,0.237,0,0.185,0.231,79.188,274133,4
1993-05-01,65,How I'm Comin',LL Cool J,29rQJydAlO0uMyWvRIZxQg,False,63,57,5,0.755,0.974,11,-8.68,1,0.208,0.0605,0,0.323,0.309,97.094,305893,4
1993-05-01,66,"Let's Go Through The Motions (From ""Who's The Man?"")",Jodeci,29rQJydAlO0uMyWvRIZxQg,False,66,66,2,0.724,0.509,4,-7.739,0,0.116,0.0779,0,0.169,0.478,171.982,158030,4
1993-05-01,67,Sleeping Satellite,Tasmin Archer,29rQJydAlO0uMyWvRIZxQg,False,76,67,3,0.6,0.824,5,-9.864,0,0.027,0.171,0.000225,0.258,0.749,96.075,281853,4
1993-05-01,68,If I Could,Regina Belle,29rQJydAlO0uMyWvRIZxQg,False,70,68,5,0.264,0.534,5,-7.4,1,0.0331,0.153,0,0.347,0.158,81.516,240267,4
1993-05-01,69,Typical Reasons (Swing My Way),Prince Markie Dee And The Soul Convention,29rQJydAlO0uMyWvRIZxQg,False,74,69,5,0.674,0.565,1,-13.902,1,0.0537,0.161,0,0.0939,0.827,102.556,267812,4
1993-05-01,70,Hat 2 Da Back,TLC,29rQJydAlO0uMyWvRIZxQg,False,62,30,13,0.701,0.697,10,-12.643,0,0.0912,0.000888,0.485,0.301,0.617,108.554,256427,4
1993-05-01,71,"Silence Is Broken (From ""Nowhere To Run"")",Damn Yankees,29rQJydAlO0uMyWvRIZxQg,False,79,71,3,0.474,0.648,2,-10.353,0,0.0283,0.003,0,0.322,0.47,84.619,302160,4
1993-05-01,72,Have I Told You Lately,Rod Stewart,29rQJydAlO0uMyWvRIZxQg,False,86,72,2,0.538,0.366,10,-14.072,1,0.0325,0.498,0,0.094,0.293,142.811,241507,4
1993-05-01,73,"Bad Boys (Theme From ""Cops"")",Inner Circle,0qeKzbUsW0V4ZWRJrHNiD3,True,0,73,1,0.781,0.722,7,-8.376,1,0.0667,0.236,0.000398,0.077,0.533,87.858,229375,4
1993-05-01,74,Funky Child,Lords Of The Underground,0qeKzbUsW0V4ZWRJrHNiD3,False,82,74,6,0.859,0.635,10,-9.532,0,0.193,0.0356,0.00346,0.13,0.53,96.571,271067,4
1993-05-01,75,Beautiful Girl,INXS,0qeKzbUsW0V4ZWRJrHNiD3,False,65,46,11,0.675,0.666,11,-6.067,1,0.027,0.0187,0.692,0.112,0.434,120.558,207547,4
1993-05-01,76,More And More,Captain Hollywood Project,0JXXm3RqxU8EKzX4P8M0n3,True,0,76,1,0.661,0.847,7,-11.855,1,0.0349,0.225,0.835,0.0863,0.71,125.862,253573,4
1993-05-01,77,That's The Way Love Is,Bobby Brown,0JXXm3RqxU8EKzX4P8M0n3,False,84,77,2,0.701,0.881,10,-6.22,0,0.0458,0.0697,3.15e-05,0.0473,0.932,108.35,291467,4
1993-05-01,78,Good Ol' Days,Levert,0JXXm3RqxU8EKzX4P8M0n3,False,78,78,7,0.651,0.753,7,-9.143,1,0.0456,0.216,0.000119,0.105,0.915,87.052,245133,4
1993-05-01,79,Kiss Of Life,Sade,0JXXm3RqxU8EKzX4P8M0n3,False,80,79,7,0.723,0.47,6,-11.302,0,0.028,0.633,0.0373,0.0968,0.783,97.107,251333,4
1993-05-01,80,Shoop Shoop (Never Stop Givin' You Love),Michael Cooper,0JXXm3RqxU8EKzX4P8M0n3,False,72,67,8,0.702,0.573,2,-10.421,1,0.0375,0.12,0,0.0893,0.627,136.443,256307,4
1993-05-01,81,Regret,New Order,1UVll7jjUlqSGxCZ6uXVaD,True,0,81,1,0.506,0.931,5,-5.635,1,0.0305,0.00146,0.0227,0.27,0.865,129.568,248973,4
1993-05-01,82,She's Not Cryin' Anymore,Billy Ray Cyrus,1UVll7jjUlqSGxCZ6uXVaD,False,77,70,8,0.611,0.309,2,-12.084,1,0.0246,0.344,1.82e-06,0.338,0.606,88.556,205773,4
1993-05-01,83,Alibis,Tracy Lawrence,1UVll7jjUlqSGxCZ6uXVaD,False,81,81,3,0.61,0.31,4,-14.391,1,0.0262,0.437,0,0.22,0.381,107.525,182960,3
1993-05-01,84,Candy Everybody Wants,"10,000 Maniacs",1UVll7jjUlqSGxCZ6uXVaD,False,67,67,9,0.622,0.876,10,-6.31,1,0.0305,0.0193,0.00684,0.0987,0.867,104.97,185960,4
1993-05-01,85,Deeper,Boss,1UVll7jjUlqSGxCZ6uXVaD,False,95,85,2,0.631,0.848,6,-6.435,0,0.338,0.055,0,0.385,0.679,83.155,241560,4
1993-05-01,86,Get Away,Bobby Brown,1UVll7jjUlqSGxCZ6uXVaD,False,73,14,16,0.816,0.765,1,-6.538,0,0.0378,0.0264,1.66e-05,0.0389,0.856,111.751,310497,4
1993-05-01,87,Every Little Thing U Do,Christopher Williams,1UVll7jjUlqSGxCZ6uXVaD,False,92,87,2,0.666,0.639,8,-8.014,0,0.05,0.0606,0.00269,0.0645,0.427,98.196,285867,4
1993-05-01,88,Closer,Remedy,1UVll7jjUlqSGxCZ6uXVaD,False,71,66,6,0.513,0.505,7,-11.304,0,0.0356,0.0603,4.03e-06,0.107,0.361,139.651,282320,4
1993-05-01,89,"Whoot, There It Is",95 South,1PJM5F9oC7AKcdYROTv8EX,True,0,89,1,0.783,0.498,7,-14.387,1,0.0556,0.0157,0.245,0.456,0.519,132.952,276867,4
1993-05-01,90,Easy,Faith No More,1PJM5F9oC7AKcdYROTv8EX,False,75,58,7,0.506,0.554,10,-6.743,0,0.0339,0.339,0.000355,0.112,0.375,124.724,186960,4
1993-05-01,92,It's My Life,Dr. Alban,,False,93,92,2,0.655,0.933,7,-7.703,1,0.0536,0.00332,0.0365,0.0983,0.472,128.701,239933,4
1993-05-01,93,Passin' Me By,The Pharcyde,4G3dZN9o3o2X4VKwt4CLts,True,0,93,1,0.759,0.756,4,-8.145,0,0.266,0.0903,2.36e-06,0.265,0.613,87.059,303493,4
1993-05-01,94,Bow Wow Wow,Funkdoobiest,4G3dZN9o3o2X4VKwt4CLts,False,89,89,2,0.899,0.525,11,-11.498,1,0.141,0.023,0.688,0.108,0.696,102.962,253144,4
1993-05-01,95,What's Up,4 Non Blondes,4G3dZN9o3o2X4VKwt4CLts,False,96,95,2,0.565,0.564,2,-10.044,1,0.0292,0.161,0,0.114,0.454,134.355,295533,4
1993-05-01,97,Bad Girl,Madonna,,False,83,36,11,0.645,0.484,11,-11.233,0,0.0396,0.0211,3.88e-06,0.0495,0.52,146.897,323333,4
1993-05-01,98,Reminisce,Mary J. Blige,,False,87,57,20,0.647,0.699,9,-8.122,0,0.0668,0.0397,3.15e-05,0.154,0.53,91.435,323133,4
1993-05-01,99,Knock-N-Boots,Wreckx-N-Effect,,False,90,72,11,0.849,0.848,8,-5.636,0,0.284,0.149,0,0.0746,0.626,103.778,291027,4
1993-05-01,100,Sweet On U,Lo-Key?,,False,91,91,2,0.723,0.699,1,-8.369,1,0.07,0.0505,0,0.136,0.66,90.206,380867,4
