date,position,title,artist,spotify_id,is_new,last_pos,peak_pos,weeks,danceability,energy,key,loudness,mode,speechiness,acousticness,instrumentalness,liveness,valence,tempo,duration_ms,time_signature
2015-04-18,1,Uptown Funk!,Mark Ronson Featuring Bruno Mars,6hr4weuSidHy2LNMw8UVJ2,False,1,1,21,0.856,0.609,0,-7.223,1,0.0824,0.00801,8.15e-05,0.0344,0.928,114.988,269667,4
2015-04-18,2,Sugar,Maroon 5,6hr4weuSidHy2LNMw8UVJ2,False,2,2,12,0.729,0.786,1,-6.348,1,0.0337,0.0747,0,0.0878,0.87,120.068,234000,4
2015-04-18,3,Love Me Like You Do,Ellie Goulding,6hr4weuSidHy2LNMw8UVJ2,False,4,3,13,0.287,0.597,5,-6.641,0,0.0419,0.273,0,0.105,0.31,189.788,253520,4
2015-04-18,4,Earned It (Fifty Shades Of Grey),The Weeknd,6hr4weuSidHy2LNMw8UVJ2,False,5,4,15,0.658,0.282,2,-8.282,0,0.0353,0.433,0,0.0741,0.39,119.757,277724,3
2015-04-18,5,Thinking Out Loud,Ed Sheeran,6hr4weuSidHy2LNMw8UVJ2,False,3,2,26,0.781,0.445,2,-6.061,1,0.0295,0.474,0,0.184,0.591,78.998,281560,4
2015-04-18,6,Trap Queen,Fetty Wap,6hr4weuSidHy2LNMw8UVJ2,False,6,6,11,0.746,0.873,7,-3.803,1,0.128,0.0244,0,0.354,0.817,148.075,222093,4
2015-04-18,7,Style,Taylor Swift,6hr4weuSidHy2LNMw8UVJ2,False,7,6,17,0.598,0.786,2,-5.572,1,0.0382,0.00256,0.00143,0.117,0.456,95.021,231000,4
2015-04-18,8,G.D.F.R.,Flo Rida Featuring Sage The Gemini & Lookas,6hr4weuSidHy2LNMw8UVJ2,False,9,8,21,0.656,0.863,0,-3.238,0,0.0412,0.037,0,0.0989,0.536,129.847,213480,4
2015-04-18,9,FourFiveSeconds,Rihanna & Kanye West & Paul McCartney,6hr4weuSidHy2LNMw8UVJ2,False,8,4,11,0.582,0.272,2,-5.662,1,0.0501,0.875,0,0.13,0.354,205.846,188238,4
2015-04-18,10,See You Again,Wiz Khalifa Featuring Charlie Puth,6hr4weuSidHy2LNMw8UVJ2,False,84,10,4,0.689,0.481,10,-7.503,1,0.0815,0.369,1.03e-06,0.0649,0.283,80.025,229526,4
2015-04-18,11,Somebody,Natalie La Rose Featuring Jeremih,6hr4weuSidHy2LNMw8UVJ2,False,10,10,11,0.83,0.52,0,-8.714,1,0.0376,0.000792,1.25e-05,0.0656,0.735,104.99,189907,4
2015-04-18,12,Shut Up And Dance,WALK THE MOON,6hr4weuSidHy2LNMw8UVJ2,False,12,12,21,0.578,0.866,1,-3.804,1,0.0619,0.00701,0,0.257,0.619,128.038,199080,4
2015-04-18,13,Chains,Nick Jonas,6hr4weuSidHy2LNMw8UVJ2,False,19,13,10,0.589,0.611,0,-5.881,0,0.0459,0.0151,0,0.0757,0.121,76.006,203107,4
2015-04-18,14,Want To Want Me,Jason Derulo,6hr4weuSidHy2LNMw8UVJ2,False,17,14,4,0.775,0.68,0,-5.508,0,0.0629,0.00906,0,0.109,0.656,114.025,207719,4
2015-04-18,15,Time Of Our Lives,Pitbull & Ne-Yo,6hr4weuSidHy2LNMw8UVJ2,False,11,9,17,0.72,0.802,1,-5.797,1,0.0582,0.0921,0,0.694,0.723,124.043,229360,4
2015-04-18,16,One Last Time,Ariana Grande,6hr4weuSidHy2LNMw8UVJ2,False,16,16,8,0.628,0.593,8,-5.036,1,0.0323,0.093,1.65e-06,0.096,0.104,125.026,197267,4
2015-04-18,17,Blank Space,Taylor Swift,6hr4weuSidHy2LNMw8UVJ2,False,13,1,23,0.752,0.678,5,-5.421,1,0.0646,0.085,1.64e-06,0.13,0.583,96.009,231827,4
2015-04-18,18,Truffle Butter,Nicki Minaj Featuring Drake & Lil Wayne,6hr4weuSidHy2LNMw8UVJ2,False,15,14,11,0.887,0.673,10,-6.846,0,0.0503,0.0743,4.06e-05,0.124,0.491,105.113,219227,4
2015-04-18,19,B**** Better Have My Money,Rihanna,6hr4weuSidHy2LNMw8UVJ2,False,23,19,2,0.781,0.728,1,-4.981,1,0.0621,0.0509,1.94e-06,0.257,0.395,102.99,219306,4
2015-04-18,20,Lay Me Down,Sam Smith,6hr4weuSidHy2LNMw8UVJ2,False,18,8,9,0.468,0.19,4,-11.138,1,0.0373,0.919,0,0.107,0.326,125.319,219536,4
2015-04-18,21,Take Me To Church,Hozier,6hr4weuSidHy2LNMw8UVJ2,False,14,2,34,0.566,0.664,4,-5.303,0,0.0464,0.634,0,0.116,0.437,128.945,241693,4
2015-04-18,22,Post To Be,Omarion Featuring Chris Brown & Jhene Aiko,6hr4weuSidHy2LNMw8UVJ2,False,22,22,13,0.733,0.676,10,-5.655,0,0.0432,0.0697,0,0.208,0.701,97.448,226581,4
2015-04-18,23,Take Your Time,Sam Hunt,6hr4weuSidHy2LNMw8UVJ2,False,20,20,14,0.558,0.719,11,-5.603,1,0.0419,0.101,0,0.212,0.483,158.031,243707,4
2015-04-18,24,Heartbeat Song,Kelly Clarkson,6hr4weuSidHy2LNMw8UVJ2,False,31,21,12,0.49,0.798,6,-3.66,1,0.0489,0.0137,0,0.0627,0.479,149.109,198733,4
2015-04-18,25,Ayo,Chris Brown & Tyga,6hr4weuSidHy2LNMw8UVJ2,False,21,21,13,0.823,0.563,6,-5.095,1,0.0443,0.0399,0,0.0851,0.682,98.031,225227,4
2015-04-18,26,Shake It Off,Taylor Swift,6hr4weuSidHy2LNMw8UVJ2,False,24,1,33,0.648,0.785,7,-5.414,1,0.165,0.0561,0,0.148,0.943,160.02,219200,4
2015-04-18,27,I Want You To Know,Zedd Featuring Selena Gomez,6hr4weuSidHy2LNMw8UVJ2,False,26,17,6,0.58,0.846,9,-2.876,0,0.0573,0.00537,6.62e-06,0.145,0.366,129.998,240000,4
2015-04-18,28,Talking Body,Tove Lo,6hr4weuSidHy2LNMw8UVJ2,False,37,28,10,0.736,0.761,4,-5.449,0,0.0338,0.0966,0,0.0823,0.114,119.999,238427,4
2015-04-18,29,I'm Not The Only One,Sam Smith,6hr4weuSidHy2LNMw8UVJ2,False,27,5,31,0.677,0.485,5,-5.795,1,0.0361,0.529,2.04e-05,0.0766,0.493,82.001,239317,4
2015-04-18,30,Blessings,Big Sean Featuring Drake,6hr4weuSidHy2LNMw8UVJ2,False,30,30,9,0.79,0.621,1,-7.634,1,0.275,0.333,0,0.122,0.15,118.895,252040,4
2015-04-18,31,I Don't Mind,Usher Featuring Juicy J,6hr4weuSidHy2LNMw8UVJ2,False,28,11,20,0.87,0.464,4,-8.337,1,0.178,0.205,0,0.0902,0.457,112.974,251989,4
2015-04-18,32,Outside,Calvin Harris Featuring Ellie Goulding,6hr4weuSidHy2LNMw8UVJ2,False,29,29,17,0.646,0.823,2,-4.123,0,0.0394,0.213,0,0.322,0.418,128.035,227267,4
2015-04-18,33,Lips Are Movin,Meghan Trainor,6hr4weuSidHy2LNMw8UVJ2,False,25,4,24,0.775,0.825,7,-5.402,1,0.0464,0.0506,1.03e-06,0.111,0.95,139.091,182667,4
2015-04-18,34,Throw Sum Mo,Rae Sremmurd Featuring Nicki Minaj & Young Thug,6hr4weuSidHy2LNMw8UVJ2,False,33,33,14,0.859,0.627,6,-7.91,0,0.13,0.0388,0.000202,0.101,0.594,142.062,260453,4
2015-04-18,35,Centuries,Fall Out Boy,6hr4weuSidHy2LNMw8UVJ2,False,34,10,30,0.393,0.858,4,-2.868,0,0.0729,0.00359,0,0.102,0.56,176.042,228360,4
2015-04-18,36,Homegrown,Zac Brown Band,6hr4weuSidHy2LNMw8UVJ2,False,36,36,12,0.711,0.801,6,-3.742,1,0.029,0.0244,0.000113,0.135,0.956,105.006,205000,4
2015-04-18,37,All About That Bass,Meghan Trainor,6hr4weuSidHy2LNMw8UVJ2,False,32,1,39,0.807,0.887,9,-3.726,1,0.0503,0.0573,2.87e-06,0.124,0.961,134.052,187920,4
2015-04-18,38,Only,"Nicki Minaj Featuring Drake, Lil Wayne & Chris Brown",6hr4weuSidHy2LNMw8UVJ2,False,35,12,23,0.573,0.495,8,-7.245,0,0.592,0.405,0,0.0969,0.255,179.196,312027,3
2015-04-18,39,Dear Future Husband,Meghan Trainor,6hr4weuSidHy2LNMw8UVJ2,False,55,39,12,0.655,0.782,1,-4.789,1,0.185,0.375,0,0.317,0.832,79.427,184227,4
2015-04-18,40,Riptide,Vance Joy,6hr4weuSidHy2LNMw8UVJ2,False,38,30,41,0.484,0.731,1,-6.694,1,0.0379,0.431,0,0.151,0.51,101.654,204280,4
2015-04-18,41,Worth It,Fifth Harmony Featuring Kid Ink,6hr4weuSidHy2LNMw8UVJ2,False,58,41,7,0.884,0.765,8,-3.865,1,0.0882,0.063,7.04e-06,0.118,0.594,99.987,224573,4
2015-04-18,42,Stay With Me,Sam Smith,6hr4weuSidHy2LNMw8UVJ2,False,39,2,52,0.418,0.42,0,-6.444,1,0.0414,0.588,6.39e-05,0.11,0.184,84.094,172724,4
2015-04-18,43,I Don't F**k With You,Big Sean Featuring E-40,6hr4weuSidHy2LNMw8UVJ2,False,40,11,28,0.815,0.724,1,-5.658,1,0.0712,0.0385,0,0.334,0.366,97.957,284413,4
2015-04-18,44,Jealous,Nick Jonas,6hr4weuSidHy2LNMw8UVJ2,False,41,7,30,0.684,0.71,11,-3.614,0,0.0779,0.0132,0,0.444,0.451,93.007,222187,4
2015-04-18,45,"Honey, I'm Good.",Andy Grammer,6hr4weuSidHy2LNMw8UVJ2,False,50,45,6,0.752,0.775,9,-7.289,1,0.0546,0.0324,0,0.351,0.595,122.014,199263,4
2015-04-18,46,Budapest,George Ezra,6hr4weuSidHy2LNMw8UVJ2,False,48,46,10,0.717,0.455,5,-8.303,1,0.0276,0.0846,0,0.11,0.389,127.812,200733,4
2015-04-18,47,Animals,Maroon 5,6hr4weuSidHy2LNMw8UVJ2,False,42,3,33,0.279,0.742,4,-6.46,0,0.0898,0.000185,0,0.593,0.328,189.868,231013,4
2015-04-18,48,Ain't Worth The Whiskey,Cole Swindell,6hr4weuSidHy2LNMw8UVJ2,False,49,43,14,0.432,0.738,2,-3.91,1,0.0309,0.042,0,0.119,0.503,153.712,191907,4
2015-04-18,49,7/11,Beyonce,6hr4weuSidHy2LNMw8UVJ2,False,44,13,19,0.747,0.705,9,-5.137,0,0.126,0.0128,0,0.126,0.56,136.024,213507,4
2015-04-18,50,Night Changes,One Direction,6hr4weuSidHy2LNMw8UVJ2,False,43,31,20,0.672,0.52,8,-7.747,1,0.0353,0.859,0,0.115,0.37,120.001,226600,4
2015-04-18,51,Slow Motion,Trey Songz,6hr4weuSidHy2LNMw8UVJ2,False,51,51,8,0.733,0.408,7,-7.834,0,0.0388,0.679,3.92e-05,0.11,0.291,94.947,197854,4
2015-04-18,52,Elastic Heart,Sia,6hr4weuSidHy2LNMw8UVJ2,False,47,17,13,0.421,0.791,9,-4.998,1,0.0496,0.0117,1.48e-05,0.146,0.499,130.075,257200,4
2015-04-18,53,Lonely Eyes,Chris Young,6hr4weuSidHy2LNMw8UVJ2,False,52,50,16,0.657,0.674,1,-5.273,1,0.0319,0.0326,1.88e-05,0.0947,0.336,106.005,217413,4
2015-04-18,54,Girl Crush,Little Big Town,6hr4weuSidHy2LNMw8UVJ2,False,45,45,7,0.5,0.225,0,-10.22,1,0.0302,0.842,0,0.112,0.355,173.788,193320,3
2015-04-18,55,She Knows,Ne-Yo Featuring Juicy J,6hr4weuSidHy2LNMw8UVJ2,False,46,19,20,0.706,0.572,8,-5.799,0,0.0326,0.0262,0,0.585,0.574,139.982,214726,4
2015-04-18,56,Hey Mama,"David Guetta Featuring Nicki Minaj, Bebe Rexha & Afrojack",6hr4weuSidHy2LNMw8UVJ2,False,70,56,2,0.596,0.73,9,-4.091,1,0.151,0.24,0,0.325,0.525,85.979,192560,4
2015-04-18,57,Say You Do,Dierks Bentley,6hr4weuSidHy2LNMw8UVJ2,False,60,57,12,0.481,0.733,3,-8.171,1,0.0368,0.142,0.000547,0.106,0.453,147.859,219360,4
2015-04-18,58,I Bet My Life,Imagine Dragons,6hr4weuSidHy2LNMw8UVJ2,False,54,28,22,0.553,0.657,1,-8.219,1,0.0405,0.335,0.000648,0.228,0.555,107.889,192707,4
2015-04-18,59,Know Yourself,Drake,6hr4weuSidHy2LNMw8UVJ2,False,57,57,7,0.72,0.412,11,-8.687,0,0.223,0.196,0,0.342,0.179,114.408,275840,4
2015-04-18,60,Watch Me,Silento,6hr4weuSidHy2LNMw8UVJ2,False,63,60,6,0.821,0.759,8,-8.541,1,0.121,0.247,0,0.321,0.962,140.01,185143,4
2015-04-18,61,King Kunta,Kendrick Lamar,6hr4weuSidHy2LNMw8UVJ2,False,78,61,3,0.884,0.657,6,-4.569,0,0.0977,0.00589,0,0.154,0.489,107.059,234693,4
2015-04-18,62,Homegrown Honey,Darius Rucker,6hr4weuSidHy2LNMw8UVJ2,False,53,53,19,0.657,0.911,1,-5.072,1,0.0496,0.122,0,0.0479,0.871,87.978,204893,4
2015-04-18,63,Geronimo,Sheppard,6hr4weuSidHy2LNMw8UVJ2,False,59,58,15,0.705,0.78,7,-6.267,1,0.0805,0.456,0.00152,0.115,0.457,142.028,218228,4
2015-04-18,64,Where Are U Now,Skrillex & Diplo With Justin Bieber,6hr4weuSidHy2LNMw8UVJ2,False,82,64,5,0.432,0.781,4,-4.038,0,0.0567,0.041,4.21e-06,0.0789,0.197,139.432,250286,4
2015-04-18,65,A Guy Walks Into A Bar,Tyler Farr,6hr4weuSidHy2LNMw8UVJ2,False,64,64,14,0.428,0.78,0,-3.472,1,0.0373,0.083,0,0.115,0.431,147.986,196000,4
2015-04-18,66,Nobody Love,Tori Kelly,6hr4weuSidHy2LNMw8UVJ2,False,68,66,6,0.753,0.709,1,-5.132,0,0.0347,0.00634,0.000896,0.0967,0.572,99.966,203453,4
2015-04-18,67,I Bet,Ciara,6hr4weuSidHy2LNMw8UVJ2,False,69,43,6,0.743,0.618,8,-7.227,1,0.0732,0.076,0,0.0731,0.285,129.034,287933,4
2015-04-18,68,Energy,Drake,6hr4weuSidHy2LNMw8UVJ2,False,61,26,8,0.747,0.571,11,-7.916,1,0.478,0.38,0,0.534,0.553,172.104,181933,4
2015-04-18,69,All Day,"Kanye West Featuring Theophilus London, Allan Kingdom & Paul McCartney",6hr4weuSidHy2LNMw8UVJ2,False,62,15,5,0.861,0.651,9,-4.718,0,0.111,0.0739,0,0.211,0.421,122.985,310907,4
2015-04-18,70,Prayer In C,Lillywood & Robin Schulz,6hr4weuSidHy2LNMw8UVJ2,False,56,23,18,0.763,0.875,9,-5.797,0,0.0262,0.024,5.41e-06,0.599,0.8,123.013,189413,4
2015-04-18,71,Raise 'Em Up,Keith Urban Featuring Eric Church,6hr4weuSidHy2LNMw8UVJ2,False,77,71,6,0.609,0.788,4,-7.855,1,0.0416,0.645,3.72e-05,0.174,0.54,108.053,184947,4
2015-04-18,72,Don't It,Billy Currington,6hr4weuSidHy2LNMw8UVJ2,False,76,72,5,0.571,0.826,1,-4.475,1,0.0362,0.0446,0,0.343,0.713,90.966,189000,4
2015-04-18,73,Trouble,Iggy Azalea Featuring Jennifer Hudson,6hr4weuSidHy2LNMw8UVJ2,False,67,67,2,0.96,0.699,7,-3.804,1,0.132,0.0948,0,0.0812,0.673,106.009,166317,4
2015-04-18,74,Legend,Drake,6hr4weuSidHy2LNMw8UVJ2,False,65,52,8,0.714,0.563,1,-7.574,1,0.0723,0.0266,0,0.0776,0.31,100.091,241853,4
2015-04-18,75,Smoke,A Thousand Horses,6hr4weuSidHy2LNMw8UVJ2,False,72,72,6,0.433,0.776,7,-5.53,1,0.029,0.0349,0.00023,0.387,0.424,149.641,219080,4
2015-04-18,76,Sippin' On Fire,Florida Georgia Line,6hr4weuSidHy2LNMw8UVJ2,False,81,62,4,0.476,0.92,10,-3.223,1,0.0329,0.00485,1.15e-05,0.355,0.694,142.952,193640,4
2015-04-18,77,Get Low,Dillon Francis & DJ Snake,3oZoXyU0SkDldgS7AcN4y4,True,0,77,1,0.674,0.932,11,-4.424,0,0.0859,0.0282,0.71,0.684,0.728,101.033,212773,4
2015-04-18,78,Believe,Mumford & Sons,3oZoXyU0SkDldgS7AcN4y4,False,79,31,4,0.359,0.621,11,-7.482,0,0.0443,0.0253,0.0586,0.223,0.422,113.699,221040,4
2015-04-18,79,CoCo,O.T. Genasis,3oZoXyU0SkDldgS7AcN4y4,False,71,20,20,0.886,0.628,8,-5.949,1,0.131,0.00215,1.15e-05,0.31,0.178,119.906,239574,4
2015-04-18,80,I Really Like You,Carly Rae Jepsen,3oZoXyU0SkDldgS7AcN4y4,False,89,48,5,0.62,0.805,5,-5.538,1,0.0417,0.00564,9.15e-05,0.285,0.586,122.062,204764,4
2015-04-18,81,Little Red Wagon,Miranda Lambert,3oZoXyU0SkDldgS7AcN4y4,False,73,55,8,0.584,0.813,6,-7.221,1,0.0582,0.0297,0.000197,0.272,0.774,95.081,204387,4
2015-04-18,82,10 Bands,Drake,3oZoXyU0SkDldgS7AcN4y4,False,74,58,8,0.825,0.756,11,-3.687,0,0.383,0.265,2.15e-06,0.0762,0.888,172.938,177733,4
2015-04-18,83,You Know You Like It,DJ Snake & AlunaGeorge,3oZoXyU0SkDldgS7AcN4y4,False,99,83,2,0.407,0.725,5,-5.346,0,0.188,0.0141,2.46e-06,0.306,0.247,196.093,247267,4
2015-04-18,84,Bills,LunchMoney Lewis,3oZoXyU0SkDldgS7AcN4y4,False,85,84,4,0.699,0.747,5,-3.453,1,0.0964,0.274,0,0.486,0.683,126.001,204600,4
2015-04-18,85,Feeling Myself,Nicki Minaj Featuring Beyonce,3oZoXyU0SkDldgS7AcN4y4,False,75,43,16,0.564,0.703,2,-5.459,1,0.269,0.437,0.00927,0.358,0.477,139.045,237840,4
2015-04-18,86,Little Toy Guns,Carrie Underwood,3oZoXyU0SkDldgS7AcN4y4,False,90,86,3,0.434,0.868,7,-1.208,1,0.0603,0.00407,1.98e-06,0.0919,0.204,161.886,210760,4
2015-04-18,87,The Matrimony,Wale Featuring Usher,7vlPI45Zzzk0palLdKry4k,True,0,87,1,0.416,0.712,5,-6.671,0,0.384,0.438,0,0.0642,0.581,78.015,395951,4
2015-04-18,88,Bright,Echosmith,7vlPI45Zzzk0palLdKry4k,False,93,88,3,0.646,0.431,6,-8.517,1,0.0262,0.637,6.99e-06,0.113,0.292,90.034,220627,4
2015-04-18,89,She Don't Love You,Eric Paslay,7vlPI45Zzzk0palLdKry4k,False,86,86,5,0.36,0.333,7,-8.491,1,0.0285,0.335,1.09e-06,0.114,0.17,74.53,262053,1
2015-04-18,90,El Perdon (Forgiveness),Nicky Jam & Enrique Iglesias,7vlPI45Zzzk0palLdKry4k,False,66,66,2,0.628,0.69,8,-5.828,1,0.0511,0.446,0,0.112,0.662,179.911,205907,4
2015-04-18,91,Good Lovin,Ludacris Featuring Miguel,50CUAS176V52tG2zGm7VHV,True,0,91,1,0.619,0.754,0,-5.231,1,0.232,0.294,3.48e-06,0.109,0.589,83.464,223440,4
2015-04-18,92,Immortals,Fall Out Boy,50CUAS176V52tG2zGm7VHV,False,87,72,7,0.616,0.868,2,-3.606,1,0.0699,0.00131,1.54e-06,0.671,0.475,108.016,189387,4
2015-04-18,94,Wild Child,Kenny Chesney With Grace Potter,,False,98,94,3,0.586,0.633,3,-7.688,1,0.0318,0.475,4.29e-06,0.164,0.445,148.984,189800,4
2015-04-18,95,Love You Like That,Canaan Smith,,False,96,95,2,0.559,0.766,11,-5.056,1,0.0295,0.0107,6.98e-05,0.194,0.723,145.26,203053,4
2015-04-18,96,Like A Wrecking Ball,Eric Church,,False,100,96,2,0.693,0.335,0,-10.863,1,0.0395,0.338,0.000552,0.118,0.623,136.071,198907,4
2015-04-18,97,Love Me Like You Mean It,Kelsea Ballerini,0knbW9EwgSLfNFMWys1mQm,True,0,97,1,0.645,0.84,4,-5.894,1,0.0518,0.0452,0,0.327,0.805,151.94,200027,4
2015-04-18,98,Commas,Future,4aoo6M6VeimaKHd5XwElaK,True,0,98,1,0.878,0.561,11,-5.978,0,0.218,0.0357,0.000237,0.133,0.332,139.962,236748,4
2015-04-18,99,Apparently,J. Cole,4aoo6M6VeimaKHd5XwElaK,False,83,58,16,0.8,0.543,5,-9.236,1,0.0911,0.564,0,0.116,0.534,133.98,293040,4
2015-04-18,100,I See You,Luke Bryan,4aoo6M6VeimaKHd5XwElaK,False,97,41,19,0.657,0.821,6,-3.388,1,0.0352,0.0838,0,0.0457,0.714,130.002,185987,4
