date,position,title,artist,spotify_id,is_new,last_pos,peak_pos,weeks,danceability,energy,key,loudness,mode,speechiness,acousticness,instrumentalness,liveness,valence,tempo,duration_ms,time_signature
2013-07-13,1,Blurred Lines,Robin Thicke Featuring T.I. + Pharrell,2bvxIrwSsQiaHOePGrjnJ9,False,1,1,11,0.853,0.599,7,-4.756,1,0.0411,0.00334,7.93e-06,0.0759,0.843,119.993,263827,4
2013-07-13,2,Get Lucky,Daft Punk Featuring Pharrell Williams,2bvxIrwSsQiaHOePGrjnJ9,False,2,2,11,0.794,0.811,6,-8.966,0,0.038,0.0426,1.07e-06,0.101,0.862,116.047,248413,4
2013-07-13,3,We Can't Stop,Miley Cyrus,2bvxIrwSsQiaHOePGrjnJ9,False,5,3,4,0.613,0.622,1,-5.794,0,0.0334,0.00882,0,0.37,0.484,80.003,231240,4
2013-07-13,4,Radioactive,Imagine Dragons,2bvxIrwSsQiaHOePGrjnJ9,False,3,3,44,0.448,0.784,9,-3.686,1,0.0627,0.106,0.000108,0.668,0.236,136.245,186813,4
2013-07-13,5,Can't Hold Us,Macklemore & Ryan Lewis Featuring Ray Dalton,2bvxIrwSsQiaHOePGrjnJ9,False,6,1,21,0.641,0.922,2,-4.457,1,0.0786,0.0291,0,0.0862,0.847,146.078,258343,4
2013-07-13,6,Cruise,Florida Georgia Line Featuring Nelly,2bvxIrwSsQiaHOePGrjnJ9,False,4,4,39,0.457,0.948,10,-3.364,1,0.0354,0.0191,0,0.0536,0.878,148.0,208960,4
2013-07-13,7,Mirrors,Justin Timberlake,2bvxIrwSsQiaHOePGrjnJ9,False,7,2,20,0.574,0.512,5,-6.664,0,0.0503,0.234,0,0.0946,0.512,76.899,484147,4
2013-07-13,8,Treasure,Bruno Mars,2bvxIrwSsQiaHOePGrjnJ9,False,8,8,7,0.874,0.692,5,-5.28,0,0.0431,0.0412,7.24e-05,0.324,0.937,116.017,178560,4
2013-07-13,9,Come & Get It,Selena Gomez,2bvxIrwSsQiaHOePGrjnJ9,False,9,6,12,0.552,0.783,7,-4.138,0,0.0504,0.00887,0.00026,0.0954,0.575,79.984,231413,4
2013-07-13,10,The Way,Ariana Grande Featuring Mac Miller,2bvxIrwSsQiaHOePGrjnJ9,False,11,9,14,0.645,0.877,5,-3.208,0,0.113,0.294,0,0.0759,0.861,82.324,227027,4
2013-07-13,11,Just Give Me A Reason,P!nk Featuring Nate Ruess,2bvxIrwSsQiaHOePGrjnJ9,False,10,1,20,0.778,0.547,2,-7.273,1,0.0489,0.346,0.000302,0.132,0.441,95.002,242733,4
2013-07-13,12,I Love It,Icona Pop Featuring Charli XCX,2bvxIrwSsQiaHOePGrjnJ9,False,12,7,22,0.711,0.906,8,-2.671,1,0.0284,0.00952,1.64e-05,0.153,0.824,125.916,157153,4
2013-07-13,13,Cups (Pitch Perfect's When I'm Gone),Anna Kendrick,2bvxIrwSsQiaHOePGrjnJ9,False,17,13,27,0.878,0.455,0,-8.845,1,0.077,0.0462,0.00484,0.0353,0.79,129.953,128013,4
2013-07-13,14,Clarity,Zedd Featuring Foxes,2bvxIrwSsQiaHOePGrjnJ9,False,14,14,15,0.509,0.781,8,-3.48,1,0.072,0.0398,0,0.0749,0.176,128.0,271427,4
2013-07-13,15,My Songs Know What You Did In The Dark (Light Em Up),Fall Out Boy,2bvxIrwSsQiaHOePGrjnJ9,False,13,13,21,0.558,0.924,9,-4.341,0,0.064,0.0271,3.32e-06,0.537,0.567,151.99,186827,4
2013-07-13,16,Same Love,Macklemore & Ryan Lewis Featuring Mary Lambert,2bvxIrwSsQiaHOePGrjnJ9,False,28,16,16,0.688,0.473,8,-9.059,1,0.167,0.716,4.46e-05,0.104,0.299,84.958,318525,4
2013-07-13,17,#Beautiful,Mariah Carey Featuring Miguel,2bvxIrwSsQiaHOePGrjnJ9,False,16,15,8,0.677,0.749,4,-5.405,1,0.0391,0.346,0,0.347,0.469,107.042,199867,4
2013-07-13,18,Love Somebody,Maroon 5,2bvxIrwSsQiaHOePGrjnJ9,False,22,18,6,0.675,0.792,1,-6.303,1,0.0368,0.145,0,0.12,0.395,120.016,229813,4
2013-07-13,19,Stay,Rihanna Featuring Mikky Ekko,2bvxIrwSsQiaHOePGrjnJ9,False,18,3,21,0.621,0.31,9,-10.164,0,0.0283,0.945,6.12e-05,0.117,0.125,111.893,240707,4
2013-07-13,20,Boys 'round Here,Blake Shelton Featuring Pistol Annies & Friends,2bvxIrwSsQiaHOePGrjnJ9,False,15,12,14,0.611,0.688,2,-6.369,1,0.0529,0.251,2.35e-06,0.248,0.649,169.895,288760,4
2013-07-13,21,Power Trip,J. Cole Featuring Miguel,2bvxIrwSsQiaHOePGrjnJ9,False,23,20,20,0.667,0.608,1,-7.054,1,0.216,0.324,0.000198,0.426,0.475,99.992,241160,4
2013-07-13,22,The Other Side,Jason Derulo,2bvxIrwSsQiaHOePGrjnJ9,False,25,22,11,0.561,0.836,9,-3.939,1,0.1,0.0525,0,0.136,0.517,127.923,226987,4
2013-07-13,23,I Need Your Love,Calvin Harris Featuring Ellie Goulding,2bvxIrwSsQiaHOePGrjnJ9,False,24,23,11,0.695,0.869,8,-5.066,1,0.0483,0.41,0,0.237,0.58,124.989,234507,4
2013-07-13,24,Thrift Shop,Macklemore & Ryan Lewis Featuring Wanz,2bvxIrwSsQiaHOePGrjnJ9,False,21,1,39,0.781,0.526,6,-6.986,0,0.293,0.0633,0,0.0457,0.665,94.993,235613,4
2013-07-13,25,I Want Crazy,Hunter Hayes,2bvxIrwSsQiaHOePGrjnJ9,False,19,19,12,0.562,0.878,8,-4.806,1,0.0387,0.0539,0,0.112,0.558,103.029,236865,4
2013-07-13,26,When I Was Your Man,Bruno Mars,2bvxIrwSsQiaHOePGrjnJ9,False,20,1,28,0.612,0.28,0,-8.648,1,0.0434,0.932,0,0.088,0.387,72.795,213827,4
2013-07-13,27,Crash My Party,Luke Bryan,2bvxIrwSsQiaHOePGrjnJ9,False,30,18,12,0.526,0.816,7,-4.009,1,0.0421,0.0285,0,0.22,0.414,144.032,234760,4
2013-07-13,28,Bad,Wale Featuring Tiara Thomas Or Rihanna,2bvxIrwSsQiaHOePGrjnJ9,False,27,21,20,0.807,0.702,6,-6.594,0,0.0748,0.307,0,0.111,0.447,114.038,238827,4
2013-07-13,29,Wagon Wheel,Darius Rucker,2bvxIrwSsQiaHOePGrjnJ9,False,26,15,21,0.537,0.66,9,-7.174,1,0.0296,0.455,0,0.135,0.574,148.096,298373,4
2013-07-13,30,U.O.E.N.O.,Rocko Featuring Future & Rick Ross,2bvxIrwSsQiaHOePGrjnJ9,False,33,30,12,0.422,0.641,10,-4.947,0,0.323,0.422,0,0.317,0.654,187.027,260276,3
2013-07-13,31,"Gone, Gone, Gone",Phillip Phillips,2bvxIrwSsQiaHOePGrjnJ9,False,36,31,17,0.664,0.642,6,-5.961,1,0.038,0.129,0,0.114,0.501,118.002,209693,4
2013-07-13,32,Safe And Sound,Capital Cities,2bvxIrwSsQiaHOePGrjnJ9,False,43,32,9,0.655,0.819,0,-4.852,1,0.0316,0.000176,0.00374,0.104,0.766,117.956,192790,5
2013-07-13,33,"Bitch, Don't Kill My Vibe",Kendrick Lamar,2bvxIrwSsQiaHOePGrjnJ9,False,42,32,19,0.587,0.698,1,-8.948,1,0.0943,0.0152,0,0.442,0.0985,133.954,310720,4
2013-07-13,34,Body Party,Ciara,2bvxIrwSsQiaHOePGrjnJ9,False,38,34,10,0.577,0.576,2,-6.299,1,0.0563,0.0143,0,0.602,0.12,133.973,234040,4
2013-07-13,35,Here's To Never Growing Up,Avril Lavigne,2bvxIrwSsQiaHOePGrjnJ9,False,29,20,12,0.482,0.873,0,-3.145,1,0.0853,0.0111,0,0.409,0.737,165.084,214320,4
2013-07-13,36,Sail,AWOLNATION,2bvxIrwSsQiaHOePGrjnJ9,False,39,30,43,0.825,0.435,1,-9.582,1,0.0568,0.452,0.609,0.0953,0.243,119.038,259102,4
2013-07-13,37,Runnin' Outta Moonlight,Randy Houser,2bvxIrwSsQiaHOePGrjnJ9,False,44,37,8,0.526,0.801,2,-3.717,1,0.0393,0.0354,3.17e-06,0.0637,0.769,172.024,193773,4
2013-07-13,38,Heart Attack,Demi Lovato,2bvxIrwSsQiaHOePGrjnJ9,False,34,10,18,0.504,0.785,8,-4.802,1,0.104,0.0738,0,0.239,0.502,173.968,210840,4
2013-07-13,39,Feel This Moment,Pitbull Featuring Christina Aguilera,2bvxIrwSsQiaHOePGrjnJ9,False,31,8,23,0.673,0.758,7,-3.632,1,0.158,0.039,0,0.341,0.542,135.956,229507,4
2013-07-13,40,Rich As F**k,Lil Wayne Featuring 2 Chainz,2bvxIrwSsQiaHOePGrjnJ9,False,40,38,15,0.595,0.359,8,-13.488,1,0.453,0.289,0,0.15,0.886,131.969,229198,4
2013-07-13,41,Ho Hey,The Lumineers,2bvxIrwSsQiaHOePGrjnJ9,False,46,3,56,0.685,0.466,0,-9.074,1,0.0304,0.794,2.06e-06,0.0915,0.353,79.936,163133,4
2013-07-13,42,No New Friends (SFTB Remix),"DJ Khaled Featuring Drake, Rick Ross & Lil Wayne",2bvxIrwSsQiaHOePGrjnJ9,False,37,37,10,0.703,0.681,2,-6.356,1,0.133,0.00589,0,0.449,0.245,124.928,308333,4
2013-07-13,43,Highway Don't Care,Tim McGraw With Taylor Swift,2bvxIrwSsQiaHOePGrjnJ9,False,35,22,18,0.477,0.791,2,-5.348,1,0.0396,0.0259,0,0.0841,0.505,157.83,279067,4
2013-07-13,44,Started From The Bottom,Drake,2bvxIrwSsQiaHOePGrjnJ9,False,45,6,21,0.793,0.524,8,-7.827,1,0.156,0.0319,0,0.156,0.579,86.325,174133,4
2013-07-13,45,Don't Ya,Brett Eldredge,2bvxIrwSsQiaHOePGrjnJ9,False,54,45,6,0.537,0.693,9,-5.256,1,0.0847,0.0566,0,0.146,0.581,176.004,181210,4
2013-07-13,46,Beat This Summer,Brad Paisley,2bvxIrwSsQiaHOePGrjnJ9,False,50,46,16,0.563,0.722,6,-5.252,1,0.0407,0.313,0,0.393,0.801,150.039,281453,4
2013-07-13,47,Suit & Tie,Justin Timberlake Featuring JAY Z,2bvxIrwSsQiaHOePGrjnJ9,False,48,3,25,0.795,0.596,11,-3.799,0,0.219,0.103,0,0.164,0.357,101.985,326280,4
2013-07-13,48,DONE.,The Band Perry,2bvxIrwSsQiaHOePGrjnJ9,False,55,46,16,0.65,0.89,1,-2.995,1,0.0366,0.322,0,0.0543,0.757,100.053,205267,4
2013-07-13,49,22,Taylor Swift,2bvxIrwSsQiaHOePGrjnJ9,False,41,20,18,0.658,0.729,7,-6.561,1,0.0378,0.00215,0.0013,0.0752,0.668,104.007,230133,4
2013-07-13,50,Tapout,"Rich Gang Featuring Lil Wayne, Birdman, Future, Mack Maine, Nicki Minaj",2bvxIrwSsQiaHOePGrjnJ9,False,57,50,8,0.762,0.577,8,-5.229,1,0.175,0.0309,0,0.108,0.287,142.055,284587,4
2013-07-13,51,Hey Pretty Girl,Kip Moore,2bvxIrwSsQiaHOePGrjnJ9,False,60,51,15,0.291,0.4,2,-10.615,1,0.0306,0.145,1.86e-05,0.259,0.0935,83.112,215920,1
2013-07-13,52,See You Again,Carrie Underwood,2bvxIrwSsQiaHOePGrjnJ9,False,52,51,9,0.514,0.742,8,-2.525,1,0.0258,0.27,1.7e-06,0.085,0.47,101.0,246453,4
2013-07-13,53,Crazy Kids,Ke$ha Featuring will.i.am Or Juicy J,2bvxIrwSsQiaHOePGrjnJ9,False,59,53,5,0.742,0.706,0,-4.6,0,0.0433,0.0141,0.00568,0.133,0.478,128.03,230747,4
2013-07-13,54,Anywhere With You,Jake Owen,2bvxIrwSsQiaHOePGrjnJ9,False,47,46,15,0.475,0.936,5,-2.545,1,0.0413,0.0418,0,0.0873,0.598,151.988,209587,4
2013-07-13,55,Beat It,Sean Kingston Featuring Chris Brown & Wiz Khalifa,2bvxIrwSsQiaHOePGrjnJ9,False,58,55,10,0.477,0.637,1,-5.386,1,0.109,0.00487,0,0.284,0.555,198.12,253453,4
2013-07-13,56,Redneck Crazy,Tyler Farr,2bvxIrwSsQiaHOePGrjnJ9,False,63,56,5,0.487,0.667,7,-4.216,0,0.0309,0.153,0,0.161,0.463,145.854,216040,4
2013-07-13,57,Next To Me,Emeli Sande,2bvxIrwSsQiaHOePGrjnJ9,False,51,25,19,0.674,0.81,7,-5.117,0,0.0378,0.0923,4.74e-05,0.11,0.391,94.995,196867,4
2013-07-13,58,Jump Right In,Zac Brown Band,2bvxIrwSsQiaHOePGrjnJ9,False,65,58,10,0.697,0.82,1,-5.108,1,0.0575,0.0888,0,0.143,0.655,104.022,180813,4
2013-07-13,59,Lego House,Ed Sheeran,2bvxIrwSsQiaHOePGrjnJ9,False,53,42,14,0.592,0.637,11,-8.48,1,0.0992,0.562,0,0.13,0.565,159.701,185093,4
2013-07-13,60,Round Here,Florida Georgia Line,2bvxIrwSsQiaHOePGrjnJ9,False,76,60,3,0.523,0.954,1,-3.051,1,0.0374,0.00385,1.65e-06,0.243,0.901,141.982,215120,4
2013-07-13,61,All Over The Road,Easton Corbin,2bvxIrwSsQiaHOePGrjnJ9,False,66,61,8,0.491,0.841,5,-3.579,1,0.0421,0.0471,0,0.0886,0.721,199.851,163067,4
2013-07-13,62,Little Bit Of Everything,Keith Urban,2bvxIrwSsQiaHOePGrjnJ9,False,68,62,6,0.619,0.882,8,-5.99,1,0.0912,0.239,0,0.033,0.897,159.98,205707,4
2013-07-13,63,Demons,Imagine Dragons,2bvxIrwSsQiaHOePGrjnJ9,False,67,63,15,0.505,0.71,3,-3.015,1,0.0321,0.19,0.00025,0.329,0.428,89.938,175200,4
2013-07-13,64,We Still In This B****,B.o.B Featuring T.I. & Juicy J,2bvxIrwSsQiaHOePGrjnJ9,False,70,64,20,0.693,0.733,1,-5.126,1,0.139,0.013,0,0.0924,0.497,140.01,247987,4
2013-07-13,65,People Like Us,Kelly Clarkson,2bvxIrwSsQiaHOePGrjnJ9,False,73,65,7,0.6,0.787,6,-5.163,1,0.0366,0.043,0,0.358,0.608,127.977,258907,4
2013-07-13,66,Crooked Smile,J. Cole Featuring TLC,2bvxIrwSsQiaHOePGrjnJ9,False,74,66,2,0.606,0.784,7,-6.293,1,0.268,0.435,0,0.689,0.48,80.985,278573,4
2013-07-13,67,Fine China,Chris Brown,2bvxIrwSsQiaHOePGrjnJ9,False,62,31,13,0.654,0.731,10,-4.767,0,0.0568,0.0419,0,0.122,0.59,104.002,213200,4
2013-07-13,68,Right Now,Rihanna Featuring David Guetta,2bvxIrwSsQiaHOePGrjnJ9,False,90,68,2,0.668,0.64,3,-5.208,0,0.0888,0.049,0,0.0675,0.259,130.004,181627,4
2013-07-13,69,Counting Stars,OneRepublic,2bvxIrwSsQiaHOePGrjnJ9,False,32,32,2,0.664,0.705,1,-4.972,0,0.0382,0.0654,0,0.115,0.477,122.017,257840,4
2013-07-13,70,Harlem Shake,Baauer,2bvxIrwSsQiaHOePGrjnJ9,False,64,1,20,0.452,0.794,0,-5.151,1,0.0483,0.0111,0.00182,0.416,0.282,137.825,196664,4
2013-07-13,71,#thatPOWER,will.i.am Featuring Justin Bieber,2bvxIrwSsQiaHOePGrjnJ9,False,61,17,15,0.797,0.608,6,-6.096,0,0.0584,0.00112,7.66e-05,0.0748,0.402,127.999,279507,4
2013-07-13,72,Hey Girl,Billy Currington,2bvxIrwSsQiaHOePGrjnJ9,False,83,72,6,0.548,0.673,1,-5.29,1,0.0268,0.0158,0,0.0794,0.652,81.947,200533,4
2013-07-13,73,More Than Miles,Brantley Gilbert,2bvxIrwSsQiaHOePGrjnJ9,False,81,73,18,0.47,0.778,5,-5.992,1,0.037,0.0295,0.000225,0.354,0.448,152.005,252867,4
2013-07-13,74,Bugatti,Ace Hood Featuring Future & Rick Ross,2bvxIrwSsQiaHOePGrjnJ9,False,72,33,20,0.6,0.592,1,-4.947,1,0.0545,0.0191,0,0.0955,0.0663,130.205,269267,4
2013-07-13,75,We Own It (Fast & Furious),2 Chainz & Wiz Khalifa,2bvxIrwSsQiaHOePGrjnJ9,False,71,16,6,0.554,0.899,8,-4.573,1,0.408,0.0521,0,0.0568,0.552,171.966,227893,4
2013-07-13,76,What About Love,Austin Mahone,2bvxIrwSsQiaHOePGrjnJ9,False,88,74,3,0.632,0.784,2,-7.457,1,0.0393,0.000157,3.6e-05,0.037,0.278,100.019,203344,4
2013-07-13,77,How Many Drinks?,Miguel,2bvxIrwSsQiaHOePGrjnJ9,False,87,77,11,0.379,0.608,0,-7.011,0,0.134,0.00311,0.000614,0.248,0.241,81.822,272987,4
2013-07-13,78,Bubble Butt,"Major Lazer Featuring Bruno Mars, Tyga & Mystic",2bvxIrwSsQiaHOePGrjnJ9,False,95,78,3,0.765,0.771,7,-6.99,1,0.347,0.0115,0.00237,0.606,0.394,194.072,227813,4
2013-07-13,79,Drunk Last Night,Eli Young Band,4hnK8P3v7kE7T4PMBYwRhu,True,0,79,1,0.528,0.856,7,-4.605,1,0.0351,0.052,0,0.0988,0.572,87.019,219213,4
2013-07-13,80,Gentleman,PSY,4hnK8P3v7kE7T4PMBYwRhu,False,79,5,12,0.861,0.742,3,-3.292,0,0.148,0.0035,0,0.0643,0.655,126.01,194960,4
2013-07-13,81,Wake Me Up!,Avicii,0nrRP2bk19rLc0orkWPQk2,True,0,81,1,0.532,0.783,2,-5.697,1,0.0523,0.0038,0.0012,0.161,0.643,124.08,247427,4
2013-07-13,82,It Goes Like This,Thomas Rhett,0nrRP2bk19rLc0orkWPQk2,False,94,82,3,0.543,0.837,11,-6.448,1,0.0608,0.117,0,0.0872,0.506,168.056,186080,4
2013-07-13,83,Ain't Worried About Nothin,French Montana,0nrRP2bk19rLc0orkWPQk2,False,97,83,2,0.688,0.904,1,-2.234,1,0.106,0.0229,0,0.0909,0.71,127.887,212427,4
2013-07-13,84,Point At You,Justin Moore,0nrRP2bk19rLc0orkWPQk2,False,89,84,5,0.626,0.805,7,-5.81,1,0.0449,0.0126,0,0.156,0.882,116.03,180720,4
2013-07-13,85,High School,Nicki Minaj Featuring Lil Wayne,0nrRP2bk19rLc0orkWPQk2,False,84,64,13,0.531,0.683,1,-4.093,0,0.333,0.135,0.00265,0.22,0.212,84.817,218747,4
2013-07-13,86,Black Skinhead,Kanye West,0nrRP2bk19rLc0orkWPQk2,False,69,69,2,0.766,0.809,1,-6.123,1,0.279,0.0011,0,0.168,0.325,130.127,188013,4
2013-07-13,87,Don't Think They Know,Chris Brown Featuring Aaliyah,3uVCPFmavlWGQUqeYh8HhR,True,0,87,1,0.479,0.606,0,-6.424,0,0.0676,0.0241,0,0.33,0.626,88.573,237987,5
2013-07-13,88,Young And Beautiful,Lana Del Rey,3uVCPFmavlWGQUqeYh8HhR,False,86,22,10,0.324,0.416,11,-8.92,0,0.0368,0.262,3.69e-05,0.11,0.151,113.986,236053,4
2013-07-13,89,Alive,Krewella,3uVCPFmavlWGQUqeYh8HhR,False,82,32,20,0.663,0.822,9,-2.909,1,0.0557,0.00413,0.00318,0.234,0.567,128.002,290760,4
2013-07-13,90,New Slaves,Kanye West,3uVCPFmavlWGQUqeYh8HhR,False,56,56,2,0.506,0.59,1,-4.322,1,0.076,0.165,1.09e-05,0.096,0.359,141.099,256093,4
2013-07-13,91,Brave,Sara Bareilles,3uVCPFmavlWGQUqeYh8HhR,False,100,61,3,0.551,0.836,10,-3.838,0,0.0524,0.00502,2.1e-05,0.0425,0.758,185.063,220573,4
2013-07-13,92,Ooh La La,Britney Spears,3uVCPFmavlWGQUqeYh8HhR,False,85,85,2,0.69,0.568,6,-4.501,1,0.0525,0.0165,6.98e-06,0.111,0.728,128.059,257493,4
2013-07-13,93,Parking Lot Party,Lee Brice,4HFNGbVmsMV5lHUvDuXLkl,True,0,93,1,0.54,0.86,1,-5.763,1,0.081,0.00646,0,0.629,0.856,171.72,207893,4
2013-07-13,94,Wop,J. Dash,4HFNGbVmsMV5lHUvDuXLkl,False,0,52,4,0.836,0.817,7,-5.672,1,0.0677,0.00968,0,0.114,0.647,112.007,230627,4
2013-07-13,95,Beneath Your Beautiful,Labrinth Featuring Emeli Sande,4HFNGbVmsMV5lHUvDuXLkl,False,0,88,3,0.558,0.522,2,-5.857,1,0.036,0.228,0,0.104,0.228,83.977,271813,4
2013-07-13,96,Sweater Weather,The Neighbourhood,4HFNGbVmsMV5lHUvDuXLkl,False,0,95,3,0.612,0.807,10,-2.81,1,0.0336,0.0495,0.0177,0.101,0.398,124.053,240400,4
2013-07-13,97,Wild For The Night,A$AP Rocky Featuring Skrillex,4HFNGbVmsMV5lHUvDuXLkl,False,96,80,16,0.757,0.848,2,-4.234,1,0.335,0.0481,0,0.121,0.686,139.995,212640,4
2013-07-13,98,Goodbye Town,Lady Antebellum,1qDahv56bbyCytqvnvY2Yp,True,0,98,1,0.678,0.72,4,-6.034,1,0.027,0.165,5.73e-06,0.114,0.538,95.027,288800,4
2013-07-13,99,Play Hard,David Guetta Featuring Ne-Yo & Akon,1qDahv56bbyCytqvnvY2Yp,False,0,64,5,0.691,0.921,8,-1.702,0,0.0535,0.174,0,0.331,0.802,130.072,201000,4
2013-07-13,100,Beware,Big Sean Featuring Lil Wayne & Jhene Aiko,6bxUnsSGZCmoHHU5auwtps,True,0,100,1,0.7,0.554,1,-5.909,1,0.187,0.219,1.36e-06,0.419,0.0633,97.127,235187,4
