date,position,title,artist,spotify_id,is_new,last_pos,peak_pos,weeks,danceability,energy,key,loudness,mode,speechiness,acousticness,instrumentalness,liveness,valence,tempo,duration_ms,time_signature
2006-06-17,1,Hips Don't Lie,Shakira Featuring Wyclef Jean,3oSvnVnypxfxRHVHawpwQu,False,9,1,12,0.778,0.824,10,-5.892,0,0.0712,0.284,0,0.405,0.756,100.024,218093,4
2006-06-17,2,Ridin',Chamillionaire Featuring Krayzie Bone,3oSvnVnypxfxRHVHawpwQu,False,1,1,16,0.787,0.799,8,-4.68,0,0.0993,0.189,0,0.3,0.835,143.052,303053,4
2006-06-17,3,Promiscuous,Nelly Furtado Featuring Timbaland,3oSvnVnypxfxRHVHawpwQu,False,3,3,5,0.795,0.978,10,-6.097,0,0.0459,0.046,8.29e-05,0.143,0.843,114.321,242200,4
2006-06-17,4,It's Goin' Down,Yung Joc,3oSvnVnypxfxRHVHawpwQu,False,24,4,10,0.888,0.577,1,-7.702,0,0.0612,0.0986,0,0.131,0.609,84.003,241840,4
2006-06-17,5,Bad Day,Daniel Powter,3oSvnVnypxfxRHVHawpwQu,False,2,1,17,0.599,0.785,3,-4.013,1,0.0309,0.448,0.00336,0.151,0.52,140.046,233640,4
2006-06-17,6,Where'd You Go,Fort Minor Featuring Holly Brook,3oSvnVnypxfxRHVHawpwQu,False,4,4,9,0.684,0.819,1,-3.309,0,0.238,0.262,0.00197,0.113,0.25,179.999,231867,4
2006-06-17,7,SOS,Rihanna,3oSvnVnypxfxRHVHawpwQu,False,5,1,17,0.677,0.671,7,-4.905,1,0.0361,0.004,5.07e-05,0.413,0.527,137.046,238920,4
2006-06-17,8,Me & U,Cassie,3oSvnVnypxfxRHVHawpwQu,False,6,6,8,0.803,0.454,8,-4.802,0,0.0294,0.352,0,0.0655,0.739,99.99,192213,4
2006-06-17,9,Unfaithful,Rihanna,3oSvnVnypxfxRHVHawpwQu,False,12,9,6,0.588,0.391,0,-8.607,0,0.0334,0.839,0,0.227,0.349,144.069,226973,4
2006-06-17,10,Temperature,Sean Paul,3oSvnVnypxfxRHVHawpwQu,False,7,1,22,0.951,0.6,0,-4.675,0,0.0685,0.106,0,0.0712,0.822,125.04,218573,4
2006-06-17,11,Snap Yo Fingers,Lil Jon Featuring E-40 & Sean Paul Of The YoungBloodZ,3oSvnVnypxfxRHVHawpwQu,False,8,7,11,0.835,0.757,8,-5.029,0,0.23,0.00647,0,0.29,0.626,82.038,274387,4
2006-06-17,12,Dani California,Red Hot Chili Peppers,3oSvnVnypxfxRHVHawpwQu,False,11,6,9,0.556,0.913,0,-2.36,1,0.0437,0.0193,8.59e-06,0.346,0.73,96.184,282160,4
2006-06-17,13,Over My Head (Cable Car),The Fray,3oSvnVnypxfxRHVHawpwQu,False,10,8,17,0.592,0.729,8,-4.156,1,0.0448,0.022,0,0.0653,0.709,116.03,236267,4
2006-06-17,14,So What,Field Mob Featuring Ciara,3oSvnVnypxfxRHVHawpwQu,False,14,14,9,0.931,0.486,6,-10.558,1,0.139,0.0579,0,0.161,0.896,120.026,216000,4
2006-06-17,15,Gimme That,Chris Brown Featuring Lil Wayne,3oSvnVnypxfxRHVHawpwQu,False,16,15,9,0.678,0.572,11,-7.033,0,0.0466,0.00374,6.59e-05,0.118,0.444,87.165,186827,4
2006-06-17,16,Unwritten,Natasha Bedingfield,3oSvnVnypxfxRHVHawpwQu,False,17,5,28,0.706,0.8,5,-6.333,1,0.0399,0.00584,0,0.0822,0.629,100.011,259333,4
2006-06-17,17,What You Know,T.I.,3oSvnVnypxfxRHVHawpwQu,False,13,3,14,0.551,0.81,11,-4.365,1,0.0344,0.0155,0,0.169,0.332,73.464,274333,4
2006-06-17,18,What's Left Of Me,Nick Lachey,3oSvnVnypxfxRHVHawpwQu,False,18,6,15,0.421,0.728,7,-5.644,1,0.035,0.136,0,0.136,0.311,150.12,244667,4
2006-06-17,19,Ms. New Booty,Bubba Sparxxx Featuring Ying Yang Twins & Mr. ColliPark,3oSvnVnypxfxRHVHawpwQu,False,15,7,20,0.64,0.62,1,-5.931,1,0.416,0.016,0,0.0831,0.609,129.37,252653,5
2006-06-17,20,Savin' Me,Nickelback,3oSvnVnypxfxRHVHawpwQu,False,19,19,14,0.441,0.815,3,-4.088,1,0.0276,0.000731,0,0.414,0.522,164.007,219320,4
2006-06-17,21,Move Along,The All-American Rejects,3oSvnVnypxfxRHVHawpwQu,False,21,15,19,0.518,0.916,3,-3.858,1,0.0454,0.000148,0,0.291,0.646,109.864,238880,4
2006-06-17,22,Black Horse & The Cherry Tree,KT Tunstall,3oSvnVnypxfxRHVHawpwQu,False,20,20,13,0.748,0.786,4,-7.788,0,0.0641,0.328,0,0.34,0.917,104.833,172373,4
2006-06-17,23,You're Beautiful,James Blunt,3oSvnVnypxfxRHVHawpwQu,False,22,1,32,0.675,0.479,0,-9.87,0,0.0278,0.633,1.76e-05,0.088,0.454,81.998,209493,4
2006-06-17,24,Walk Away,Kelly Clarkson,3oSvnVnypxfxRHVHawpwQu,False,23,12,22,0.75,0.888,0,-4.524,1,0.0426,0.0147,1.11e-06,0.0759,0.935,115.973,189307,4
2006-06-17,25,I Write Sins Not Tragedies,Panic! At The Disco,3oSvnVnypxfxRHVHawpwQu,False,31,25,14,0.569,0.83,9,-4.106,0,0.14,0.0807,0,0.114,0.609,170.094,186635,4
2006-06-17,26,Crazy,Gnarls Barkley,3oSvnVnypxfxRHVHawpwQu,False,35,26,5,0.835,0.741,8,-1.609,1,0.0339,0.0172,0.0577,0.0826,0.612,111.963,182066,4
2006-06-17,27,Buttons,The Pussycat Dolls Featuring Snoop Dogg,3oSvnVnypxfxRHVHawpwQu,False,37,27,4,0.57,0.821,2,-4.38,1,0.267,0.178,0,0.289,0.408,210.857,225560,4
2006-06-17,28,Be Without You,Mary J. Blige,3oSvnVnypxfxRHVHawpwQu,False,28,3,30,0.724,0.705,2,-5.859,0,0.112,0.067,0,0.262,0.662,146.589,246333,4
2006-06-17,29,When You're Mad,Ne-Yo,3oSvnVnypxfxRHVHawpwQu,False,26,15,14,0.66,0.548,6,-7.127,1,0.215,0.364,0,0.108,0.436,86.947,222000,4
2006-06-17,30,"Lean Wit It, Rock Wit It",Dem Franchize Boyz Featuring Lil Peanut & Charlay,3oSvnVnypxfxRHVHawpwQu,False,25,7,22,0.886,0.62,5,-5.854,1,0.307,0.082,0,0.1,0.6,76.035,229813,4
2006-06-17,31,Bossy,Kelis Featuring Too $hort,3oSvnVnypxfxRHVHawpwQu,False,30,30,5,0.906,0.624,4,-5.556,1,0.179,0.000185,6.21e-06,0.0608,0.775,84.009,274947,4
2006-06-17,32,Why You Wanna,T.I.,3oSvnVnypxfxRHVHawpwQu,False,33,32,8,0.802,0.772,1,-4.893,0,0.192,0.358,0,0.0603,0.654,96.046,215000,4
2006-06-17,33,Enough Cryin,Mary J. Blige Featuring Brook-Lyn,3oSvnVnypxfxRHVHawpwQu,False,36,32,9,0.784,0.587,9,-6.698,1,0.364,0.125,0.000101,0.0358,0.623,96.842,260893,4
2006-06-17,34,Summertime,Kenny Chesney,3oSvnVnypxfxRHVHawpwQu,False,38,34,8,0.48,0.928,4,-5.501,1,0.0899,0.169,0,0.0479,0.713,167.986,206587,4
2006-06-17,35,Everytime We Touch,Cascada,3oSvnVnypxfxRHVHawpwQu,False,32,10,27,0.633,0.976,8,-5.362,1,0.0519,0.00281,1.29e-05,0.382,0.493,142.027,197124,4
2006-06-17,36,Who Says You Can't Go Home,Bon Jovi,3oSvnVnypxfxRHVHawpwQu,False,34,23,21,0.537,0.885,7,-3.641,1,0.0343,0.0437,0,0.274,0.802,131.698,230280,4
2006-06-17,37,What Hurts The Most,Rascal Flatts,3oSvnVnypxfxRHVHawpwQu,False,29,6,18,0.537,0.674,5,-5.134,0,0.0277,0.0088,0,0.265,0.33,136.002,214107,4
2006-06-17,38,Do It To It,Cherish Featuring Sean Paul Of The YoungBloodZ,3oSvnVnypxfxRHVHawpwQu,False,45,38,5,0.826,0.67,2,-5.559,1,0.169,0.00798,0,0.495,0.794,74.007,226293,4
2006-06-17,39,Torn,LeToya,3oSvnVnypxfxRHVHawpwQu,False,48,39,7,0.422,0.894,11,-3.507,0,0.332,0.262,0,0.142,0.636,152.17,249253,4
2006-06-17,40,Not Ready To Make Nice,Dixie Chicks,3oSvnVnypxfxRHVHawpwQu,False,39,23,6,0.425,0.554,6,-4.145,1,0.0298,0.134,8.56e-05,0.0963,0.288,83.917,237297,4
2006-06-17,41,Gettin' Some,Shawnna,3oSvnVnypxfxRHVHawpwQu,False,42,31,12,0.823,0.586,4,-6.044,0,0.336,0.0901,0,0.0605,0.611,78.054,202760,4
2006-06-17,42,When The Stars Go Blue,Tim McGraw,3oSvnVnypxfxRHVHawpwQu,False,40,37,10,0.445,0.682,10,-6.686,1,0.0289,0.357,7.28e-06,0.109,0.631,181.64,235280,4
2006-06-17,43,Miss Murder,AFI,3oSvnVnypxfxRHVHawpwQu,False,61,43,5,0.308,0.873,8,-4.542,1,0.0533,0.00022,0.000729,0.0974,0.686,143.519,206587,4
2006-06-17,44,Say I,Christina Milian Featuring Young Jeezy,3oSvnVnypxfxRHVHawpwQu,False,27,21,10,0.685,0.904,8,-2.308,1,0.141,0.0164,4.9e-06,0.643,0.663,100.109,211440,4
2006-06-17,45,DJ Play A Love Song,Jamie Foxx Featuring Twista,3oSvnVnypxfxRHVHawpwQu,False,51,45,7,0.793,0.618,2,-8.664,1,0.108,0.109,0,0.331,0.31,119.984,258800,4
2006-06-17,46,I Love My B****,Busta Rhymes Featuring will.i.am & Kelis,3oSvnVnypxfxRHVHawpwQu,False,98,46,2,0.604,0.808,0,-5.805,0,0.314,0.0297,0,0.0493,0.688,193.894,227667,4
2006-06-17,47,For You I Will (Confidence),Teddy Geiger,3oSvnVnypxfxRHVHawpwQu,False,41,29,18,0.375,0.539,1,-12.153,0,0.042,0.0363,0.000233,0.132,0.0772,178.801,227596,3
2006-06-17,48,Settle For A Slowdown,Dierks Bentley,3oSvnVnypxfxRHVHawpwQu,False,44,42,12,0.532,0.665,5,-5.632,1,0.0318,0.0813,1.85e-05,0.332,0.213,81.002,223200,4
2006-06-17,49,Don't Forget To Remember Me,Carrie Underwood,3oSvnVnypxfxRHVHawpwQu,False,55,49,7,0.434,0.608,2,-4.281,1,0.0311,0.564,0,0.283,0.331,78.606,240267,4
2006-06-17,50,Breathe (2 AM),Anna Nalick,3oSvnVnypxfxRHVHawpwQu,False,50,45,23,0.386,0.452,2,-7.715,1,0.0278,0.417,0,0.0881,0.287,169.837,279827,3
2006-06-17,51,Doing Too Much,Paula DeAnda Featuring Baby Bash,3oSvnVnypxfxRHVHawpwQu,False,59,51,5,0.716,0.668,2,-5.136,1,0.083,0.279,0,0.337,0.744,141.006,247431,4
2006-06-17,52,Wanted Dead Or Alive,Chris Daughtry,3oSvnVnypxfxRHVHawpwQu,False,43,43,2,0.483,0.668,7,-6.861,1,0.04,0.000938,0,0.107,0.329,156.033,271573,4
2006-06-17,53,Last Day Of My Life,Phil Vassar,3oSvnVnypxfxRHVHawpwQu,False,52,47,6,0.557,0.549,0,-6.674,1,0.0246,0.272,0,0.109,0.268,139.945,234307,3
2006-06-17,54,Something's Gotta Give,LeAnn Rimes,3oSvnVnypxfxRHVHawpwQu,False,53,51,13,0.647,0.85,2,-3.464,1,0.0292,0.0771,0,0.0662,0.471,109.002,236840,4
2006-06-17,55,The Adventure,Angels & Airwaves,3oSvnVnypxfxRHVHawpwQu,False,57,55,8,0.543,0.878,11,-5.994,1,0.0472,0.0485,0.00101,0.125,0.189,144.157,312533,4
2006-06-17,56,Hate Me,Blue October,3oSvnVnypxfxRHVHawpwQu,False,60,56,8,0.449,0.691,4,-5.65,0,0.0349,0.477,0,0.0966,0.201,93.267,380200,4
2006-06-17,57,The World,Brad Paisley,3oSvnVnypxfxRHVHawpwQu,False,63,57,7,0.446,0.947,4,-6.594,1,0.052,0.302,0.000692,0.0979,0.88,176.798,241680,4
2006-06-17,58,Girl,Paul Wall,3oSvnVnypxfxRHVHawpwQu,False,49,35,14,0.693,0.729,4,-8.281,0,0.0347,0.000107,1.9e-05,0.119,0.614,83.989,278453,4
2006-06-17,59,Life Is A Highway,Rascal Flatts,2Fs18NaCDuluPG1DHGw1XG,True,0,59,1,0.582,0.952,5,-3.848,1,0.0731,0.00324,0,0.223,0.655,103.027,276320,4
2006-06-17,60,Me And My Gang,Rascal Flatts,2Fs18NaCDuluPG1DHGw1XG,False,62,60,4,0.628,0.9,7,-3.719,1,0.0408,0.0775,0,0.0454,0.611,108.745,217987,4
2006-06-17,61,U And Dat,E-40 Featuring T-Pain & Kandi Girl,2Fs18NaCDuluPG1DHGw1XG,False,72,61,4,0.858,0.484,6,-7.448,0,0.277,0.0241,1.8e-06,0.123,0.329,99.992,202720,4
2006-06-17,62,Why,Jason Aldean,2Fs18NaCDuluPG1DHGw1XG,False,56,43,14,0.568,0.695,9,-3.828,1,0.0294,0.0688,0,0.15,0.218,135.926,213733,4
2006-06-17,63,Let U Go,Ashley Parker Angel,2Fs18NaCDuluPG1DHGw1XG,False,46,12,8,0.382,0.932,0,-3.027,1,0.0734,0.00946,0,0.301,0.321,171.999,233280,4
2006-06-17,64,Hustlin',Rick Ross,2Fs18NaCDuluPG1DHGw1XG,False,67,64,5,0.502,0.652,9,-7.224,1,0.3,0.0848,0,0.0675,0.648,136.08,254093,4
2006-06-17,65,Leave The Pieces,The Wreckers,2Fs18NaCDuluPG1DHGw1XG,False,68,65,2,0.514,0.679,6,-6.117,1,0.0273,0.0255,0,0.0594,0.496,164.109,210233,4
2006-06-17,66,Girl Next Door,Saving Jane,2Fs18NaCDuluPG1DHGw1XG,False,54,31,17,0.627,0.81,2,-5.684,1,0.0437,0.0134,0,0.109,0.496,122.058,203253,4
2006-06-17,67,Every Time I Hear Your Name,Keith Anderson,2Fs18NaCDuluPG1DHGw1XG,False,73,67,9,0.562,0.757,1,-3.945,1,0.0253,0.277,0,0.0745,0.299,93.02,263027,4
2006-06-17,68,(When You Gonna) Give It Up To Me,Sean Paul Feat. Keyshia Cole,2Fs18NaCDuluPG1DHGw1XG,False,97,68,2,0.951,0.6,0,-4.675,0,0.0685,0.106,0,0.0712,0.822,125.04,218573,4
2006-06-17,69,The Real Thing,Bo Bice,2Fs18NaCDuluPG1DHGw1XG,False,66,56,13,0.494,0.87,2,-4.33,1,0.0413,0.0707,2.98e-05,0.0798,0.504,146.882,201667,4
2006-06-17,70,Beep,The Pussycat Dolls Featuring will.i.am,2Fs18NaCDuluPG1DHGw1XG,False,64,13,20,0.935,0.745,7,-6.391,1,0.0431,0.00914,0,0.116,0.518,103.691,229360,4
2006-06-17,71,"A Little Less Sixteen Candles, A Little More Touch Me",Fall Out Boy,2Fs18NaCDuluPG1DHGw1XG,False,70,65,11,0.538,0.889,7,-3.586,1,0.0596,0.00704,0,0.312,0.696,133.044,169027,4
2006-06-17,72,A Little Too Late,Toby Keith,2Fs18NaCDuluPG1DHGw1XG,False,79,72,3,0.635,0.749,11,-5.815,1,0.0294,0.175,3.71e-05,0.139,0.628,100.95,248040,4
2006-06-17,73,Size Matters (Someday),Joe Nichols,2Fs18NaCDuluPG1DHGw1XG,False,74,73,10,0.562,0.754,5,-5.163,1,0.0392,0.0199,0,0.311,0.676,175.021,170960,4
2006-06-17,74,MakeDamnSure,Taking Back Sunday,2Fs18NaCDuluPG1DHGw1XG,False,78,48,7,0.553,0.837,6,-5.608,1,0.0452,0.00941,0,0.372,0.432,140.495,208280,4
2006-06-17,75,Stay With You,Goo Goo Dolls,2Fs18NaCDuluPG1DHGw1XG,False,76,51,8,0.433,0.868,0,-3.03,1,0.0422,0.00127,2.87e-06,0.132,0.41,139.896,236267,4
2006-06-17,76,Life Ain't Always Beautiful,Gary Allan,2Fs18NaCDuluPG1DHGw1XG,False,84,76,5,0.481,0.508,2,-7.666,1,0.0248,0.216,0.000175,0.105,0.268,86.013,224613,4
2006-06-17,77,4 Minutes,Avant,2Fs18NaCDuluPG1DHGw1XG,False,77,52,13,0.828,0.6,10,-5.429,1,0.162,0.0942,0,0.126,0.655,119.969,240320,4
2006-06-17,78,If You're Going Through Hell (Before The Devil Even Knows),Rodney Atkins,2Fs18NaCDuluPG1DHGw1XG,False,89,78,3,0.625,0.848,2,-4.008,1,0.0314,0.105,0,0.23,0.716,137.993,235427,4
2006-06-17,79,Kick Push,Lupe Fiasco,6nz35DNIzbtj5ztpDEcW1j,True,0,79,1,0.652,0.809,5,-5.276,1,0.17,0.164,0,0.175,0.512,94.786,254466,4
2006-06-17,80,Ridin' Rims,Dem Franchize Boyz,6nz35DNIzbtj5ztpDEcW1j,False,92,80,2,0.739,0.603,2,-7.788,1,0.0784,0.081,0,0.0833,0.496,158.873,323960,4
2006-06-17,81,Crazy Bitch,Buckcherry,6nz35DNIzbtj5ztpDEcW1j,False,94,81,5,0.661,0.978,1,-3.064,0,0.107,0.0247,0,0.0856,0.592,98.019,204960,4
2006-06-17,82,How To Save A Life,The Fray,6nz35DNIzbtj5ztpDEcW1j,False,90,82,8,0.64,0.743,10,-4.08,1,0.0379,0.269,0,0.101,0.361,122.035,262533,4
2006-06-17,83,"Steady, As She Goes",The Raconteurs,6nz35DNIzbtj5ztpDEcW1j,False,91,82,4,0.524,0.578,9,-4.563,1,0.12,0.0132,0.00921,0.108,0.537,123.669,215267,4
2006-06-17,84,Bring It On Home,Little Big Town,6nz35DNIzbtj5ztpDEcW1j,False,95,84,2,0.55,0.514,8,-7.348,1,0.0265,0.118,0,0.0906,0.311,138.105,260627,4
2006-06-17,85,Back Like That,Ghostface Killah Featuring Ne-Yo,6nz35DNIzbtj5ztpDEcW1j,False,82,61,10,0.718,0.663,8,-5.154,1,0.19,0.013,0,0.0631,0.488,95.728,242000,4
2006-06-17,86,One,Mary J. Blige And U2,3Lk7RWStfLaHG7lXsuS87j,True,0,86,1,0.344,0.874,0,-3.161,1,0.0777,0.0841,0,0.129,0.269,185.888,260467,4
2006-06-17,87,Takin' It To The Streets,Taylor Hicks,3Lk7RWStfLaHG7lXsuS87j,False,69,69,2,0.463,0.524,1,-8.207,1,0.0316,0.026,0,0.102,0.308,144.055,248693,4
2006-06-17,88,Can't Let Go,Anthony Hamilton,3Lk7RWStfLaHG7lXsuS87j,False,96,71,14,0.65,0.501,10,-6.905,1,0.0963,0.582,0,0.112,0.374,127.984,232533,4
2006-06-17,89,Good Luck Charm,Jagged Edge,3Lk7RWStfLaHG7lXsuS87j,False,86,73,9,0.634,0.653,11,-5.89,1,0.0689,0.434,0,0.109,0.5,116.156,264640,4
2006-06-17,90,Shoulder Lean,Young Dro Featuring T.I.,2OqYarizUUGzSSNHPrDEii,True,0,90,1,0.7,0.518,4,-7.191,0,0.177,0.0471,0,0.1,0.542,75.973,258680,4
2006-06-17,91,Best Friend,50 Cent & Olivia,2OqYarizUUGzSSNHPrDEii,False,83,35,15,0.549,0.636,10,-3.923,0,0.376,0.395,0,0.0974,0.661,182.363,251547,4
2006-06-17,92,I Got You,Craig Morgan,2OqYarizUUGzSSNHPrDEii,False,99,92,3,0.588,0.702,3,-5.295,1,0.0269,0.316,0,0.189,0.597,106.052,233653,4
2006-06-17,93,Chasing Cars,Snow Patrol,2OqYarizUUGzSSNHPrDEii,False,71,54,3,0.563,0.592,9,-4.571,1,0.0276,0.209,5.08e-05,0.132,0.136,104.016,267933,4
2006-06-17,94,Hustler Musik,Lil Wayne,2OqYarizUUGzSSNHPrDEii,False,0,87,6,0.661,0.746,8,-2.223,0,0.25,0.362,0,0.454,0.678,83.935,303667,4
2006-06-17,95,Animal I Have Become,Three Days Grace,2OqYarizUUGzSSNHPrDEii,False,0,88,3,0.553,0.853,8,-3.668,1,0.0339,0.000684,0,0.126,0.506,122.023,231400,4
2006-06-17,96,Don't Wait,Dashboard Confessional,2OqYarizUUGzSSNHPrDEii,False,80,80,2,0.464,0.13,2,-12.048,1,0.0313,0.912,0.000211,0.104,0.0618,74.096,233514,4
2006-06-17,97,Poppin' My Collar,Three 6 Mafia,2OqYarizUUGzSSNHPrDEii,False,75,21,16,0.729,0.795,7,-4.579,1,0.144,0.354,0,0.536,0.856,146.747,176880,4
2006-06-17,98,I Can't Unlove You,Kenny Rogers,6Yp4C2d3ZYhbUc4xiQAySq,True,0,98,1,0.538,0.457,10,-5.876,1,0.027,0.0846,2.76e-06,0.158,0.439,139.827,204653,4
2006-06-17,99,Control Myself,LL Cool J Featuring Jennifer Lopez,6Yp4C2d3ZYhbUc4xiQAySq,False,81,4,11,0.825,0.876,10,-6.556,0,0.211,0.00928,1.2e-05,0.205,0.48,120.066,233973,4
2006-06-17,100,Wherever You Are,Jack Ingram,6Yp4C2d3ZYhbUc4xiQAySq,False,93,63,13,0.572,0.81,2,-5.629,1,0.0315,0.058,0,0.101,0.575,107.906,215560,4
