date,position,title,artist,spotify_id,is_new,last_pos,peak_pos,weeks,danceability,energy,key,loudness,mode,speechiness,acousticness,instrumentalness,liveness,valence,tempo,duration_ms,time_signature
2018-07-28,1,In My Feelings,Drake,,False,1,1,3,0.835,0.626,1,-5.833,1,0.125,0.0589,6e-05,0.396,0.35,91.03,217925,4
2018-07-28,2,I Like It,"Cardi B, Bad Bunny & J Balvin",,False,2,1,15,0.816,0.726,5,-3.998,0,0.129,0.099,0,0.372,0.65,136.048,253390,4
2018-07-28,3,Girls Like You,Maroon 5 Featuring Cardi B,,False,3,3,8,0.609,0.529,0,-6.859,1,0.106,0.545,0,0.127,0.474,60.349,235680,4
2018-07-28,4,Nice For What,Drake,,False,4,1,15,0.585,0.909,8,-6.474,1,0.0707,0.0891,9.7e-05,0.119,0.758,93.372,210747,4
2018-07-28,5,Boo'd Up,Ella Mai,,False,5,5,16,0.561,0.779,10,-5.107,0,0.0531,0.0862,0,0.078,0.235,81.965,256064,4
2018-07-28,6,Lucid Dreams,Juice WRLD,,False,7,3,10,0.511,0.566,6,-7.23,0,0.2,0.349,0,0.34,0.218,83.903,239836,4
2018-07-28,7,Better Now,Post Malone,,False,12,7,12,0.68,0.578,10,-5.804,1,0.04,0.331,0,0.135,0.341,145.038,231267,4
2018-07-28,8,No Tears Left To Cry,Ariana Grande,,False,8,3,13,0.699,0.713,9,-5.507,0,0.0594,0.04,3.11e-06,0.294,0.354,121.993,205920,4
2018-07-28,9,Psycho,Post Malone Featuring Ty Dolla $ign,,False,9,1,21,0.75,0.56,8,-8.094,1,0.105,0.546,0,0.111,0.459,140.06,221440,4
2018-07-28,10,God's Plan,Drake,,False,6,1,26,0.754,0.449,7,-9.211,1,0.109,0.0332,8.29e-05,0.552,0.357,77.169,198973,4
2018-07-28,11,God Is A Woman,Ariana Grande,5OCJzvD7sykQEKHH7qAC3C,True,0,11,1,0.602,0.658,1,-5.934,1,0.0558,0.0233,6e-05,0.237,0.268,145.031,197547,4
2018-07-28,12,Delicate,Taylor Swift,5OCJzvD7sykQEKHH7qAC3C,False,15,12,19,0.75,0.404,9,-10.178,0,0.0682,0.216,0.000357,0.0911,0.0499,95.045,232253,4
2018-07-28,13,Taste,Tyga Featuring Offset,5OCJzvD7sykQEKHH7qAC3C,False,18,13,8,0.884,0.559,0,-7.442,1,0.12,0.0236,0,0.101,0.342,97.994,232959,4
2018-07-28,14,The Middle,"Zedd, Maren Morris & Grey",5OCJzvD7sykQEKHH7qAC3C,False,13,5,25,0.753,0.657,7,-3.061,1,0.0449,0.171,0,0.112,0.437,107.01,184732,4
2018-07-28,15,Sad!,XXXTENTACION,5OCJzvD7sykQEKHH7qAC3C,False,10,1,20,0.74,0.613,8,-4.88,1,0.145,0.258,0.00372,0.123,0.473,75.023,166606,4
2018-07-28,16,Yes Indeed,Lil Baby & Drake,5OCJzvD7sykQEKHH7qAC3C,False,17,6,10,0.963,0.346,5,-9.309,0,0.53,0.0355,0,0.108,0.562,119.957,142273,4
2018-07-28,17,Meant To Be,Bebe Rexha & Florida Georgia Line,5OCJzvD7sykQEKHH7qAC3C,False,14,2,39,0.643,0.783,10,-6.458,1,0.0856,0.047,0,0.083,0.579,154.084,163870,4
2018-07-28,18,Friends,Marshmello & Anne-Marie,5OCJzvD7sykQEKHH7qAC3C,False,20,11,23,0.626,0.88,9,-2.384,0,0.0504,0.205,0,0.128,0.534,95.079,202621,4
2018-07-28,19,Perfect,Ed Sheeran,5OCJzvD7sykQEKHH7qAC3C,False,22,1,47,0.598,0.448,8,-6.312,1,0.0232,0.162,0,0.106,0.168,95.009,263400,3
2018-07-28,20,Nonstop,Drake,5OCJzvD7sykQEKHH7qAC3C,False,11,2,3,0.912,0.412,7,-8.074,1,0.123,0.0165,0.0126,0.104,0.423,154.983,238614,4
2018-07-28,21,Love Lies,Khalid & Normani,5OCJzvD7sykQEKHH7qAC3C,False,25,21,22,0.708,0.648,6,-5.626,1,0.0449,0.0956,0,0.134,0.338,143.955,201707,4
2018-07-28,22,Mine,Bazzi,5OCJzvD7sykQEKHH7qAC3C,False,19,11,26,0.71,0.789,4,-3.874,1,0.0722,0.0161,2.77e-06,0.451,0.717,142.929,131064,4
2018-07-28,23,In My Blood,Shawn Mendes,5OCJzvD7sykQEKHH7qAC3C,False,23,11,18,0.622,0.711,5,-7.321,1,0.0665,0.0573,0,0.13,0.487,140.016,211360,4
2018-07-28,24,I'm Upset,Drake,5OCJzvD7sykQEKHH7qAC3C,False,16,7,8,0.899,0.586,11,-7.866,0,0.343,0.279,0,0.0836,0.492,150.002,214467,4
2018-07-28,25,Tequila,Dan + Shay,5OCJzvD7sykQEKHH7qAC3C,False,24,21,19,0.489,0.581,11,-5.731,1,0.0281,0.0312,0,0.132,0.494,86.016,196747,4
2018-07-28,26,One Kiss,Calvin Harris & Dua Lipa,5OCJzvD7sykQEKHH7qAC3C,False,29,26,15,0.791,0.862,9,-3.24,0,0.11,0.037,2.19e-05,0.0814,0.592,123.994,214847,4
2018-07-28,27,Back To You,Selena Gomez,5OCJzvD7sykQEKHH7qAC3C,False,31,22,10,0.601,0.724,6,-4.856,1,0.0486,0.0945,1.68e-06,0.12,0.508,102.061,207905,4
2018-07-28,28,Apes**t,The Carters,5OCJzvD7sykQEKHH7qAC3C,False,30,13,5,0.698,0.783,2,-6.503,1,0.266,0.016,0,0.176,0.378,160.034,264853,4
2018-07-28,29,I Like Me Better,Lauv,5OCJzvD7sykQEKHH7qAC3C,False,33,29,23,0.752,0.505,9,-7.621,1,0.253,0.535,2.55e-06,0.104,0.419,91.97,197437,4
2018-07-28,30,Never Be The Same,Camila Cabello,5OCJzvD7sykQEKHH7qAC3C,False,26,6,31,0.637,0.713,0,-4.333,1,0.0747,0.181,0.000637,0.137,0.243,129.923,226973,4
2018-07-28,31,Get Along,Kenny Chesney,5OCJzvD7sykQEKHH7qAC3C,False,35,31,15,0.632,0.804,7,-6.109,1,0.0503,0.101,0,0.17,0.35,92.456,199625,4
2018-07-28,32,Youngblood,5 Seconds Of Summer,5OCJzvD7sykQEKHH7qAC3C,False,40,32,7,0.596,0.854,7,-5.114,0,0.463,0.0169,0,0.124,0.152,120.274,203418,4
2018-07-28,33,Don't Matter To Me,Drake Featuring Michael Jackson,5OCJzvD7sykQEKHH7qAC3C,False,21,9,3,0.822,0.318,10,-12.391,1,0.0575,0.493,0.0128,0.11,0.138,102.998,245787,4
2018-07-28,34,Whatever It Takes,Imagine Dragons,5OCJzvD7sykQEKHH7qAC3C,False,27,12,25,0.672,0.655,10,-5.021,0,0.0311,0.0362,0,0.117,0.556,134.945,201240,4
2018-07-28,35,Look Alive,BlocBoy JB Featuring Drake,5OCJzvD7sykQEKHH7qAC3C,False,32,5,23,0.922,0.581,10,-7.495,1,0.27,0.00104,5.86e-05,0.105,0.595,140.022,181263,4
2018-07-28,36,Simple,Florida Georgia Line,5OCJzvD7sykQEKHH7qAC3C,False,37,36,7,0.362,0.882,3,-3.717,1,0.0973,0.0791,0,0.15,0.864,199.811,185200,4
2018-07-28,37,Moonlight,XXXTENTACION,5OCJzvD7sykQEKHH7qAC3C,False,34,13,14,0.921,0.537,9,-5.723,0,0.0804,0.556,0.00404,0.102,0.711,128.009,135090,4
2018-07-28,38,Mercy,Brett Young,5OCJzvD7sykQEKHH7qAC3C,False,41,38,11,0.638,0.367,4,-7.906,1,0.0266,0.84,0,0.0999,0.219,71.957,217120,4
2018-07-28,39,Big Bank,"YG Featuring 2 Chainz, Big Sean & Nicki Minaj",5OCJzvD7sykQEKHH7qAC3C,False,46,39,7,0.745,0.346,1,-7.709,1,0.331,0.00552,0,0.0881,0.112,203.911,237240,4
2018-07-28,40,This Is America,Childish Gambino,5OCJzvD7sykQEKHH7qAC3C,False,39,1,11,0.854,0.463,5,-6.159,1,0.137,0.117,0,0.354,0.549,120.024,225773,4
2018-07-28,41,Be Careful,Cardi B,5OCJzvD7sykQEKHH7qAC3C,False,36,11,16,0.82,0.568,6,-8.23,0,0.411,0.0256,0,0.0952,0.535,152.279,210787,4
2018-07-28,42,Te Bote,"Casper Magico, Nio Garcia, Darell, Nicky Jam, Ozuna & Bad Bunny",5OCJzvD7sykQEKHH7qAC3C,False,43,36,13,0.903,0.675,11,-3.445,0,0.214,0.542,1.28e-05,0.0595,0.442,96.507,417920,4
2018-07-28,43,Mob Ties,Drake,5OCJzvD7sykQEKHH7qAC3C,False,28,13,3,0.754,0.575,4,-8.393,0,0.0682,0.045,0.00131,0.276,0.491,86.009,205147,4
2018-07-28,44,Summertime Magic,Childish Gambino,4j3GWI86JvSaF0BLdmgcfF,True,0,44,1,0.76,0.579,0,-7.374,1,0.0569,0.0129,0.00351,0.106,0.125,100.01,213600,4
2018-07-28,45,I Was Jack (You Were Diane),Jake Owen,4j3GWI86JvSaF0BLdmgcfF,False,50,45,8,0.604,0.868,6,-3.539,1,0.0445,0.086,0,0.0502,0.553,94.058,187027,4
2018-07-28,46,Sit Next To Me,Foster The People,4j3GWI86JvSaF0BLdmgcfF,False,42,42,18,0.638,0.738,6,-4.976,0,0.0292,0.117,0.000384,0.689,0.657,97.021,243147,4
2018-07-28,47,X,Nicky Jam x J Balvin,4j3GWI86JvSaF0BLdmgcfF,False,51,41,20,0.594,0.749,9,-5.298,0,0.056,0.0338,0.00106,0.3,0.694,179.968,172854,4
2018-07-28,48,Drowns The Whiskey,Jason Aldean Featuring Miranda Lambert,4j3GWI86JvSaF0BLdmgcfF,False,52,48,5,0.552,0.698,8,-4.817,1,0.0306,0.294,0.000103,0.0905,0.6,90.006,202067,4
2018-07-28,49,One Number Away,Luke Combs,4j3GWI86JvSaF0BLdmgcfF,False,49,34,18,0.544,0.781,6,-6.16,0,0.0311,0.00585,0,0.191,0.527,144.075,221800,4
2018-07-28,50,Jumpsuit,twenty one pilots,4j3GWI86JvSaF0BLdmgcfF,False,60,50,2,0.62,0.61,11,-8.329,0,0.0373,0.00849,0.162,0.205,0.235,127.052,238560,4
2018-07-28,51,Changes,XXXTENTACION,4j3GWI86JvSaF0BLdmgcfF,False,47,18,14,0.669,0.308,11,-10.068,1,0.029,0.883,0,0.0984,0.52,64.934,121887,4
2018-07-28,52,Bed,Nicki Minaj Featuring Ariana Grande,4j3GWI86JvSaF0BLdmgcfF,False,48,43,5,0.757,0.73,7,-6.304,1,0.185,0.0342,5.87e-05,0.136,0.452,90.013,189533,4
2018-07-28,53,You Say,Lauren Daigle,6Up545NUflOiXo8cEraH49,True,0,53,1,0.494,0.632,5,-6.89,1,0.0342,0.682,0,0.0869,0.0797,147.873,274693,4
2018-07-28,54,Life Changes,Thomas Rhett,6Up545NUflOiXo8cEraH49,False,61,54,4,0.687,0.845,7,-4.37,1,0.0576,0.1,0,0.0452,0.809,87.972,190227,4
2018-07-28,55,All Girls Are The Same,Juice WRLD,6Up545NUflOiXo8cEraH49,False,57,41,10,0.671,0.529,0,-7.226,1,0.307,0.0769,0.000335,0.0856,0.203,161.989,165820,4
2018-07-28,56,Eastside,"benny blanco, Halsey & Khalid",0d2iYfpKoM0QCKvcLCkBao,True,0,56,1,0.56,0.68,6,-7.648,0,0.321,0.555,0,0.116,0.319,89.391,173800,4
2018-07-28,57,Take Back Home Girl,Chris Lane Featuring Tori Kelly,0d2iYfpKoM0QCKvcLCkBao,False,70,57,7,0.493,0.796,11,-3.971,1,0.0691,0.39,0,0.0957,0.644,159.988,212107,4
2018-07-28,58,Emotionless,Drake,0d2iYfpKoM0QCKvcLCkBao,False,38,8,3,0.414,0.677,1,-5.12,1,0.254,0.0248,0,0.0793,0.0853,172.521,302173,4
2018-07-28,59,Up Down,Morgan Wallen Featuring Florida Georgia Line,0d2iYfpKoM0QCKvcLCkBao,False,54,49,17,0.589,0.882,6,-3.039,1,0.035,0.0813,0,0.146,0.793,129.915,197253,4
2018-07-28,60,Jackie Chan,Tiesto & Dzeko Featuring Preme & Post Malone,0d2iYfpKoM0QCKvcLCkBao,False,88,60,2,0.747,0.834,3,-2.867,0,0.045,0.374,0,0.0586,0.687,128.005,215760,4
2018-07-28,61,Can't Take A Joke,Drake,0d2iYfpKoM0QCKvcLCkBao,False,45,18,3,0.761,0.598,10,-7.249,0,0.182,0.126,0,0.0839,0.446,173.897,163974,4
2018-07-28,62,Coming Home,Keith Urban Featuring Julia Michaels,0d2iYfpKoM0QCKvcLCkBao,False,77,62,4,0.383,0.703,4,-6.988,1,0.228,0.216,5.47e-06,0.131,0.57,88.502,213939,4
2018-07-28,63,Don't Go Breaking My Heart,Backstreet Boys,0d2iYfpKoM0QCKvcLCkBao,False,82,63,4,0.643,0.703,0,-5.573,1,0.0913,0.0218,0,0.0964,0.246,95.041,215724,4
2018-07-28,64,"Sunrise, Sunburn, Sunset",Luke Bryan,0d2iYfpKoM0QCKvcLCkBao,False,81,64,3,0.471,0.897,9,-2.27,1,0.0597,0.193,0,0.196,0.719,159.958,216093,4
2018-07-28,65,Growing Pains,Alessia Cara,0d2iYfpKoM0QCKvcLCkBao,False,86,65,3,0.353,0.753,1,-6.277,0,0.74,0.0833,0,0.383,0.432,191.142,193627,4
2018-07-28,66,Solo,Clean Bandit Featuring Demi Lovato,0d2iYfpKoM0QCKvcLCkBao,False,98,66,3,0.737,0.636,11,-4.546,0,0.0437,0.0441,6.66e-05,0.35,0.565,105.005,222653,4
2018-07-28,67,Elevate,Drake,0d2iYfpKoM0QCKvcLCkBao,False,44,14,3,0.758,0.474,1,-8.72,1,0.147,0.0152,0,0.116,0.0542,76.061,184960,4
2018-07-28,68,Wasted,Juice WRLD Featuring Lil Uzi Vert,1a7WZZZH7LzyvorhpOJFTe,True,0,68,1,0.742,0.579,0,-5.024,1,0.202,0.0381,0,0.0952,0.502,144.994,258475,4
2018-07-28,69,Freaky Friday,Lil Dicky Featuring Chris Brown,1a7WZZZH7LzyvorhpOJFTe,False,72,8,18,0.755,0.599,8,-5.042,1,0.224,0.147,0,0.109,0.755,133.123,216632,4
2018-07-28,70,Hotel Key,Old Dominion,1a7WZZZH7LzyvorhpOJFTe,False,87,70,3,0.758,0.867,11,-5.087,1,0.0475,0.152,0,0.308,0.964,102.018,166573,4
2018-07-28,71,Desperate Man,Eric Church,1vHeu2j2MpfMqqvcXKLtic,True,0,71,1,0.711,0.796,10,-5.87,1,0.0341,0.0716,0.0045,0.262,0.901,109.991,208733,4
2018-07-28,72,Hopeless Romantic,Wiz Khalifa Featuring Swae Lee,7IBSffWIu7P2MC7kMwy2FM,True,0,72,1,0.877,0.477,9,-7.379,0,0.0587,0.307,0,0.0929,0.552,127.023,226743,4
2018-07-28,73,Fr Fr,Wiz Khalifa Featuring Lil Skies,1RagpNpkD3KcjXMLGMe99V,True,0,73,1,0.916,0.493,1,-7.371,0,0.162,0.12,2.63e-06,0.211,0.327,140.057,195591,4
2018-07-28,74,Kiss Somebody,Morgan Evans,1RagpNpkD3KcjXMLGMe99V,False,74,74,3,0.57,0.684,6,-7.054,1,0.0465,0.136,0,0.205,0.531,89.012,213183,4
2018-07-28,75,OTW,"Khalid, Ty Dolla $ign & 6LACK",1RagpNpkD3KcjXMLGMe99V,False,97,57,12,0.652,0.678,2,-6.183,1,0.0541,0.183,3.26e-05,0.106,0.28,72.989,263014,4
2018-07-28,76,Ball For Me,Post Malone Featuring Nicki Minaj,1RagpNpkD3KcjXMLGMe99V,False,75,16,12,0.797,0.55,9,-4.166,1,0.24,0.513,0,0.0786,0.543,134.206,206267,4
2018-07-28,77,All Mine,Kanye West,1RagpNpkD3KcjXMLGMe99V,False,85,11,7,0.925,0.31,11,-6.531,0,0.291,0.123,0,0.0931,0.291,121.927,145507,4
2018-07-28,78,Medicine,Queen Naija,1RagpNpkD3KcjXMLGMe99V,False,90,45,7,0.741,0.37,8,-8.437,0,0.324,0.24,0,0.118,0.13,116.06,219136,4
2018-07-28,79,Nico And The Niners,twenty one pilots,5SehvGGC53A7SZKCLXQcyt,True,0,79,1,0.728,0.602,9,-7.748,0,0.185,0.0699,7.01e-06,0.318,0.328,140.081,225040,4
2018-07-28,80,Blue Tint,Drake,5SehvGGC53A7SZKCLXQcyt,False,55,30,3,0.889,0.372,7,-10.254,0,0.357,0.013,0,0.184,0.123,133.997,162800,4
2018-07-28,81,Cry Pretty,Carrie Underwood,5SehvGGC53A7SZKCLXQcyt,False,91,48,6,0.374,0.742,6,-3.36,1,0.0432,0.00517,0,0.11,0.21,139.953,247320,3
2018-07-28,82,After Dark,Drake Featuring Static Major & Ty Dolla $ign,5SehvGGC53A7SZKCLXQcyt,False,56,41,3,0.687,0.429,2,-13.075,1,0.192,0.0407,0,0.142,0.336,141.966,289560,4
2018-07-28,83,Sin Pijama,Becky G + Natti Natasha,5SehvGGC53A7SZKCLXQcyt,False,99,83,6,0.791,0.745,11,-3.695,0,0.0464,0.354,2.93e-05,0.104,0.82,94.014,188560,4
2018-07-28,84,Broken,lovelytheband,6XcfKZvJio9Z0fQy11GnNX,True,0,84,1,0.666,0.728,7,-5.808,1,0.0419,0.00175,4.26e-06,0.0429,0.51,122.996,204878,4
2018-07-28,85,Hooked,Dylan Scott,3DV49ruvI5Sl6iisPZAc2c,True,0,85,1,0.597,0.721,9,-6.422,1,0.0356,0.0362,0,0.0832,0.437,132.054,149293,4
2018-07-28,86,Alone,Halsey Featuring Big Sean & Stefflon Don,3DV49ruvI5Sl6iisPZAc2c,False,66,66,14,0.445,0.662,2,-4.802,0,0.181,0.0164,0,0.219,0.479,200.04,207458,4
2018-07-28,87,Ocean,TK Kravitz Featuring Jacqueez,2yI8omCrTAyrTcK7NRppu7,True,0,87,1,0.709,0.264,1,-17.696,0,0.186,0.268,0,0.24,0.341,133.858,219437,4
2018-07-28,88,Ocean,Martin Garrix Featuring Khalid,2yI8omCrTAyrTcK7NRppu7,False,92,78,3,0.506,0.693,0,-7.265,0,0.0412,0.584,9.58e-05,0.0891,0.221,139.912,216420,4
2018-07-28,89,Everything's Gonna Be Alright,David Lee Murphy & Kenny Chesney,2yI8omCrTAyrTcK7NRppu7,False,80,66,13,0.764,0.587,5,-7.002,0,0.0298,0.0721,6.45e-06,0.094,0.494,89.98,229573,4
2018-07-28,90,1942,G-Eazy Featuring Yo Gotti & YBN Nahmir,794QVQtFNy7hvtjQP1keQd,True,0,90,1,0.817,0.646,4,-5.12,0,0.249,0.0152,0,0.125,0.835,162.898,213080,4
2018-07-28,91,Break Up In The End,Cole Swindell,794QVQtFNy7hvtjQP1keQd,False,0,91,2,0.507,0.372,1,-8.433,1,0.0303,0.481,0,0.271,0.257,86.422,199693,4
2018-07-28,92,I'm A Mess,Bebe Rexha,04ZTP5KsCypmtCmQg5tH9R,True,0,92,1,0.63,0.694,11,-6.257,0,0.0253,0.00281,0,0.0719,0.216,97.005,195519,4
2018-07-28,93,Narcos,Migos,04ZTP5KsCypmtCmQg5tH9R,False,0,36,10,0.936,0.585,0,-6.914,1,0.125,0.0142,0,0.132,0.242,124.991,255379,4
2018-07-28,94,Remind Me To Forget,Kygo Featuring Miguel,5sIx4BlfYGuZeSLF40N9GH,True,0,94,1,0.685,0.508,0,-6.4,1,0.0987,0.193,0,0.139,0.315,99.063,217287,4
2018-07-28,95,Call Out My Name,The Weeknd,5sIx4BlfYGuZeSLF40N9GH,False,95,4,16,0.471,0.581,1,-5.195,1,0.0345,0.19,0,0.309,0.161,133.991,228382,3
2018-07-28,96,Praise The Lord (Da Shine),A$AP Rocky Featuring Skepta,5sIx4BlfYGuZeSLF40N9GH,False,0,45,6,0.854,0.569,5,-8.151,0,0.106,0.0609,0.0816,0.1,0.294,80.015,205040,4
2018-07-28,97,Zombie,Bad Wolves,5sIx4BlfYGuZeSLF40N9GH,False,0,54,18,0.448,0.826,2,-3.244,0,0.0319,0.00756,0,0.117,0.19,77.093,254805,4
2018-07-28,98,8 Out Of 10,Drake,5sIx4BlfYGuZeSLF40N9GH,False,59,21,3,0.527,0.689,2,-7.87,1,0.741,0.161,0,0.498,0.31,170.538,195720,4
2018-07-28,99,31 Days,Future,5sIx4BlfYGuZeSLF40N9GH,False,65,65,2,0.875,0.644,1,-6.554,1,0.222,0.267,0,0.125,0.788,139.086,240682,4
2018-07-28,100,Talk Up,Drake Featuring JAY-Z,5sIx4BlfYGuZeSLF40N9GH,False,58,20,3,0.758,0.491,11,-9.877,1,0.138,0.00354,6.5e-06,0.292,0.334,140.121,223240,4
