{
    "title": "The Hot 100",
    "name": "hot-100",
    "date": "2021-03-27",
    "next_date": "",
    "prev_date": "2021-03-20",
    "entries": [
        {
            "title": "Up",
            "artist": "Cardi B",
            "is_new": false,
            "last_pos": 6,
            "peak_pos": 1,
            "rank": 1,
            "weeks": 6
        },
        {
            "title": "Leave The Door Open",
            "artist": "Silk Sonic (Bruno Mars & Anderson .Paak)",
            "is_new": false,
            "last_pos": 4,
            "peak_pos": 2,
            "rank": 2,
            "weeks": 2
        },
        {
            "title": "Drivers License",
            "artist": "Olivia Rodrigo",
            "is_new": false,
            "last_pos": 5,
            "peak_pos": 1,
            "rank": 3,
            "weeks": 10
        },
        {
            "title": "What's Next",
            "artist": "Drake",
            "is_new": false,
            "last_pos": 1,
            "peak_pos": 1,
            "rank": 4,
            "weeks": 2
        },
        {
            "title": "Save Your Tears",
            "artist": "The Weeknd",
            "is_new": false,
            "last_pos": 7,
            "peak_pos": 4,
            "rank": 5,
            "weeks": 14
        },
        {
            "title": "Blinding Lights",
            "artist": "The Weeknd",
            "is_new": false,
            "last_pos": 8,
            "peak_pos": 1,
            "rank": 6,
            "weeks": 67
        },
        {
            "title": "Levitating",
            "artist": "Dua Lipa Featuring DaBaby",
            "is_new": false,
            "last_pos": 13,
            "peak_pos": 5,
            "rank": 7,
            "weeks": 24
        },
        {
            "title": "Mood",
            "artist": "24kGoldn Featuring iann dior",
            "is_new": false,
            "last_pos": 10,
            "peak_pos": 1,
            "rank": 8,
            "weeks": 32
        },
        {
            "title": "34+35",
            "artist": "Ariana Grande",
            "is_new": false,
            "last_pos": 9,
            "peak_pos": 2,
            "rank": 9,
            "weeks": 20
        },
        {
            "title": "Wants And Needs",
            "artist": "Drake Featuring Lil Baby",
            "is_new": false,
            "last_pos": 2,
            "peak_pos": 2,
            "rank": 10,
            "weeks": 2
        },
        {
            "title": "Go Crazy",
            "artist": "Chris Brown & Young Thug",
            "is_new": false,
            "last_pos": 11,
            "peak_pos": 3,
            "rank": 11,
            "weeks": 45
        },
        {
            "title": "What You Know Bout Love",
            "artist": "Pop Smoke",
            "is_new": false,
            "last_pos": 12,
            "peak_pos": 9,
            "rank": 12,
            "weeks": 28
        },
        {
            "title": "Calling My Phone",
            "artist": "Lil Tjay Featuring 6LACK",
            "is_new": false,
            "last_pos": 14,
            "peak_pos": 3,
            "rank": 13,
            "weeks": 5
        },
        {
            "title": "Back In Blood",
            "artist": "Pooh Shiesty Featuring Lil Durk",
            "is_new": false,
            "last_pos": 16,
            "peak_pos": 13,
            "rank": 14,
            "weeks": 11
        },
        {
            "title": "Therefore I Am",
            "artist": "Billie Eilish",
            "is_new": false,
            "last_pos": 17,
            "peak_pos": 2,
            "rank": 15,
            "weeks": 19
        },
        {
            "title": "Streets",
            "artist": "Doja Cat",
            "is_new": false,
            "last_pos": 18,
            "peak_pos": 16,
            "rank": 16,
            "weeks": 10
        },
        {
            "title": "Positions",
            "artist": "Ariana Grande",
            "is_new": false,
            "last_pos": 15,
            "peak_pos": 1,
            "rank": 17,
            "weeks": 21
        },
        {
            "title": "You're Mines Still",
            "artist": "Yung Bleu Featuring Drake",
            "is_new": false,
            "last_pos": 21,
            "peak_pos": 18,
            "rank": 18,
            "weeks": 15
        },
        {
            "title": "You Broke Me First.",
            "artist": "Tate McRae",
            "is_new": false,
            "last_pos": 20,
            "peak_pos": 17,
            "rank": 19,
            "weeks": 30
        },
        {
            "title": "Beat Box",
            "artist": "SpotemGottem Featuring Pooh Shiesty Or DaBaby",
            "is_new": false,
            "last_pos": 25,
            "peak_pos": 15,
            "rank": 20,
            "weeks": 9
        },
        {
            "title": "Best Friend",
            "artist": "Saweetie Featuring Doja Cat",
            "is_new": false,
            "last_pos": 22,
            "peak_pos": 21,
            "rank": 21,
            "weeks": 10
        },
        {
            "title": "Dakiti",
            "artist": "Bad Bunny & Jhay Cortez",
            "is_new": false,
            "last_pos": 23,
            "peak_pos": 5,
            "rank": 22,
            "weeks": 20
        },
        {
            "title": "On Me",
            "artist": "Lil Baby",
            "is_new": false,
            "last_pos": 27,
            "peak_pos": 23,
            "rank": 23,
            "weeks": 15
        },
        {
            "title": "For The Night",
            "artist": "Pop Smoke Featuring Lil Baby & DaBaby",
            "is_new": false,
            "last_pos": 24,
            "peak_pos": 6,
            "rank": 24,
            "weeks": 37
        },
        {
            "title": "Astronaut In The Ocean",
            "artist": "Masked Wolf",
            "is_new": false,
            "last_pos": 37,
            "peak_pos": 25,
            "rank": 25,
            "weeks": 5
        },
        {
            "title": "No More Parties",
            "artist": "Coi Leray Featuring Lil Durk",
            "is_new": false,
            "last_pos": 39,
            "peak_pos": 26,
            "rank": 26,
            "weeks": 6
        },
        {
            "title": "Good Days",
            "artist": "SZA",
            "is_new": false,
            "last_pos": 19,
            "peak_pos": 9,
            "rank": 27,
            "weeks": 12
        },
        {
            "title": "My Ex's Best Friend",
            "artist": "Machine Gun Kelly X blackbear",
            "is_new": false,
            "last_pos": 28,
            "peak_pos": 21,
            "rank": 28,
            "weeks": 31
        },
        {
            "title": "What's Your Country Song",
            "artist": "Thomas Rhett",
            "is_new": false,
            "last_pos": 30,
            "peak_pos": 29,
            "rank": 29,
            "weeks": 13
        },
        {
            "title": "Heartbreak Anniversary",
            "artist": "Giveon",
            "is_new": false,
            "last_pos": 52,
            "peak_pos": 30,
            "rank": 30,
            "weeks": 5
        },
        {
            "title": "Lemon Pepper Freestyle",
            "artist": "Drake Featuring Rick Ross",
            "is_new": false,
            "last_pos": 3,
            "peak_pos": 3,
            "rank": 31,
            "weeks": 2
        },
        {
            "title": "Put Your Records On",
            "artist": "Ritt Momney",
            "is_new": false,
            "last_pos": 35,
            "peak_pos": 30,
            "rank": 32,
            "weeks": 22
        },
        {
            "title": "The Good Ones",
            "artist": "Gabby Barrett",
            "is_new": false,
            "last_pos": 32,
            "peak_pos": 32,
            "rank": 33,
            "weeks": 12
        },
        {
            "title": "Dynamite",
            "artist": "BTS",
            "is_new": false,
            "last_pos": 43,
            "peak_pos": 1,
            "rank": 34,
            "weeks": 30
        },
        {
            "title": "Starting Over",
            "artist": "Chris Stapleton",
            "is_new": false,
            "last_pos": 41,
            "peak_pos": 25,
            "rank": 35,
            "weeks": 29
        },
        {
            "title": "Street Runner",
            "artist": "Rod Wave",
            "is_new": true,
            "last_pos": 0,
            "peak_pos": 36,
            "rank": 36,
            "weeks": 1
        },
        {
            "title": "Anyone",
            "artist": "Justin Bieber",
            "is_new": false,
            "last_pos": 38,
            "peak_pos": 6,
            "rank": 37,
            "weeks": 11
        },
        {
            "title": "Just The Way",
            "artist": "Parmalee x Blanco Brown",
            "is_new": false,
            "last_pos": 31,
            "peak_pos": 31,
            "rank": 38,
            "weeks": 12
        },
        {
            "title": "Willow",
            "artist": "Taylor Swift",
            "is_new": false,
            "last_pos": 42,
            "peak_pos": 1,
            "rank": 39,
            "weeks": 14
        },
        {
            "title": "Without You",
            "artist": "The Kid LAROI",
            "is_new": false,
            "last_pos": 44,
            "peak_pos": 34,
            "rank": 40,
            "weeks": 15
        },
        {
            "title": "Good Time",
            "artist": "Niko Moon",
            "is_new": false,
            "last_pos": 33,
            "peak_pos": 20,
            "rank": 41,
            "weeks": 24
        },
        {
            "title": "Cry Baby",
            "artist": "Megan Thee Stallion Featuring DaBaby",
            "is_new": false,
            "last_pos": 45,
            "peak_pos": 28,
            "rank": 42,
            "weeks": 15
        },
        {
            "title": "Telepatia",
            "artist": "Kali Uchis",
            "is_new": false,
            "last_pos": 40,
            "peak_pos": 39,
            "rank": 43,
            "weeks": 4
        },
        {
            "title": "Better Together",
            "artist": "Luke Combs",
            "is_new": false,
            "last_pos": 36,
            "peak_pos": 15,
            "rank": 44,
            "weeks": 24
        },
        {
            "title": "Whoopty",
            "artist": "CJ",
            "is_new": false,
            "last_pos": 29,
            "peak_pos": 10,
            "rank": 45,
            "weeks": 19
        },
        {
            "title": "My Head And My Heart",
            "artist": "Ava Max",
            "is_new": false,
            "last_pos": 47,
            "peak_pos": 45,
            "rank": 46,
            "weeks": 6
        },
        {
            "title": "Beautiful Mistakes",
            "artist": "Maroon 5 Featuring Megan Thee Stallion",
            "is_new": false,
            "last_pos": 54,
            "peak_pos": 47,
            "rank": 47,
            "weeks": 2
        },
        {
            "title": "Damage",
            "artist": "H.E.R.",
            "is_new": false,
            "last_pos": 50,
            "peak_pos": 44,
            "rank": 48,
            "weeks": 14
        },
        {
            "title": "Long Live",
            "artist": "Florida Georgia Line",
            "is_new": false,
            "last_pos": 51,
            "peak_pos": 48,
            "rank": 49,
            "weeks": 11
        },
        {
            "title": "Throat Baby (Go Baby)",
            "artist": "BRS Kash",
            "is_new": false,
            "last_pos": 46,
            "peak_pos": 24,
            "rank": 50,
            "weeks": 22
        },
        {
            "title": "Time Today",
            "artist": "Moneybagg Yo",
            "is_new": false,
            "last_pos": 53,
            "peak_pos": 37,
            "rank": 51,
            "weeks": 6
        },
        {
            "title": "We're Good",
            "artist": "Dua Lipa",
            "is_new": false,
            "last_pos": 56,
            "peak_pos": 49,
            "rank": 52,
            "weeks": 5
        },
        {
            "title": "Down To One",
            "artist": "Luke Bryan",
            "is_new": false,
            "last_pos": 48,
            "peak_pos": 36,
            "rank": 53,
            "weeks": 12
        },
        {
            "title": "Lady",
            "artist": "Brett Young",
            "is_new": false,
            "last_pos": 55,
            "peak_pos": 54,
            "rank": 54,
            "weeks": 10
        },
        {
            "title": "Track Star",
            "artist": "Mooski",
            "is_new": false,
            "last_pos": 60,
            "peak_pos": 55,
            "rank": 55,
            "weeks": 4
        },
        {
            "title": "Heat Waves",
            "artist": "Glass Animals",
            "is_new": false,
            "last_pos": 57,
            "peak_pos": 56,
            "rank": 56,
            "weeks": 9
        },
        {
            "title": "Goosebumps",
            "artist": "Travis Scott & HVME",
            "is_new": false,
            "last_pos": 58,
            "peak_pos": 56,
            "rank": 57,
            "weeks": 9
        },
        {
            "title": "Real As It Gets",
            "artist": "Lil Baby Featuring EST Gee",
            "is_new": false,
            "last_pos": 34,
            "peak_pos": 34,
            "rank": 58,
            "weeks": 2
        },
        {
            "title": "Hold On",
            "artist": "Justin Bieber",
            "is_new": false,
            "last_pos": 26,
            "peak_pos": 26,
            "rank": 59,
            "weeks": 2
        },
        {
            "title": "Monsters",
            "artist": "All Time Low Featuring Demi Lovato & blackbear",
            "is_new": false,
            "last_pos": 59,
            "peak_pos": 55,
            "rank": 60,
            "weeks": 12
        },
        {
            "title": "Forever After All",
            "artist": "Luke Combs",
            "is_new": false,
            "last_pos": 67,
            "peak_pos": 2,
            "rank": 61,
            "weeks": 21
        },
        {
            "title": "Buss It",
            "artist": "Erica Banks",
            "is_new": false,
            "last_pos": 61,
            "peak_pos": 47,
            "rank": 62,
            "weeks": 10
        },
        {
            "title": "Hell Of A View",
            "artist": "Eric Church",
            "is_new": false,
            "last_pos": 68,
            "peak_pos": 63,
            "rank": 63,
            "weeks": 10
        },
        {
            "title": "Body",
            "artist": "Megan Thee Stallion",
            "is_new": false,
            "last_pos": 63,
            "peak_pos": 12,
            "rank": 64,
            "weeks": 17
        },
        {
            "title": "Momma's House",
            "artist": "Dustin Lynch",
            "is_new": false,
            "last_pos": 62,
            "peak_pos": 62,
            "rank": 65,
            "weeks": 10
        },
        {
            "title": "Wasted On You",
            "artist": "Morgan Wallen",
            "is_new": false,
            "last_pos": 64,
            "peak_pos": 9,
            "rank": 66,
            "weeks": 10
        },
        {
            "title": "Somebody Like That",
            "artist": "Tenille Arts",
            "is_new": false,
            "last_pos": 71,
            "peak_pos": 67,
            "rank": 67,
            "weeks": 9
        },
        {
            "title": "La Noche de Anoche",
            "artist": "Bad Bunny & Rosalia",
            "is_new": false,
            "last_pos": 66,
            "peak_pos": 53,
            "rank": 68,
            "weeks": 8
        },
        {
            "title": "The Business",
            "artist": "Tiesto",
            "is_new": false,
            "last_pos": 77,
            "peak_pos": 69,
            "rank": 69,
            "weeks": 4
        },
        {
            "title": "On The Ground",
            "artist": "ROSE",
            "is_new": true,
            "last_pos": 0,
            "peak_pos": 70,
            "rank": 70,
            "weeks": 1
        },
        {
            "title": "Masterpiece",
            "artist": "DaBaby",
            "is_new": false,
            "last_pos": 73,
            "peak_pos": 55,
            "rank": 71,
            "weeks": 8
        },
        {
            "title": "Girl Like Me",
            "artist": "Black Eyed Peas X Shakira",
            "is_new": false,
            "last_pos": 70,
            "peak_pos": 67,
            "rank": 72,
            "weeks": 10
        },
        {
            "title": "Almost Maybes",
            "artist": "Jordan Davis",
            "is_new": false,
            "last_pos": 78,
            "peak_pos": 73,
            "rank": 73,
            "weeks": 8
        },
        {
            "title": "Quicksand",
            "artist": "Morray",
            "is_new": false,
            "last_pos": 79,
            "peak_pos": 74,
            "rank": 74,
            "weeks": 6
        },
        {
            "title": "Pick Up Your Feelings",
            "artist": "Jazmine Sullivan",
            "is_new": false,
            "last_pos": 85,
            "peak_pos": 75,
            "rank": 75,
            "weeks": 8
        },
        {
            "title": "Breaking Up Was Easy In The 90's",
            "artist": "Sam Hunt",
            "is_new": false,
            "last_pos": 82,
            "peak_pos": 76,
            "rank": 76,
            "weeks": 3
        },
        {
            "title": "Made For You",
            "artist": "Jake Owen",
            "is_new": false,
            "last_pos": 80,
            "peak_pos": 77,
            "rank": 77,
            "weeks": 4
        },
        {
            "title": "You Got It",
            "artist": "VEDO",
            "is_new": false,
            "last_pos": 75,
            "peak_pos": 75,
            "rank": 78,
            "weeks": 12
        },
        {
            "title": "Lost",
            "artist": "NF Featuring Hopsin",
            "is_new": true,
            "last_pos": 0,
            "peak_pos": 79,
            "rank": 79,
            "weeks": 1
        },
        {
            "title": "Sand In My Boots",
            "artist": "Morgan Wallen",
            "is_new": false,
            "last_pos": 72,
            "peak_pos": 32,
            "rank": 80,
            "weeks": 10
        },
        {
            "title": "Beers And Sunshine",
            "artist": "Darius Rucker",
            "is_new": false,
            "last_pos": 69,
            "peak_pos": 42,
            "rank": 81,
            "weeks": 14
        },
        {
            "title": "One Too Many",
            "artist": "Keith Urban Duet With P!nk",
            "is_new": false,
            "last_pos": 76,
            "peak_pos": 62,
            "rank": 82,
            "weeks": 14
        },
        {
            "title": "Follow You",
            "artist": "Imagine Dragons",
            "is_new": true,
            "last_pos": 0,
            "peak_pos": 83,
            "rank": 83,
            "weeks": 1
        },
        {
            "title": "Baila Conmigo",
            "artist": "Selena Gomez With Rauw Alejandro",
            "is_new": false,
            "last_pos": 0,
            "peak_pos": 74,
            "rank": 84,
            "weeks": 2
        },
        {
            "title": "Nobody",
            "artist": "Dylan Scott",
            "is_new": false,
            "last_pos": 89,
            "peak_pos": 85,
            "rank": 85,
            "weeks": 3
        },
        {
            "title": "Glad You Exist",
            "artist": "Dan + Shay",
            "is_new": false,
            "last_pos": 88,
            "peak_pos": 63,
            "rank": 86,
            "weeks": 6
        },
        {
            "title": "Like I Want You",
            "artist": "Giveon",
            "is_new": false,
            "last_pos": 0,
            "peak_pos": 87,
            "rank": 87,
            "weeks": 4
        },
        {
            "title": "Daywalker!",
            "artist": "Machine Gun Kelly & CORPSE",
            "is_new": true,
            "last_pos": 0,
            "peak_pos": 88,
            "rank": 88,
            "weeks": 1
        },
        {
            "title": "Hello",
            "artist": "Pop Smoke Featuring A Boogie Wit da Hoodie",
            "is_new": false,
            "last_pos": 84,
            "peak_pos": 84,
            "rank": 89,
            "weeks": 4
        },
        {
            "title": "Settling Down",
            "artist": "Miranda Lambert",
            "is_new": true,
            "last_pos": 0,
            "peak_pos": 90,
            "rank": 90,
            "weeks": 1
        },
        {
            "title": "Bandido",
            "artist": "Myke Towers & Juhn",
            "is_new": false,
            "last_pos": 83,
            "peak_pos": 82,
            "rank": 91,
            "weeks": 6
        },
        {
            "title": "Neighbors",
            "artist": "Pooh Shiesty Featuring BIG30",
            "is_new": false,
            "last_pos": 87,
            "peak_pos": 51,
            "rank": 92,
            "weeks": 6
        },
        {
            "title": "Drankin N Smokin",
            "artist": "Future & Lil Uzi Vert",
            "is_new": false,
            "last_pos": 90,
            "peak_pos": 31,
            "rank": 93,
            "weeks": 9
        },
        {
            "title": "Hellcats & Trackhawks",
            "artist": "Lil Durk",
            "is_new": false,
            "last_pos": 74,
            "peak_pos": 74,
            "rank": 94,
            "weeks": 2
        },
        {
            "title": "Opp Stoppa",
            "artist": "YBN Nahmir Featuring 21 Savage",
            "is_new": false,
            "last_pos": 86,
            "peak_pos": 78,
            "rank": 95,
            "weeks": 6
        },
        {
            "title": "Still Trappin'",
            "artist": "Lil Durk & King Von",
            "is_new": false,
            "last_pos": 92,
            "peak_pos": 53,
            "rank": 96,
            "weeks": 12
        },
        {
            "title": "Finesse Out The Gang Way",
            "artist": "Lil Durk Featuring Lil Baby",
            "is_new": false,
            "last_pos": 91,
            "peak_pos": 39,
            "rank": 97,
            "weeks": 7
        },
        {
            "title": "Gone",
            "artist": "Dierks Bentley",
            "is_new": false,
            "last_pos": 98,
            "peak_pos": 98,
            "rank": 98,
            "weeks": 3
        },
        {
            "title": "Lil Bit",
            "artist": "Nelly & Florida Georgia Line",
            "is_new": false,
            "last_pos": 100,
            "peak_pos": 99,
            "rank": 99,
            "weeks": 2
        },
        {
            "title": "Undivided",
            "artist": "Tim McGraw & Tyler Hubbard",
            "is_new": false,
            "last_pos": 0,
            "peak_pos": 76,
            "rank": 100,
            "weeks": 2
        }
    ]
}