{
    "key"   : "chart",
    "value" : {
        "status_code"   : 200,
        "request"       : {
            "name"  : "hot-100" ,
            "date"  : "2020-01-06"           
        },
        "response"      : {
            "title"     : "The Hot 100",
            "name"      : "hot-100",
            "date"      : "2020-01-11",
            "next_date" : "2020-01-18",
            "prev_date" : "2020-01-04",
            "entries"   : [
                {
                    "title"         : "Circles",
                    "artist"        : "Post Malone",
                    "is_new"        : false,
                    "last_pos"      : 5,
                    "peak_pos"      : 1,
                    "rank"          : 1,
                    "weeks"         : 18                
                }, ..., 
                {
                    "title"         : "July",
                    "artist"        : "Noah Cyrus & Leon Bridges",
                    "is_new"        : true,
                    "last_pos"      : 0,
                    "peak_pos"      : 100,
                    "rank"          : 100,
                    "weeks"         : 1,
                    "snapshot_date" : "2020-01-11"
                }
            ]

        }
    }
}