<svg xmlns="http://www.w3.org/2000/svg" width="24.578" height="22.805" viewBox="0 0 24.578 22.805">
  <g id="Group_1648" data-name="Group 1648" transform="translate(1520 -1629.508)">
    <path id="Path_1633" data-name="Path 1633" d="M1552,126.052l9.627-9.345a2.366,2.366,0,0,1,3.324,0l9.627,9.345h-2.5v10.6h-5.8v-5.967h-5.766v5.967h-6.02v-10.6Z" transform="translate(-3071 1514.659)" fill="#297629" stroke="#297629" stroke-linecap="round" stroke-linejoin="round" stroke-miterlimit="10" stroke-width="2"/>
    <g id="Path_1634" data-name="Path 1634" transform="translate(-1510 1645)" fill="#adbe0d">
      <path d="M 4.5 6.5 L 0.5 6.5 L 0.5 1 C 0.5 0.7243000268936157 0.7243000268936157 0.5 1 0.5 L 4 0.5 C 4.275700092315674 0.5 4.5 0.7243000268936157 4.5 1 L 4.5 6.5 Z" stroke="none"/>
      <path d="M 1 1 L 1 6 L 4 6 L 4 1 L 1 1 M 1 0 L 4 0 C 4.552279949188232 0 5 0.4477200508117676 5 1 L 5 7 L 0 7 L 0 1 C 0 0.4477200508117676 0.4477200508117676 0 1 0 Z" stroke="none" fill="#adbe0d"/>
    </g>
  </g>
</svg>
