<svg xmlns="http://www.w3.org/2000/svg" width="22.222" height="21.081" viewBox="0 0 22.222 21.081">
  <g id="Group_688" data-name="Group 688" transform="translate(-543 -691)">
    <path id="Path_771" data-name="Path 771" d="M548.494,694.247h-2.247a2.337,2.337,0,0,0-2.247,2.4v12.025a2.337,2.337,0,0,0,2.247,2.4h0" transform="translate(0 0)" fill="none" stroke="#adbe0d" stroke-linecap="round" stroke-linejoin="round" stroke-miterlimit="10" stroke-width="2"/>
    <path id="Path_394" data-name="Path 394" d="M546.247,711.081h0a2.327,2.327,0,0,0,2.247-2.385V694.385A2.326,2.326,0,0,1,550.741,692h11.234a2.7,2.7,0,0,1,.735.132,2.28,2.28,0,0,1,1.512,2.253V708.7a2.326,2.326,0,0,1-2.247,2.385H546.247" fill="#297629" stroke="#297629" stroke-linecap="round" stroke-linejoin="round" stroke-miterlimit="10" stroke-width="2"/>
    <g id="Group_334" data-name="Group 334" transform="translate(551.864 695.843)">
      <path id="Path_395" data-name="Path 395" d="M579.864,708.494h-6.741A1.127,1.127,0,0,1,572,707.37v-2.247A1.127,1.127,0,0,1,573.123,704h6.741a1.127,1.127,0,0,1,1.123,1.123v2.247A1.127,1.127,0,0,1,579.864,708.494Z" transform="translate(-572 -704)" fill="#adbe0d"/>
      <path id="Path_769" data-name="Path 769" d="M0,0H7.257" transform="translate(0.845 7.082)" fill="none" stroke="#adbe0d" stroke-linecap="round" stroke-width="2"/>
      <path id="Path_770" data-name="Path 770" d="M0,0H5.275" transform="translate(0.845 10.082)" fill="none" stroke="#adbe0d" stroke-linecap="round" stroke-width="2"/>
    </g>
  </g>
</svg>
