[gd_scene load_steps=6 format=2]

[ext_resource path="res://Assets/kenney_topdowntanksredux/PNG/Default size/bulletRed2_outline.png" type="Texture" id=1]
[ext_resource path="res://Scripts/Bullets/TankShell.gd" type="Script" id=2]
[ext_resource path="res://Scenes/Bullets/ShellExplosion.tscn" type="PackedScene" id=3]
[ext_resource path="res://Scenes/Bullets/ExplosionAudio.tscn" type="PackedScene" id=4]

[sub_resource type="RectangleShape2D" id=1]
extents = Vector2( 12.2992, 8.98833 )

[node name="TankShell" type="Area2D"]
script = ExtResource( 2 )
ExplosionAnim = ExtResource( 3 )
ExplosionAudio = ExtResource( 4 )

[node name="Sprite" type="Sprite" parent="."]
rotation = 1.5708
scale = Vector2( 1.5, 1.5 )
texture = ExtResource( 1 )

[node name="CollisionShape2D" type="CollisionShape2D" parent="."]
shape = SubResource( 1 )

[connection signal="body_entered" from="." to="." method="_on_TankShell_body_entered"]
