[gd_scene load_steps=6 format=2]

[ext_resource path="res://Assets/tower-defense-top-down/PNG/Default size/towerDefense_tile268.png" type="Texture" id=1]
[ext_resource path="res://Scenes/AI/TankTurret.tscn" type="PackedScene" id=2]
[ext_resource path="res://Scripts/AI/Tank.gd" type="Script" id=3]
[ext_resource path="res://Scenes/Health.tscn" type="PackedScene" id=4]

[sub_resource type="RectangleShape2D" id=1]
extents = Vector2( 25.9812, 19.4536 )

[node name="Tank" type="StaticBody2D"]
scale = Vector2( 2.5, 2.5 )
script = ExtResource( 3 )

[node name="TankBody" type="Sprite" parent="."]
texture = ExtResource( 1 )

[node name="CollisionShape2D" type="CollisionShape2D" parent="."]
shape = SubResource( 1 )

[node name="TankTurret" parent="." instance=ExtResource( 2 )]
position = Vector2( 0.509064, 0 )

[node name="Health" parent="." instance=ExtResource( 4 )]
