[gd_scene load_steps=5 format=2]

[ext_resource path="res://Assets/kenney_topdowntanksredux/PNG/Default size/sandbagBrown.png" type="Texture" id=1]
[ext_resource path="res://Scripts/Objects/SandBag.gd" type="Script" id=2]
[ext_resource path="res://Scenes/Health.tscn" type="PackedScene" id=3]

[sub_resource type="RectangleShape2D" id=1]
extents = Vector2( 16.101, 10.9994 )

[node name="SandBag" type="StaticBody2D" groups=[
"objects",
]]
scale = Vector2( 2, 2 )
script = ExtResource( 2 )

[node name="Health" parent="." instance=ExtResource( 3 )]

[node name="Sprite" type="Sprite" parent="."]
texture = ExtResource( 1 )

[node name="CollisionShape2D" type="CollisionShape2D" parent="."]
shape = SubResource( 1 )
