[gd_scene load_steps=3 format=2]

[ext_resource path="res://Assets/Audio/explosion-1.wav" type="AudioStream" id=1]
[ext_resource path="res://Scripts/Bullets/ExplosionAudio.gd" type="Script" id=2]

[node name="ExplosionAudio" type="Node2D"]
script = ExtResource( 2 )

[node name="Audio" type="AudioStreamPlayer2D" parent="."]
stream = ExtResource( 1 )
volume_db = -5.0

[node name="Timer" type="Timer" parent="."]
wait_time = 0.5
autostart = true
