[gd_scene load_steps=5 format=2]

[ext_resource path="res://assets/game_pieces/elephant.png" type="Texture" id=1]
[ext_resource path="res://scripts/game_pieces/elephant.gd" type="Script" id=2]

[sub_resource type="SpriteFrames" id=2]
animations = [ {
"frames": [ ExtResource( 1 ) ],
"loop": false,
"name": "unsolved",
"speed": 1.0
} ]

[sub_resource type="RectangleShape2D" id=1]
extents = Vector2( 58.5, 58.5 )

[node name="GamePiece" type="Area2D"]
scale = Vector2( 0.9, 0.9 )
script = ExtResource( 2 )

[node name="Sprite" type="AnimatedSprite" parent="."]
scale = Vector2( 0.929688, 0.929688 )
frames = SubResource( 2 )
animation = "unsolved"
speed_scale = 2.0
centered = false

[node name="CollisionShape2D" type="CollisionShape2D" parent="."]
position = Vector2( 59.5, 59.5 )
shape = SubResource( 1 )

[node name="PlaceCapturedIndicator" type="ColorRect" parent="."]
visible = false
modulate = Color( 0.298039, 0.258824, 1, 0.443137 )
margin_right = 118.0
margin_bottom = 118.0
mouse_filter = 2
__meta__ = {
"_edit_use_anchors_": false
}
