<svg width="28" height="28" viewBox="0 0 28 28" fill="none" xmlns="http://www.w3.org/2000/svg">
<g id="Emoji emotions" clip-path="url(#clip0_808_15421)">
<path id="Vector" d="M14.4665 25.1417L12.7748 23.6017C6.76647 18.1533 2.7998 14.5483 2.7998 10.15C2.7998 6.545 5.62314 3.73334 9.21647 3.73334C11.2465 3.73334 13.1948 4.67834 14.4665 6.16C15.7381 4.67834 17.6865 3.73334 19.7165 3.73334C23.3098 3.73334 26.1331 6.545 26.1331 10.15C26.1331 14.5483 22.1665 18.1533 16.1581 23.6017L14.4665 25.1417Z" fill="#FE3535"/>
</g>
<defs>
<clipPath id="clip0_808_15421">
<rect width="28" height="28" fill="white"/>
</clipPath>
</defs>
</svg>
