<svg width="55" height="35" viewBox="0 0 55 35" fill="none" xmlns="http://www.w3.org/2000/svg">
<g id="toggle">
<rect id="Rectangle 629" x="1" width="54" height="30" rx="15" fill="#333333"/>
<g id="Rectangle 631" opacity="0.4" filter="url(#filter0_d_191_30597)">
<rect x="4" y="3" width="24" height="24" rx="12" fill="#D9D9D9"/>
</g>
</g>
<defs>
<filter id="filter0_d_191_30597" x="0" y="3" width="32" height="32" filterUnits="userSpaceOnUse" color-interpolation-filters="sRGB">
<feFlood flood-opacity="0" result="BackgroundImageFix"/>
<feColorMatrix in="SourceAlpha" type="matrix" values="0 0 0 0 0 0 0 0 0 0 0 0 0 0 0 0 0 0 127 0" result="hardAlpha"/>
<feOffset dy="4"/>
<feGaussianBlur stdDeviation="2"/>
<feComposite in2="hardAlpha" operator="out"/>
<feColorMatrix type="matrix" values="0 0 0 0 0 0 0 0 0 0 0 0 0 0 0 0 0 0 0.25 0"/>
<feBlend mode="normal" in2="BackgroundImageFix" result="effect1_dropShadow_191_30597"/>
<feBlend mode="normal" in="SourceGraphic" in2="effect1_dropShadow_191_30597" result="shape"/>
</filter>
</defs>
</svg>
