<svg width="8" height="20" viewBox="0 0 8 20" fill="none" xmlns="http://www.w3.org/2000/svg">
<path d="M0 10.4562C0 4.75562 3.58552 1.6294 6.78282 0.0920849C7.5746 -0.288617 8.27579 0.582409 7.89177 1.39951C6.07644 5.26208 6 7 6 20C3.17637 20 0 17.5103 0 10.4562Z" fill="#004280"/>
</svg>
