<svg width="20" height="20" viewBox="0 0 20 20" fill="none" xmlns="http://www.w3.org/2000/svg">
<rect x="2.80713" y="1.61137" width="6.02263" height="11.5668" rx="3.01131" fill="white" stroke="black"/>
<rect x="2.80713" y="1.61168" width="6.39224" height="11.5668" rx="3.19612" fill="white" stroke="black"/>
<mask id="mask0_599_18972" style="mask-type:alpha" maskUnits="userSpaceOnUse" x="2" y="1" width="8" height="13">
<rect x="3.07471" y="1.82187" width="5.91261" height="11.0219" rx="2.9563" fill="white" stroke="black"/>
</mask>
<g mask="url(#mask0_599_18972)">
<rect x="4.15479" y="4.06764" width="5.54418" height="5.91379" rx="2.77209" fill="black"/>
<rect x="4.15479" y="4.43813" width="2.21767" height="2.21767" rx="1.10884" fill="white"/>
</g>
<rect x="10.8008" y="1.61137" width="6.02263" height="11.5668" rx="3.01131" fill="white" stroke="black"/>
<rect x="10.8008" y="1.61172" width="6.39224" height="11.5668" rx="3.19612" fill="white" stroke="black"/>
<mask id="mask1_599_18972" style="mask-type:alpha" maskUnits="userSpaceOnUse" x="10" y="1" width="8" height="13">
<rect x="10.8892" y="1.82185" width="6.21316" height="11.0219" rx="3.10658" fill="white" stroke="black"/>
</mask>
<g mask="url(#mask1_599_18972)">
<rect x="12.1484" y="4.06763" width="5.54418" height="5.91379" rx="2.77209" fill="black"/>
<rect x="12.1484" y="4.43811" width="2.21767" height="2.21767" rx="1.10884" fill="white"/>
</g>
<path d="M8.20215 15.2757C8.02244 15.4853 8.04672 15.801 8.25638 15.9807C8.46605 16.1604 8.7817 16.1361 8.96141 15.9265L8.20215 15.2757ZM11.9083 14.4964L11.4923 14.7737V14.7738L11.9083 14.4964ZM9.321 16.5249L9.3018 16.0253C9.0296 16.0358 8.81586 16.2622 8.82109 16.5345C8.82633 16.8069 9.0486 17.0249 9.321 17.0249V16.5249ZM12.2779 17.8186L11.8096 17.6435L12.2779 17.8186ZM8.82571 17.1959C8.68363 16.9592 8.37649 16.8824 8.13971 17.0245C7.90292 17.1666 7.82615 17.4737 7.96824 17.7105L8.82571 17.1959ZM8.96141 15.9265C9.33443 15.4913 9.86904 14.9088 10.4009 14.6035C10.6639 14.4524 10.8695 14.403 11.0209 14.4198C11.146 14.4336 11.3101 14.5005 11.4923 14.7737L12.3243 14.2191C12.0128 13.7517 11.6065 13.4785 11.1309 13.4258C10.6814 13.3761 10.2557 13.5337 9.90298 13.7362C9.20324 14.138 8.56835 14.8485 8.20215 15.2757L8.96141 15.9265ZM11.4923 14.7738C11.7335 15.1356 11.7286 15.3183 11.7118 15.3858C11.6964 15.448 11.6362 15.5502 11.4081 15.6638C10.9316 15.9012 10.1111 15.9942 9.3018 16.0253L9.3402 17.0246C10.1325 16.9941 11.1601 16.9046 11.854 16.5589C12.2112 16.381 12.5668 16.0916 12.6823 15.627C12.7964 15.1678 12.6375 14.6888 12.3243 14.2191L11.4923 14.7738ZM9.321 17.0249C9.91292 17.0249 10.6897 17.0949 11.2538 17.271C11.5433 17.3614 11.7131 17.4607 11.7891 17.5391C11.8052 17.5557 11.8136 17.5679 11.8177 17.575C11.8215 17.5816 11.8221 17.5846 11.8221 17.5848C11.8221 17.5848 11.8229 17.5873 11.8222 17.5945C11.8216 17.6021 11.8191 17.6181 11.8096 17.6435L12.7462 17.9937C12.8225 17.7898 12.8457 17.5752 12.7971 17.3623C12.749 17.1515 12.6389 16.9791 12.5073 16.8432C12.2566 16.5845 11.8947 16.4234 11.5518 16.3164C10.8512 16.0977 9.96113 16.0249 9.321 16.0249V17.0249ZM11.8096 17.6435C11.621 18.1476 11.1539 18.4204 10.5753 18.3858C9.9931 18.3509 9.30353 17.9922 8.82571 17.1959L7.96824 17.7105C8.59925 18.7621 9.57293 19.3275 10.5154 19.384C11.4615 19.4407 12.3803 18.9722 12.7462 17.9937L11.8096 17.6435Z" fill="black"/>
</svg>
