<svg width="28" height="28" viewBox="0 0 28 28" fill="none" xmlns="http://www.w3.org/2000/svg">
<g id="Group 722">
<g id="Ellipse 106">
<circle cx="14" cy="14" r="14" fill="#FE7235"/>
<circle cx="14" cy="14" r="13.5" stroke="white" stroke-opacity="0.2"/>
</g>
<g id="Group 718">
<g id="Group 711">
<g id="Group 684">
<rect id="Rectangle 538" x="8.27783" y="6.72089" width="4.46204" height="11.4156" rx="2.23102" fill="white" stroke="black"/>
<g id="Mask group">
<mask id="mask0_206_8285" style="mask-type:alpha" maskUnits="userSpaceOnUse" x="7" y="6" width="7" height="13">
<rect id="Rectangle 540" x="8.27783" y="6.72046" width="4.46204" height="11.4156" rx="2.23102" fill="white" stroke="black"/>
</mask>
<g mask="url(#mask0_206_8285)">
<rect id="Rectangle 539" x="10.1284" y="9.03003" width="3.32566" height="7.47537" rx="1.66283" fill="black"/>
<path id="Polygon 1" d="M11.3574 13.4761L10.1232 13.9983L10.1232 12.9539L11.3574 13.4761Z" fill="white"/>
</g>
</g>
</g>
<g id="Group 685">
<rect id="Rectangle 538_2" x="14.6104" y="6.72089" width="4.46204" height="11.4156" rx="2.23102" fill="white" stroke="black"/>
<g id="Mask group_2">
<mask id="mask1_206_8285" style="mask-type:alpha" maskUnits="userSpaceOnUse" x="14" y="6" width="6" height="13">
<rect id="Rectangle 540_2" x="14.6104" y="6.72046" width="4.46204" height="11.4156" rx="2.23102" fill="white" stroke="black"/>
</mask>
<g mask="url(#mask1_206_8285)">
<rect id="Rectangle 539_2" x="16.4609" y="9.03003" width="3.32566" height="7.47537" rx="1.66283" fill="black"/>
<path id="Polygon 1_2" d="M17.6899 13.4761L16.4557 13.9983L16.4557 12.9539L17.6899 13.4761Z" fill="white"/>
</g>
</g>
</g>
</g>
<path id="Rectangle 544" d="M21.1099 21.0948C21.1099 20.6502 20.6592 20.3158 20.2055 20.4632C19.1135 20.818 18.1011 21.0865 17.1265 21.2661C18.129 21.3705 19.1746 21.5295 20.3122 21.7423C20.7306 21.8206 21.1099 21.5028 21.1099 21.0948ZM8.29541 21.7451C9.43662 21.5332 10.483 21.3752 11.4807 21.2705C10.5072 21.092 9.4961 20.8238 8.40584 20.4677C7.9515 20.3192 7.49995 20.654 7.49995 21.0985C7.49995 21.5053 7.87796 21.8226 8.29541 21.7451Z" fill="white" stroke="black"/>
</g>
</g>
</svg>
