<svg width="28" height="28" viewBox="0 0 28 28" fill="none" xmlns="http://www.w3.org/2000/svg">
<g id="Check circle">
<path id="Vector" d="M12.3668 16.1L9.82933 13.5625C9.61544 13.3486 9.35294 13.2416 9.04183 13.2416C8.73072 13.2416 8.4585 13.3583 8.22516 13.5916C8.01127 13.8055 7.90433 14.0778 7.90433 14.4083C7.90433 14.7389 8.01127 15.0111 8.22516 15.225L11.5502 18.55C11.7641 18.7639 12.0363 18.8708 12.3668 18.8708C12.6974 18.8708 12.9696 18.7639 13.1835 18.55L19.8043 11.9291C20.0182 11.7153 20.1252 11.4528 20.1252 11.1416C20.1252 10.8305 20.0085 10.5583 19.7752 10.325C19.5613 10.1111 19.2891 10.0041 18.9585 10.0041C18.6279 10.0041 18.3557 10.1111 18.1418 10.325L12.3668 16.1ZM14.0002 25.6666C12.3863 25.6666 10.8696 25.3602 9.45016 24.7473C8.03072 24.1352 6.796 23.3041 5.746 22.2541C4.696 21.2041 3.86494 19.9694 3.25283 18.55C2.63994 17.1305 2.3335 15.6139 2.3335 14C2.3335 12.3861 2.63994 10.8694 3.25283 9.44998C3.86494 8.03054 4.696 6.79581 5.746 5.74581C6.796 4.69581 8.03072 3.86437 9.45016 3.25148C10.8696 2.63937 12.3863 2.33331 14.0002 2.33331C15.6141 2.33331 17.1307 2.63937 18.5502 3.25148C19.9696 3.86437 21.2043 4.69581 22.2543 5.74581C23.3043 6.79581 24.1354 8.03054 24.7475 9.44998C25.3604 10.8694 25.6668 12.3861 25.6668 14C25.6668 15.6139 25.3604 17.1305 24.7475 18.55C24.1354 19.9694 23.3043 21.2041 22.2543 22.2541C21.2043 23.3041 19.9696 24.1352 18.5502 24.7473C17.1307 25.3602 15.6141 25.6666 14.0002 25.6666Z" fill="#01C3FF"/>
</g>
</svg>
