<svg width="180" height="180" viewBox="0 0 180 180" fill="none" xmlns="http://www.w3.org/2000/svg">
<path fill-rule="evenodd" clip-rule="evenodd" d="M57.1956 33.1812L51.9997 13.7899L84.8041 5.00003L90 24.3913L95.1959 5.00004L128 13.7899L122.804 33.1812L137 18.9858L161.014 43.0003L146.819 57.1957L166.21 51.9998L175 84.8042L155.609 90L175 95.1959L166.21 128L146.819 122.804L161.014 137L137 161.014L122.804 146.819L128 166.21L95.1959 175L90 155.609L84.8041 175L51.9998 166.21L57.1956 146.819L43.0003 161.014L18.9858 137L33.1811 122.804L13.7899 128L5 95.1959L24.3913 90L5 84.8042L13.7899 51.9998L33.1812 57.1957L18.9858 43.0003L43.0003 18.9858L57.1956 33.1812Z" fill="white"/>
</svg>
