<svg width="20" height="20" viewBox="0 0 20 20" fill="none" xmlns="http://www.w3.org/2000/svg">
<path d="M4.58887 13.4403C4.58887 13.4403 8.64176 15.1322 12.2356 14.112C15.8295 13.0918 16.5725 11.9078 16.5725 11.9078" stroke="black" stroke-miterlimit="10" stroke-linecap="round"/>
<path d="M8.89207 16.0077L8.81735 14.4592C8.81735 14.4592 10.0482 14.5406 11.0432 14.4187C12.0381 14.2969 13.0805 13.9371 13.0805 13.9371L13.4755 15.3735C13.6373 15.9621 13.2387 16.557 12.6328 16.6312L10.0125 16.9521C9.43551 17.0228 8.92008 16.5883 8.89207 16.0077Z" fill="white" stroke="black"/>
<path d="M11.3637 16.7866L11.0688 14.3795" stroke="black"/>
<path d="M3.17432 11.3815C3.17432 11.3815 4.47787 11.7393 4.52492 12.9682C4.57198 14.1971 3.89201 14.8897 3.51105 14.9872" stroke="black" stroke-miterlimit="10" stroke-linecap="round"/>
<path d="M0.763895 4.48311C0.524696 5.36129 0.688846 8.93404 2.99687 10.2666C5.30489 11.5991 8.0472 11.1702 9.12198 9.30866C10.1968 7.44707 8.45368 6.14524 6.14566 4.81271C3.83764 3.48017 1.83868 2.62153 0.763895 4.48311Z" fill="black"/>
<path d="M19.2361 4.48316C19.4753 5.36134 19.3112 8.93409 17.0031 10.2666C14.6951 11.5992 11.9528 11.1703 10.878 9.3087C9.80323 7.44712 11.5463 6.14529 13.8543 4.81275C16.1624 3.48022 18.1613 2.62157 19.2361 4.48316Z" fill="black"/>
<path d="M16.7877 4.63196C16.7933 4.56624 16.8623 4.56624 16.8679 4.63196L16.9152 5.18323C16.9763 5.89508 17.382 6.45632 17.8967 6.54078L18.2952 6.60619C18.3428 6.614 18.3428 6.70935 18.2952 6.71716L17.8967 6.78257C17.382 6.86703 16.9763 7.42827 16.9152 8.14011L16.8679 8.69139C16.8623 8.75711 16.7933 8.75711 16.7877 8.69139L16.7404 8.14011C16.6793 7.42827 16.2736 6.86703 15.7589 6.78257L15.3603 6.71716C15.3128 6.70935 15.3128 6.614 15.3603 6.60619L15.7589 6.54078C16.2736 6.45632 16.6793 5.89508 16.7404 5.18323L16.7877 4.63196Z" fill="white"/>
<path d="M6.96325 6.24228C6.96697 6.19899 7.01239 6.19899 7.0161 6.24228L7.04726 6.60543C7.08748 7.07437 7.35478 7.44409 7.69381 7.49973L7.95637 7.54282C7.98767 7.54796 7.98767 7.61077 7.95637 7.61591L7.69381 7.659C7.35478 7.71465 7.08748 8.08436 7.04726 8.55329L7.0161 8.91645C7.01239 8.95975 6.96697 8.95975 6.96325 8.91645L6.9321 8.55329C6.89187 8.08436 6.62457 7.71465 6.28554 7.659L6.02298 7.61591C5.99169 7.61077 5.99169 7.54796 6.02298 7.54282L6.28554 7.49973C6.62457 7.44409 6.89187 7.07437 6.9321 6.60543L6.96325 6.24228Z" fill="white"/>
<path d="M8.2915 7.91048C8.2915 7.91048 9.0339 7.39711 10.1475 7.39711C11.2611 7.39711 12.0035 7.91048 12.0035 7.91048" stroke="black" stroke-linecap="round"/>
</svg>
