{
  "startup_app": {
    "name": "Slitherio",
    "description": "Slither snake game",
    "url": "https://slither.io",
    "uuid": "SlitherPOC-1tkcgzqv475",
    "autoShow": true,
    "enableAppLogging": false
  },
  "runtime": {
    "arguments": "",
    "version": "community"
  },
  "shortcut": {
    "company": "Slither",
    "description": "Slither POC",
    "name": "Slither",
    "target": [
      "desktop"
    ]
  }
}